##TITLE=1H_CG-1213-A
 CDCl3
 8 sc, 
 10.10.2024
##JCAMPDX= 6.0         $$ Bruker NMR JCAMP-DX V2.0
##DATA TYPE= NMR SPECTRUM
##DATA CLASS= NTUPLES
##ORIGIN= UXNMR, Bruker Analytische Messtechnik GmbH
##OWNER= root
$$ XWIN-NMR		Version 3.5
$$ Thu Oct 10 13:46:07 2024 Russian Standard Time (UT+4h)  she@DPX200
##.OBSERVE FREQUENCY= 200.1318
##.OBSERVE NUCLEUS= ^1H
##.ACQUISITION MODE= SIMULTANEOUS
##.ACQUISITION SCHEME= undefined
##.AVERAGES= 8
##.DIGITISER RES= 18
##SPECTROMETER/DATA SYSTEM= spect
##.PULSE SEQUENCE= zg30
##.SOLVENT NAME= D2O
##.SHIFT REFERENCE= (INTERNAL, D2O, 0, 21.0047)
##AUDIT TRAIL= $$ (NUMBER, WHEN, WHO, WHERE, WHAT)
$$ ##TITLE= Audit trail, XWIN-NMR		Version 3.5
$$ ##JCAMPDX= 5.01
$$ ##ORIGIN= Bruker BioSpin GmbH
$$ ##OWNER= she
$$ F:/spectra/data/she/nmr/H-F/1/pdata/1/auditp.txt
$$ ##AUDIT TRAIL=  $$ (NUMBER, WHEN, WHO, WHERE, WHAT)
(   1,<2024-10-10 13:44:38.04 +0400>,<she>,<DPX200>,
      <created by zg, POWCHK disabled, PULCHK disabled
       configuration hash MD5:
       00 E9 B6 7A A2 85 ED C7 34 08 36 98 17 FE 4E 26
       data hash MD5: 16K
       04 6C 38 F2 51 1C 66 E3 E6 0C B9 B4 6E B1 E9 13>)
(   2,<2024-10-10 13:44:41.04 +0400>,<she>,<DPX200>,
      <Start of raw data processing
       efp BC_mod = 2 LB = 0.24 FT_mod = 6 PKNL = 1 PHC0 = -26347.26 PHC1 = 17.98743 SI = 16K 
       data hash MD5: 16K
       3F 06 CA 00 27 48 C8 FA C5 F1 CF F8 3A 45 82 66>)
(   3,<2024-10-10 13:45:03.70 +0400>,<she>,<DPX200>,
      <pk PHC0 = -156.2252 PHC1 = -3.4 
       data hash MD5: 16K
       00 BC 02 5D 88 8B 05 9B DA 8C 4B E6 F0 D1 26 1B>)
(   4,<2024-10-10 13:45:07.39 +0400>,<she>,<DPX200>,
      <abs ABSG = 5 
       data hash MD5: 16K
       4F E8 A1 E1 27 E3 F4 8B 1A 5E 31 F7 00 98 CF B3>)
$$ ##END=
$$ 
$$ hash MD5
$$ 65 54 91 2F AC F4 95 0A D3 A8 3E 60 F1 27 D5 6E
##$RELAX= 
##$RELAX= 
##$RELAX= 
##$RELAX= 
##$RELAX= 
##$RELAX= 
$$ Bruker specific parameters
$$ --------------------------
##$DU= <F:/spectra>
##$EXPNO= 1
##$NAME= <H-F>
##$PROCNO= 1
##$TYPE= <nmr>
##$USER= <she>
##$AMP= (0..31)
100 100 100 100 100 100 100 100 100 100 100 100 100 100 100 100 100 100 
100 100 100 100 100 100 100 100 100 100 100 100 100 100 
##$AQSEQ= 0
##$AQ_mod= 1
##$AUNM= <au_zg>
##$AUTOPOS= <>
##$BF1= 200.13
##$BF2= 200.13
##$BF3= 200.13
##$BF4= 200.13
##$BF5= 200.13
##$BF6= 200.13
##$BF7= 200.13
##$BF8= 200.13
##$BYTORDA= 1
##$CFDGTYP= 0
##$CFRGTYP= 5
##$CHEMSTR= <none>
##$CNST= (0..31)
1 1 145 1 1 1 1 1 1 1 1 1 1 1 1 1 1 1 1 1 1 1 1 1 1 1 1 1 1 1 1 1 
##$CPDPRG= <>
##$CPDPRG1= <>
##$CPDPRG2= <>
##$CPDPRG3= <>
##$CPDPRG4= <mlev>
##$CPDPRG5= <mlev>
##$CPDPRG6= <mlev>
##$CPDPRG7= <mlev>
##$CPDPRG8= <mlev>
##$CPDPRGB= <>
##$CPDPRGT= <>
##$D= (0..31)
0 1.2 0 0 0 0 0 0 0 0.06 0 0.03 0 0 0 0 0.0002 0 0 0 0 0 0 0 0 0 0 0 0 
0 0 0 
##$DATE= 1728553477
##$DBL= (0..7)
120 120 120 120 120 120 120 120 
##$DBP= (0..7)
150 150 150 150 150 150 150 150 
##$DBP07= 0
##$DBPNAM0= <>
##$DBPNAM1= <>
##$DBPNAM2= <>
##$DBPNAM3= <>
##$DBPNAM4= <>
##$DBPNAM5= <>
$$ [...]
##$SUBNAM3= <"">
##$SUBNAM4= <"">
##$SUBNAM5= <"">
##$SUBNAM6= <"">
##$SUBNAM7= <"">
##$SUBNAM8= <"">
##$SUBNAM9= <"">
##$SW= 24.0689170037331
##$SWIBOX= (0..15)
0 0 2 0 0 0 0 0 0 0 0 0 0 0 0 0 
##$SW_h= 4816.95568400771
##$TD= 16384
##$TD0= 1
##$TE= 0
##$TE2= 300
##$TE3= 300
##$TEG= 300
##$TL= (0..7)
0 120 120 120 120 120 120 120 
##$TP= (0..7)
150 150 150 150 150 150 150 150 
##$TP07= 0
##$TPNAME0= <>
##$TPNAME1= <>
##$TPNAME2= <>
##$TPNAME3= <>
##$TPNAME4= <>
##$TPNAME5= <>
##$TPNAME6= <>
##$TPNAME7= <>
##$TPOAL= (0..7)
0.5 0.5 0.5 0.5 0.5 0.5 0.5 0.5 
##$TPOFFS= (0..7)
0 0 0 0 0 0 0 0 
##$TUNHIN= 0
##$TUNHOUT= 0
##$TUNXOUT= 0
##$USERA1= <user>
##$USERA2= <user>
##$USERA3= <user>
##$USERA4= <user>
##$USERA5= <user>
##$V9= 5
##$VALIST= <valist>
##$VCLIST= <CCCCCCCCCCCCCCC>
##$VD= 0
##$VDLIST= <DDDDDDDDDDDDDDD>
##$VPLIST= <PPPPPPPPPPPPPPP>
##$VTLIST= <TTTTTTTTTTTTTTT>
##$WBST= 1024
##$WBSW= 4
##$XGAIN= (0..3)
0 0 0 0 
##$XL= 0
##$YL= 0
##$YMAX_a= 286668
##$YMIN_a= -534378
##$ZGOPTNS= <>
##$ZL1= 120
##$ZL2= 120
##$ZL3= 120
##$ZL4= 120
##$ABSF1= 20.97088
##$ABSF2= -3.098251
##$ABSG= 5
##$ABSL= 3
##$ALPHA= 0
##$AQORDER= 0
##$ASSFAC= 0
##$ASSFACI= 0
##$ASSFACX= 0
##$ASSWID= 0
##$AUNMP= <proc_1d>
##$AZFE= 0.1
##$AZFW= 0.1
##$BCFW= 0
##$BC_mod= 2
##$BYTORDP= 0
##$COROFFS= 0
##$CY= -3
##$DATMOD= 1
##$DC= 0
##$DFILT= <>
##$DTYPP= 0
##$F1P= 0
##$F2P= 0
##$FCOR= 1
##$FTSIZE= 16384
##$FT_mod= 6
##$GAMMA= 0
##$GB= 0
##$INTBC= 1
##$INTSCL= 3.70164e-10
##$ISEN= 128
##$LB= 0.24
##$LEV0= 0
##$LPBIN= 0
##$MAXI= 10000
##$MC2= 0
##$MEAN= 0
##$ME_mod= 0
##$MI= 1.114404
##$NCOEF= 0
##$NC_proc= -8
##$NLEV= 6
##$NOISF1= 3.799351
##$NOISF2= 2.8
##$NSP= 0
##$NTH_PI= 0
##$NZP= 0
##$OFFSET= 21.00467
##$PC= 1
##$PHC0= -26503.48
##$PHC1= 14.58743
##$PH_mod= 1
##$PKNL= yes
##$PPARMOD= 0
##$PSCAL= 0
##$PSIGN= 0
##$REVERSE= no
##$SF= 200.130004813915
##$SI= 16384
##$SIGF1= 3
##$SIGF2= 2
##$SINO= 5.538805
##$SIOLD= 16384
##$SREGLST= <1H.CDCl3>
##$SSB= 0
##$STSI= 16384
##$STSR= 0
##$SW_p= 4816.95568400771
##$SYMM= 0
##$S_DEV= 0
##$TDeff= 16384
##$TDoff= 0
##$TI= <>
##$TILT= no
##$TM1= 0
##$TM2= 0
##$TOPLEV= 0
##$USERP1= <user>
##$USERP2= <user>
##$USERP3= <user>
##$USERP4= <user>
##$USERP5= <user>
##$WDW= 1
##$XDIM= 16384
##$YMAX_p= 493098304
##$YMIN_p= -1511606
$$ End of Bruker specific parameters
$$ ---------------------------------
##NTUPLES= NMR SPECTRUM
##VAR_NAME=  FREQUENCY,     SPECTRUM/REAL,   SPECTRUM/IMAG
##SYMBOL=    X,             R,               I
##VAR_TYPE=  INDEPENDENT,   DEPENDENT,       DEPENDENT
##VAR_FORM=  AFFN,          ASDF,            ASDF
##VAR_DIM=   16384,         16384,           16384
##UNITS=     HZ,            ARBITRARY UNITS, ARBITRARY UNITS
##FACTOR=    0.29402158847633, 1,            1
##FIRST=     4203.66454599995, 0,            0
##LAST=      -613.291138007764, 0,           0
##MIN=       -613.291138007764, -1511606,    0
##MAX=       4203.66454599995, 493098304,    0
$$ Real data points
##PAGE= N=1
##DATA TABLE= (X++(R..R)), XYDATA
$$ [...]
$$ plain form
6675 32646016 32761998 32848625 33162826 33275838 33306315 32797083 32003325 31479562 30569271 30178814
6665 30178814 29724188 29448662 29491965 29532398 29681770 29938386 30205455 30464739 30256060 29859688
6655 29859688 29646849 29500695 29354706 29311336 29467893 29335154 28757278 28166540 27694344 26836445
6645 26836445 25887816 24979098 24130584 23395556 22744508 22182326 21749588 21579714 21603398 21427338
6635 21427338 21400928 21106184 20915356 20845228 20490407 20076901 19704960 19546314 19546855 19511260
6625 19511260 19540977 19514693 19436950 19088967 18710891 18183179 17748820 17145901 16571068 16120552
6615 16120552 15688053 15280151 15016529 14851433 14776451 14598110 14421255 14102623 13769299 13265967
6605 13265967 12837275 12350795 12279559 12191254 12009940 11970819 11757244 11478549 11428710 11033512
$$ packed form
6675C2646016J15982Q6627L14201J13012L0477n09232p93758n23763r10291l90457
6665C0178814m54626k75526M3303M0433J49372K56616K67069K59284k08679l96372
6655B9859688k12839j46154j45989m3370J56557j32739n77876n90738m72196q57899
6645B6836445r48629r08718q48514p35028o51048n62182m32738j69874K3684j76060
6635B1427338k6410k94744j90828p0128l54821m13506l71941j58646N41l5595
6625A9511260K9717k6284p7743l47983l78076n27712m34359o02919n74833m50516
6615A6120552m32499m07902k63622j65096p4982j78341j76855l18632l33324n03332
6605A3265967m28692m86480p1236q8305j81314l9121k13575k78695m9839l95198
$$ plain form
6595 11033512 10751981 10801720 10460677 10123496 9980998 9769991 9347854 8811637 8670343 8596159
6585 8596159 8452728 8398618 8051545 7770302 7735033 7419395 7407398 7379510 7098673 6965731
6575 6965731 6701684 6764102 6509437 6299969 6198042 5994625 5782440 5808089 5776411 5799615
6565 5799615 5674294 5487177 5337513 5159232 4995696 4898371 4913688 4743520 4606834 4362709
6555 4362709 4367873 4272355 4263081 4138188 4074299 4069283 3945671 3899042 3828638 3911036 3703786
6544 3703786 3624878 3480037 3469156 3237590 3210748 3444167 3267952 3206211 3245847 3369122
6534 3369122 3167089 3195029 3200393 3205660 3153126 3212232 3279325 3065045 3064767 3249702 2827868
6523 2827868 2916871 2847925 2749399 2721763 2431044 2528226 2601746 2386599 2292549 2411590 2331296
$$ packed form
6595A1033512k81531M9739l41043l37181j42498k11007m22137n36217j41294p4184
6585H596159j43431n4110l47073k81243l5269l15638j1997k7888k80837j32942
6575F965731k64047O2418k54665k09468j01927k03417k12185K5649l1678K3204
6565E799615j25321j87117j49664j78281j63536r7325J5317j70168j36686k44125
6555D362709N164r5518r274j24893o3889n016j23612m6629p0404Q2398k07250
6544C703786p8908j44841j0881k31566k6842K33419j76215o1741L9636J23275
6534C369122k02033K7940N364N267n2534N9106O7093k14280k78J84935m21834
6523B827868Q9003o8946r8526k7636k90719R7182P3520k15147r4050J19041q0294
$$ plain form
6512 2331296 2256477 2236778 2205554 2255045 2172340 2077148 2038672 2047605 2144996 2018875 1964723
6501 1964723 2036082 2097234 2090622 2063407 2131135 2015705 1770980 1772647 1675270 1703412 1769980
6490 1769980 1778133 1723555 1457201 1428593 1599279 1456754 1231140 1246905 1445012 1248235
6480 1248235 1066994 1143554 1110368 1022592 1203573 1309866 1142757 1038991 1125141 1088343
6470 1088343 1092093 993943 874370 843479 995252 944849 1033648 873644 679791 710729 923959
6459 923959 917418 1028581 967326 873101 838233 739332 746547 689780 781287 592026 630306 714475
6447 714475 827396 777088 573961 728563 792266 788051 883848 822167 795917 850336 775351
6436 775351 759217 675169 645170 586422 639214 470558 412942 344232 319032 296553 594438
$$ packed form
6512B331296p4819j9699l1224M9491q2705r5192l8476Q933R7391j26121n4152
6501A964723P1359O1152o612k7215O7728j15430k44725J667r7377K8142O6568
6490A769980Q153n4578k66354k8608J70686j42525k25614J5765J98107j96777
6480A248235j81241P6560l3186q7776J80981J06293j67109j03766Q6150l6798
6470A088343L750r8150j19573l0891J51773n0403Q8799j60004j93853L0938K13230
6459I23959o541J11163o1255r4225l4868r8901P215n6767R1507j89261L8280Q4169
6447G14475J12921n0308k03127J54602O3703m215R5797o1681k6250N4419p4985
6436G75351j6134q4048k9999n8748N2792j68656n7616o8710k5200k2479K97885
$$ plain form
6425 594438 659149 526187 540531 509406 548806 583662 537448 270718 262693 288493 448445
6414 448445 406024 343779 395032 522187 379210 209923 320169 489619 487327 569817 467367
6403 467367 483977 419729 516390 554858 374583 386548 429613 308035 377917 228952 394627
6392 394627 452679 380651 212972 209465 448711 187893 59775 231295 173409 228127 375031
6381 375031 204066 281504 248681 142962 175567 261919 208211 307216 328594 241875 36842
6370 36842 138115 343387 426226 338865 323654 311525 298817 293064 14821 -48512 117285
6359 117285 90607 194974 80740 110555 60318 -38897 35242 142608 130163 114474 11507
6348 11507 -72843 -38716 70948 318704 326246 221764 244028 94192 105056 377551 318719
$$ packed form
6425E94438O4711j32962J4344l1125L9400L4856m6214k66730q025K5800J59952
6414D48445m2421o2245N1253J27155j42977j69287J10246J69450k292Q2490j02450
6403D67367J6610o4248R6661L8468j80275J1965M3065j21578O9882j48965J65675
6392C94627N8052p2028j67679l507K39246k60818j28118J71520n7886N4718J46904
6381C75031j70965P7438l2823j05719L2605Q6352n3708R9005K1378q6719k05033
6370C6842J01273K05272Q2839q7361j5211j2129j2708n753k78243o3333J65797
6359A17285k6678J04367j14234K9815n0237r9215P4139J07366j2445j5689j02967
6348A1507q4350L4127J09664K47756P542j04482K2264j49836J0864K72495n8832
$$ plain form
6337 318719 60163 -71090 -106155 91540 -79142 -77496 -50209 -126878 26577 133766 106929
6326 106929 -246895 36672 356908 346475 291905 328178 187732 82685 394257 434819
6316 434819 211338 169563 258462 177016 79510 195910 195840 233263 136744 221318 75588 139017
6304 139017 232882 274976 123707 -50202 -113874 -146185 -47392 -117651 -185272 153149 36945
6293 36945 148433 168166 175146 19259 110965 126856 14213 24954 195617 196673 791
6282 791 59230 144555 97860 88217 93062 -6492 15962 111867 149198 246602 242451 165975 -34681
6269 -34681 123359 191737 24198 131275 117397 209185 -26978 100746 226093 199389 241356
6258 241356 158362 -38815 -42426 124685 261537 283294 369721 61681 65195 87720 201702
$$ packed form
6337C18719k58556j31253l5065J97695j70682J646K7287p6669J53455J07189k6837
6326A06929l53824K83567L20236j0433n4570L6273j40446j05047L11572M0562
6316D34819k23481m1775Q8899q1446r7506J16400p0L7423r6519Q4574j45730O3429
6304A39017R3865M2094j51269j73909o3672l2311R8793p0259o7621L38421j16204
6293C6945J11488J9733O980j55887R1706J5891j12643J0741J70663J056j95882
6282G91N8439Q5325m6695r643M845r9554K2454R5905L7331R7404m151p6476k00656
6269c4681J58040O8378j67539J07077j3878R1788k36163J27724J25347k6704M1967
6258B41356q2994j97177l611J67111J36852K1757Q6427l08040L514K2525J13982
$$ plain form
6247 201702 110045 201711 224563 57911 199544 312031 28952 82355 250097 270170 201067
6236 201067 100417 62652 119263 336798 323465 247206 137960 156141 136958 27309 122229
6225 122229 109219 331625 232347 194972 306516 215572 158391 219397 247233 309870 263262
6214 263262 159758 265961 183329 317209 198886 187500 137869 64684 220519 345479
6204 345479 227875 100200 238310 209691 104235 210655 228040 157659 246990 241264 211728
6193 211728 186328 -118323 170814 377131 416953 383027 267976 120458 317527 259801
6183 259801 214222 287609 448706 463311 391991 498195 196450 220842 297569 403524 369486
6172 369486 473620 624086 482863 490117 651220 565060 529048 618945 607720 694620 707009
$$ packed form
6247B01702r1657R1666K2852j66652J41633J12487k83079N3403J67742K0073o9103
6236B01067j00650l7765N6611K17535j3333p6259j09246J8181j9183j09649R4920
6225A22229j3010K22406r9278l7375J11544r0944n7181O1006K7836O2637m6608
6214B63262j03504J06203q2632J33880j18323j1386m9631p3185J55835J24960
6204C45479j17604j27675J38110k8619j05456J06420J7385p0381Q9331n726k9536
6193B11728k5400l04651K89137K06317L9822l3926j15051j47518J97069n7726
6183B59801m5579P3387J61097J4605p1320J06204l01745K4392P6727J05955l4038
6172C69486J04134J50466j41223P254J61103q6160l6012Q9897j1225Q6900J2389
$$ plain form
6161 707009 398065 523181 526952 686641 684464 531509 732886 748021 779082 849919 858683
6150 858683 941536 1013878 1041606 1145040 1124959 1011265 1012907 1036772 1080846 876165 981862
6139 981862 1000805 1225448 1245900 1152350 1273787 1179006 1131776 1105328 1240224 1255923 1222307
6128 1222307 972448 1055256 1239413 1342807 1417482 1382601 1381718 1359974 1401024 1231343 1279748
6117 1279748 1394564 1399448 1471894 1563765 1487459 1446022 1514580 1456458 1574838 1618793 1597922
6106 1597922 1443347 1721813 1722376 1494319 1601453 1654963 1951773 1814515 1736205 1771394 1763376
6095 1763376 1873247 1715478 1830473 2000124 2138711 2256239 2347234 2379163 2207957 2115811
6085 2115811 2278589 2139452 2271802 2441691 2380740 2503108 2399725 2446029 2526434 2540771
$$ packed form
6161G07009l08944J25116L771J59689k177j52955K01377J5135L1061P0837Q764
6150H58683Q2853P2342K7728J03434k0081j13694J642K3865M4074k04681J05697
6139I81862J8943K24643K0452r3550J21437r4781m7230k6448J34896J5699l3616
6128A222307k49859Q2808J84157J03394P4675l4881q83k1744M1050j69681M8405
6117A279748J14816M884P2446R1871p6306m1437O8558n8122J18380M3955k0871
6106A597922j54575K78466N63k28057J07134N3510K96810j37258p8310L5189q018
6095A763376J09871j57769J14995J69651J38587J17528R0995L1929j71206r2146
6085B115811J62778j39137J32350J69889o0951J22368j03383M6304Q0405J4337
$$ plain form
6075 2540771 2622068 2609233 2578539 2688054 2638324 2610037 2632254 2766847 2761154 3019085 2992232
6064 2992232 2854311 3036596 2975260 3084717 2875546 2951830 2893928 2952993 2915691 2971614 2936277
6053 2936277 3010705 3225058 3141480 3135871 3066182 3277761 3337520 3392316 3437958 3544920 3455245
6042 3455245 3535554 3509712 3375010 3475009 3545281 3596007 3589056 3594751 3552568 3609760 3584666 3672587
6030 3672587 3754673 3920222 3987962 3986863 3908480 3949761 4118197 4352777 4397067 4514371 4670253
6019 4670253 4847195 4720366 4876686 5008000 5116500 5254903 5168536 5249289 5190328 5123044
6009 5123044 5200869 5224891 5321912 5310013 5409955 5416651 5589427 5636187 5689017 5665945 5811190
5998 5811190 5861917 5823385 5914932 6140200 6261752 6332040 6526335 6552736 6758978 6768116 6942809
$$ packed form
6075B540771Q1297j2835l0694J09515m9730k8287K2217J34593n693K57931k6853
6064B992232j37921J82285o1336J09457k09171P6284n7902N9065l7302N5923l5337
6053B936277P4428K14353q3578n609o9689K11579N9759N4796M5642J06962q9675
6042C455245Q0309k5842j34702R9999P0272N0726o951N695m2183N7192k5094Q7921
6030C672587Q2086J65549O7740j099p8383M1281J68436K34580M4290J17304J55882
6019D670253J76942j26829J56320J31314J08500J38403q6367Q0753n8961o7284
6009E123044P7825K4022R7021j1899R9942O696J72776M6760N2830k3072J45245
5998E811190N0727l8532R1547K25268J21552P0288J94295K6401K06242R138J74693
$$ plain form
5987 6942809 7021119 7025490 6928457 6853111 6685792 6650961 6577811 6715658 6720228 6652619 6547790
5976 6547790 6650942 6629492 6686842 6651159 6629442 6684686 6749043 6578186 6741886 6776024 6967925
5965 6967925 6944589 7013024 7306120 7550976 7886598 8064275 8464093 9019808 9348507 9685814
5955 9685814 10018499 10256952 10452930 10599822 10775081 10868664 11029481 10994109 10819613 10921085
5945 10921085 10972173 10977485 10794697 10345817 10061207 9644240 9380910 9069646 8830337 8481236
5935 8481236 7889106 7699693 7541782 7267122 7293625 7105082 7058643 7091234 6755217 6910709
5925 6910709 7234885 7470678 7412840 7618808 7842994 8098702 8437024 8608599 9074725 9302310
5915 9302310 9443695 9765436 10012062 10218779 10321163 10549425 10782419 10773901 10919454 11028950
$$ packed form
5987F942809P8310M371r7033p5346j67319l4831p3150J37847M570o7609j04829
5976F547790J03152k1450N7350l5683k1717N5244O4357j70857J63700L4138J91901
5965F967925k3336O8435K93096K44856L35622J77677L99818N55715L28699L37307
5955I685814L32685K38453J95978J46892J75259R3583J60817l5372j74496J01472
5945A0921085N1088N312j82788m48880k84610m16967k63330l11264k39309l49101
5935H481236n92130j89413j57911k74660K6503j88543m6439L2591l36017J55492
5925F910709L24176K35793n7838K05968K24186K55708L38322J71575M66126K27585
5915I302310J41385L21741K46626K06717J02384K28262K32994q518J45553J09496
$$ plain form
5905 11028950 11296750 11364239 11205057 10978549 10739040 10614147 10417610 10312635 10278399 10118927
5895 10118927 9980817 9784361 9944039 10036500 9937977 9977721 9986722 9996255 10004322 9998771 10142891
5884 10142891 10245313 10337866 10359168 10209912 10238744 10472976 10567794 10748466 10818801 11049563
5874 11049563 11217867 11295098 11523977 11888191 12191198 12495221 12918429 13313998 13759350 14186565
5864 14186565 14597298 14851171 15193055 15523118 15646047 15893963 15972446 16122708 16208650 16226610
5854 16226610 16128349 16096494 15990740 15991835 15918008 15637030 14994442 14596335 14403103 13905450
5844 13905450 13558436 13105188 12775622 12414923 11936403 11759877 11519192 11251445 11230366 11205295
5834 11205295 11113087 11022360 10931577 10620472 10537717 10522917 10355906 10434047 10395821 10108569 10207944
$$ packed form
5905A1028950K67800O7489j59182k26508k39509j24893j96537j04975l4236j59472
5895A0118927j38110j96456J59678R2461r8523L9744R001R533Q067n551J44120
5884A0142891J02422R2553K1302j49256K8832K34232R4818J80672P0335K30762
5874A1049563J68304P7231K28879L64214L03007L04023M23208L95569M45352M27215
5864A4186565M10733K53873L41884L30063J22929K47916P8483J50262Q5942J7960
5854A6226610r8261l1855j05754J095p3827k80978o42588l98107j93232m97653
5844A3905450l47014m53248l29566l60699m78520j76526k40685k67747k1079k5071
5834A1205295r2208r0727r0783l11105q2755j4800j67011P8141l8226k87252R9375
$$ plain form
5823 10207944 10227062 10107757 10152563 10156393 9895036 10045815 10181375 10104977 10300050 10548554
5813 10548554 10620818 10870155 10995924 11320211 11539974 11816188 12205070 12491448 12928806 13412337
5803 13412337 13979540 14272732 14521328 14693484 14871666 15084106 15079945 15164914 15241188 15161630
5793 15161630 15106956 15096593 15316047 15445048 15255036 14887921 14864880 14890908 14834495 14607697
5783 14607697 14558363 14572324 14678395 14826753 14924584 14972771 14855129 15194979 15387069 15518381
5773 15518381 15808790 16191697 16376240 16523283 16866959 17290553 17633082 18006666 18708754
5764 18708754 19334196 19837194 20551371 21414798 22171044 23055363 23945752 24546130 24731306
5755 24731306 24624744 24580158 24255124 23808112 23720058 23612856 23455499 23367271 23624200 23818876
$$ packed form
5823A0207944J9118j19305M4806L830k61357J50779J35560p6398J95073K48504
5813A0548554P2264K49337J25769L24287K19763K76214L88882K86378M37358M83531
5803A3412337N67203K93192K48596J72156J78182K12440m161Q4969P6274p9558
5793A5161630n4674j0363K19454J29001j90012l67115k3041K6028n6413k26798
5783A4607697m9334J3961J06071J48358R7831M8187j17642L39850J92090J31312
5773A5518381K90409L82907J84543J47043L43676M23594L42529L73584P02088
5764A8708754O25442N02998P14177Q63427P56246Q84319Q90389O00378J85176
5755B4731306j06562m4586l25034m47012q8054j07202j57357q8228K56929J94676
$$ plain form
5745 23818876 23833632 24155810 24360942 24144156 23756589 23512397 23315366 22843138 22568080 22134830
5735 22134830 21469078 20586445 19620403 18781359 17932869 17171021 16440593 15673938 14947834
5726 14947834 14355037 13841549 13253481 12804016 12519831 11963988 11449311 10773435 10482181
5717 10482181 10120296 9835277 9366949 8942912 8772295 8381441 8106699 8058321 7697642 7408802
5707 7408802 7134453 6951278 6765229 6485530 6053111 5607214 5618756 5565998 5545128 5314691
5697 5314691 5297844 4989790 4744071 4611487 4363901 4398521 4340856 4270073 4132360 3810542
5687 3810542 3662607 3689359 3611669 3621083 3562264 3461971 3396494 3297023 3125909 3110773 2971016
5676 2971016 3101071 3190081 2954842 2941611 2830348 2696918 2772415 3001903 2782362 2746772
$$ packed form
5745B3818876J4756L22178K05132k16786l87567k44192j97031m72228k75058m33250
5735B2134830o65752q82633r66042q39044q48490p61848p30428p66655p26104
5726A4947834n92797n13488n88068m49465k84185n55843n14677o75876k91254
5717A0482181l61885k85019m68328m24037j70617l90854k74742m8378l60679k88840
5707G408802k74349j83175j86049k79699m32419m45897J1542n2758k0870k30437
5697E314691j6847l08054k45719j32584k47586L4620n7665p0783j37713l21818
5687C810542j47935K6752p7690R414n8819j00293o5477r9471j71114j5136j39757
5676B971016J30055Q9010k35239j3231j11263j33430P5497K29488k19541l5590
$$ plain form
5666 2746772 2765717 2819248 2764664 2540983 2549283 2577709 2579654 2514584 2468982 2480583 2269302
5655 2269302 2173911 2193565 2135993 2108937 2082159 2046988 2079420 2091150 1980242 1970800 1791829
5644 1791829 1931622 2138269 2044019 1915360 1985457 1965622 1933681 1905422 1777769 1811078 1855804
5633 1855804 1563838 1561863 1631887 1786325 1651740 1544882 1626724 1608342 1678654 1556549 1541345
5622 1541345 1310076 1378350 1518785 1656295 1642137 1555210 1567539 1547341 1292890 1279873 1148446
5611 1148446 1423419 1344713 1234735 1309859 1277840 1267361 1187982 1245043 1106666 1099487 1407234
5600 1407234 1441352 1259938 1319336 1393212 1439089 1389785 1340063 1383396 1477762 1393843 1442167
5589 1442167 1391416 1146604 1228824 1266305 1280216 1244740 1271361 1526716 1383830 1373360 1538074
$$ packed form
5666B746772J8945N3531n4584k23681Q300K8426J945o5070m5602J1601k11281
5655B269302r5391J9654n7572k7056k6778l5171L2432J1730j10908r442j78971
5644A791829J39793K06647r4250j28659P0097j9835l1941k8259j27653L3309M4726
5633A855804k91966j975P0024J54438j34585j06858Q1842j8382P0312j22105j5204
5622A541345k31269O8274J40435J37510j4158q6927J2329k0198k54451j3017j31427
5611A148446K74973p8706j09978P5124l2019j0479p9379N7061j38377p179L07747
5600A407234L4118j81414N9398P3876M5877m9304m9722M3333R4366q3919M8324
5589A442167n0751k44812Q2220L7481J3911l5476K6621K55355j42886j0470J64714
$$ plain form
5578 1538074 1558432 1655172 1446531 1239231 1255246 1337707 1576501 1446163 1357945 1296772 1464502
5567 1464502 1614066 1655334 1495515 1678424 1639860 1520163 1703049 1514147 1556558 1731441
5557 1731441 1707740 1677690 1786784 1626203 1619779 1640040 1655494 1740007 1727709 1603330 1423685
5546 1423685 1396235 1420283 1583453 1579839 1628145 1652472 1644739 1652782 1427610 1575322 1491897
5535 1491897 1506196 1728149 1737580 1683309 1476387 1520790 1672319 1846253 1863171 1959814 1909320
5524 1909320 1811138 1892151 1719746 1570254 1797770 1991840 1975869 2140371 2124348 2061110
5514 2061110 2200527 1946154 1942089 1890827 1832503 1901843 1966753 1964376 1778328 1741245 1889552
5503 1889552 2009350 1910063 1900502 1937884 1828551 1837690 1910010 1917967 1762937 1861551 1990760
$$ packed form
5578A538074K0358R6740k08641k07300J6015Q2461K38794j30338q8218o1173J67730
5567A464502J49564M1268j59819J82909l8564j19697J82886j88902M2411J74883
5557A731441k3701l0050J09094j60581o424K0261J5454Q4513j2298j24379j79645
5546A423685k7450K4048J63170l614M8306K4327p733Q043k25172J47712q3425
5535A491897J4299K21953R431n4271k06922M4403J51529J73934J6918R6643n0494
5524A909320r8182Q1013j72405j49492K27516J94070j5971J64502j6023o3238
5514B061110J39417k54373m065n1262n8324O9340O4910k377j86048l7083J48307
5503A889552J19798r9287r561L7382j09333R139P2320P957j55030R8614J29209
$$ plain form
5492 1990760 1772321 1700819 1924139 1926662 1906768 1990205 2020363 2053575 2267726 2361234 2257160
5481 2257160 2267417 2175494 2288576 2435368 2498612 2367775 2435251 2421151 2661457 2571595 2622758
5470 2622758 2599592 2780061 2805385 2791756 2905979 2828634 2988639 3162091 3120416 3207972 3358125
5459 3358125 3235019 2974805 3214057 3337012 3228102 3277842 3391245 3537602 3422340 3537314
5449 3537314 3508760 3591893 3620729 3664089 3454280 3573693 3696274 3819091 3926604 3882692
5439 3882692 3979218 3982062 3949939 3819910 3906334 3945263 4017895 4083898 4032267 4132777 4206074
5428 4206074 4448995 4580964 4791391 4663284 4685619 4622445 4751895 4883666 4895891 5308105
5418 5308105 5328313 5452563 5643150 5764585 5908922 5928936 6108633 6035531 6199880 6293123
$$ packed form
5492A990760k18439p1502K23320K523j9894Q3437L0158L3212K14151R3508j04074
5481B257160J0257r1923J13082J46792O3244j30837O7476j4100K40306q9862N1163
5470B622758k3166J80469K5324j3629J14223p7345J60005J73452m1675Q7556J50153
5459C358125j23106k60214K39252J22955j08910M9740J13403J46357j15262J14974
5449C537314k8554Q3133K8836M3360k09809J19413J22581J22817J07513m3912
5439C882692R6526K844l2123j30029Q6424L8929P2632O6003n1631J00510P3297
5428D206074K42921J31969K10427j28107K2335o3174J29450J31771J2225M12214
5418E308105K0208J24250J90587J21435J44337K0014J79697p3102J64349R3243
$$ plain form
5408 6293123 6126554 6289993 6397704 6414819 6339989 6263969 6184835 6333836 6376130 6313113 6510515
5397 6510515 6544497 6592689 6662880 6647243 6591667 6780026 6825728 7056796 6970410 6734117 6674476
5386 6674476 6995376 7208516 7203709 7162038 7137900 7154222 6988389 7105118 7088067 7140785 7156064
5375 7156064 7150092 7030717 7054841 7259726 7515861 7607518 7582690 7734136 7973533 7769102
5365 7769102 7917710 8062065 8076745 7920381 8028115 8125974 8172757 8073624 8032765 8119314 8173910
5354 8173910 8184273 8084164 8176950 8143606 8308705 8243775 8140898 8416908 8275863 8272865 8438081
5343 8438081 8637055 8577178 8593510 8615720 8545255 8484887 8663433 8654754 8496305 8530051 8301590
5332 8301590 8164562 8198378 8251636 8195072 8134600 8117262 8048518 7829407 7545644 7378396 7424971
$$ packed form
5408F293123j66569J63439J07711J7115p4830p6020p9134J49001M2294o3017J97402
5397F510515L3982M8192P0191j5637n5576J88359M5702K31068q6386k36293n9641
5386F674476L20900K13140m807m1671k4138J6322j65833J16729j7051N2718J5279
5375G156064n972j19375K4124K04885K56135R1657k4828J51446K39397k04431
5365G769102J48608J44355J4680j56364J07734R7859M6783r9133m0859Q6549N4596
5354H173910J0363j00109R2786l3344J65099o4930j02877K76010j41045k998J65216
5343H438081J98974n9877J6332K2210p0465o0368J78546q679j58449L3746k28461
5332H301590j37028L3816N3258n6564o0472j7338o8744k19111k83763j67248M6575
$$ plain form
5321 7424971 7281155 7192867 7090074 7316909 7279588 7169144 7143604 7068221 6982583 6969752 7011556
5310 7011556 6933294 6962419 6789098 6645785 6786110 6936610 7106773 7004920 7103564 7150652
5300 7150652 7218985 7286998 7314379 7518997 7531108 7552033 7641755 7669509 7940605 8095683 8152561
5289 8152561 8578040 8870909 9037725 9123854 9430334 9435063 9884898 10052165 10291253 10284388
5279 10284388 10488310 10728604 10796230 11025268 10963169 11185672 11108912 10898469 11305617 11466409
5269 11466409 11623555 11762354 11782109 12084606 12348665 12761819 12852106 12952495 13091614 13273032
5259 13273032 13548911 13818761 14135729 14478904 14642954 14971613 15341103 15807881 16180626
5250 16180626 16620074 17125564 18142375 19024003 19909445 21146317 22455128 23410069 24293099
$$ packed form
5321G424971j43816q8288j02793K26835l7321j10444k5540p5383q5638j2831M1804
5310G011556p8262K9125j73321j43313J40325J50500J70163j01853R8644M7088
5300G150652O8333O8013K7381K04618J2111K0925Q9722K7754K71096J55078N6878
5289H152561M25479K92869J66816Q6129L06480M729M49835J67267K39088o865
5279A0284388K03922K40294O7626K29038o2099K22503p6760k10443M07148J60792
5269A1466409J57146J38799J9755L02497K64059M13154R0287J00389J39119J81418
5259A3273032K75879K69850L16968L43175J64050L28659L69490M66778L72745
5250A6180626M39448N05490J016811Q81628Q85442J236872J308811R54941Q83030
$$ plain form
5241 24293099 25069114 25356615 25467242 25235218 25041118 24591793 24435247 24359158 24484982 24702546
5231 24702546 24886861 25453527 25934348 26576793 26974424 27051087 26936514 26933604 26867801 26986745
5221 26986745 26870446 26865790 26366282 25771987 25034179 23946902 23230092 22530951 21894742 21320504
5211 21320504 20900443 20558654 20077119 19964469 19759538 19779953 19925554 19888624 19845589 19828135
5201 19828135 20117240 20336767 20222415 20518979 20682215 20522510 20556913 20500577 20570745 20795108
5191 20795108 20623113 20563994 20738188 20615919 20772974 20702039 20658111 20752984 20784776 20813756
5181 20813756 20785061 20652532 20632162 20670122 20615460 20635434 20476973 20443991 20300274 20141336
5171 20141336 20019723 19646451 19533237 19483638 19313801 19084956 18922115 19118848 19310994 19242099
$$ packed form
5241B4293099P76015K87501J10627k32024j94100m49325j56546p6089J25824K17564
5231B4702546J84315N66666M80821O42445L97631P6663j14573k910o5803J18944
5221B6986745j16299m656m99508n94295p37808j087277p16810o99141o36209n74238
5211B1320504m20061l41789m81535j12650k04931K0415J45601l6930m3035j7454
5201A9828135K89105K19527j14352K96564J63236j59705L4403n6336P0168K24363
5191B0795108j71995n9119J74194j22269J57055p0935m3928R4873L1792K8980
5181B0813756k8695j32529k0370L7960n4662J9974j58461l2982j43717j58938
5171B0141336j21613l73272j13214m9599j69837k28845j62841J96733J92146o8895
$$ plain form
5161 19242099 19429280 19415574 19649718 19967445 20226082 20279087 20731293 21030923 21407011 21768718
5151 21768718 21988464 22344406 22473286 22566195 22639465 22760194 22960711 23030416 22721651 22720434
5141 22720434 22773617 22790249 22680313 22655568 22637557 22597050 22415882 22255413 22489018 22367764
5131 22367764 21966982 21703490 21562304 21234960 20823477 20609753 20348757 20135148 19788702
5122 19788702 19310734 19083740 18611628 18440357 18041374 17673520 17447988 17146620 16925242
5113 16925242 16744056 16625886 16545622 16426296 16508331 16329057 16309429 16426773 16244070 16117411
5103 16117411 16275254 16385479 16634405 16569248 16689486 16761480 16886674 17059606 17133784 17288738
5093 17288738 17363647 17533886 17610659 17954376 18263162 18342065 18750457 19072588 19347756 19413205
$$ packed form
5161A9242099J87181j3706K34144L17727K58637N3005M52206K99630L76088L61707
5151B1768718K19746L55942J28880R2909P3270J20729K00517O9705l08765j217
5141B2720434N3183J6632j09936k4745j8011m0507j81168j60469K33605j21254
5131B2367764m00782k63492j41186l27344m11483k13724k60996k13609l46446
5122A9788702m77968k26994m72112j71271l98983l67854k25532l01368k21378
5113A6925242j81186j18170q0264j19326Q2035j79274j9628J17344j82703j26659
5103A6117411J57843J10225K48926o5157J20238P1994J25194J72932P4178J54954
5093A7288738P4909J70239P6773L43717L08786P8903M08392L22131K75168O5449
$$ plain form
5083 19413205 19750769 19947470 19994740 20526866 21077505 21577775 21736554 22231657 22600143 22954164
5073 22954164 23382222 23850657 24381055 24807668 25502144 26270309 26887719 27504488 28285755
5064 28285755 29130412 29969012 30905139 31765030 32473048 33461383 34738036 35721060 36681453
5055 36681453 37665164 38927278 40232618 41801255 43145784 44816300 46365240 48246276
5047 48246276 50044513 51667212 53915805 56245510 58591668 60917586 63211463 65845361
5039 65845361 68455383 71043973 73934294 77249070 80503540 84018642 88022252 92453376
5031 92453376 97432905 103191331 109726723 116263176 122647311 129169987 135265569 140297578
5023 140297578 144421253 147640815 150951456 154666638 158404713 162634925 167727663 173553522
$$ packed form
5083A9413205L37564J96701M7270N32126N50639N00270J58779M95103L68486L54021
5073B2954164M28058M68435N30398M26613O94476P68165O17410O16769P81267
5064B8285755Q44657Q38600R36127Q59891P08018R88335J276653R83024R60393
5055C6681453R83711J262114J305340J568637J344529J670516J548940J881036
5047D8246276J798237J622699K248593K329705K346158K325918K293877K633898
5039F5845361K610022K588590K890321L314776L254470L515102M003610M431124
5031I2453376M979529N758426O535392O536453O384135O522676O095582N032009
5023A40297578M123675L219562L310641L715182L738075M230212N092738N825859
$$ plain form
5015 173553522 179972703 186263283 192727627 199977109 207605839 214439658 218980068 220738030
5007 220738030 221797288 223531002 226151532 230192510 234374594 238655336 241731666 243119088
4999 243119088 242723180 242739473 243950611 246018181 247628641 247364174 244585660 240469457 235822584
4990 235822584 231398877 227341328 223420948 218684622 212549845 206263479 200272586 195584448
4982 195584448 192292906 190004102 188050834 184165017 177023032 169946649 164258747 159487637
4974 159487637 155955076 153242664 150577075 147163715 141494475 134830082 128081874 122147751
4966 122147751 117163111 113014315 109530279 107032102 104923775 103053763 101685097 100886449
4958 100886449 100405568 99911936 100088970 100725128 101641443 102732242 104065448 105586387 107695044
$$ packed form
5015A73553522O419181O290580O464344P249482P628730O833819M540410J757962
5007B20738030J059258J733714K620530M040978M182084M280742L076330J387422
4999B43119088l95908J6293J211138K067570J610460k64467k778514m116203m646873
4990B35822584m423707m057549l920380m736326o134777o286366n990893m688138
4982A95584448l291542k288804j953268l885817p141985p076383n687902m771110
4974A59487637l532561k712412k665589l413360n669240o664393o748208n934123
4966A22147751m984640m148796l484036k498177k108327j870012j368666p98648
4958A00886449m80881m93632J77034O36158R16315J090799J333206J520939K108657
$$ plain form
4949 107695044 110009197 112382859 115264044 118220551 122003070 125854239 130357872 135447687
4941 135447687 141090671 147058903 153379655 160183876 167021630 174042212 181384621 188473598
4933 188473598 195747192 202875862 210012539 216937013 223305364 229568308 236382972 244033298
4925 244033298 252646231 262739984 273511565 285238573 297204985 308500453 319293432
4918 319293432 329549875 338591915 345885913 350581483 352533693 353330316 354205899 355488620
4910 355488620 357554967 360710194 364583229 368263948 371548339 374360271 378062547 382038841
4902 382038841 385545934 387801652 387798800 385793368 381565770 376136075 370425681 364019371
4894 364019371 356526344 346972587 335738913 324387286 313603443 304117994 296402831 290152579
$$ packed form
4949A07695044K314153K373662K881185K956507L782519L851169M503633N089815
4941A35447687N642984N968232O320752O804221O837754P020582P342409P088977
4933A88473598P273594P128670P136677O924474O368351O262944O814664P650326
4925B44033298Q612933J0093753J0771581J1727008J1966412J1295468J0792979
4918C19293432J0256443R042040P293998M695570J952210P96623Q75583J282721
4910C55488620K066347L155227L873035L680719L284391K811932L702276L976294
4902C82038841L507093K255718k852k005432m227598n429695n710394o406310
4894C64019371p493027r553757j1233674j1351627j0783843r485449p715163o250252
$$ plain form
4886 290152579 284272115 277029612 268220622 258540365 249491205 241629708 234670400 228433129
4878 228433129 222207632 215008919 206108243 195918765 185405014 175049347 165287257 156250779
4870 156250779 148064668 140630612 133420782 126878402 120723138 115301464 110500638 106071847
4862 106071847 101789869 97775399 94071413 90650320 87425607 84117607 81094385 78608440
4854 78608440 75895143 73384456 70918917 68601620 66489786 64614498 62837914 61029459
4846 61029459 59734651 58035521 56490053 55347295 53889431 52766384 51881895 50641920
4838 50641920 49598694 48857044 47880025 47013963 46098861 45483586 44971759 44271383 43814949
4829 43814949 43157754 42735140 42243559 41780746 41382764 40842192 40454250 40036176 39729267
$$ packed form
4886B90152579n880464p242503q808990r680257r049160p861497o959308o237271
4878B28433129o225497p198713q900676j0189478j0513751j0355667r762090r036478
4870A56250779q186111p434056p209830o542380o155264n421674m800826m428791
4862A06071847m281978m014470l703986l421093l224713l308000l023222k485945
4854G8608440k713297k510687k465539k317297k111834j875288j776584j808455
4846F1029459j294808j699130j545468j142758j457864j123047q84489j239975
4838E0641920j043226p41650r77019q66062r15102o15275n11827p00376m56434
4829D3814949o57195m22614m91581m62813l97982n40572l87942m18074l06909
$$ plain form
4820 39729267 39531110 39291424 39061549 38691273 38513285 38481289 38394783 38514561 38441145 38198813
4810 38198813 38132606 38171196 38223417 38137687 38214576 38255006 38268651 38481788 38464383 38286515 38641422
4799 38641422 38681386 38665978 38857529 38890099 39231334 39452366 39426389 39573621 39767479 40011243
4789 40011243 39907977 40062052 40139298 40318279 40678402 40700347 40671128 40807839 40829495 40640870
4779 40640870 41046482 41147107 41047434 41245798 41173569 41075649 41344907 41309249 41317706 41340696 41186324
4768 41186324 41215891 40857971 40890540 41093302 40763246 40542472 40505712 40256985 40139288 40066942
4758 40066942 39870566 39732125 39888987 39781689 39920449 39838740 39722593 39673544 39463971 39585385
4748 39585385 39654976 39613323 39798278 39995003 40015968 40097951 40466712 40663652 40843288 40955830
$$ packed form
4820C9729267j98157k39686k29875l70276j77988l1996q6506J19778p3416k42332
4810C8198813o6207L8590N2221q5730P6889M0430J3645K13137j7405j77868L54907
4799C8641422L9964j5408J91551L2570L41235K21032k5977J47232J93858K43764
4789D0011243j03266J54075P7246J78981L60123K1945k9219J36711K1656j88625
4779D0640870M05612J00625r9673J98364p2229r7920K69258l5658Q457K2990j54372
4768D1186324K9567l57920L2569K02762l30056k20774l6760k48727j17697p2346
4758D0066942j96376j38441J56862j07298J38760q1709j16147m9049k09573J21414
4748C9585385O9591m1653J84955J96725K0965Q1983L68761J96940J79636J12542
$$ plain form
4738 40955830 41475016 41730478 42191323 42402278 42554392 43029897 43592942 43785598 43931139
4729 43931139 44409842 44632468 45046548 45263870 45808465 46162368 46798582 47141487 47680256
4720 47680256 48124275 48410638 49012057 49348175 49932486 50532879 50944051 51336580 51727948
4711 51727948 52380787 52941553 53270720 53752922 54275166 54877148 55498596 55875902 56390701
4702 56390701 56517644 56892960 57432708 57954812 58502182 59020270 59415941 60058588 60501072
4693 60501072 60980427 61298115 61878310 62128227 62550133 63087005 63678330 64408153 65051494
4684 65051494 65783329 66472282 67331805 68304366 69102666 69993000 70819137 71622144 72532757
4675 72532757 73478064 74309958 75157126 76164842 77132742 78485388 79323256 80309179 81522957
$$ packed form
4738D0955830N19186K55462M60845K10955J52114M75505N63045J92656J45541
4729D3931139M78703K22626M14080K17322N44595L53903O36214L42905N38769
4720D7680256M44019K86363O01419L36118N84311O00393M11172L92529L91368
4711E1727948O52839N60766L29167M82202N22244O01982O21448L77306N14799
4702E6390701J26943L75316N39748N22104N47370N18088L95671O42647M42484
4693F0501072M79355L17688N80195K49917M21906N36872N91325P29823O43341
4684F5051494P31835O88953Q59523R72561P98300Q90334Q26137Q03007R10613
4675G2532757R45307Q31894Q47168J007716R67900J352646Q37868R85923J213778
$$ plain form
4666 81522957 82861844 84336844 85805968 87158818 88487671 89965972 91495619 92992563
4658 92992563 94610733 96537135 98290634 100079838 102023016 104213809 106204190 108067319
4650 108067319 110119507 112023621 114238628 116390245 118400519 120921072 123476458 126157444
4642 126157444 129040285 131973317 135111394 138614232 142104315 145677502 149278103 153082313
4634 153082313 156864427 160668683 164420102 168096935 172265443 176393254 181141298 186317561
4626 186317561 192604920 199279878 206884440 215805797 225928662 237209386 248728533 259736278
4618 259736278 270427328 281034634 290377625 297801693 303334545 307659362 311680056 316132289
4610 316132289 320938439 327223801 335211916 344551613 355342460 367569883 380794146 395094444
$$ packed form
4666H1522957J338887J475000J469124J352850J328853J478301J529647J496944
4658I2992563J618170J926402J753499J789204J943178K190793J990381J863129
4650A08067319K052188J904114K215007K151617K010274K520553K555386K680986
4642A26157444K882841K933032L138077L502838L490083L573187L600601L804210
4634A53082313L782114L804256L751419L676833M168508M127811M748044N176263
4626A86317561O287359O674958P604562Q921357J0122865J1280724J1519147J1007745
4618B59736278J0691050J0607306R342991P424068N532852M324817M020694M452233
4610C16132289M806150O285362P988115R339697J0790847J2227423J3224263J4300298
$$ plain form
4602 395094444 410049743 424699724 437730678 447507768 452992112 454944165 456360857 457783911
4594 457783911 459118811 460465148 461455562 463076430 465129803 465819428 467303323 470478396
4586 470478396 474643273 478010366 479874597 479591618 477614237 474885429 472117358 469478867
4578 469478867 466219805 461818053 455911009 448845062 440937972 432763203 425240224 418786181
4570 418786181 413692111 409320758 404353040 399142405 395084516 392194983 390388372 389620179
4562 389620179 390238201 391825316 393844013 395283983 396370099 397483893 398095749 398829857
4554 398829857 399413180 399724287 398840815 396621299 393195825 389113053 384552965 380051704
4546 380051704 375765874 371576648 367728190 363992241 360291184 355725657 349989214 343163810
$$ packed form
4602C95094444J4955299J4649981J3030954R777090N484344J952053J416692J423054
4594D57783911J334900J346337R90414J620868K053373O89625J483895L175073
4586D70478396M164877L367093J864231k82979j977381k728808k768071k638491
4578D69478867l259062m401752n907044p065947p907090q174769p522979o454043
4570D18786181n094070m371353m967718n210635m057889k889533j806611p68193
4562C89620179O18022J587115K018697J439970J086116J113794O11856P34108
4554C98829857N83323L11107q83472k219516l425474m082772m560088m501261
4546C80051704m285830m189226l848458l735949l701057m565527n736443o825404
$$ plain form
4538 343163810 335839982 328082800 319391511 309730041 298499446 286693406 274617503 262937569
4530 262937569 251842909 241389652 231700367 222518042 214193133 206912304 200204366 194443345
4522 194443345 189083435 184432689 180352347 176785889 173806735 171096257 168708917 166237326
4514 166237326 164547182 163085484 161732944 160530823 159643695 159058595 158220098 157067711
4506 157067711 155783066 154815171 153924759 153415463 153017618 152819367 152600215 152780957 153042319
4497 153042319 153821479 155115094 156657808 158599974 161392613 164870302 168862502 172928304
4489 172928304 177379725 181537752 185475496 188439753 190701204 192175005 193561022 195497307
4481 195497307 197823155 200479901 203356960 206581636 210073348 214220198 218880054 224360565
$$ packed form
4538C43163810p323828p757182q691289r661470j1230595j1806040j2075903j1679934
4530B62937569j1094660j0453257r689285r182325q324909p280829o707938n761021
4522A94443345n359910m650746m080342l566458k979154k710478k387340k471591
4514A66237326j690144j461698j352540j202121q87128n85100q38497j152387
4506A57067711j284645r67895q90412n09296l97845j98251k19152J80742K61362
4497A53042319P79160J293615J542714J942166K792639L477689L992200M065802
4489A72928304M451421M158027L937744K964257K261451J473801J386017J936285
4481A95497307K325848K656746K877059L224676L491712M146850M659856N480511
$$ plain form
4473 224360565 229738547 234542749 237630001 239255108 240469945 241833083 243991525 246708928
4465 246708928 248983591 250441192 250391773 248987981 247437471 246433678 246071540 246186642 245778265
4456 245778265 243718312 239948770 235134225 230027416 225462348 221152681 216528476 211281768
4448 211281768 205958642 200044574 194530896 189439469 185152343 181328981 176517324 170488113
4440 170488113 164097664 157304622 151468813 146416056 142012180 137680234 132986371 127836782
4432 127836782 121906161 115403702 109245159 103269561 98030488 93480979 89211052 85277877
4424 85277877 81711119 78340886 75373125 72644876 69949472 67483484 64903733 63083800
4416 63083800 61229454 59044863 57237141 55779316 54011759 52406412 51111711 49708243
$$ packed form
4473B24360565N377982M804202L087252J625107J214837J363138K158442K717403
4465B46708928K274663J457601m9419j403792j550510j003793l62138J15102m08377
4456B45778265k059953l769542m814545n106809m565068m309667m624205n246708
4448B11281768n323126n914068n513678n091427m287126l823362m811657o029211
4440A70488113o390449o793042n835809n052757m403876m331946m693863n149589
4432A27836782n930621o502459o158543n975598n239073m549509m269927l933175
4424H5277877l566758l370233k967761k728249k695404k465988k579751j819933
4416F3083800j854346k184591j807722j457825j767557j605347j294701j403468
$$ plain form
4408 49708243 48498669 47455763 46366107 45170591 44269055 43291992 42630910 41765426 40928459
4399 40928459 40068741 39209749 38660113 37963431 37326512 36873818 36381230 35657788 35472058
4390 35472058 35088635 34659723 34272088 33784061 33593942 33199040 32895107 32558894 32230189
4381 32230189 32068074 31869204 31776847 31687077 31592111 31561325 31416308 31219671 31442723 31284887
4371 31284887 31425652 31287175 31440454 31721666 31826073 31828309 31933050 31643998 31845545 31977392
4361 31977392 32086889 32261789 32121543 32093797 32487363 32845547 33063496 33245815 33379634 33399930
4351 33399930 33474333 33607508 33919613 33784747 33956400 34074887 34222257 34264563 34275026 34400069
4341 34400069 34349365 34573973 35120729 35376925 35698286 36302005 36720777 37062198 37049435 37541690
$$ packed form
4408D9708243j209574j042906j089656j195516r01536r77063o61082q65484q36967
4399D0928459q59718q58992n49636o96682o36919m52694m92588p23442j85730
4390C5472058l83423m28912l87635m88027j90119l94902l03933l36213l28705
4381C2230189j62115j98870r2357q9770r4966l0786j45017j96637K23052j57836
4371C1284887J40765j38477J53279K81212J04407K236J04741k89052K01547J31847
4361C1977392J09497J74900j40246k7746L93566L58184K17949J82319J33819K0296
4351C3399930P4403J33175L12105j34866J71653J18487J47370M2306J0463J25043
4341C4400069n0704K24608N46756K56196L21361O03719M18772L41421j2763M92255
$$ plain form
4331 37541690 37690205 37899477 38216181 38570685 38796243 39559809 40317309 41115005 41941456
4322 41941456 42764087 44104623 44908303 45708674 46366815 47127034 48082854 48871332 49100722
4313 49100722 49390787 49545793 49633756 49612883 49602150 49633147 49472680 49485583 49513409 49818367
4303 49818367 49847159 50455898 50952267 51284678 51729970 52192892 52320553 52562312 52789516 52919356
4293 52919356 53144348 53321566 53338196 53245050 53229092 53178426 52935868 52604453 52200906 51659038
4283 51659038 50966036 50308318 49652750 49103731 48266372 48003798 47517058 47231276 46903723
4274 46903723 46189374 46047258 45675065 45487729 45244461 45002072 44875104 44630352 44458164
4265 44458164 44363973 44020371 43795080 43880673 43456046 43381042 43384806 43359264 43283323 43225983 43228536
$$ packed form
4331C7541690J48515K09272L16704L54504K25558P63566P57500P97696Q26451
4322D1941456Q22631J340536Q03680Q00371O58141P60219R55820P88478K29390
4313D9100722K90065J55006Q7963k0873j0733L0997j60467J2903K7826L04958
4303D9818367K8792O08739M96369L32411M45292M62922J27661K41759K27204J29840
4293E2919356K24992J77218J6630r3146j5958n0666k42558l31415m03547n41868
4283E1659038o93002o57718o55568n49019q37359k62574m86740k85782l27553
4274D6903723p14349j42116l72193j87336k43268k42389j26968k44752j72188
4265D4458164r4191l43602k25291Q5593m24627p5004L764k5542p5941n7340K553
$$ plain form
4254 43228536 43302087 43157458 42929968 42683767 42643268 42863285 42745343 42730297 42507921 42413458
4244 42413458 42400288 42340367 42427503 42301199 42076388 42182262 42005799 42093993 41891538 41840378
4234 41840378 42209767 42027147 42051805 42191661 42211033 42595083 42617567 42515861 42631708 42810230
4224 42810230 42921524 42905374 42837841 42656894 42834574 42984527 43052269 43150993 43356617 43383931
4214 43383931 43478934 43539436 43672468 44006422 44140470 44586132 45019644 45230851 45401486 45840880
4204 45840880 46017330 46571536 47183693 47341177 47846219 48503504 49124141 49622296 50051947
4195 50051947 50838442 51662619 52212637 53069082 53940865 54638621 55250242 56129754 56657365
4186 56657365 56975600 57643166 58411450 59077436 59954675 60785226 61863823 62985595 64237362
$$ packed form
4254D3228536P3551j44629k27490k46201m0499K20017j17942j5046k22376r4463
4244D2413458j3170n9921Q7136j26304k24811J05874j76463Q8194k02455n1160
4234D1840378L69389j82620K4658J39856J9372L84050K2484j01706J15847J78522
4224D2810230J11294j6150o7533j80947J77680J49953O7742R8724K05624K7314
4214D3383931R5003O0502J33032L33954J34048M45662M33512K11207J70635M39394
4204D5840880J76450N54206O12157J57484N05042O57285O20637M98155M29651
4195E0051947P86495Q24177N50018Q56445Q71783O97756O11621Q79512N27611
4186E6657365L18235O67566P68284O65986Q77239Q30551J078597J121772J251767
$$ plain form
4177 64237362 65744876 66947930 68429406 69738944 71168921 72808201 74672137 76607118
4169 76607118 78670144 80852822 83666654 86282427 88279778 90287487 92257650 94091128
4161 94091128 96181700 98146323 100390808 102855438 105316986 108363710 111529916 114985850
4153 114985850 118015255 120531208 123560397 126959032 130700538 134642180 139274273 144380931
4145 144380931 149287026 154957353 161107420 168411798 176814453 186446654 197952538 212275448
4137 212275448 229965374 252412465 282067654 316490684 351981810 384981118 410404502
4130 410404502 425601946 417854248 399710539 384827582 373105329 361869690 351256486
4123 351256486 347284297 351073069 362160927 381704383 411549209 446098363 460599235
$$ packed form
4177F4237362J507514J203054J481476J309538J429977J639280J863936J934981
4169G6607118K063026K182678K813832K615773J997351K007709J970163J833478
4161I4091128K090572J964623K244485K464630K461548L046724L166206L455934
4153A14985850L029405K515953L029189L398635L741506L941642M632093N106658
4145A44380931M906095N670327O150067P304378Q402655R632201J1505884J4322910
4137B12275448J7689926K2447091K9655189L4423030L5491126L2999308K5423384
4130D10404502J5197444p747698j8143709j4882957j1722253j1235639j0613204
4123C51256486l972189L788772J1087858J9543456K9844826L4549154J4500872
$$ plain form
4116 460599235 442432971 431134475 431823513 436418118 439777355 447527961 446454091 415042349
4108 415042349 371018452 332473271 305736969 286627592 273104589 263245088 254496742
4101 254496742 244159692 233413487 225308616 219370109 215046409 211061523 205394643 198153649
4093 198153649 191107958 185267401 179864352 174880764 170327749 166357768 162860251 159978593
4085 159978593 157890024 156426494 155178491 153961708 153067250 152666293 152298922 152584149 153036619
4076 153036619 153942351 154948431 156613115 158328340 159877279 161054106 161881920 161033547
4068 161033547 159189290 157863076 157251745 157173762 157472015 158559146 159920439 161058074 162905439
4059 162905439 166139615 169239198 170055936 169317150 169513901 170073809 170537903 171829427 173857747
$$ packed form
4116D60599235j8166264j1298496O89038M594605L359237P750606j073870l1411742
4108D15042349m4023897l8545181k6736302j9109377j3523003r859501q748346
4101B54496742j0337050j0746205q104871n938507m323700l984886n666880p240994
4093A98153649p045691n840557n403049m983588m553015l969981l497517k881658
4085A59978593k088569j463530j248003j216783q94458m00957l67371K85227M52470
4076A53036619R05732J006080J664684J715225J548939J176827Q27814q48373
4068A61033547j844257j326214o11331p7983K98253J087131J361293J137635J847365
4059A62905439L234176L099583Q16738p38786J96751N59908M64094J291524K028320
$$ plain form
4050 173857747 174160491 172901157 172195182 172325144 173783454 176112661 179024151 183311164
4042 183311164 188233985 193743848 199212088 203886281 207578789 210355282 213506333 217306609
4034 217306609 221461390 225645125 230721601 236437092 242694434 249990544 258240482 266153547
4026 266153547 271301215 275927292 282446689 289540390 297510832 305821445 313279645 317941474
4018 317941474 321671859 325480213 330221323 335355438 340278157 345260788 349269367 352244640
4010 352244640 354239816 355194389 355497276 354977057 354500646 354610009 355666859 357623571 360305951
4001 360305951 362719632 364610496 365365357 364377619 362073252 358771461 354719486 350599485
3993 350599485 345866974 340447753 334381317 327930670 322284761 317429076 312644830 308117114
$$ packed form
4050A73857747L02744j259334p05975J29962J458310K329207K911490M287013
4042A83311164M922821N509863N468240M674193L692508K776493L151051L800276
4034B17306609M154781M183735N076476N715491O257342P296110Q249938P913065
4026B66153547N147668M626077O519397P093701P970442Q310613P458200M661829
4018C17941474L730385L808354M741110N134115M922719M982631M008579K975273
4010C52244640J995176R54573L02887n20219m76411J09363J056850J956712K682380
4001C60305951K413681J890864P54861r87738k304367l301791m051975m120001
3993C50599485m732511n419221o066436o450647n645909m855685m784246m527716
$$ plain form
3985 308117114 304750456 302829591 302291394 302555166 301969718 298723079 293069562 288458496
3977 288458496 284905579 282874592 281870559 280950361 279293112 277969316 277796145 279333289
3969 279333289 282402095 286640759 291999766 298560893 306559067 316186614 327669842 341915318
3961 341915318 359296221 381692393 408971066 438281784 465075231 484663799 493098304
3954 493098304 482042233 463710441 448927538 437160774 425057181 414634076 409555224
3947 409555224 411937023 422578389 443662266 472795542 488668404 469522217 448057090
3940 448057090 439491482 436645738 435904893 439752078 431142509 395034743 352801791 318544611
3932 318544611 293976642 274741008 259707342 247093390 235893823 225200370 216089605
$$ packed form
3985C08117114l366658j920865n38197K63772n85448l246639n653517m611066
3977B88458496l552917k030987j004033r20198j657249j323796j73171J537144
3969B79333289L068806M238664N359007O561127P998174R627547J1483228J4245476
3961C41915318J7380903K2396172K7278673K9310718K6793447J9588568Q434505
3954D93098304j1056071j8331792j4782903j1766764j2103593j0423105n078852
3947D09555224K381799J0641366K1083877K9133276J5872862j9146187k1465127
3940D48057090q565608k845744p40845L847185q609569l6107766m2232952l4257180
3932C18544611k4567969j9235634j5033666j2613952j1199567j0693453r110765
$$ plain form
3925 216089605 208336221 202388296 196817397 192149946 187864757 184531911 182150296 180785447
3917 180785447 180173411 180291140 180717741 182502895 185205064 188957972 192785446 196732253
3909 196732253 200197873 204825532 211963596 222820533 235096734 246186988 252476636 252950626
3901 252950626 249326194 245525432 240429421 233543902 229233700 229848781 234803819 243518821
3893 243518821 246992899 236776887 224300799 215618776 209105031 203937647 194348887 177314408
3885 177314408 159374256 144669218 132773728 123437859 115519346 108743014 102835338 97460740
3877 97460740 93115236 89479179 86387173 83653151 81143055 78910098 76703220 74884720
3869 74884720 73204829 71764666 70631458 69610893 69046800 68608990 67971066 67602745 67520220
$$ packed form
3925B16089605p753384n947925n570899m667451m285189l332846k381615j364849
3917A80785447o12036J17729M26601J785154K702169L752908L827474L946807
3909A96732253L465620M627659P138064J0856937J2276201J1090254O289648M73990
3901B52950626l624432l800762n096011o885519m310202O15081M955038Q715002
3893B43518821L474078j0216012j2476088q682023o513745n167384r588760j7034479
3885A77314408j7940152j4705038j1895490r335869p918513o776332n907676n374598
3877I7460740m345504l636057l092006k734022k510096k232957k206878j818500
3869G4884720j679891j440163j133208j020565n64093m37810o37924l68321q2525
$$ plain form
3860 67520220 67868379 67929905 68065864 68232355 68282284 68158095 68477773 68687121 69080325 69745595
3850 69745595 70605293 71945227 73261713 74634159 76147751 77538489 79229450 81122165
3842 81122165 83166227 85212311 87154312 89366592 91664419 94053618 96308612 98708350
3834 98708350 101358156 104334055 107523320 110665212 114037150 117542641 121423161 125333221
3826 125333221 129606114 134555219 139923277 146305086 153526922 161240736 170082816 179828069
3818 179828069 190381973 202647007 216932566 233930375 253949474 277566944 304923512
3811 304923512 335514471 365330220 390091124 405404574 409941930 406971885 401184379
3804 401184379 395569627 392033961 392804938 399224832 411465657 427008006 439315816 440399513
$$ packed form
3860F7520220L48159O1526J35959J66491M9929j24189L19678K09348L93204O65270
3850F9745595Q59698J339934J316486J372446J513592J390738J690961J892715
3842H1122165K044062K046084J942001K212280K297827K389199K254994K399738
3834I8708350K649806K975899L189265L141892L371938L505491L880520L910060
3826A25333221M272893M949105N368058O381809P221836P713814Q842080R745253
3818A79828069J0553904J2265034J4285559J6997809K0019099K3617470K7356568
3811C04923512L0590959K9815749K4760904J5313450M537356k970045n787506
3804D01184379n614752l535666P70977O419894J2240825J5542349J2307810J083697
$$ plain form
3796 440399513 432976728 425083010 419023662 413555942 404334844 387205628 363182105 337681171
3788 337681171 314052773 293375195 274984868 259315319 245827199 233958468 223712891
3781 223712891 215308436 208326401 202170800 196136041 190252713 184198157 178523618 173206346
3773 173206346 167714968 162200755 156164465 149597022 143464122 137969968 132939850 128125198
3765 128125198 123760451 120103302 116540672 113217382 110029000 107168915 104332512 101523620
3757 101523620 98722638 96076563 93631279 91389600 89146801 86765516 84331895 82066696
3749 82066696 79927373 77822697 75744937 73746584 71966856 70444562 69296319 68046803
3741 68046803 67104020 66557018 65973860 65551921 65497968 65278559 64602350 64153406 63794683 63423757
$$ packed form
3796D40399513p422785p893718o059348n467720r221098j7129216k4023523k5500934
3788C37681171k3628398k0677578j8390327j5669549j3488120j1868731j0245577
3781B23712891q404455o982035o155601o034759n883328o054556n674539n317272
3773A73206346n491378n514213o036290o567443o132900n494154n030118m814652
3765A28125198m364747l657149l562630l323290l188382k860085k836403k808892
3757A01523620k800982k646075k445284k241679k242799k381285k433621k265199
3749H2066696k139323k104676k077760j998353j779728j522294j148243j249516
3741F8046803r42783n47002n83158m21939n3953k19409o76209m48944l58723l70926
$$ plain form
3731 63423757 63234891 63227639 63251287 63462898 63552074 63586252 63426156 63388252 63365782 63324251 63339644
3720 63339644 63174399 62748753 62352364 62133080 61570534 61326642 61386524 61442294 61153650 61039782
3710 61039782 61275533 61548070 61872732 62325650 63052562 63297715 63548388 63800808 64353775
3701 64353775 65012159 65818366 67048622 68315634 69575028 71216089 73328381 75872966
3693 75872966 79235523 82268503 84790377 86558171 87287483 86796642 86258719 85932661 86107420
3684 86107420 86760030 87917516 89530273 91273597 92842780 93687010 94424141 93598778 91902173
3675 91902173 90427065 89887834 90349349 91182483 91439815 89266988 85239335 80732857 76640827
3666 76640827 73443776 70245968 66746408 62894779 59236882 56125111 53617209 51058474
$$ packed form
3731F3423757j88866p252K3648K11611Q9176L4178j60096l7904k2470m1531J5393
3720F3339644j65245m25646l96389k19284n62546k43892N9882N5770k88644j13868
3710F1039782K35751K72537L24662M52918P26912K45153K50673K52420N52967
3701F4353775O58384Q06207J230256J267012J259394J641061K112292K544585
3693G5872966L362557L032980K521874J767794P29312m90841n37923l26058J74759
3684H6107420O52610J157486J612757J743324J569183Q44230P37131q25363j696605
3675I1902173j475108n39231M61515Q33134K57332k172827m027653m506478m092030
3666G6640827l197051l197808l499560l851629l657897l111771k507902k558735
$$ plain form
3658 51058474 48961700 47117633 45554833 43704902 42049472 40772754 39672787 38638464
3650 38638464 37778177 37108320 36185190 35565028 35134509 34698666 34229110 33911443 33379389
3641 33379389 33032977 32983044 33075956 33022828 33091575 33189906 33915355 34882140 36295550 37974230
3631 37974230 39422273 40354840 39999750 39032012 37952898 36880114 36067632 35517936 35040115
3622 35040115 35527614 36453542 37980044 38206977 36466427 35366800 34857779 34302329 34044405
3613 34044405 32661774 30065342 28158077 26206309 24986448 24015536 23056596 22298117 21717077
3604 21717077 21228758 20833240 20484453 20095949 19758831 19565347 19106262 18655526 18599666 18292447
3594 18292447 17964322 17711071 17681804 17538913 17438269 17457829 17305898 17295369 17156417 16998560
$$ packed form
3658E1058474k096774j844067j562800j849931j655430j276718j099967j034323
3650C8638464q60287o69857r23130o20162m30519m35843m69556l17667n32054
3641C3379389l46412m9933R2912n3128O8747R8331P25449R66785J413410J678680
3631C7974230J448043R32567l55090r67738j079114j072784q12482n49696m77821
3622C5040115M87499R25928J526502K26933j740550j099627n09021n55450k57924
3613C4044405j382631k596432j907265j951768j219861r70912r58940p58479n81040
3604B1717077m88319l95518l48787l88504l37118j93484m59085m50736n5860l07219
3594A8292447l28125k53251k9267j42891j00644J9560j51931j0529j38952j57857
$$ plain form
3584 16998560 16643189 16800744 16989693 16875986 16702977 16354920 16259618 16257034 15959587 15866236
3574 15866236 15896564 15811080 15708104 15641825 15488588 15323385 15242959 15249954 15355139 15249225
3564 15249225 15245897 15064660 15184903 15368678 15176008 15240231 15344878 15420035 15635433 15422313
3554 15422313 15654229 15683326 15821255 15837506 15954486 15838913 15901838 16078079 16242979 16629110
3544 16629110 16988041 17144371 17364856 17385253 17284330 17476575 17456551 17531418 17476575 17363699
3534 17363699 17265272 17198265 17150452 17174139 17242975 17394464 17286133 17151479 17171924 17230123 16960633
3523 16960633 16753085 16179108 16005624 15947766 15760076 15921328 15960561 16036099 15966917 15928859
3513 15928859 15919500 15814297 15874380 15919964 15824740 15717764 15716656 15542845 15504622 15504173 15331854
$$ packed form
3584A6998560l55371J57555J88949j13707j73009l48057r5302k584k97447r3351
3574A5866236L0328q5484j02976o6279j53237j65203q0426O995J05185j05914
3564A5249225l328j81237J20243J83775j92670O4223J04647P5157K15398k13120
3554A5422313K31916K9097J37929J6251J16980j15573O2925J76241J64900L86131
3544A6629110L58931J56330K20485K0397j00923J92245k0024P4867n4843j12876
3534A7363699r8427o7007m7813K3687O8836J51489j08331j34654K0445N8199k69490
3523A6960633k07548n73977j73484n7858j87690J61252L9233P5538o9182l8058
3513A5928859r359j05203O0083M5584r5224j06976j108j73811l8223m49j72319
$$ plain form
3502 15331854 15209142 15200204 15111791 14551707 14356464 14168015 13824154 13812353 13587978 13227408
3492 13227408 12884511 12566415 12365705 12203538 11918265 11612265 11429793 11256526 11332676 11117195
3482 11117195 11218456 11470258 11399553 11299268 11088717 10740658 10621758 10583808 10753222 10605426
3472 10605426 10685453 10693143 10541044 10703427 10603040 10528214 10405117 10413295 10266713 10153815
3462 10153815 9907345 10118713 9817539 9722231 9645847 9698325 9597977 9546664 9647166 9580014
3452 9580014 9537534 9612202 9777191 9857982 10009354 9893426 9690942 9722571 9686472 9589164 9407807
3441 9407807 9156855 9282935 9100780 9017376 9205085 9114688 9258705 9278440 9637889 9564931
3431 9564931 9342363 9459485 9654106 9744843 9826558 9899357 9925584 10139673 9890831 9766677
$$ packed form
3502A5331854j22712q938q8413n60084j95243j88449l43861j1801k24375l60570
3492A3227408l42897l18096k00710j62167k85273l06000j82472j73267P6150k15481
3482A1117195J01261K51802p0705j00285k10551l48059j18900l7950J69414j47796
3472A0605426Q0027P690j52099J62383j00387p4826j23097Q178j46582j12898
3462A0153815k46470K11368l01174r5308p6384N2478j00348n1313J00502o7152
3452I580014m2480P4668J64989Q0791J51372j15928k02484L1629l6099r7308j81357
3441I407807k50952J26080j82155q3404J87709r0397J44017J9735L59449p2958
3431I564931k22568J17122J94621R0737Q1715P2799K6227K14089k48842j24154
$$ plain form
3421 9766677 9634786 9656260 9410764 9174901 8923298 8853125 8847747 8822266 8857601 8957824 9051344
3410 9051344 9032558 9029449 9284130 9465425 9423323 9495282 9518230 9502058 9535629 9331712 9206154
3399 9206154 8912510 8775974 8765133 8576156 8482731 8351049 8094904 8156968 7957689 7752550
3389 7752550 7899766 7948942 7849213 7972564 7845547 8109050 8031125 7960944 8010372 7951940 7845266
3378 7845266 7613272 7575550 7413746 7274323 7171665 6844325 6640297 6630816 6488947 6487298
3368 6487298 6453251 6537936 6488562 6417955 6422919 6406980 6269897 6261810 6359599 6499982 6406899
3357 6406899 6310334 6176263 6161622 6089671 6131188 5969892 5894121 5677097 5630802 5394193 5474763
3346 5474763 5449402 5495124 5626150 5834979 5838251 5945745 6104782 6087745 6081131 6231397 6126639
$$ packed form
3421I766677j31891K1474k45496k35863k51603p0173n378k5481L5335J00223R3520
3410I051344j8786l109K54681J81295m2102P1959K2948j6172L3571k03917j25558
3399I206154k93644j36536j0841j88977r3425j31682k56145O2064j99279k05139
3389G752550J47216M9176r9729J23351j27017K63503p7925p0181M9428n8432j06674
3378G845266k31994l7722j61804j39423j02658l27340k04028r481j41869j649
3368F487298l4047Q4685m9374p0607M964j5939j37083q087R7789J40383r3083
3357F406899r6565j34071j4641p1951M1517j61296p5771k17024m6295k36609Q0570
3346E474763k5361M5722J31026K08829L272J07494J59037j7037o614J50266j04758
$$ plain form
3335 6126639 6125463 6064611 6076365 6138108 6224400 6590212 6467661 6354601 5857275 5646655 5446425
3324 5446425 5563136 5628257 5583436 5462239 5530209 5611555 5604818 5442124 5584364 5361841 5434143
3313 5434143 5359817 5118675 4943998 4753966 4672711 4715895 4677216 4515212 4390373 4243323
3303 4243323 4147387 4194541 3847904 3726129 3644021 3611402 3426148 3331257 3517451 3341829
3293 3341829 3221646 3367287 3360790 3150862 3071369 3055999 2928524 2861656 2803786 2698799 2696922
3282 2696922 2400272 2524890 2693602 2594921 2533722 2771603 2413368 2397025 2505611 2510228
3272 2510228 2513194 2406269 2390127 2238020 2272130 2362037 2382646 2212501 2233917 2298241 2460972
3261 2460972 2545534 2495103 2477676 2484841 2560641 2352609 2340184 2437066 2598559 2581287 2612102
$$ packed form
3335F126639j176o0852J1754O1743Q6292L65812j22551j13060m97326k10620k00230
3324E446425J16711O5121m4821j21197O7970Q1346o737j62694J42240k22523P2302
3313E434143p4326k41142j74677j90032q1255M3184l8679j62004j24839j47050
3303D243323r5936M7154l46637j21775q2108l2619j85254r4891J86194j75622
3293C341829j20183J45641o497k09928p9493j5370j27475o6868n7870j04987j877
3282B696922k96650J24618J68712r8681o1199K37881l58235j6343J08586M617
3272B510228K966j06925j6142j52107L4110Q9907K0609j70145K1416O4324J62731
3261B460972Q4562n0431j7427P165P5800k08032j2425R6882J61493j7272L0815
$$ plain form
3250 2612102 2404944 2201677 2431054 2489465 2361323 2411772 2329377 2329199 2354187 2413059 2433814
3239 2433814 2315312 2389659 2431649 2404715 2351260 2401845 2459571 2448119 2467117 2356972 2381033
3228 2381033 2319208 2502129 2331844 2225791 2553200 2481310 2477958 2361360 2374440 2533785
3218 2533785 2467762 2574521 2335711 2179226 2395675 2496601 2514142 2234866 2241336 2377345
3208 2377345 2366661 2327618 2366969 2334066 2182914 2379533 2151732 2075223 2105326 2071949 2196626
3197 2196626 2162795 2056758 2165716 2210848 2187710 2204443 2103116 1990610 2030250 2185541
3187 2185541 2156565 2227485 2223759 2223740 2018778 2123696 2187580 2151673 2210782 2212092 2155849 2102700
3175 2102700 2052212 2026908 2085014 2098694 2126767 2277829 2327547 2199874 2151622 1986632 2223027
$$ packed form
3250B612102k07158k03267K29377N8411j28142N0449q2395j78K4988N8872K0755
3239B433814j18502P4347M1990k6934n3455N0585N7726j1452J8998j10145K4061
3228B381033o1825J82921j70285j06053L27409p1890l352j16598J3080J59345
3218B533785o6023J06759k38810j56485K16449J00926J7541k79276O470J36009
3208B377345j0684l9043L9351l2903j51152J96619k27801p6509L0103l3377J24677
3197B196626l3831j06037J08958M5132k3138J6733j01327j12506L9640J55291
3187B185541k8976P0920l726j9k04962J04918O3884l5907N9109J310n6243n3149
3175B102700n0488k5304N8106J3680K8073J51062M9718j27673m8252j64990K36395
$$ plain form
3164 2223027 2322043 2350880 2392229 2159315 2323039 2341988 2222997 2349137 2271010 2240075 2279440
3153 2279440 2399173 2352675 2503163 2553397 2352065 2252362 2181826 2048138 2284829 2364945
3143 2364945 2424029 2476222 2260438 2422456 2513828 2411377 2384886 2463536 2395488 2591435 2527772
3132 2527772 2479799 2643013 2559897 2477106 2482132 2306105 2339070 2520470 2599996 2576735 2541891
3121 2541891 2730763 2613910 2544485 2646708 2467666 2504993 2522199 2721267 2595958 2641510
3111 2641510 2677087 2817828 2811189 2764248 2645222 2754950 2826858 2799385 2768059 2757164 2765807
3100 2765807 2631510 2858486 2808575 2769309 2942632 2957992 2934255 2827920 2825803 2754009 2800739
3089 2800739 2855590 2722157 2951414 2796837 2882637 2956106 3046634 3113665 2904691 2840616 2901017
$$ packed form
3164B223027R9016K8837M1349k32914J63724J8949j18991J26140p8127l0935L9365
3153B279440J19733m6498J50488N0234k01332r9703p0536j33688K36691Q0116
3143B364945N9084N2193k15784J62018R1372j02451k6491P8650o8048J95947o3663
3132B527772m7973J63214q3116q2791N026j76027L2965J81400P9526k3261l4844
3121B541891J88872j16853o9425J02223j79042L7327J7206J99068j25309M5552
3111B641510L5577J40741o639m6941j19026J09728P1908k7473l1326j0895Q643
3100B765807j34297K26976m9911l9266J73323J5360k3737j06335k117p1794M6730
3089B800739N4851j33433K29257j54577Q5800P3469R0528O7031k08974o4075O0401
$$ plain form
3078 2901017 2869306 3105628 3070378 2931231 2986948 2757762 2906087 2932192 2934934 2948094 2977127
3067 2977127 3005661 3038227 3066710 2912421 2854777 3054289 3066963 3157737 3138701 3248439 3110730
3056 3110730 3268104 3125322 3114134 3332833 3228974 3375019 3288152 3310352 3449692 3430756
3046 3430756 3599979 3563917 3473986 3674478 3825556 3868199 3894239 3898296 4059856 4147374 4151755
3035 4151755 4158497 4228189 4220063 4367898 4267723 3937639 4075209 4108364 4287457 4568527 4777603
3024 4777603 4817342 4622139 4698221 4775332 4812738 5071171 4972469 5142877 5291332 5341991 5412598
3013 5412598 5347744 5462902 5821229 5758628 5942038 5787613 5868165 6163902 6465652 6675726
3003 6675726 6657697 6555547 6684831 6969190 7203472 7363691 7777181 7732499 7764592 8026511
$$ packed form
3078B901017l1711K36322l5250j39147N5717k29186J48325K6105K742J3160K9033
3067B977127K8534L2566K8483j54289n7644J99512J2674R0774j9036J09738j37709
3056C110730J57374j42782j1188K18699j03859J46045q6867K2200J39340j8936
3046C430756J69223l6062q9931K00492J51078M2643K6040M057J61560Q7518M381
3035D151755O742O9692q126J47835j00175l30084J37570L3155J79093K81070K09076
3024D777603L9739j95203P6082P7111L7406K58433r8702J70408J48455N0659P0607
3013E412598o4854J15158L58327o2601J83410j54425Q0552K95737L01750K10074
3003F675726j8029j02150J29284K84359K34282J60219M13490m4682L2093K61919
$$ plain form
2993 8026511 8313280 8464280 8542634 8698525 9086855 9234984 9684484 9969539 10109209 10457784
2983 10457784 10685362 10953877 11196234 11719180 12147060 12512661 12833828 13079835 13384586
2974 13384586 13615338 13933219 14330755 14790231 15137059 15377428 15977949 16492202 16867328
2965 16867328 17241862 17723729 18249829 18657859 19104443 19859067 20570469 21053184 21804107
2956 21804107 22335348 23256804 23864107 24675662 25718301 26673171 28013508 29307761 30716628
2947 30716628 32480985 34424035 36034275 37928639 39850086 41544352 42788260 43746148
2939 43746148 44616543 45168961 45463519 45912602 45842227 45575578 45085528 44054372 42887677
2930 42887677 41516218 39694442 38117800 36187533 34565259 33081263 31549045 30253988
$$ packed form
2993H026511K86769J51000P8354J55891L88330J48129M49500K85055J39670L48575
2983A0457784K27578K68515K42357N22946M27880L65601L21167K46007L04751
2974A3384586K30752L17881L97536M59476L46828K40369O00521N14253L75126
2965A6867328L74534M81867N26100M08030M46584P54624P11402M82715P50923
2956B1804107N31241R21456O07303Q11555J042639R54870J340337J294253J408867
2947C0716628J764357J943050J610240J894364J921447J694266J243908R57888
2939D3746148Q70395N52418K94558M49083p0375k66649m90050j031156j166695
2930D2887677j371459j821776j576642j930267j622274j483996j532218j295057
$$ plain form
2922 30253988 29158433 28338966 27571157 26658777 25745724 24930332 24313586 23909425 23188920
2913 23188920 22227778 21601467 21222905 20642908 20184568 19737555 19004786 18520728 18110733
2904 18110733 17514901 17068099 16612109 16139605 15693093 15476768 15088160 14777471 14579342
2895 14579342 14318994 14192643 14059581 13841281 13694345 13742390 13507365 13475365 13365603 13562591
2885 13562591 13572214 13628261 13473681 13346661 13186203 13168887 12851440 12546509 12412580 12381039
2875 12381039 12374423 12654242 12645985 12576057 12832479 12829282 12915191 12876581 12858701 12999902 13341976
2864 13341976 13666930 13952689 14070553 13883876 13926811 13970525 13477039 13169184 12648401 12315853
2854 12315853 12054425 11883318 11766383 11752193 11895573 11844592 12228829 12634331 12547658 12205914
$$ packed form
2922C0253988j095555q19467p67809r12380r13053q15392o16746m04161p20505
2913B3188920r61142o26311l78562n79997m58340m47013p32769m84058m09995
2904A8110733n95832m46802m55990m72504m46512k16325l88608l10689j98129
2895A4579342k60348j26351j33062k18300j46936M8045k35025l2000j09762J96988
2885A3562591R623N6047j54580j27020j60458j7316l17447l04931j33929l1541
2875A2381039o616K79819q257o9928K56422l197Q5909l8610j7880J41201L42074
2864A3341976L24954K85759J17864j86677M2935M3714m93486l07855n20783l32548
2854A2315853k61428j71107j16935j4190J43380n0981L84237M05502q6673l41744
$$ plain form
2844 12205914 12090020 12078707 12002567 12288571 12305099 11997628 11582576 11011182 10605897 10423123
2834 10423123 10029671 9460470 9228640 9280486 8894614 8688764 8525776 8420433 8528191 8477834
2824 8477834 8704332 8765580 8341601 8051410 8048600 7980342 8007939 8039674 7751243 7387286 6909505
2813 6909505 6734284 6529596 6354130 6145681 5964908 5903808 5751037 5464697 5218117 5378278
2803 5378278 5161870 5031630 5189737 5085803 4956242 5006509 5024316 4839882 4607501 4512919
2793 4512919 4397036 4316591 4384002 4412163 4372081 4234455 4311530 4253345 4099013 3817689 3640328
2782 3640328 3657336 3917714 4068231 3832578 3696816 3707785 3800294 3729015 3604769 3650072
2772 3650072 3692055 3700256 3583462 3760150 3751371 3545493 3402071 3451730 3487564 3600374 3640745
$$ packed form
2844A2205914j15894j1313p6140K86004J6528l07471m15052n71394m05285j82774
2834A0423123l93452n69201k31830N1846l85872k05850j62988j05343J07758n0357
2824H477834K26498O1248m23979k90191k810o8258K7597L1735k88431l63957m77781
2813F909505j75221k04688j75466k08449j80773o1100j52771k86340k46580J60161
2803E378278k16408j30240J58107j03934j29561N0267J7807j84434k32381r4582
2793D512919j15883q0445O7411K8161m0082j37626P7075n8185j54332k81324j77361
2782C640328J7008K60378J50517k35653j35762J0969R2509p1279j24246M5303
2772C650072M1983Q201j16794J76688q779k05878j43422M9659L5834J12810M0371
$$ plain form
2761 3640745 3630408 3618006 3535142 3386609 3412793 3357060 3640213 3670350 3495733 3535894 3574432
2750 3574432 3588101 3503847 3612343 3702938 3864610 3787302 3964802 3868703 4037074 4045038 4006698
2739 4006698 3933126 4268311 4282582 4011132 4232259 4454031 4504581 4395859 4582135 4677226
2729 4677226 4768414 4833425 5029457 5151901 5234563 5387186 5429986 5609347 5711149 5792686
2719 5792686 6058339 6191886 6498082 6727000 6597787 6737614 7029908 7291499 7536195 7817618
2709 7817618 7983174 8106139 8351831 8779226 9026700 9418395 9819780 9944551 10084244 10364159
2699 10364159 10767823 10989620 11136593 11384847 11689218 12006904 12373411 12776711 13330781
2690 13330781 13458651 13933405 14417807 15040505 15220098 15810806 16237756 16642398 17113693
$$ packed form
2761C640745j0337j2402q2864j48533K6184n5733K83153L0137j74617M0161L8538
2750C574432J3669q4254J08496R0595J61672p7308J77500r6099J68371P964l8340
2739D006698p3572L35185J4271k71450K21127K21772N0550j08722J86276R5091
2729D677226R1188O5011J96032J22444Q2662J52623M2800J79361J01802Q1537
2719E792686K65653J33547L06196K28918j29213J39827K92294K61591K44696K81423
2709G817618J65556J22965K45692M27395K47474L91695M01385J24771J39693K79915
2699A0364159M03664K21797J46973K48254L04371L17686L66507M03300N54070
2690A3330781J27870M74754M84402O22698J79593N90708M26950M04642M71295
$$ plain form
2681 17113693 17059758 17024425 17300713 17705938 17689272 18140856 18169094 18240506 18171133 17994704
2671 17994704 17994746 17702852 17841301 17870767 18235626 18349084 18301323 18373313 18805672 18715551 18389294
2660 18389294 18405912 18438523 18347973 18151135 17821741 17369930 17333102 16877007 16581657 16366830
2650 16366830 15836317 15454667 15126403 14646686 14260859 13938559 13759372 13358519 13007057
2641 13007057 12638433 12320176 11885108 11529195 11073300 10553534 10197974 9615773 9204466
2632 9204466 9007089 8425980 8042904 7753844 7603124 7159812 6883662 6422741 6159276 6025421
2622 6025421 5933409 5687355 5454646 5428615 5345111 5008317 4858726 4596400 4460999 4398036
2612 4398036 4189563 4102872 4028601 3934270 3649729 3467489 3389537 3144759 2996320 3100190
$$ packed form
2681A7113693n3935l5333K76288M05225j6666M51584K8238P1412o9373j76429
2671A7994704M2k91894J38449K9466L64859J13458m7761P1990M32359r0121l26257
2660A8389294J6618L2611r0550j96838l29394m51811l6828m56095k95350k14827
2650A6366830n30513l81650l28264m79717l85827l22300j79187m00853l51462
2641A3007057l68624l18257m35068l55913m55895n19766l55560n82201m11307
2632I204466j97377n81109l83076k89060j50720m43312k76150m60921k63465j33855
2622F025421r2012k46054k32709k6031q3504l36794j49591k62326j35401o2963
2612D398036k08473q6691p4271r4331k84541j82240p7952k44778j48439J03870
$$ plain form
2602 3100190 3010124 2900704 3015652 2721124 2682696 2902135 2769196 2525463 2500439 2424739
2592 2424739 2521293 2431702 2465798 2297605 2275953 2223943 1969199 1940765 1829869 1904389 1851328
2581 1851328 1828416 1521529 1297790 1347959 1219061 1232187 1293401 1287882 1341345 1349476 1285108
2570 1285108 1182917 1355172 1086905 983747 1143009 1100132 1032867 983723 1059307 1091785
2560 1091785 805849 853558 844402 866327 904670 884801 820834 716807 598380 789127 779331
2549 779331 599725 685378 635210 673820 774820 697077 624233 607694 622040 445295 482639
2538 482639 577685 536366 221834 545986 543821 468373 662726 533859 409276 402384 580231
2527 580231 402183 253586 218496 334713 551694 517270 336303 279959 312098 337954 295929
$$ packed form
2602C100190r0066j09420J14948k94528l8428K19439j32939k43733k5024p5700
2592B424739R6554q9591L4096j68193k1652n2010k54744k8434j10896P4520n3061
2581A851328k2912l06887k23739N0169j28898J3126O1214n519N3463Q131o4368
2570A285108j02191J72255k68267j03158J59262m2877o7265m9144P5584L2478
2560A091785k85936M7709r156K1925L8343j9869o3967j04027j18427J90747r796
2549G79331j79606Q5653n0168L8610J01000p7743p2844j6539J4346j76745L7344
2538D82639R5046m1319l14532L24152k165p5448J94353j28867j24583o892J77847
2527E80231j78048j48597l5090J16217K16981l4424j80967n6344L2139K5856m2025
$$ plain form
2516 295929 207356 414687 453015 390058 495053 475492 455922 394977 248881 322284 252692
2505 252692 164670 333286 264830 179918 198269 77287 329728 231536 161234 81206 175971
2494 175971 141255 265421 278135 321704 114076 206361 326318 284725 313133 176912 353713
2483 353713 441575 297196 91290 214797 279203 206311 77817 173993 193434 -53871 107409
2472 107409 244559 77154 192964 405217 421222 217431 22196 -4599 258248 360994
2462 360994 124771 64689 37661 13952 28665 101046 24872 29922 278373 71302 -1284
2451 -1284 111335 357512 170772 227559 134366 235431 41807 59996 345038 396086 272831
2440 272831 315219 336346 328332 79041 174930 247577 148373 141081 218758 169420 49308 79552
$$ packed form
2516B95929q8573K07331L8328o2957J04995j9561j9570o0945j46096P3403o9592
2505B52692q8022J68616o8456q4912J8351j20982K52441r8192p0302q0028R4765
2494A75971l4716J24166J2714M3569k07628R2285J19957m1593K8408j36221J76801
2483C53713Q7862j44379k05906J23507O4406p2892j28494R6176J9441k47305J61280
2472A07409J37150j67405J15810K12253J6005k03791j95235k6795K62847J02746
2462C60994k36223o0082k7028k3709J4713P2381p6174N050K48451k07071p2586
2451a284J12619K46177j86740N6787r3193J01065j93624J8189K85042N1048j23255
2440B72831M2388K1127q014k49291R5889P2647r9204p292P7677m9338j20112L0244
$$ plain form
2428 79552 123031 219264 254599 291375 67208 125989 180420 -29257 -52077 -171086 39507
2417 39507 18646 4930 -71059 -91982 106262 -93960 58467 108 -62487 64009 -97244
2406 -97244 -47983 -206059 -263738 92672 125095 -63208 -128451 87074 14845 79134 -14091
2395 -14091 -205383 -222429 -139442 96667 -78699 -205151 -129226 -74705 -36630 -50326 30470
2384 30470 -101114 -44786 -98312 53792 49603 -13624 -200768 -78520 -23228 -92540 94956
2373 94956 139132 -117146 -130496 -197759 -220860 -224258 -152476 122561 40439 -110706 -191738
2362 -191738 22573 87637 -93677 -50055 -113533 -285132 -226274 -148787 -53989 -187133 12384
2351 12384 -132093 -120176 -64955 -30960 -134060 -185404 -149512 -56465 156283 104199 -12547
$$ packed form
2428G9552M3479R6233L5335L6776k24167N8781N4431k09677k2820j19009K10593
2417C9507k0861j3716p5989k0923J98244k00222J52427n8359o2595J26496j61253
2406i7244M9261j58076n7679L56410L2423j88303o5243K15525p2229O4289r3225
2395a4091j91292j7046Q2987K36109j75366j26452P5925N4521L8075j3696Q0796
2384C0470j31584N6328n3526J52104m189o3227j87144J22248N5292o9312J87496
2373I4956M4176k56278j3350o7263k3101l398P1782K75037q2122j51145q1032
2362a91738K14311O5064j81314M3622o3478j71599N8858P7487R4798j33144J99517
2351A2384j44477J1917N5221L3995j03100n1344L5892R3047K12748n2084j16746
$$ plain form
2340 -12547 -90529 -14868 -236105 -461022 -208064 -254003 -320183 -179031 3434 151745 59290
2329 59290 73356 40494 96549 -148603 -227865 -57953 108008 -3654 -138505 -98556 -99409
2318 -99409 -74852 -181663 -111946 -72493 -46085 11431 14056 -216940 -273921 -187697 -103016 -107118
2306 -107118 14915 75565 -81110 -178891 793 -118291 -204040 -139896 -272304 -291132 -274667
2295 -274667 -102731 -13421 -79886 -215758 171974 101580 122357 101715 -169699 -97454 154532
2284 154532 22635 -153397 -161858 -193744 -109600 -217147 49151 52311 -140273 -169429 18306
2273 18306 6136 -72388 -170322 -246398 -181154 -144472 -60907 -196672 -142154 -49786 -75988 -89163
2261 -89163 -80425 -67128 18760 -212544 -238558 -167824 -127638 -83586 -254116 -19314 21887
$$ packed form
2340a2547p7982P5661k21237k24917K52958m5939o6180J41152J82465J48311r2455
2329E9290J4066l2862N6055k45152p9262J69912J65961j11662j34851L9949q53
2318i9409K4557j06811O9717L9453K6408N7516K625k30996n6981Q6224Q4681m102
2306a07118J22033O0650j56675r7781J79684j19084q5749O4144j32408j8828J6465
2295b74667J71936Q9310o6465j35872L87732p0394K0777k0642k71414P2245K51986
2284A54532j31897j76032q461l1886Q4144j07547K66298L160j92584k9156J87735
2273A8306j2170p8524r7934p6076O5244L6682Q3565j35765N4518R2368k6202j3175
2261h9163Q738J3297Q5888k31304k6014P0734M0186M4052j70530K34802M1201
$$ plain form
2250 21887 -83862 -250031 -252652 -202836 -348493 -178590 -223621 -448724 -156612 -160472 -325070
2239 -325070 -159096 -51484 -84924 -138917 16003 -134166 -101520 -341451 -318434 -204509
2229 -204509 -194526 -120355 -296199 -61099 -13 -48252 -29893 -126635 -194256 -167668 -95057
2218 -95057 -97824 103977 -76828 -179140 -271030 -342366 -322867 -107450 -46648 -134190 69922
2207 69922 89573 -192423 -140611 -180696 -351312 -473850 -299688 -183760 -216790 -197252 -167231
2196 -167231 -126437 -48599 -116069 -58147 28587 -120103 17075 16801 -137974 -263799 56187
2185 56187 16383 -29111 -135590 -25882 5630 -72387 -96509 -11494 34786 -107131 77406
2174 77406 185492 136806 -76280 25058 42666 107150 155836 189397 163514 68138 158975
$$ packed form
2250B1887j05749j66169k621M9816j45657J69903m5031k25103K92112l860j64598
2239c25070J65974J07612l3440n3993J54920j50169L2646k39931K3017J13925
2229b04509R983P4171j75844K35100O1086m8239J8359r6742o7621K6588P2611
2218i5057k767K01801j80805j02312r1890p1336J9499K15417O0802q7542K04112
2207F9922J9651k81996N1812m0085j70616j22538J74162J15928l3030J9538L0021
2196a67231M0794P7838o7470N7922Q6734j48690J37178k74j54775j25825L19986
2185E6187l9804m5494j06479J09708L1512p8017k4122Q5015M6280j41917J84537
2174G7406J08086m8686k13086J01338J7608O4484M8686L3561k5883r5376R0837
$$ plain form
2163 158975 -115426 14577 54073 7625 214744 198268 26373 68757 242859 135017
2153 135017 44740 89461 -44230 119414 79932 254368 167490 208261 337739 369584 358490
2142 358490 330884 168478 308753 542590 465050 523455 292774 513703 590904 531808 751690
2131 751690 491172 553480 775401 912481 950944 963725 1154580 1246338 1217914 1197526 1265702
2120 1265702 1292799 1276836 1502337 1781926 1991167 2084548 2095660 2223986 2346018 2541230
2110 2541230 2615323 2847147 3083388 3196692 3231255 3540877 3732914 3878200 3793277 3959881
2100 3959881 4423093 4802311 4986701 5235225 5605016 5924091 6600572 7378148 8358969 9750689
2090 9750689 11609361 13594704 16462761 19676957 21281814 20596730 19520414 18534121 17934433
$$ packed form
2163A58975k74401J30003L9496m6448K07119j6476j71895M2384J74102j07842
2153A35017r0277M4721j33691J63644l9482J74436q6878M0771J29478L1845j1094
2142C58490k7606j62406J40275K33837p7540N8405k30681K20929P7201n9096K19882
2131G51690k60518O2308K21921J37080L8463J2781J90855R1758k8424k0388O8176
2120A265702K7097j5963K25501K79589K09241R3381J1112J28326J22032J95212
2110B541230P4093K31824K36241J13304L4563L09622J92037J45286q4923J66604
2100C959881M63212L79218J84390K48524L69791L19075O76481P77576R80821J391720
2090I750689J858672J985343K868057L214196J604857o85084j076316r86293n99688
$$ plain form
2081 17934433 18140632 19486792 20972356 18868740 17085448 16619418 14697142 12056502
2073 12056502 9868801 8190489 7006696 6201500 5559135 5117170 4490932 3903323 3755114
2064 3755114 3262672 2986390 2730640 2403775 2481981 2260188 1924999 1741008 1790273 1867128
2054 1867128 1698523 1556053 1368523 1274805 1294495 1172104 983463 975070 1022547 887585
2044 887585 947044 921293 755814 507062 576189 680221 652761 518373 593811 359807 373674
2033 373674 614842 573307 451796 530887 480227 415733 262228 176398 204815 174277 408595
2022 408595 337032 68820 120834 246310 223117 223905 255090 215665 63153 38417 249054
2011 249054 -2444 -138910 111129 16361 19104 214089 166835 144340 74040 241170 124476
$$ packed form
2081A7934433K06199J346160J485564k103616j783292m66030j922276k640640
2073A2056502k187701j678312j183793q05196o42365m41965o26238n87609j48209
2064C755114m92442k76282k55750l26865P8206k21793l35189j83991M9265P6855
2054A867128j68605j42470j87530r3718J9690j22391j88641q393M7477j34962
2044H87585N9459k5751j65479k48752O9127J04032k7460j34388P5438k34004J3867
2033C73674K41168m1535j21511P9091n0660o4494j53505q5830K8417l0538K34318
2022D08595p1563k68212N2014J25476k3193P88L1185l9425j52512k4736K10637
2011B49054k51498j36466K50039r4768K743J94985m7254k2495p0300J67130j16694
$$ plain form
2000 124476 18810 -129767 -86816 21571 -2657 -28391 -63656 -56163 -74843 -150689 -217409
1989 -217409 -190661 -105256 -91981 -48470 58156 106229 86746 51298 49364 -171809 77348
1978 77348 174702 65520 -36228 -7681 894 -206596 -141837 26347 -228703 -220135 -284139
1967 -284139 -90856 -49276 -18695 -259970 -195522 -83585 -131012 -155090 -278477 -161164 93515
1956 93515 -15776 -98979 -230714 94102 179899 98096 -50859 -226771 -207096 -112494 -49486
1945 -49486 -297312 -156108 -102031 12667 317 -93024 -262279 -74341 5709 -145039 190361
1934 190361 129206 -30304 -225602 -76826 76755 13416 -108930 -180067 -205410 -211757 -136144
1923 -136144 -123684 -278651 -271817 -190737 -117637 -23906 -140598 -239032 -125164 -125650 -161204 -57209
$$ packed form
2000A24476j05666j48577M2951J08387k4228k5734l5265P493j8680p5846o6720
1989b17409K6748Q5405J3275M3511J06626M8073j9483l5448j934k21173K49157
1978G7348R7354j09182j01748K8547Q575k07490O4759J68184k55050Q568o4004
1967b84139J93283M1580L0581k41275O4448J11937m7427k4078j23387J17313K54679
1956I3515j09291q3203j31735L24816Q5797q1803j48955j75912J9675R4602O3008
1945d9486k47826J41204N4077J14698j2350r3341j69255J87938Q0050j50748L35400
1934A90361o1155j59510j95298J48776J53581o3339j22346p1137k5343o347P5613
1923a36144J2460j54967O834Q1080P3100R3731j16692r8434J13868m86l5554J03995
$$ plain form
1911 -57209 -54129 -135793 -218721 -30400 41819 -103264 -240912 -290512 -128117 -81877 -235123
1900 -235123 -149258 9613 -56737 -160138 -231022 -213053 -191396 -261161 17768 -50630 -251062
1889 -251062 -193198 -26359 -37339 -23820 -20661 58880 -107008 52930 -195462 41388 25760
1878 25760 212057 49219 -180978 38137 -19260 -145490 -49425 -82782 -284823 -156269
1868 -156269 -182337 -187953 -62131 -242233 -347187 -76462 81574 -23280 -55037 -60626 -185585
1857 -185585 -124009 -57185 -9102 -93691 -255107 -203541 -144525 -67833 -79889 -166916 -171185 -135729
1845 -135729 -302965 -325465 -116691 -1361 -40050 -62543 -42246 -8007 -243692 -99664 -151025
1834 -151025 -318210 -143443 -69562 -202518 -265176 -140310 -261582 -149708 -146140 8190
$$ packed form
1911e7209L080q1664q2928J88321P2219j45083j37648m9600J62395M6240j53246
1900b35123Q5865J58871o6350j03401p0884J7969K1657o9765K78929o8398k00432
1889b51062N7864J66839j0980J3519L159P9541j65888J59938k48392K36850j5628
1878B5760J86297j62838k30197K19115n7397j26230R6065l3357k02041J28554
1868a56269k6068n616J25822j80102j04954K70725J58036j04854l1757n589j24959
1857a85585O1576O6824M8083q4589j61416N1566N9016P6692j2056q7027m269L5456
1845a35729j67236k2500K08774J15330l8689k2493K0297L4239k35685J44028n1361
1834a51025j67185J74767P3881j32956o2658J24866j21272J11874L568J54330
$$ plain form
1824 8190 -189245 -140674 39047 39438 -207853 -251234 -173204 22308 -185584 -192333 -206826 -244424
1812 -244424 -229559 -177667 -64853 -90088 -38227 -169723 -185150 -60552 -80429 -80283 -186815
1801 -186815 -169814 -110842 144755 -46081 -147794 -160823 -122642 -159171 -50455 -215899 -427735
1790 -427735 -120024 -150625 -16181 -92230 -142202 -71472 -173393 -264329 -143630 -182441 22783
1779 22783 -143162 -160709 -128930 -86983 -59729 -135557 -10800 -61910 -113353 -124220 -153543
1768 -153543 -82699 -210456 -76648 -37647 -64536 101783 -12957 -211308 -109088 -226007
1758 -226007 -270710 -160484 -253810 -201019 -183192 -196128 -169821 -55842 -57756 -183497 -110167
1747 -110167 -97242 -195236 -94717 -298958 -255369 -179773 -100397 62535 -291501 -418158 -190807
$$ packed form
1824H190j97435M8571J79721L91k47291m3381P8030J95512k07892o749j4493l7598
1812b44424J4865N1892J12814k5235N1861j31496j5427J24598j9877J46j06532
1801a86815J7001N8972K55597j90836j01713j3029L8181l6529J08716j65444k11836
1790d27735L07711l0601J34444p6049m9972P0730j01921r0936J20699l8811K05224
1779B2783j65945j7547L1779M1947K7254p5828J24757n1110n1443j0867k9323
1768a53543P0844j27757J33808L9001k6889J66319j14740j98351J02220j16919
1758b26007m4703J10226r3326N2791J7827j2936K6307J13979j914j25741P3330
1747a10167J2925r7994J00519k04241M3589P5596P9376J62932l54036j26657K27351
$$ plain form
1736 -190807 -261940 -197915 -55352 64858 -253071 -211104 -257994 -71889 -132345 -278755 -103920
1725 -103920 -227544 -176264 -62148 -106480 -395520 -327939 -253676 -170851 -243821 -310889 -246148
1714 -246148 60521 -105904 -363293 -444750 -201532 26891 -152044 -175367 -177040 -167873 -331222
1703 -331222 -335796 -194375 -295960 -359998 -292899 -208861 -312926 -165288 31666 -181298 -8544
1692 -8544 -38579 -31727 -53168 -162966 -270510 -361227 -262896 -141896 -184990 -11132 18210
1681 18210 -254609 -75831 -57600 32952 -135697 -441896 -122677 -133812 -215974 -215391 -154897
1670 -154897 -76933 46509 202091 -58834 -195800 -142373 -70294 -153129 -205996 -84986 35238
1659 35238 -335976 -358753 -151155 -176638 -171072 -17208 -16289 -201662 -57464 -31933 -32341 -205826
$$ packed form
1736a90807p1133O4025J42563J20210l17929M1967m6890J86105o0456j46410J74835
1725a03920j23624N1280J14116m4332k89040O7581P4263Q2825p2970o7068O4741
1714b46148L06669j66425k57389q1457K43218K28423j78935k3323j673R167j63349
1703c31222m574J41421j01585o4038O7099Q4038j04065J47638J96954k12964J72754
1692h544l0035O852k1441j09798j07544r0717R8331J21000m3094J73858K9342
1681A8210k72819J78778J8231R0552j68649l06199L19219j1135q2162N83O0494
1670a54897P7964J23442J55582k60925j36966N3427P2079q2835n2867J21010J20224
1659C5238l71214k2777K07598k5483N566J53864R19j85373J44198K5531m08j73485
$$ plain form
1647 -205826 -164171 -287896 -350986 -185359 -81497 -195680 -82659 -86616 -254545 -90441
1637 -90441 251721 -118811 -434974 -145685 16749 -147402 -336701 -367530 -337559 -191739
1627 -191739 -101765 104799 129182 203209 -28727 -13301 -97749 -96791 -277157 -215840 -79923
1616 -79923 -228755 -180385 -123796 -123676 -160550 -309336 -199324 -168560 -117319 -179259 -2056
1605 -2056 -135466 -204738 -137888 -29303 -264755 16222 -109253 -191790 -177361 -65218 41431
1594 41431 -323756 -217257 -197537 -4739 -22837 -69217 -41187 -52671 -156347 87985 -117682
1583 -117682 -16697 -180417 -224118 -59807 -95080 75854 -58295 -10274 46651 -106369
1573 -106369 -9339 -35329 -214508 -147565 -101477 63280 -143634 -253881 -312788 -246570 -156385
$$ packed form
1647b05826M1655j23725o3090J65627J03862j14183J13021l957j67929J64104
1637i0441L42162l70532l16163K89289J62434j64151j89299l0829K9971J45820
1627a91739Q9974K06564K4383P4027k31936J5426q4448R58j80366O1317J35917
1616g9923j48832M8370N6589J20l6874j48786J10012L0764N1241o1940J77203
1605b056j33410o9272O6850J08585k35452K80977j25475q2537J4429J12143J06649
1594D1431l65187J06499J9720J92798j8098m6380K8030j1484j03676K44332k05667
1583a17682J00985j63720m3701J64311l5273J70934j34149M8021N6925j53020
1573a06369R7030k5990j79179O6943M6088J64757k06914j10247n8907O6218R0185
$$ plain form
1562 -156385 -202343 31046 -59238 50280 -81588 -224754 -148147 -312095 -373557 -38897
1552 -38897 -128218 -342746 -318974 -98647 -178745 -120763 -143673 9086 111429 -189107 -111073
1541 -111073 -49842 -121326 -178794 -260969 -508088 -387980 -240765 -330326 -136894 -122700 -17056
1530 -17056 -89120 -80935 -127570 -148018 30094 -95624 -195898 -81428 91130 -146165 -87323
1519 -87323 -129502 -266390 -118958 -179003 -36722 30204 54956 -87192 97007 67363 -144884
1508 -144884 -154716 -112344 -57571 169551 77093 48008 -14215 70072 30591 -123674 -132212 -48093
1496 -48093 107420 -160128 -210689 -244358 -12900 -101461 -51559 125884 -108945 -66649 -6407
1485 -6407 25192 -84213 -156723 103218 112420 242291 158318 -75333 -149351 -97904 -131629
$$ packed form
1562a56385m5958K33389r0284J09518j31868j43166P6607j63948o1462L34660
1552c8897q9321k14528K3772K20327q0098N7982k2910J52759J02343l00536P8034
1541a11073O1231p1484n7468q2175k47119J20108J47215q9561J93432J4194J05644
1530a7056p2064Q185m6635k0448J78112j25718j00274J14470J72558k37295N8842
1519h7323m2179j36888J47432o0045J42281O6926K4752j42148J84199k9644k12247
1508a44884r832M2372N4773K27122r2458k9085o2223Q4287l9481j54265q538Q4119
1496d8093J55513k67548n0561l3669K31458q8561M9902J77443k34829M2296O0242
1485f407L1599j09405p2510K59941R202J29871q3973k33651p4018N1447l3725
$$ plain form
1474 -131629 -122380 -172615 -318779 -202249 -148664 -107079 -225120 -74001 46565 -197011 -147827
1463 -147827 -206626 23350 -232415 -147648 64499 77603 122292 -15130 -83357 -56028 -152918
1452 -152918 -29843 55256 -69779 -282422 -74090 10844 -216091 -98353 -199566 -243487
1442 -243487 -89097 7913 -177261 -121732 -59749 -5079 194948 97532 -35753 -109976 -191821
1431 -191821 -213961 -207439 -197243 -144947 -198342 -76050 -92990 -156677 -149984 71139 164831 109118
1419 109118 -132040 -132225 86112 -91299 -267721 -415081 -268423 -195386 -97694 25511 27630
1408 27630 131720 34086 31632 -81709 -230140 -287569 -230794 27961 -113856 -142489 -189884
1397 -189884 -143333 -29080 -148206 4073 57358 -54927 -230671 -482599 -228414 -120167
$$ packed form
1474a31629R249n0235j46164J16530N3585M1585j18041J51119J20566k43576M9184
1463a47827n8799K29976k55765Q4767K12147J3104M4689j37422o8227K7329r6890
1452a52918J23075Q5099j25035k12643K08332Q4934k26935J17738j01213m3921
1442b43487J54390R7010j85174N5529O1983N4670K00027r7416j33285p4223q1845
1431a91821k2140O522J0196N2296n3395J22292j6940o3687O693K21123R3692n5713
1419A09118k41158j85K18337j77411j76422j47360J46658P3037R7692J23205K119
1408B7630J04090r7634k454j13341j48431n7429N6775K58755j41817k8633m7395
1397a89884M6551J14253j19126J52279N3285j12285j75744k51928K54185J08247
$$ plain form
1387 -120167 -36953 -169715 -232834 -93922 61646 7204 -178725 -134728 -114200 -72049 -155620
1376 -155620 -205030 -163318 -168172 -195710 -145333 -177420 -109879 -321944 -388252 -339979 -182463
1365 -182463 48219 -252882 -212927 -133275 -185338 -185636 8840 -307009 -439899 -60136 -88654
1354 -88654 -167050 -239519 46877 144432 -25557 -284459 -223996 -111687 -183173 -97949 -35956
1343 -35956 83123 61411 209243 21829 -83678 -105170 47458 -173457 -16038 -99331
1333 -99331 -112275 -69860 -162669 -135586 -48202 -160333 -237899 -272832 -211914 -15735 -167838
1322 -167838 -126876 -65180 -72301 -24779 -230530 -198661 -1326 151101 -12440 -75044 -200992
1311 -200992 -112893 -94045 -160199 -240404 -103963 -63869 -126866 -2290 -144660 -59610 -361398
$$ packed form
1387a20167Q3214j32762o3119J38912J55568n4442j85929M3997K0528M2151q3571
1376a55620m9410M1712m854k7538N0377l2087O7541k12065o6308M8273J57516
1365a82463K30682l01101L9955P9652n2063k98J94476l15849j32890L79763k8518
1354h8654p8396p2469K86396R7555j69989k58902O0463J12309p1486Q5224O1993
1343c5956J19079k1712J47832j87414j05507k1492J52628k20915J57419q3293
1333i9331j2944M2415r2809K7083Q7384j12131p7566l4933O0918J96179j52103
1322a67838M0962O1696p121M7522k05751L1869J97335J52427j63541o2604j25948
1311b00992Q8099J8848o6154q0205J36441M0094o2997J24576j42370Q5050l01788
$$ plain form
1300 -361398 -158711 -175918 -195669 -315272 -314746 -235212 -320444 -134636 9487 -83984 -100174
1289 -100174 -258384 -184108 -134094 -110270 -122342 -88380 -57322 -307563 -84853 -26023 -196152
1278 -196152 -10233 55617 33041 -12479 89878 -86580 -135177 -205147 -92811 -139303 -51941
1267 -51941 -54360 62467 -10595 -160404 -56734 -74761 44519 86399 -67615 -62033 -30324
1256 -30324 -93901 11602 22062 -111002 -90061 -98752 7711 100989 280562 28600 -1081
1245 -1081 -96108 -126389 -47618 -134434 49154 169231 147504 -40930 -94768 67609 -86205
1234 -86205 -79457 -121837 -243045 -34830 -70527 -110538 24366 74105 -29942 17252 -69993
1223 -69993 -179087 -67627 50296 -24522 -82907 136603 -27856 -37074 25715 71979 33012
$$ packed form
1300c61398K02687j7207j9751j19603N26P9534q5232J85808J44123r3471j6190
1289a00174j58210P4276N0014K3824j2072L3962L1058k50241K22710N8830j70129
1278a96152J85919O5850k2576m5520J02357j76458m8597o9970J12336m6492Q7362
1267e1941k419J16827p3062j49809J03670j8027J19280M1880j54014N582L1709
1256c0324o3577J05503J0460j33064K0941q691J06463R3278J79573k51962k9681
1245a081r5027l0281P8771q6816J83588J20077k1727j88434n3838J62377j53814
1234h6205O748m2380j21208K08215l5697m0011J34904M9739j04047M7194q7245
1223f9993j09094J11460J17923p4818n8385K19510j64459r218O2789M6264l8967
$$ plain form
1212 33012 117701 101815 -161125 -213862 -167119 -69569 -110981 -142597 -243027 -167340 -179182
1201 -179182 -139305 -39747 -8014 11695 72030 150356 20915 2949 -38200 4842 167332
1190 167332 -43682 -82794 -96735 -21470 -184490 -166402 -183563 -303549 -197335 -18076 -166942
1179 -166942 -111018 6767 167287 23909 75932 90972 108776 47623 -175158 -181876 -174994
1168 -174994 -172826 -52562 4218 75905 -133981 -176674 41225 111113 -149672 -150081 -157115 54231
1156 54231 5782 -18632 -289916 -88830 34266 -56213 -93436 -208442 -9009 -9582 -309276
1145 -309276 -263888 -44165 66079 -25850 -71228 37640 62503 17958 61239 -20799 25177
1134 25177 27699 -152840 -154704 -188476 -19586 -116106 -149248 -207529 -113942 -34524 -50937 207
$$ packed form
1212C3012Q4689j5886k62940n2737M6743R7550m1412l1616j00430P5687j1842
1201a79182L9877R9558L1733J9709O0335P8326j29441j7966m1149M3042J62490
1190A67332k11014l9112j3941P5265j63020J8088j7161j19986J06214J79259j48866
1179a66942N5924J17785J60520j43378N2023J5040J7804o1153k22781o718O882
1168a74994K168J20264N6780P1687k09886m2693K17899O9888k60785m09p034K11346
1156E4231m8449k4414k71284K01086J23096r0479l7223j15006J99433n73k99694
1145c09276M5388K19723J10244r1929m5378J08868K4863m4545M3281q2038M5976
1134B5177K522j80539j864l3772J68890r6520l3142n8281R3587P9418j6413N1144
$$ plain form
1122 207 -17173 76546 96173 50567 184296 124826 170313 -113767 -267836 -128798 25899
1111 25899 -87811 -172598 -111177 71748 249901 82689 -51484 -22613 -120061 141155 73800
1100 73800 14090 -34125 -250863 -195455 -34586 -4521 -64030 -167966 -117665 -29749 -57978
1089 -57978 159605 -20200 -57349 193853 211985 186599 6976 -7232 14496 90640 244047
1078 244047 186155 41517 17262 -5478 -36942 53829 -10658 64072 59787 23033 51838 -24966
1066 -24966 -41529 41264 238825 51929 -35065 -143415 -110233 -111599 -36214 120256 -107577
1055 -107577 -280443 81400 -112795 67509 24037 105258 -24490 -200059 -354471 -232106
1045 -232106 -196133 -34577 -25064 -188087 106912 235454 165103 79216 -15009 71194 39775
$$ packed form
1122B07j7380R3719J9627m5606J33729n9470M5487k84080j54069J39038J54697
1111B5899j13710q4787O1421J82925J78153j67212j34173K8871r7448K61216o7355
1100G3800n9710m8215k16738N5408J60869L0065n9509j03936N0301Q7916k8229
1089e7978K17583j79805l7149K51202J8132k5386j79623j4208K1728P6144J53407
1078B44047n7892j44638k4255k2740l1464R0771o4487P4730m285l6754K8805p6804
1066b4966j6563Q2793J97561j86896q6994j08350L3182j366P5385J56470k27833
1055a07577j72866L61843j94195J80304m3472Q1221j29748j75569j54412J22365
1045b32106L5973J61556R513j63023K94999J28542p0351q5887r4225Q6203l1419
$$ plain form
1034 39775 14902 -121156 -256097 -233483 -81444 36021 64172 35645 77508 13615 -79980
1023 -79980 250438 148601 -91950 50554 187698 66411 -30331 -117130 67854 151205
$$ packed form
1034C9775k4873j36058j34941K2614J52039J17465K8151k8527M1863o3893r3595
1023g9980L30418j01837k40551J42504J37144j21287r6742q6799J84984Q3351
$$ [...]
##END NTUPLES=NMR SPECTRUM
##END=
