##TITLE=1H_CG-1213-2
 CDCl3
 8 sc, 
 8.10.2024
##JCAMPDX= 6.0         $$ Bruker NMR JCAMP-DX V2.0
##DATA TYPE= NMR SPECTRUM
##DATA CLASS= NTUPLES
##ORIGIN= UXNMR, Bruker Analytische Messtechnik GmbH
##OWNER= root
$$ XWIN-NMR		Version 3.5
$$ Tue Oct  8 14:04:09 2024 Russian Standard Time (UT+4h)  she@DPX200
##.OBSERVE FREQUENCY= 200.1318
##.OBSERVE NUCLEUS= ^1H
##.ACQUISITION MODE= SIMULTANEOUS
##.ACQUISITION SCHEME= undefined
##.AVERAGES= 8
##.DIGITISER RES= 18
##SPECTROMETER/DATA SYSTEM= spect
##.PULSE SEQUENCE= zg30
##.SOLVENT NAME= CDCl3
##.SHIFT REFERENCE= (INTERNAL, CDCl3, 0, 23.2583)
##AUDIT TRAIL= $$ (NUMBER, WHEN, WHO, WHERE, WHAT)
$$ ##TITLE= Audit trail, XWIN-NMR		Version 3.5
$$ ##JCAMPDX= 5.01
$$ ##ORIGIN= Bruker BioSpin GmbH
$$ ##OWNER= she
$$ F:/spectra/data/she/nmr/H-F/1/pdata/1/auditp.txt
$$ ##AUDIT TRAIL=  $$ (NUMBER, WHEN, WHO, WHERE, WHAT)
(   1,<2024-10-08 14:02:34.89 +0400>,<she>,<DPX200>,
      <created by zg, POWCHK disabled, PULCHK disabled
       configuration hash MD5:
       00 E9 B6 7A A2 85 ED C7 34 08 36 98 17 FE 4E 26
       data hash MD5: 16K
       B4 9D 86 80 0A E5 B7 71 82 90 08 55 CA AB 2F 44>)
(   2,<2024-10-08 14:02:45.06 +0400>,<she>,<DPX200>,
      <Start of raw data processing
       efp BC_mod = 2 LB = 0.24 FT_mod = 6 PKNL = 1 PHC0 = -26343.96 PHC1 = 8.38747 SI = 16K 
       data hash MD5: 16K
       2D 29 7B 56 D4 4F 86 E1 2F 13 AB 45 0E BC 63 58>)
(   3,<2024-10-08 14:03:06.62 +0400>,<she>,<DPX200>,
      <pk PHC0 = -163.1771 PHC1 = 6.6 
       data hash MD5: 16K
       21 19 C2 2C A5 27 8A D3 B5 C1 2D EA 89 61 D9 12>)
(   4,<2024-10-08 14:03:09.78 +0400>,<she>,<DPX200>,
      <abs ABSG = 5 
       data hash MD5: 16K
       D9 FC 4E BD 39 4C C2 F1 2B 6A 9C F7 0F 11 4A 0A>)
(   5,<2024-10-08 14:03:28.56 +0400>,<she>,<DPX200>,
      <abs ABSG = 5 
       data hash MD5: 16K
       16 6B BA 8E 1C 91 F2 7E D9 F1 5C 51 0C 15 EA 50>)
$$ ##END=
$$ 
$$ hash MD5
$$ 03 0B EF 31 37 AC 92 A5 36 29 FA C6 CA B2 C2 15
##$RELAX= 
##$RELAX= 
##$RELAX= 
##$RELAX= 
##$RELAX= 
##$RELAX= 
$$ Bruker specific parameters
$$ --------------------------
##$DU= <F:/spectra>
##$EXPNO= 1
##$NAME= <H-F>
##$PROCNO= 1
##$TYPE= <nmr>
##$USER= <she>
##$AMP= (0..31)
100 100 100 100 100 100 100 100 100 100 100 100 100 100 100 100 100 100 
100 100 100 100 100 100 100 100 100 100 100 100 100 100 
##$AQSEQ= 0
##$AQ_mod= 1
##$AUNM= <au_zg>
##$AUTOPOS= <>
##$BF1= 200.13
##$BF2= 200.13
##$BF3= 200.13
##$BF4= 200.13
##$BF5= 200.13
##$BF6= 200.13
##$BF7= 200.13
##$BF8= 200.13
##$BYTORDA= 1
##$CFDGTYP= 0
##$CFRGTYP= 5
##$CHEMSTR= <none>
##$CNST= (0..31)
1 1 145 1 1 1 1 1 1 1 1 1 1 1 1 1 1 1 1 1 1 1 1 1 1 1 1 1 1 1 1 1 
##$CPDPRG= <>
##$CPDPRG1= <>
##$CPDPRG2= <>
##$CPDPRG3= <>
##$CPDPRG4= <mlev>
##$CPDPRG5= <mlev>
##$CPDPRG6= <mlev>
##$CPDPRG7= <mlev>
##$CPDPRG8= <mlev>
##$CPDPRGB= <>
##$CPDPRGT= <>
##$D= (0..31)
0 1.2 0 0 0 0 0 0 0 0.06 0 0.03 0 0 0 0 0.0002 0 0 0 0 0 0 0 0 0 0 0 0 
0 0 0 
##$DATE= 1728381754
##$DBL= (0..7)
$$ [...]
##$SUBNAM3= <"">
##$SUBNAM4= <"">
##$SUBNAM5= <"">
##$SUBNAM6= <"">
##$SUBNAM7= <"">
##$SUBNAM8= <"">
##$SUBNAM9= <"">
##$SW= 24.0689170037331
##$SWIBOX= (0..15)
0 0 2 0 0 0 0 0 0 0 0 0 0 0 0 0 
##$SW_h= 4816.95568400771
##$TD= 16384
##$TD0= 1
##$TE= 0
##$TE2= 300
##$TE3= 300
##$TEG= 300
##$TL= (0..7)
0 120 120 120 120 120 120 120 
##$TP= (0..7)
150 150 150 150 150 150 150 150 
##$TP07= 0
##$TPNAME0= <>
##$TPNAME1= <>
##$TPNAME2= <>
##$TPNAME3= <>
##$TPNAME4= <>
##$TPNAME5= <>
##$TPNAME6= <>
##$TPNAME7= <>
##$TPOAL= (0..7)
0.5 0.5 0.5 0.5 0.5 0.5 0.5 0.5 
##$TPOFFS= (0..7)
0 0 0 0 0 0 0 0 
##$TUNHIN= 0
##$TUNHOUT= 0
##$TUNXOUT= 0
##$USERA1= <user>
##$USERA2= <user>
##$USERA3= <user>
##$USERA4= <user>
##$USERA5= <user>
##$V9= 5
##$VALIST= <valist>
##$VCLIST= <CCCCCCCCCCCCCCC>
##$VD= 0
##$VDLIST= <DDDDDDDDDDDDDDD>
##$VPLIST= <PPPPPPPPPPPPPPP>
##$VTLIST= <TTTTTTTTTTTTTTT>
##$WBST= 1024
##$WBSW= 4
##$XGAIN= (0..3)
0 0 0 0 
##$XL= 0
##$YL= 0
##$YMAX_a= 313939
##$YMIN_a= -302387
##$ZGOPTNS= <>
##$ZL1= 120
##$ZL2= 120
##$ZL3= 120
##$ZL4= 120
##$ABSF1= 23.25826
##$ABSF2= -0.8109264
##$ABSG= 5
##$ABSL= 3
##$ALPHA= 0
##$AQORDER= 0
##$ASSFAC= 0
##$ASSFACI= 0
##$ASSFACX= 0
##$ASSWID= 0
##$AUNMP= <proc_1d>
##$AZFE= 0.1
##$AZFW= 0.1
##$BCFW= 0
##$BC_mod= 2
##$BYTORDP= 0
##$COROFFS= 0
##$CY= -3
##$DATMOD= 1
##$DC= 0
##$DFILT= <>
##$DTYPP= 0
##$F1P= 0
##$F2P= 0
##$FCOR= 1
##$FTSIZE= 16384
##$FT_mod= 6
##$GAMMA= 0
##$GB= 0
##$INTBC= 1
##$INTSCL= 3.70164e-10
##$ISEN= 128
##$LB= 0.24
##$LEV0= 0
##$LPBIN= 0
##$MAXI= 10000
##$MC2= 0
##$MEAN= 0
##$ME_mod= 0
##$MI= 1.114404
##$NCOEF= 0
##$NC_proc= -6
##$NLEV= 6
##$NOISF1= 3.799351
##$NOISF2= 2.8
##$NSP= 0
##$NTH_PI= 0
##$NZP= 0
##$OFFSET= 23.25826
##$PC= 1
##$PHC0= -26507.14
##$PHC1= 14.98747
##$PH_mod= 1
##$PKNL= yes
##$PPARMOD= 0
##$PSCAL= 0
##$PSIGN= 0
##$REVERSE= no
##$SF= 200.129553811462
##$SI= 16384
##$SIGF1= 3
##$SIGF2= 2
##$SINO= 5.538805
##$SIOLD= 16384
##$SREGLST= <1H.CDCl3>
##$SSB= 0
##$STSI= 16384
##$STSR= 0
##$SW_p= 4816.95568400771
##$SYMM= 0
##$S_DEV= 0
##$TDeff= 16384
##$TDoff= 0
##$TI= <>
##$TILT= no
##$TM1= 0
##$TM2= 0
##$TOPLEV= 0
##$USERP1= <user>
##$USERP2= <user>
##$USERP3= <user>
##$USERP4= <user>
##$USERP5= <user>
##$WDW= 1
##$XDIM= 16384
##$YMAX_p= 297272085
##$YMIN_p= -1223545
$$ End of Bruker specific parameters
$$ ---------------------------------
##NTUPLES= NMR SPECTRUM
##VAR_NAME=  FREQUENCY,     SPECTRUM/REAL,   SPECTRUM/IMAG
##SYMBOL=    X,             R,               I
##VAR_TYPE=  INDEPENDENT,   DEPENDENT,       DEPENDENT
##VAR_FORM=  AFFN,          ASDF,            ASDF
##VAR_DIM=   16384,         16384,           16384
##UNITS=     HZ,            ARBITRARY UNITS, ARBITRARY UNITS
##FACTOR=    0.29402158847633, 1,            1
##FIRST=     4654.66534171089, 0,            0
##LAST=      -162.290342296817, 0,           0
##MIN=       -162.290342296817, -1223545,    0
##MAX=       4654.66534171089, 297272085,    0
$$ Real data points
##PAGE= N=1
##DATA TABLE= (X++(R..R)), XYDATA
$$ [...]
5305I386107l82422l59836l77741k58324k55157j95735k03707j66680j62712k22194
5295F801599j92950j51899k24193j57109j84792q4818r8266r0297j00429j20640
5285E396206n7199o9934p3497o6557p9802o8532m3796j4950k2821p6222m2876
5274D780020m391m0190J5615l1814J1193l5821p4383l2514l5390l1354p2511n6097
5262D392363q0036n5227q6606j04660m380l8868m5195q190l3348J6606o248q1143
5250C865068N3731K412N3366J9027J0714M8622P1973K0687M9925o1973j7250k9033
5238D087269q2581m2674p3815j40961p3356o3734l3080j04644r0082l3968q0772
5227C267602j1660k5976l3605m8744k4108j9367N767M5054j8187j2670L1944O8894
$$ y = [9386107, 9003685, 8643849, 8266108, 8007784, 7752627, 7556892, 7353185, 7186505, 7023793, 6801599, 6608649, 6456750, 6232557, 6075448, 5890656, 5805838, 5707572, 5617275, 5516846, 5396206, 5339007, 5269073, 5195576, 5129019, 5049217, 4980685, 4936889, 4921939, 4899118, 4822896, 4780020, 4775629, 4735439, 4751054, 4719240, 4730433, 4694612, 4620229, 4587715, 4552325, 4520971, 4448460, 4392363, 4312327, 4257100, 4170494, 4065834, 4061454, 4022586, 3977391, 3969201, 3935853, 3952459, 3946211, 3865068, 3918799, 3921211, 3974577, 3993604, 4004318, 4052940, 4124913, 4145600, 4195525, 4133552, 4116302, 4087269, 4004688, 3962014, 3888199, 3747238, 3673882, 3610148, 3577068, 3472424, 3382342, 3348374, 3267602, 3255942, 3229966, 3196361, 3147617, 3123509, 3104142, 3109909, 3154963, 3136776, 3124106, 3156050, 3224944]
5215C224944N6705P6838K5073n9493j1680p6538M0839J5159k0824O630L6040M9969
5203C363662L8141K7560N7669j0588M1174K2607j2997N5842J7168P4211R9654
5192C774103N6921N5774j9471P3990J16847L8687Q8939N1567K2585J56935Q5924
5181D502801R4553J20166J84166J41721J16115J44281J97533J85520K05967K61155
5171F153978K60829K99725L47490L23203M19231N14087O21728P50468J040275
5162A0731014J121006J044568P16507N73456l9423o10583p23434n92781k76444
5153A1943886n2806J49351L94971M84773P64535J104184J374516J722443J725618
5144A9611471J473759J174138N94051M74374k3505l84066j17996M4866J62550
$$ y = [3224944, 3281649, 3358487, 3383560, 3324067, 3312387, 3235849, 3276688, 3291847, 3271023, 3277653, 3313693, 3363662, 3401803, 3429363, 3487032, 3476444, 3517618, 3540225, 3527228, 3583070, 3600238, 3674449, 3774103, 3831024, 3886798, 3867327, 3941317, 4058164, 4096851, 4185790, 4237357, 4259942, 4416877, 4502801, 4597354, 4717520, 4901686, 5043407, 5159522, 5303803, 5501336, 5686856, 5892823, 6153978, 6414807, 6714532, 7062022, 7385225, 7804456, 8318543, 8940271, 9690739, 10731014, 11852020, 12896588, 13613095, 14186551, 14147128, 13536545, 12813111, 12220330, 11943886, 11891080, 12040431, 12435402, 12920175, 13684710, 14788894, 16163410, 17885853, 19611471, 21085230, 22259368, 22853419, 23327793, 23304288, 22920222, 22802226, 22847092, 23009642]
5135B3009642L94484k85808j117791j717189k087681j718485j410938j186353
5127A3879881q10401n70783k85891j02017J7063K31932K78352O33908R28815J305570
5117A5506429J236148J033406J008166M99629M10962M8377l45371r74846j776403
5108A6646497j814301j732909j523533j412865j136518q54534p30719n52478m06532
5099F482108m33767l20673l24472k50755l12005k18567j99024k32122j74330j30482
5089C885911q5862j05686q7567k6568p4866j45834q0189p3253p2293n6184n8824
5078C018785m6893m0873j0850l5799o2719l3081N84j2187n5816p8675q9030r8450
5066B454996r4815n9802l7859l3927n8474n0018l6174j1829o1893o1384q817n7747
$$ y = [23009642, 23404126, 23118318, 22000527, 20283338, 18195657, 16477172, 15066234, 13879881, 13069480, 12498697, 12212806, 12110789, 12127852, 12359784, 12638136, 13272044, 14200859, 15506429, 16742577, 17775983, 18784149, 19283778, 19694740, 19743117, 19397746, 18422900, 16646497, 14832196, 13099287, 11575754, 10162889, 9026371, 8171837, 7441118, 6888640, 6482108, 6048341, 5727668, 5403196, 5152441, 4840436, 4621869, 4422845, 4190723, 4016393, 3885911, 3800049, 3694363, 3606796, 3580228, 3505362, 3359528, 3279339, 3206086, 3133793, 3077609, 3018785, 2971892, 2931019, 2920169, 2884370, 2821651, 2788570, 2789154, 2776967, 2721151, 2642476, 2553446, 2454996, 2360181, 2300379, 2262520, 2228593, 2170119, 2120101, 2083927, 2072098, 2010205, 1948821, 1940004, 1882257]
5054A882257J8170q6166j0572L889k1147k7531J4747l0192P546p269l7863l094
5042A702775K385l7352p2162l4264l4209o1021m4716j6509q44j0429O035j8931
5030A380758p522j6970m4307j2891k1318p8909J9611n5167o2636o6619L0192L806
5018A068028l0692j5739l9931n5808K0778K1552l4686l7070l588L5371J7819K0631
5006I66665l2805j0496j7001L2472m091k6824m8729J4651j9076n3691j8594o9797
4994G12684M718K4113R831j7453j9938l6430k7476k3983O0669k6057j5093l3821
4982F11764k2504P751k6776J5119m1096L0748k9029m5334P342N809N396j5290
4970E03900k9108M095j920o2370M023L6488M2759j7151k4408M6234l9972J4777
$$ y = [1882257, 1900427, 1814261, 1803689, 1807578, 1786431, 1758900, 1773647, 1743455, 1751001, 1743732, 1705869, 1702775, 1705160, 1667808, 1595646, 1561382, 1527173, 1466152, 1421436, 1404927, 1404083, 1393654, 1399689, 1380758, 1373236, 1356266, 1311959, 1299068, 1277750, 1198841, 1218452, 1163285, 1100649, 1034030, 1064222, 1068028, 1037336, 1021597, 981666, 925858, 946636, 968188, 933502, 896432, 892844, 928215, 946034, 966665, 933860, 923364, 906363, 938835, 934744, 907920, 859191, 873842, 854766, 801075, 782481, 712684, 717402, 741515, 751346, 733893, 713955, 677525, 650049, 626066, 686735, 660678, 645585, 611764, 589260, 597011, 570235, 585354, 544258, 575006, 545977, 500643, 507985, 513794, 519190, 503900, 474792, 478887, 476967, 414597, 418620, 455108, 497867, 480716, 456308, 502542, 462570, 477347]
4958D77347l323k7200m1999O1615k4953j7480j0130j0719m8450k2607J036o4453
4946B68684R274K5005N6697J2985o4714r347J9379o0179K4340K8310K670J5015
4934C28119n4077k2100Q7316j5265n3985L8535k3438J9382p2220L1356J1499j8649
4922B56473L7732k4851j6645L0553j5022q212J6726j0205l4972J2546J4452P71
4910B59346m4815j6500O686l2194j2699O0922p096J5542k4986L277K1183J0974
4898B39640j6349k5517K2951o530P244j173J6212M1811Q974j4850l323n651k4065
4885B39374K8915L031K9772l3475l405l0892J2221q576l6332K2638j6562K3073
4873B29782q028J3151n42k133J9722K5896L5127m7788j4660J2621k3237l5393
$$ y = [477347, 474024, 446824, 404825, 466440, 441487, 424007, 413877, 403158, 354708, 332101, 333137, 268684, 277958, 302963, 359660, 372645, 307931, 298584, 317963, 257784, 282124, 310434, 313104, 328119, 274042, 251942, 339258, 323993, 270008, 308543, 285105, 304487, 232267, 263623, 275122, 256473, 294205, 269354, 252709, 283262, 268240, 260028, 276754, 266549, 231577, 244123, 258575, 259346, 214531, 198031, 204717, 172523, 159824, 220746, 213650, 229192, 204206, 207483, 228666, 239640, 223291, 197774, 220725, 214195, 221439, 220266, 236478, 278289, 287263, 272413, 269090, 263439, 239374, 268289, 271320, 301092, 267617, 264212, 233320, 245541, 236965, 200633, 223271, 206709, 229782, 221754, 234905, 234363, 232230, 251952, 277848, 312975, 265187, 250527, 263148, 239911, 204518]
4861B04518P739K4738j719l8863O5120k902q0921J1420J8430k611m4884j8725
4849A41340l9017O0867J8216J06M661k0231K3423N8285o5941n0313N2152L6415
4837B19963l5043J4346k8692j094J4963n289j9536K2238m1157j7422j5891L0651
4825A38037L9203m585m1103k2676l0768M9447l768M3632m7852J1491K8543m3005
4813A16596l5935J0627J9091k498m2853L4904N3354m6246J5714j3782J5173O090
4801A30235l5030K483M7144J363l4634P556K9903O3286j5634n6106m3188M3510
4789A40888M5060P277l943k5968k4756K580Q728K9450m200l9968K4612J3232l5881
4776A37111J460N4990j0809j5472m7794K2832K0606N978j0600N687J8561M5219
$$ y = [204518, 212257, 236995, 235276, 196413, 261533, 258631, 177710, 189130, 207560, 204949, 160065, 141340, 102323, 163190, 181406, 181512, 186173, 165942, 189365, 247650, 181709, 131396, 183548, 219963, 184920, 199266, 170574, 169480, 184443, 179154, 159618, 181856, 140699, 123277, 107386, 138037, 177240, 172655, 131552, 108876, 78108, 127555, 123787, 167419, 119567, 131058, 159601, 116596, 80661, 91288, 110379, 107881, 65028, 99932, 153286, 107040, 122754, 108972, 124145, 130235, 95205, 97688, 144832, 146195, 111561, 119117, 149020, 212306, 196672, 140566, 97378, 140888, 185948, 193225, 189282, 163314, 138558, 141138, 149866, 179316, 175116, 135148, 159760, 172992, 137111, 138571, 193561, 182752, 167280, 119486, 142318, 162924, 168902, 158302, 163989, 182550, 227769]
4764B27769K7580r108m0654L7959K3110m80j3054K7372L270k8812j5865j1466
4752B27621O844J4582J1627j1574n21N5645k1237o6913J7070O0074j8290M646
4740B79574k4973M439q828o569J1087J236K9279K4309n224j5097k9284J8996L3190
4727C12135O971n652K4105k9275J6629N2795k9240J4307k4844m782R562m8478
4715B94233J7135P1736K9660p1463K7644k7706j5909n970K5707L3004j583k9239
4703C47249o614M3978n37j4579o760K7370M417k113L2183l8224K6327l4120j005
4690C77572p52j2844J0947l7115M1471j1992l5086k5462L0959R338M6886k9796
4678C64126O4440l9024l6881L6852m4232J1141p171L2144J5108m0364L517N273
$$ y = [227769, 255349, 246241, 205587, 243546, 266656, 266176, 253122, 280494, 283764, 254952, 239087, 227621, 234465, 249047, 260674, 249100, 248579, 304224, 282987, 216074, 233144, 293218, 274928, 279574, 254601, 259040, 250212, 243643, 254730, 255966, 285245, 309554, 304330, 289233, 259949, 278945, 312135, 319106, 313454, 337559, 308284, 324913, 377708, 348468, 362775, 337931, 333149, 342711, 294233, 311368, 383104, 412764, 341301, 368945, 341239, 325330, 319360, 345067, 378071, 376488, 347249, 340635, 384613, 384076, 369497, 362737, 390107, 394524, 392411, 424594, 386370, 412697, 378577, 377572, 376820, 363976, 374923, 337808, 379279, 367287, 332201, 306739, 337698, 347036, 393922, 364126, 428566, 389542, 352661, 389513, 345281, 356422, 349251, 381395, 396503, 356139, 359656, 364929]
4666C64929K3068q7887K2339K6124L3196J6064K6214o582k2352k0J1587r515L6077
4653D33242j6637J0560j7901N630j2343j8806K0139L3711J0309p602L2551l6315
4641D36538J0690N1828K7258J4259L100m4721q264K6108P3087j7409j733L2154
4629F02895k5102M6785L6669q624r584M277K4891P965k2382L6649M1598R231N2460
4616G97728J9283K8761l87j7157M6467Q2708K4856n193M504M0144N0836J3650
4604A086200M9129N1196J4586L9894K4165j5147K1179p376J8579N2770N2072R171
4592A396418K8167P6768J3666M9110p530M5256O0895K7026O952Q102Q9588M6228
4580A840646O9264j2680M7894P6568K1687O2913j1713L7907J01463Q8779K9822
$$ y = [364929, 387997, 300110, 322449, 348573, 381769, 397833, 424047, 417465, 395113, 395093, 406680, 397165, 433242, 416605, 427165, 409264, 414894, 402551, 383745, 403884, 437595, 447904, 440302, 472853, 436538, 447228, 499056, 526314, 540573, 543673, 498952, 490688, 516796, 589883, 572474, 570741, 602895, 577793, 624578, 661247, 652623, 643039, 647316, 672207, 680172, 657790, 694439, 736037, 745268, 797728, 817011, 845772, 845385, 828228, 874695, 957403, 982259, 977066, 981570, 1021714, 1072550, 1086200, 1135329, 1186525, 1201111, 1241005, 1265170, 1250023, 1271202, 1263826, 1282405, 1335175, 1387247, 1396418, 1424585, 1501353, 1515019, 1564129, 1556599, 1601855, 1662750, 1689776, 1696728, 1704830, 1794418, 1840646, 1909910, 1897230, 1945124, 2021692, 2043379, 2106292, 2094579, 2132486, 2233949, 2322728, 2352550]
4569B352550M4218N6047Q5863O5581J02081J01311J24337R3029J37708J52914
4559C315639P8376J10114J72825J40959J58578J95920K47357K07153K30726K20766
4549E078413K96918K60884K76689K93426L40382L25510L66730L64094L53863L42103
4539H299012L02929K76084K41039K18303K13772J57728J09960N6598l8790r3550
4529I743085j18164p2720j33794r8266k00426k28590k68030l00276l20544l22899
4519G679376l80382l61641l44502l17823l24826k76218k91447k33105k66570k61482
4509D621380j80204j48817j87691j72210k12177j08381j83024j78457p2973j88364
4499B989082j18317j10640r2457j06779j54361r3909j17007k4328j15209n6568
$$ y = [2352550, 2396768, 2452815, 2538678, 2604259, 2706340, 2807651, 2931988, 3025017, 3162725, 3315639, 3394015, 3504129, 3676954, 3817913, 3976491, 4172411, 4419768, 4626921, 4857647, 5078413, 5375331, 5636215, 5912904, 6206330, 6546712, 6872222, 7238952, 7603046, 7956909, 8299012, 8601941, 8878025, 9119064, 9337367, 9551139, 9708867, 9818827, 9875425, 9836635, 9743085, 9624921, 9552201, 9418407, 9320141, 9119715, 8891125, 8623095, 8322819, 8002275, 7679376, 7298994, 6937353, 6592851, 6275028, 5950202, 5673984, 5382537, 5149432, 4882862, 4621380, 4441176, 4292359, 4104668, 3932458, 3720281, 3611900, 3428876, 3250419, 3177446, 2989082, 2870765, 2760125, 2667668, 2560889, 2406528, 2312619, 2195612, 2171284, 2056075, 1999507]
4489A999507k5714j34807o2233l2586m1381q5686m3334j778o7454q8334k522l2865
4477A380813k881q9407p3200m6488M223l3889p4826m3785k0397k9126n3010j0422
4465I07605K4879p7730j6350j1136k2428J7855j6662n5564k0002k5979N29J0165
4453G15182m100m1624N878J5569n6813m5894p2067L6143P788k1315L806K5493
4441E68046P954n8255r889m064l4276o628m2408K3787O8054k1224l6073j7539
4429D37485k382L6457k1820J0544l1145L1343m4893l8921P0384j9900o6520p987
4417C52645L0999k7629J2306J1735M0970m4246K6376L5940o0957M7307k4789M564
4405D05221l986k3479J9148m010n1047M509L0604l4960M1068k8973k42k3253j0312
$$ y = [1999507, 1973793, 1838986, 1776753, 1744167, 1702786, 1617100, 1573766, 1571988, 1504534, 1416200, 1413678, 1380813, 1377932, 1288525, 1215325, 1168837, 1173060, 1139171, 1064345, 1020560, 1000163, 971037, 918027, 907605, 932484, 854754, 838404, 827268, 804840, 822695, 806033, 750469, 730467, 704488, 705017, 715182, 711082, 669458, 675336, 690905, 634092, 588198, 516131, 552274, 560062, 538747, 542553, 568046, 576000, 517745, 507856, 503792, 469516, 462888, 420480, 444267, 512321, 491097, 455024, 437485, 435103, 471560, 449740, 460284, 429139, 460482, 415589, 376668, 447052, 427152, 360632, 352645, 383644, 356015, 368321, 380056, 421026, 376780, 403156, 439096, 378139, 425446, 400657, 405221, 401235, 377756, 396904, 392894, 341847, 346356, 376960, 342000, 383068, 354095, 353853, 330600, 320288]
4392C20288J1176J3935j2817m9749L4741k9443M6990L6105k4933K4931m0808K0122
4380C50538K8365o7447L6986J2797J9392L1546k5040l8587O377M9101K5248n382
4368D23894m6651M8017M4437l5813K1019j4060M4073J8134O2169K5174p5664K8709
4356E43438n7122L9347j5438J6983m19p4742J4952n9640K5933J0296k5449k5906
4344C92233J3276j0692q18n142P807K9436j4247k6536K964Q892k9925J2248O0701
4331D40197j2912p450L3125N0412Q726L2329K8502M7042L5613N9725O8969P879
4319G92157N4641L2090K934J3717K2795j03932k0064p1487p9722l2282k1069j6134
4307E73644k9757j8953m8119J0287l0756j2702K670k8841j613J0041K3684l3124
$$ y = [320288, 331464, 345399, 332582, 282833, 317574, 288131, 335121, 371226, 346293, 371224, 330416, 350538, 378903, 311456, 348442, 361239, 380631, 412177, 387137, 348550, 354927, 404028, 429276, 423894, 377243, 425260, 469697, 433884, 454903, 440843, 484916, 503050, 565219, 590393, 514729, 543438, 486316, 525663, 510225, 527208, 526789, 452047, 466999, 407359, 433292, 443588, 418139, 392233, 405509, 394817, 393999, 388857, 396664, 426100, 411853, 385317, 388281, 397173, 367248, 379496, 440197, 427285, 419835, 452960, 503372, 512098, 544427, 572929, 619971, 655584, 715309, 784278, 792157, 846798, 878888, 881822, 895539, 918334, 814402, 794338, 722851, 643129, 610847, 589778, 573644, 543887, 524934, 476815, 487102, 456346, 443644, 446314, 417473, 415860, 425901, 449585, 416461]
4295D16461l0489O5944n414k4476k7419m515N654r476n392k602j3496K3137K2080
4282D09997K9468J7484n8722N5984k7336K7105J2401J1237K8077r826J1274K9970
4270E37113N6367J7669M7492l8639M1986K1233k5073M514Q133M7242k3467k1357
4258F73213m8503j9753k9110K3218J6828J3437p8248J3245J9233M2396j4966j8963
4246E92027k3556K7600M1221Q282j0068J9809n656M5888M0543l5908q552Q915
4234G00545J1775K0175r505J4402K1000n373K8370K7563N5200M1812M3662N676
4222I55302O117L6472J2729L131M807O6529R754J793N1748R9729P0485Q3987O2746
4209A465329p040L978J5797o3517q8518r1531r0491j5171q4179l0373j50152j7792
$$ y = [416461, 385972, 451916, 446502, 422026, 394607, 390092, 395746, 386270, 380878, 378276, 364780, 387917, 409997, 439465, 456949, 398227, 454211, 426875, 453980, 466381, 477618, 505695, 495869, 507143, 537113, 593480, 611149, 658641, 620002, 661988, 683221, 658148, 662662, 670795, 718037, 694570, 673213, 624710, 604957, 575847, 599065, 615893, 629330, 551082, 564327, 583560, 625956, 610990, 592027, 568471, 596071, 637292, 645574, 635506, 655315, 649659, 695547, 736090, 700182, 691630, 700545, 712320, 732495, 722990, 737392, 758392, 753019, 781389, 808952, 864152, 905964, 949626, 955302, 961419, 997891, 1010620, 1013751, 1018558, 1085087, 1094841, 1096634, 1148382, 1248111, 1318596, 1402583, 1465329, 1458289, 1462267, 1478064, 1414547, 1326029, 1234498, 1144007, 1128836, 1044657, 1014284, 864132, 846340]
4197H46340n9176l9176l4304j9377m4897n1483o3630L8228n8268j5199L4316m3893
4185D89481j3461n093o7017N3008k5880L318l3344n0854l2071N1572k5827j8311
4173C25521J4761k806L7763r3066j4652M9313k0613J4473m2761K5734L5869k0453
4161C09083L0388j5307k1576j7604N6656J5970J8686L846p986k1932j6844M0585
4149C73965P41L2295J5653n8132l9889l2707N609q6032K716K6788k2146q891n56
4136B09414m9214n4903M5554K5703j9978k0081o2507L8959n3316Q001L1383L3316
4124A32331k7719K2801O496O929m7192m276n707J2132m5534Q655K0533P360j9905
4111F6904K5197P5103m9876m5721N9036k8679l951J1797k4755k1027j1406M3154
$$ y = [846340, 787164, 747988, 713684, 694307, 649410, 597927, 534297, 572525, 514257, 499058, 533374, 489481, 476020, 470927, 403910, 456918, 431038, 434356, 401012, 350158, 318087, 369659, 343832, 325521, 340282, 337476, 375239, 282173, 267521, 316834, 296221, 310694, 267933, 293667, 329536, 309083, 339471, 324164, 302588, 284984, 341640, 357610, 376296, 380142, 372156, 350224, 333380, 373965, 374706, 407001, 422654, 364522, 324633, 291926, 297535, 211503, 214219, 241007, 218861, 209970, 209414, 160200, 105297, 150851, 176554, 156576, 136495, 73988, 112947, 59631, 67632, 99015, 132331, 104612, 127413, 133909, 140838, 93646, 89370, 83663, 95795, 50261, 58916, 79449, 86809, 66904, 92101, 167204, 117328, 71607, 130643, 101964, 98013, 109810, 85055, 64028, 52622, 95776]
4099I5776l7244M7453m7923J6671K6469j9564k5526O544q693R846k9402K1658
4087E6065j0348n5463L7508J3086l1855K14J6961j9916M190L9061Q981k8804J4861
4074D4541K3503l7818o891O987l996n5973L4845n804M0785o3241Q387M2066j2331
4061A5060M407K8151K6046m4592j6435K2454N2925J0726l8540q38L483r218O3278
4048A16907l2970l2010j9983K0446m7233K6138L8908j2284j0018L6913j7262n4919
4036A2633K0630j2735O1787J0657r468l4454J7822k0069J2812J9266j8940J5115
4024G5056N5251L3455j1385M5378l0630j7165L551L7131q6326M968N272j6193
4012I8363O400k6686j6856J2513j3383j4880K3674n434P806J31M545J9126l7973
$$ y = [95776, 58532, 105985, 58062, 74733, 101202, 81638, 56112, 62656, 53963, 63809, 34407, 56065, 45717, -9746, 27762, 40848, 8993, 9207, 26168, 6252, 10442, 49503, 58484, 29680, 44541, 68044, 30226, 23335, 30322, 26326, -29647, 5198, -606, 40179, -23062, -14675, 27391, 15060, 19467, 47618, 73664, 29072, 12637, 35091, 88016, 98742, 60202, 59364, 62847, 53629, 116907, 83937, 51927, 31944, 52390, 5157, 31295, 70203, 57919, 47901, 84814, 67552, 12633, 33263, 20528, 82315, 92972, 83504, 49050, 66872, 46803, 59615, 78881, 59941, 75056, 130307, 163762, 152377, 197755, 167125, 149960, 153511, 190642, 104316, 109284, 114556, 98363, 104763, 78077, 61221, 73734, 60351, 45471, 69145, 63711, 71517, 71648, 76193, 95319, 57346]
3999E7346j0680k868M9100J3259k8915l7851M3793N171j7234K7837j004J9097
3987A17051K0711n6485J2489L5163n2528j460J2672n1648j3685m4443Q5575L9657
3975A03069m133l9129m9325K4564j8164N3095k5455J3010K9780J3872m1442q184
3963E1558K5059K6259k1697j3072j3068j4834N141k8806m14P5251l3711k4313
3951C3353J4367j1747m5779K7206N492K9710Q363l6267l3360N1163J7948K7807
3939H8256O6651o3740o390m647L8665m6828l034K2128Q947J3229j4645L1521J895
3926A32008j4993L2715l965L4415K6460n4206K5948j2316j3942K5268l1480M3403
3914A89315K3356q7604P2655K6807l9475q89k7090J4188M1987j1228l4383j7440
$$ y = [57346, 46666, 43798, 92898, 106157, 77242, 39391, 83184, 88355, 71121, 98958, 97954, 117051, 137762, 81277, 93766, 128929, 76401, 74941, 87613, 35965, 22280, -22163, 63412, 103069, 98936, 59807, 10482, 35046, 16882, 69977, 44522, 57532, 87312, 101184, 59742, 51558, 76617, 102876, 81179, 68107, 55039, 40205, 45346, 16540, 16126, 91377, 57666, 33353, 47720, 35973, -9806, 17400, 22892, 52602, 60965, 24698, -8662, 42501, 60449, 88256, 154907, 91167, 84777, 80130, 118795, 71967, 68933, 91061, 100008, 113237, 98592, 130113, 132008, 117015, 149730, 145765, 180180, 206640, 152434, 178382, 166066, 152124, 177392, 145912, 189315, 212671, 125067, 197722, 224529, 185054, 184165, 157075, 171263, 213250, 202022, 167639, 150199]
3902A50199k87j6813m264K0518J5774n4359K3647N951M1r460J711J9988K3081
3889A75727l6852l7013P890N0945o502Q29M3934j9048k0648k5591k6744M5963
3877A52890K1532m221j5772M3817L3694n9138R904j9698N6476N147l9088J8761
3865B04304J7611p658L125j6362P7627j4570R239K9623l2579K9748o978r1572
3853B01558r793O266l7494j3901j7023P6270k8542M6963J4078l6850k1942n338
3841A74252L2890q270m0029n959j4925q727L4796L5252j6307j6925M5021Q935
3829B20004j9121K7424k1353L638J0922j9334l2208j414O7314m304J9344L6860
3817B87772L9386n4140J6684p5073J8088J5205L8182M2822k9569j5919k1688k56
$$ y = [150199, 149912, 133099, 128835, 149353, 165127, 110768, 134415, 140366, 140407, 130947, 132658, 152646, 175727, 138875, 101862, 109752, 160697, 154195, 155024, 198958, 179910, 159262, 133671, 106927, 152890, 174422, 170201, 154429, 198246, 231940, 172802, 182706, 163008, 219484, 224631, 185543, 204304, 221915, 214257, 217382, 201020, 278647, 264077, 273316, 302939, 270360, 300108, 293130, 201558, 191765, 198031, 160537, 146636, 129613, 205883, 177341, 224304, 238382, 201532, 179590, 174252, 207142, 198872, 158843, 152884, 137959, 129232, 164028, 199280, 182973, 166048, 211069, 220004, 200883, 228307, 206954, 210592, 221514, 202180, 169972, 168558, 235872, 231568, 250912, 287772, 327158, 273018, 289702, 214629, 232717, 247922, 286104, 328926, 299357, 283438, 261750, 261494]
3805B61494M532O471l3570J3259l627J1334l294J9282M1135J285K0375K7271j6682
3792C49265n9938P0677l0883l1303j5781M9380K930j8538K1511K0547L5123m4482
3780C48508j1184p147J4964M256K6997k2162L5492l5806n3043K4497J0661M2748
3768C78781J3502M3214Q391n8353J4108M8522K2686J7206J1897K5637m1298k4969
3756D59324M2111M774M35O059l2001J8818K6649l1318j1095j0854K4409j9126
3744D78185m269O8136o093m4042l1201N6046P964O313R57k8504M2693j9231m9180
3731D77774J09005k1840m5957k0059L4061K1975K1921j8787J646k0116j0309P205
3719E36519K6867l075K491M3739k4347N886k1739N1751J254N1084m5860L058P827
$$ y = [261494, 266026, 272497, 238927, 252186, 248559, 259893, 256599, 275881, 317016, 318301, 338676, 365947, 349265, 289327, 360004, 329121, 297818, 282037, 331417, 334347, 315809, 337320, 357867, 392990, 348508, 337324, 330177, 345141, 349397, 376394, 354232, 389724, 353918, 300875, 325372, 336033, 378781, 392283, 435497, 443888, 385535, 399643, 448165, 470851, 488057, 499954, 525591, 484293, 459324, 501435, 506209, 506644, 512703, 480702, 499520, 526169, 494851, 483756, 472902, 497311, 478185, 473916, 542052, 535959, 491917, 460716, 516762, 524726, 531039, 531996, 503492, 546185, 526954, 477774, 586779, 564939, 518982, 498923, 532984, 554959, 576880, 558093, 559739, 539623, 529314, 536519, 563386, 560311, 562802, 606541, 582194, 588080, 566341, 618092, 619346, 670430, 624570, 627628, 635455]
3706F35455M3232l3553M5357k5880Q086o131L4615M927l7619P4369M1942k9367
3694G55433J3965J5809j1298J9385L1299R438k8406N5158k5434l8409N8847J3198
3682H68985j9620j4583k1645J4526K6999J5530J4669k9995j1985P784l886k2855
3670H23924M9389J573l4594M5827j1786K4675Q1943p66O6915J6007K765L3249
3658A099121L1054O4070J6586J4866o285M4448N2937k1351K6119J8846L5144l1482
3646A344073o089K5420M5388K3519J9265M6699K1454O1275k3194M8523L7903j2303
3634A631933K8122K9156R2406N0821P953M2774P8475N6235p193N0916L8393J4204
3622B114195M6590M8238L8871j636j0229R713j344J33O808k4292j1960M3074l4608
$$ y = [635455, 678687, 645134, 690491, 664611, 672697, 666566, 701181, 706108, 668489, 742858, 784800, 755433, 769398, 785207, 773909, 793294, 824593, 834031, 805625, 860783, 835349, 796940, 855787, 868985, 849365, 834782, 813137, 827663, 854662, 870192, 884861, 854866, 842881, 850665, 846779, 823924, 873313, 874886, 840292, 886119, 874333, 899008, 980951, 980185, 1047100, 1063107, 1065872, 1099121, 1130175, 1194245, 1210831, 1225697, 1219412, 1263860, 1316797, 1295446, 1321565, 1340411, 1375555, 1344073, 1337984, 1363404, 1408792, 1432311, 1451576, 1498275, 1519729, 1581004, 1557810, 1606333, 1644236, 1631933, 1660055, 1689211, 1781617, 1832438, 1840391, 1883165, 1961640, 2017875, 2010682, 2061598, 2099991, 2114195, 2160785, 2209023, 2247894, 2246258, 2236029, 2245742, 2244398, 2244531, 2251339, 2227047, 2215087, 2258161, 2223553]
3609B223553O4862l9244l1843q0499p1459q8709j2024r433L5310M190O354k1358
3597A979700l6070M0126K1213L9571l0650L1591L3686L0445K4437r066k210j2878
3585B109895O9275J0731q87P8814N6089M465P7991P2315L0610Q2381L3542N4793
3573B680014Q2033N0573J4026n9874o385K7263K5803o1673o8395n7215l8667j8961
3561B568542k5094p3862l1794k2487l3547J3763k9875R133k767k4970k2665Q062
3549B332439K8661j3075k7623M1703J0163J0513k1267N9375Q9280K0472j7939
3538B512702O0104O464M108N8771j2576N0673K2336O0153K0966K0383M6694R795
3526B860573K0647Q4367K9023L1592N0133K1181M7158J8054M2962O4126O3684
$$ y = [2223553, 2288415, 2249171, 2217328, 2136829, 2065370, 1976661, 1964637, 1955204, 1990514, 1994704, 2001058, 1979700, 1943630, 1983756, 2004969, 2044540, 2013890, 2045481, 2079167, 2109612, 2134049, 2124983, 2122773, 2109895, 2179170, 2189901, 2189014, 2267828, 2323917, 2328382, 2406373, 2478688, 2509298, 2591679, 2625221, 2680014, 2762047, 2812620, 2826646, 2766772, 2760387, 2787650, 2813453, 2751780, 2683385, 2626170, 2587503, 2568542, 2543448, 2469586, 2437792, 2415305, 2381758, 2395521, 2365646, 2374779, 2372012, 2347042, 2324377, 2332439, 2361100, 2348025, 2320402, 2362105, 2372268, 2382781, 2361514, 2420889, 2510169, 2530641, 2512702, 2572806, 2579270, 2583378, 2642149, 2629573, 2680246, 2702582, 2762735, 2783701, 2804084, 2850778, 2860573, 2881220, 2965587, 2994610, 3026202, 3076335, 3097516, 3144674, 3162728, 3205690, 3269816, 3333500]
3515C333500L7836J35059P2092N0365P2333J7261N1178j3250j7415K9830j5863
3504C752926L6311J7768L2001J7991J15101M3746M4214N2492J3998M2924L5362
3493D204834J20227M0633L2927L7335J1401Q8411J9827J15883J03302M5896P2146
3482D892822J45904J31013Q4801N1533N9515N6636J28417J47551J54844J70845
3472F023881J62244J49127J80158J62015J27664J29299J24644J32079J15103J53995
3462G460209K00998J73270J67255J52408K68033J82405J89081K30273K03494K45337
3452I472763K30677J29299J58445J38003M9593J17312J20807J06079J38648J91103
3442A0852729J87343J93332J78125J78899K36935K60599L16569K97064L03936
$$ y = [3333500, 3371336, 3506395, 3578487, 3628852, 3701185, 3718446, 3769624, 3756374, 3738959, 3768789, 3752926, 3789237, 3807005, 3839006, 3856997, 3972098, 4015844, 4060058, 4112550, 4126548, 4169472, 4204834, 4325061, 4365694, 4398621, 4435956, 4447357, 4535768, 4555595, 4671478, 4774780, 4820676, 4892822, 5038726, 5169739, 5254540, 5306073, 5365588, 5422224, 5550641, 5698192, 5853036, 6023881, 6186125, 6335252, 6515410, 6677425, 6805089, 6934388, 7059032, 7191111, 7306214, 7460209, 7661207, 7834477, 8001732, 8154140, 8422173, 8604578, 8793659, 9023932, 9227426, 9472763, 9703440, 9832739, 9991184, 10129187, 10178780, 10296092, 10416899, 10522978, 10661626, 10852729, 11040072, 11233404, 11411529, 11590428, 11827363, 12087962, 12404531, 12701595, 13005531]
3433A3005531L45446L53766L87916L35186L88132M20646M70410N18890M92740
3424A6718663N21689N93117N71575P33056P06141O87352P66575Q18838Q61310
3415B2978316R96390J026969J143350J208264J331505J411838J610072J764738
3407C3471442J935076K127456K426766K725024L051736L510065L877923M070202
3399E7195690L911098L153931K021976R16932L38762L14047Q40255J603281K574289
3390G2870261L796234N024144O184755O960803O427835M746887L423203L106658
3382A12540780L924130N178681N470844M251870J995975j191933m016963m997378
3374A23156006m477610k875709j465446j532015k508194l209178l065836j852248
$$ y = [13005531, 13350977, 13704743, 14092659, 14427845, 14815977, 15236623, 15707033, 16225923, 16718663, 17240352, 17833469, 18405044, 19138100, 19844241, 20531593, 21298168, 22117006, 22978316, 23974706, 25001675, 26145025, 27353289, 28684794, 30096632, 31706704, 33471442, 35406518, 37533974, 39960740, 42685764, 45737500, 49247565, 53125488, 57195690, 61106788, 64260719, 66282695, 67199627, 67538389, 67852436, 68692691, 70295972, 72870261, 76666495, 81690639, 87875394, 94836197, 101264032, 106010919, 109434122, 112540780, 116464910, 121643591, 127114435, 131366305, 133362280, 132170347, 128153384, 123156006, 118678396, 115802687, 114337241, 112805226, 110297032, 107087854, 104022018, 102169770]
3366A02169770j69154J034321P53983Q8972m02916p88380r76606j223451j451767
3357I9034772j714663k775035n190214p108410q182216p924501o811033n667916
3349E3660784m792967l973037l355474k918435k500006k175367j992001j624422
3341C0329075j431322j353244j129145r96165r44572q47895p73846q39757p48772
3332B1264357o88835p11617o67512n68072o10865n37549m96371n33083n04444
3323A5946009m60282n23442m61546l82389m01610l56962l60229m00153l54811
3314A2244585l25991l28601l30553k50671k48238l24151k58669k64268k12220
3305I701223k23394k08148j66521j72073j41999j79295j81400j47422j15451j63422
$$ y = [102169770, 102000616, 103034937, 103788920, 103877892, 103474976, 102686596, 101709990, 100486539, 99034772, 97320109, 94545074, 89354860, 82246450, 74064234, 66139733, 59328700, 53660784, 48867817, 44894780, 41539306, 38620871, 36120865, 33945498, 31953497, 30329075, 28897753, 27544509, 26415364, 25419199, 24474627, 23626732, 22852886, 22013129, 21264357, 20575522, 19863905, 19196393, 18628321, 18017456, 17479907, 16983536, 16450453, 15946009, 15485727, 14962285, 14500739, 14118350, 13716740, 13359778, 12999549, 12599396, 12244585, 11918594, 11589993, 11259440, 11008769, 10760531, 10436380, 10177711, 9913443, 9701223, 9477829, 9269681, 9103160, 8931087, 8789088, 8609793, 8428393, 8280971, 8165520, 8002098]
3295H002098j00767j13242j43439p4043j03689j67920j65231j69102j21852k01509
3285F641304j27073j68312j52834r7548q1252j63924j36784o3145j05893q0965
3275E463574n3250j7259q7713o4137k9494m8683j09831n0630P622o9240j29172
3264D811787m197n3021m2466J1960J2703m5698m0398m1103k4896L0993o974m9059
3252D559631k1661m8653k2330l1046j9755j34470j32610n8515k5085p4537P403
3241C998372j3369j3779n3262m8008l4949o302k7597n4001o1131K1516J2313m2057
3229C677746J3100l3308l1265j4280L3869j5423n7661O2117J0105L0747K963k3180
3217C655530o1541L5616Q054j2231N1222m1450J15n1022M3876j8547l5092J3503
$$ y = [8002098, 7901331, 7788089, 7644650, 7570607, 7466918, 7298998, 7133767, 6964665, 6842813, 6641304, 6514231, 6345919, 6193085, 6095537, 6014285, 5850361, 5713577, 5650432, 5544539, 5463574, 5410324, 5393065, 5305352, 5241215, 5211721, 5163038, 5053207, 5002577, 5010199, 4940959, 4811787, 4807590, 4754569, 4712103, 4724063, 4736766, 4691068, 4650670, 4609567, 4584671, 4615664, 4608690, 4559631, 4537970, 4489317, 4466987, 4435941, 4416186, 4281716, 4149106, 4090591, 4065506, 3990969, 3998372, 3985003, 3971224, 3917962, 3869954, 3835005, 3828703, 3801106, 3747105, 3685974, 3707490, 3719803, 3677746, 3690846, 3657538, 3626273, 3611993, 3645862, 3630439, 3572778, 3634895, 3645000, 3675747, 3678710, 3655530, 3593989, 3629605, 3637659, 3625428, 3676650, 3635200, 3635315, 3584293, 3628169, 3609622, 3574530, 3588033]
3205C588033J0152N3614K2334Q907J2553j4135K7835J2674K9008M3698k8664J2892
3193C778901J462j767K9107L9229K033K7107P3129M2799P0222M9879J3851J00124
3181D226076P2047L5980N1990P2533N1222L7025R2910N9236M4371k7346J43333
3170D859377K216L8036M4535J2483K4283O8411N7817N5745k0682O719O0285O4432
3158E273657K5321Q5785M0355O1397O6337Q5714J12289R0079Q4721K9251P1220
3147F026126J09390P4025R6791J56810N3383R6488O5854R5714J54249J13554J49864
3136G192248J16562J88918K24878K37782J70373K18702K31118K36548K30935J96460
3126I244524J76897J54247K32451K27439K84243K53023K76928L55197L13563K85992
$$ y = [3588033, 3598185, 3651799, 3674133, 3683040, 3695593, 3681458, 3709293, 3721967, 3750975, 3794673, 3766009, 3778901, 3780363, 3778596, 3807703, 3846932, 3848965, 3876072, 3949201, 3992000, 4062222, 4112101, 4125952, 4226076, 4298123, 4334103, 4386093, 4458626, 4509848, 4546873, 4639783, 4699019, 4743390, 4716044, 4859377, 4861593, 4899629, 4944164, 4956647, 4980930, 5049341, 5107158, 5162903, 5142221, 5148940, 5209225, 5273657, 5298978, 5384763, 5425118, 5486515, 5552852, 5638566, 5750855, 5840934, 5925655, 5954906, 6026126, 6135516, 6209541, 6306332, 6463142, 6516525, 6613013, 6678867, 6774581, 6928830, 7042384, 7192248, 7308810, 7497728, 7722606, 7960388, 8130761, 8349463, 8580581, 8817129, 9048064, 9244524, 9421421, 9575668, 9808119, 10035558, 10319801, 10572824, 10849752, 11204949, 11518512, 11804504]
3116A1804504L36474L69732L71605L88526L23680L76435L83399L80111M59207
3107A5193673M23158M27931M31668M54787M64292M95703N90561O56586N63608
3098A9701967N98957O53915O79684P53307P53963Q70801R41279R68412J014018
3089B6936303J223629J343796J395339J660762J888078K069840K347149K557860
3081D1422756K934135L364983L798384M176105M276054L676734K106385K62130
3073F6017666j330491j948590j972264j519313q47675k51564L03777Q95953J501041
3064F0848540K211935K899920L806499M889860O029037O909609O674317M472465
3056I8742182P17770l071732n413641n915777n330473m294484l294115k286512
$$ y = [11804504, 12140978, 12510710, 12882315, 13270841, 13594521, 13970956, 14354355, 14734466, 15193673, 15616831, 16044762, 16476430, 16931217, 17395509, 17891212, 18481773, 19138359, 19701967, 20300924, 20954839, 21634523, 22387830, 23141793, 24012594, 24953873, 25922285, 26936303, 28159932, 29503728, 30899067, 32559829, 34447907, 36517747, 38864896, 41422756, 44356891, 47721874, 51520258, 55696363, 59972417, 63649151, 65755536, 66017666, 64687175, 62738585, 60766321, 59247008, 58399333, 58147769, 58451546, 59347499, 60848540, 63060475, 65960395, 69766894, 74656754, 80685791, 87595400, 94269717, 98742182, 99459952, 96388220, 90974579, 85058802, 79728329, 75433845, 72139730, 69853218]
3048F9853218j420130p22815o7468O49506J362160K123073K864247L451882M030976
3039H2124649M202847L623043K699784J853504J636527K088165K928425L823198
3031A04980142M532564M850790M863864M556650L742092K093600m66523l316438
3023A25836741n541148o674254p130153p332755p460318p260471o971246o371523
3015G1094873n673214m988765m373012l728255l274117k832243k425099k114906
3007D1685262j748538j545796j261531j064209p84308n52246m09370l15341p86192
2998C3217731j026466j089140r77194p41627o42438o30541n98848n35569n60945
2989B6414963n05710m31451m23082m13206l85977k85268k66801j50727j22761
$$ y = [69853218, 68433088, 67710273, 67642805, 68292311, 69654471, 71777544, 74641791, 78093673, 82124649, 86327496, 89950539, 92650323, 94503827, 96140354, 98228519, 101156944, 104980142, 109512706, 114363496, 119227360, 123784010, 127526102, 129619702, 129153179, 125836741, 120295593, 113621339, 106491186, 99158431, 91698113, 84437642, 77466396, 71094873, 65421659, 60432894, 56059882, 52331627, 49057510, 46225267, 43800168, 41685262, 39936724, 38390928, 37129397, 36065188, 35280880, 34728634, 34319264, 34003923, 33217731, 32191265, 31102125, 30124931, 29383304, 28740866, 28110325, 27511477, 26975908, 26414963, 25909253, 25477802, 25054720, 24641514, 24255537, 23970269, 23703468, 23552741, 23429980]
2980B3429980j10J62293K61207M41473L42209r5868m65586n11527m26359k38610
2970B2899102j19872o4408p976O588R3169R7311J37969J74758K17997K65512L38192
2959B4038342M27790M50904N42632O77512P46859Q37006R85918J068654R42798
2950C0718415R82289J139353J411643J719024K052485K588149L226411L971164
2942D7808933M861717N433710N125998L162155N15839j373218k198691j698051
2934F1638392m96627P09816J710077J791671Q09321J96189P3483P25531J778369
2925F8936222K289236J367377l28986j649914k056006j584879j021538j484493
2917F4467019k282702k840602k796774j846477n51905N24860J293373J276698
$$ y = [23429980, 23429870, 23592163, 23853370, 24294843, 24637052, 24541184, 24075598, 23564071, 23137712, 22899102, 22779230, 22714822, 22706846, 22713434, 22806603, 22903914, 23041883, 23216641, 23434638, 23700150, 24038342, 24466132, 24917036, 25459668, 26137180, 26884039, 27721045, 28706963, 29775617, 30718415, 31700704, 32840057, 34251700, 35970724, 38023209, 40611358, 43837769, 47808933, 52670650, 58104360, 63230358, 66392513, 66908352, 65535134, 63336443, 61638392, 61141765, 61851581, 63561658, 65353329, 66162650, 66358839, 66432322, 67157853, 68936222, 71225458, 72592835, 72263849, 70613935, 68557929, 66973050, 65951512, 64467019, 62184317, 59343715, 56546941, 54700464, 54148559, 54673419, 55966792, 57243490]
2909E7243490k91493k577177m235913m999827m768709m056114l374544k855853
2901C0083860k357010j956884j688526j474582j290801j124269r62985r02458
2893A8326345p98820p15753p31426o56556n55159n52157n25933n10665n43991
2884A2735885n15247m61076m22904l54810l78886l60793l41357k70186k59845
2875I370781k64265k76938k19027j94264j74592k08075j89976k07455j81209j14832
2865G340148j40562j08649j07390j59055j10710n3196p8891j25202j34494n9743
2855F262256m6253l6585J9816q2267p7889p0278m6912p7092m2063p5483r5206
2844E632044o5833n6679q7103j09839j6706m1329q8130k7138k5860J7656j8912
$$ y = [57243490, 56951997, 54374820, 50138907, 45139080, 40370371, 36314257, 32939713, 30083860, 27726850, 25769966, 24081440, 22606858, 21316057, 20191788, 19228803, 18326345, 17527525, 16811772, 16080346, 15423790, 14868631, 14316474, 13790541, 13279876, 12735885, 12220638, 11759562, 11336658, 10981848, 10602962, 10242169, 9900812, 9630626, 9370781, 9106516, 8829578, 8610551, 8416287, 8241695, 8033620, 7843644, 7636189, 7454980, 7340148, 7199586, 7090937, 6983547, 6824492, 6713782, 6660586, 6581695, 6456493, 6321999, 6262256, 6216003, 6179418, 6199234, 6116967, 6039078, 5968800, 5921888, 5844796, 5802733, 5727250, 5632044, 5566211, 5509532, 5422429, 5312590, 5295884, 5254555, 5166425, 5139287, 5113427, 5131083, 5112171]
2833E112171q7421n8282l4038p6992p4936l7055k302j2789M756L0857j5878M6218
2821D794309l6831L432J6104M0114M3125P661R5361N2492J30693P3924O7449J03671
2809E391504J13154K27400K78004L42321N20967O87195R97148N31112k33128o41759
2799H213918r23067o15234m74000l74294l69659k44612k26654j88156j77644j73868
2789D446730k21470o3395j54489o5782r7913q1078p3805n2434o0430j15676n9335
2778C400923K9199q5798r948l8435n0467k4831j1693k6362m5814l7464j1920j7952
2766C069438m6448m3394K6392k7487o7721l5234L7008l6817m6532L9659m8515
2755B820349l8239j6525k0397N3072l0668M6666N9219j0976n7891K4450P2305
$$ y = [5112171, 5024750, 4966468, 4932430, 4855438, 4780502, 4743447, 4741145, 4728356, 4733112, 4763969, 4748091, 4794309, 4757478, 4760910, 4777014, 4817128, 4860253, 4867914, 4963275, 5015767, 5146460, 5220384, 5287833, 5391504, 5504658, 5732058, 6010062, 6352383, 6873350, 7560545, 8557693, 9088805, 8855677, 8213918, 7290851, 6675617, 6201617, 5827323, 5457664, 5213052, 4986398, 4798242, 4620598, 4446730, 4225260, 4161865, 4007376, 3941594, 3843681, 3762603, 3688798, 3636364, 3575934, 3460258, 3400923, 3430122, 3344324, 3334376, 3295941, 3245474, 3220643, 3208950, 3182588, 3136774, 3099310, 3087390, 3069438, 3022990, 2979596, 3005988, 2978501, 2910780, 2875546, 2912554, 2875737, 2829205, 2868864, 2820349, 2782110, 2765585, 2745188, 2798260, 2767592, 2814258, 2873477, 2862501, 2804610, 2829060, 2901365]
2744B901365J2577k5273J7233N1446J4187K7447J537L0167k2642K8471K6903N340
2732C068758J6085O2156L2910M369K5279J3806K7042K1213L5998J9713Q8968M5820
2720C462117M2838J09475M1994K6508J9178K4221K5049N1600K062K2759N2911
2709C880712N5277M8980J26482K5984N4558M4408P4215N2269N3212J05954J90378
2698D712429J74223O0002M5773J50215J02808m2210L2881P364L2756P3821N9141
2687E409203J8517N3743r533K8226Q8931Q2746J33706Q5799J42052J60070J73194
2676F366654J56742J54708J59091K05713K55610K89138L51394K88166K26229K36240
2666H689685J20214K487l5086l1769J2965J12945J52618K14576K67351K51919
$$ y = [2901365, 2913942, 2888669, 2905902, 2957348, 2971535, 2998982, 3000519, 3030686, 3008044, 3036515, 3063418, 3068758, 3084843, 3146999, 3179909, 3184278, 3209557, 3223363, 3250405, 3271618, 3307616, 3327329, 3416297, 3462117, 3504955, 3614430, 3656424, 3682932, 3702110, 3726331, 3751380, 3802980, 3805042, 3827801, 3880712, 3935989, 3984969, 4111451, 4137435, 4191993, 4236401, 4310616, 4362885, 4416097, 4522051, 4712429, 4886652, 4946654, 4992427, 5142642, 5245450, 5203240, 5236121, 5243485, 5276241, 5350062, 5409203, 5427720, 5481463, 5471930, 5500156, 5589087, 5671833, 5805539, 5891338, 6033390, 6193460, 6366654, 6523396, 6678104, 6837195, 7042908, 7298518, 7587656, 7939050, 8227216, 8453445, 8689685, 8809899, 8812386, 8777300, 8745531, 8758496, 8871441, 9024059, 9238635, 9505986, 9757905]
2656I757905K30405J89016J38338Q1065L9315J06369J06764m5796j23249j50531
2646A0329601K760J14429K73253L76627M37621O44559O12868N86446M28546L31383
2636A4138093N0675m7556j70566k27873j05195M4516J50252K69843J84392O3749
2626A4350330k1014k22447l99437m32662m74900m57093m47426l73749k91135j11970
2616A1118497q2326M9975J45337K98761K09054K33652K12078J91394Q162k2381
2606A2362203n7757j39305l6141N0790Q6107J577M6413o639k06205k61955k98480
2595A1540608k90106k66945k14830j95919p8746l4041P6871L9019L7826r1687
2585A0522050n8233q1899m0526l0029K2635Q9266J32637J43388Q4622J53108K07166
$$ y = [9757905, 9988310, 10177326, 10315664, 10396729, 10436044, 10542413, 10649177, 10603381, 10480132, 10329601, 10332361, 10446790, 10720043, 11096670, 11534291, 12178850, 12791718, 13378164, 13806710, 14138093, 14188768, 14141212, 13970646, 13742773, 13637578, 13682094, 13832346, 14102189, 14286581, 14350330, 14329316, 14106869, 13707432, 13274770, 12799870, 12342777, 11895351, 11521602, 11230467, 11118497, 11036171, 11086146, 11231483, 11530244, 11739298, 11972950, 12185028, 12376422, 12384584, 12362203, 12304446, 12165141, 12129000, 12179790, 12265897, 12267474, 12313887, 12307248, 12101043, 11839088, 11540608, 11250502, 10983557, 10768727, 10572808, 10494062, 10460021, 10536892, 10575911, 10613737, 10522050, 10463817, 10381918, 10341392, 10311363, 10333998, 10423264, 10555901, 10699289, 10783911, 10937019, 11144185]
2574A1144185J80888K53336K47790K35317J68073J68585K98211K54295L37941
2565A3288621K94708M13133L95224M47937N27159N11310N91850N41950N86690
2556A7598582N85428M77466M11324K66637L03131J51916R1114m9342J3023K1565
2546A9870844L7426M4426J75532K44907K63366L78814M32200N09231O29095O42926
2536B3228767P85754P71307Q07248Q61720R35733R86749J194215J188798J221514
2527C1981805J128395R98367P54503O77271N69707O33860P11485Q26986Q87520
2518C9169899R20517R95429J066047J096925J091837J115822J218590J339598
2510D8014664J582883J704182J981590K250404K660203K906063L144372L241018
$$ y = [11144185, 11325073, 11578409, 11826199, 12061516, 12229589, 12398174, 12696385, 12950680, 13288621, 13583329, 13996462, 14391686, 14839623, 15366782, 15878092, 16469942, 17011892, 17598582, 18184010, 18661476, 19072800, 19339437, 19642568, 19794484, 19885598, 19836256, 19849279, 19870844, 19908270, 19952696, 20128228, 20373135, 20636501, 21015315, 21447515, 21956746, 22585841, 23228767, 24014521, 24785828, 25593076, 26454796, 27390529, 28377278, 29571493, 30760291, 31981805, 33110200, 34108567, 34863070, 35540341, 36110048, 36743908, 37455393, 38282379, 39169899, 40090416, 41085845, 42151892, 43248817, 44340654, 45456476, 46675066, 48014664, 49597547, 51301729, 53283319, 55533723, 58193926, 61099989, 64244361, 67485379]
2502F7485379L288139L347643L426239L415938L401359L093947K833863K603747
2494I2896254K829372L070039L419126L667828L858145L954884M092186L852405
2486A21640239L619004L107750K752335K268009J801922J182191J18293j448038
2478A35041705l064118m711887n709130o019517n412291m320970k961775j795293
2470A01046724p73021l54831o14339k138559l994652n431091n549379n060411
2462G7130441m222045l446085k705611k244833j742827j306804r20573o25872
2454E9915791j62555M6967L93075O73776P59529N99744N64648M73013L39199J52809
2444F3755996J18696j16447k85127l27345l88730k45643j71528q8503L7557J19129
$$ y = [67485379, 70773518, 74121161, 77547400, 80963338, 84364697, 87458644, 90292507, 92896254, 95725626, 98795665, 102214791, 105882619, 109740764, 113695648, 117787834, 121640239, 125259243, 128366993, 131119328, 133387337, 135189259, 136371450, 136489743, 135041705, 131977587, 127265700, 121556570, 115537053, 110124762, 105803792, 102842017, 101046724, 100273703, 99918872, 99304533, 97165974, 93171322, 87740231, 82190852, 77130441, 72908396, 69462311, 66756700, 64511867, 62769040, 61462236, 60541663, 59915791, 59753236, 59800203, 60193278, 60867054, 61626583, 62226327, 62790975, 63263988, 63603187, 63755996, 63874692, 63758245, 63473118, 63145773, 62757043, 62511400, 62339872, 62251369, 62288926, 62408055]
2434F2408055M06526P37790R30056J317230J727765K330193L002505M025708M739421
2425H1625249N379265O019806P450377Q615609J0649231J3584057J8709390K4842220
2417A76875204L1638882L7877511M1868007R012481k4933152m2414794m0505124
2410A89419015k8079545k1608171j6868314j3863759j0165386p780131n311576
2403H5742133m520482m294618o154802o546272n834294m454206l791393l016818
2395D7129248k797969k224876k185899j986633j947167j620415j710133j383145
2387C1273011j306152j075354j067872q18442q75729p00038q38435o41988p55022
2378B3193979n58467o79104m98742n18886m60986n15632l25179l69769l18814
$$ y = [62408055, 62814581, 63552371, 64482427, 65799657, 67527422, 69857615, 72860120, 76885828, 81625249, 87004514, 93024320, 100474697, 109090306, 119739537, 133323594, 152032984, 176875204, 208514086, 246391597, 288259604, 297272085, 272338933, 229924139, 189419015, 161339470, 139731299, 122862985, 108999226, 98833840, 91053709, 85742133, 81221651, 76927033, 70772231, 64225959, 58391665, 53937459, 50146066, 47129248, 44331279, 42106403, 39920504, 37933871, 35986704, 34366289, 32656156, 31273011, 29966859, 28891505, 27823633, 27005191, 26129462, 25429424, 24590989, 23949001, 23193979, 22635512, 21956408, 21457666, 20938780, 20477794, 19962162, 19636983, 19267214, 18948400]
2369A8948400m42977k51155k89420j22778l37725l17176m55363k53362l36957
2360A6141487j81500k36855j63207j71880j30504j29564k0215j37308l6868j10355
2350A4823231M4571J2329M7025O4434J27642N8611J66893J52125J28041P4412
2340A5699314M9365Q9684J21492J49602K33112K07690L39733K61961K67339J90537
2330A7609829J72445J08703J39592J60347L00684K48795L26365L54291L89586
2321A9810637M18122M72163M05301N06657N75175N49396O37184O51240P49724
2312B4775599P77338R13036R06761Q70291R75918J104389J186231J351877J453092
2303C4314532J635830J845477K056953K326203K672689K868553K914200K463849
$$ y = [18948400, 18505423, 18254268, 17964848, 17842070, 17504345, 17187169, 16731806, 16478444, 16141487, 15959987, 15723132, 15559925, 15388045, 15257541, 15127977, 15107762, 14970454, 14933586, 14823231, 14867802, 14880131, 14927156, 14991590, 15119232, 15177843, 15344736, 15496861, 15624902, 15699314, 15748679, 15838363, 15959855, 16109457, 16342569, 16550259, 16889992, 17151953, 17419292, 17609829, 17782274, 17890977, 18030569, 18190916, 18491600, 18740395, 19066760, 19421051, 19810637, 20228759, 20700922, 21106223, 21612880, 22188055, 22737451, 23374635, 24025875, 24775599, 25552937, 26465973, 27372734, 28243025, 29218943, 30323332, 31509563, 32861440, 34314532, 35950362, 37795839, 39852792, 42178995, 44851684, 47720237, 50634437, 53098286]
2295E3098286J857016J030859O20867P66003J161089J783667K459152L233473
2287F6010412L966343M689065N410266O290511P243861Q429180J0165897J2473750
2279A24679285J5411075J8720626K1383631K1854397J6504187J652237j5191593
2272B05013845k3523450k3004856j9290032j5436109j2220656r505112p510089
2265I4523541n949148n217120m905448m875625m645809m432622l977133l388998
2257E7131638k722687k080340j659878j436493j463175j714406j929591k026210
2249D2098858k065939j845063j537423j297506j088512r71772q53353q25851p80072
2240C0833367p71298o65113o74688n74753m83033l30594k28522j42855o1141r3067
$$ y = [53098286, 54955302, 55986161, 56607028, 57373031, 58534120, 60317787, 62776939, 66010412, 69976755, 74665820, 80076086, 86366597, 93610458, 102039638, 112205535, 124679285, 140090360, 158810986, 180194617, 202049014, 218553201, 220205438, 205013845, 181490395, 158485539, 139195507, 123759398, 111538742, 102033630, 94523541, 88574393, 83357273, 78451825, 73576200, 68930391, 64497769, 60520636, 57131638, 54408951, 52328611, 50668733, 49232240, 47769065, 46054659, 44125068, 42098858, 40032919, 38187856, 36650433, 35352927, 34264415, 33292643, 32439290, 31613439, 30833367, 30062069, 29396956, 28722268, 28147515, 27664482, 27333888, 27105366, 26962511, 26901370, 26808303]
2230B6808303k1165L6884O831p0914j09868j59664k65707l17634o47122p72588
2220B4487356q40730q12255p15630n68324m97378l75481l80203k73222k68222
2211A9755911k33210j10604j5730J8864J05382J24292K08867L20990L08371L54493
2201B0837626M76475N43039O04609N43607M10461K49930Q6230p7846j18539k37405
2191B3318187k36588l51227l32587k45587j84664r2295k2786J12852K80839L45949
2181B2592093N21152O86305Q06044R58912J001588R14283Q26878Q05485J057664
2172C0170404J313170J707919J934402K003490K094387K180751K352313K773453
2164D6530289L523309M648002O137468P745389R183186R691443O992198L3989
$$ y = [26808303, 26787138, 26824022, 26830853, 26759939, 26650071, 26490407, 26224700, 25907066, 25259944, 24487356, 23646626, 22834371, 22118741, 21550417, 21053039, 20677558, 20297355, 20024133, 19755911, 19522701, 19412097, 19396367, 19415231, 19520613, 19644905, 19853772, 20174762, 20483133, 20837626, 21314101, 21857140, 22461749, 23005356, 23415817, 23665747, 23751977, 23674131, 23555592, 23318187, 23081599, 22730372, 22397785, 22152198, 21967534, 21875239, 21852453, 21965305, 22246144, 22592093, 23113245, 23799550, 24605594, 25564506, 26566094, 27480377, 28307255, 29112740, 30170404, 31483574, 33191493, 35125895, 37129385, 39223772, 41404523, 43756836, 46530289, 50053598, 54701600, 60839068, 68584457, 77767643, 87459086, 94451284, 94485273]
2156I4485273p138304j0643685j0240215q379620o507387n132315m121184l433352
2148C8889211l061771k864681k637576k387570k120408j831695j545602j350399
2140B1089509j123664r33683q87313q28519o57814n93145n37847m08988l96877
2131A4721659k78980j98659j53452k01746k67270j20863j01796L2075J47584K74160
2121A3852712L90330N42209N10093M59567J66502k48980n70935o82840o87681
2112A3730977n09034l09062j14217J1282J84659L08847M21977L18895p1049l80291
2102A3592984m79486m69635k80423j79358n7573j26058l7175P9030K59673K66827
2092A2568806k35585o30457l92869j95112q1158m3668k59931m30412m79939m57865
$$ y = [94485273, 87346969, 76703284, 66463069, 58083449, 51576062, 46443747, 42322563, 38889211, 35827440, 32962759, 30325183, 27937613, 25817205, 23985510, 22439908, 21089509, 19965845, 19032162, 18144849, 17316330, 16658516, 16065371, 15527524, 15118536, 14721659, 14442679, 14244020, 14090568, 13888822, 13621552, 13500689, 13398893, 13430968, 13578552, 13852712, 14243042, 14785251, 15295344, 15754911, 15921413, 15672433, 15101498, 14418658, 13730977, 13221943, 12912881, 12798664, 12809946, 12994605, 13303452, 13725429, 14044324, 13973275, 13592984, 13113498, 12643863, 12363440, 12184082, 12126509, 12000451, 11963276, 12042306, 12301979, 12568806, 12333221, 11702764, 11309895, 11114783, 11033625, 10989957, 10730026, 10299614, 9819675, 9361810]
2082I361810l00379k64475q0972l0291J05305J16711J33773R0971j15545l14172
2072H702736m61427m09150m52883l55936l86259k79329k66464j95338j00285k16597
2062E579068j66896j38224n5724j43159j18799k0414p9391j29863j0729Q140O8746
2051D792755L6119Q9732M3357J08744J2530l1475j06890j76932j96174j52103
2041D419663r7056j31174j11013j13737o5967p6698j42852m9718j5604j09831
2031C506013n5834n3723o5639j4597p5005p2832N9457q1498o1838m3147j9350
2020C022007k3365m2539o9980l6613j12516p65n0277m5473K2458n8236o613O439
2008B604527q8841K9906Q384J8927j7101k0593L4923O411j7855M3753j3360n9079
$$ y = [9361810, 9061431, 8796956, 8715984, 8685693, 8790998, 8907709, 9041482, 9132453, 9016908, 8702736, 8241309, 7832159, 7379276, 7023340, 6637081, 6357752, 6091288, 5895950, 5795665, 5579068, 5412172, 5273948, 5218224, 5075065, 4956266, 4935852, 4856461, 4726598, 4715869, 4724009, 4792755, 4828874, 4918606, 4961963, 5070707, 5083237, 5051762, 4944872, 4767940, 4571766, 4419663, 4322607, 4191433, 4080420, 3966683, 3900716, 3824018, 3681166, 3631448, 3615844, 3506013, 3450179, 3396456, 3330817, 3316220, 3241215, 3168383, 3227840, 3146342, 3084504, 3041357, 3022007, 2998642, 2956103, 2886123, 2849510, 2736994, 2736229, 2685952, 2640479, 2662937, 2604701, 2598088, 2604527, 2515686, 2545592, 2553976, 2572903, 2555802, 2535209, 2570132, 2576543, 2558688, 2602441, 2589081, 2530002]
1996B530002o1520J9266J256J0472p5377q357k0179j3180l2938m2221m6038N1004
1984B312190L4452l5071k8955L7664J9482l3642j1442m2270j0490M3330Q817K403
1972B296468l1049K2882q545L6597J3667k7155L0051K6258K6284J3942K6197J7015
1960B442612L4990M9189L4305l203J0291K4308M4452M4465m2843n6457J8802k5832
1948B575079K190J0648m1656j5476M0424L6151J4162O1090M4676J9249M2920Q1565
1936B871022M9604N4285Q6482K7917J04490J02348J38085J31303L3258N3434N6245
1925C708473P4821P4143J75766J71991J69344K62997K72608L33029M02359L30434
1915E975965K82962J02741k1506k19164k47734k14731k64365k31895j26533q9804
$$ y = [2530002, 2468482, 2487748, 2489004, 2499476, 2424099, 2415742, 2395563, 2382383, 2349445, 2307224, 2261186, 2312190, 2346642, 2311571, 2282616, 2320280, 2339762, 2306120, 2294678, 2252408, 2241918, 2285248, 2294065, 2296468, 2265419, 2288301, 2279756, 2316353, 2330020, 2302865, 2332916, 2359174, 2385458, 2399400, 2425597, 2442612, 2477602, 2526791, 2561096, 2557893, 2568184, 2592492, 2636944, 2681409, 2638566, 2582109, 2600911, 2575079, 2577269, 2587917, 2546261, 2530785, 2571209, 2607360, 2621522, 2682612, 2727288, 2746537, 2789457, 2871022, 2920626, 2974911, 3061393, 3089310, 3193800, 3296148, 3434233, 3565536, 3598794, 3652228, 3708473, 3783294, 3857437, 4033203, 4205194, 4374538, 4637535, 4910143, 5243172, 5645531, 5975965, 6258927, 6361668, 6340162, 6120998, 5873264, 5658533, 5394168, 5162273, 5035740, 4945936]
1905D945936j12905n498L4361O4351J23600J34907K45910K45840L07338L94468
1895F378308M60680N93112O79247O72255O07668L55476M5908j87483m41852o30378
1885H532941o70365n78952n32990l49599k40121j56958r7634Q327J28427J30366
1875F173442J93830K46623J49107J08704J8848p4129o2926j22974o1566L8501
1865F607460J18718J33310N257q1341j92261k44815l61053k76040k51379j49167
1855E308689l8624l834Q6489J90460K45967K81514K77312K57191R1450k3334j67530
1844F505750k51251l50847m73186m70783m04859l81854k65048l12768k46927j72919
1834C175308j38391j22064p8417j11140n3973k7435K5849K1752L5061O3476Q4628
$$ y = [4945936, 4833031, 4827533, 4861894, 4926245, 5049845, 5184752, 5430662, 5676502, 5983840, 6378308, 6838988, 7432100, 8111347, 8783602, 9391270, 9746746, 9792654, 9605171, 9163319, 8532941, 7862576, 7283624, 6750634, 6401035, 6160914, 6003956, 5906322, 5914649, 6043076, 6173442, 6367272, 6613895, 6763002, 6871706, 6890554, 6816425, 6753499, 6630525, 6568959, 6607460, 6726178, 6859488, 6864745, 6783404, 6591143, 6346328, 5985275, 5709235, 5457856, 5308689, 5270065, 5266231, 5352720, 5543180, 5789147, 6070661, 6347973, 6605164, 6696614, 6673280, 6505750, 6254499, 5903652, 5430466, 4959683, 4554824, 4172970, 3907922, 3595154, 3348227, 3175308, 3036917, 2914853, 2836436, 2725296, 2671323, 2643888, 2669737, 2691489, 2726550, 2790026, 2874654]
1823B874654J15565K09379J47516J37654N3088J7657o2184j24406k34004l35923
1813B798996k09751j66916j69390j23571j31698p9148j09149p4154q2303p7545
1803A575371m9603q1053l7993l658k890p8785n1769m5413K89L138o4653j3700
1791A149281l5208o7072l2210j1896m706k3816J3301q1472J1277k9015j6682p9
1779H71703l6826K835q944k8908K5284l6835K4525n8243k5642M658j4280J38K8283
1766G47748k4391l9224J5895l7152l0319J1825j6614m3414q095L8635L3937j6032
1754F32799O942l6128j5961M9684p0306J4869L6661J3800L065j0990l5017j4269
1742E75149l1109N3390J6247n8855q1254K9974M1951O503L5638m3076j9575P594
$$ y = [2874654, 2990219, 3199598, 3347114, 3484768, 3537856, 3555513, 3493329, 3368923, 3134919, 2798996, 2589245, 2422329, 2252939, 2129368, 1997670, 1918522, 1809373, 1735219, 1652916, 1575371, 1525768, 1444715, 1406722, 1403064, 1400174, 1321389, 1269620, 1224207, 1224496, 1227634, 1162981, 1149281, 1114073, 1047001, 1014791, 1002895, 998189, 974373, 987674, 906202, 917479, 888464, 871782, 871703, 834877, 837712, 828768, 799860, 825144, 788309, 812834, 754591, 728949, 733607, 719327, 719465, 747748, 723357, 684133, 700028, 662876, 632557, 644382, 627768, 584354, 576259, 614894, 648831, 632799, 639741, 603613, 587652, 637336, 567030, 581899, 618560, 632360, 635425, 624435, 589418, 575149, 544040, 597430, 613677, 554822, 473568, 503542, 545493, 551996, 587634, 544558, 524983, 532577]
1730E32577j108k6559O64K1725J6119K9947l9673M6526J0266l4042j1724L1426
1718E76144L5770J2214o9316k0516L8382k7714K5804k3995Q887m336L1562P121
1706E90007J9212J931l0013j4613l3948P9950k045n05J732M578j4285j0498K4492
1693F15995q230O094m0660J916O9928N907k9805J8460m4325J7893K9305l8608
1681F03870o321K5877M8201M169J01J8206j8586J5076L0995N0776n2289k0507
1669F99568M5770N3296K7304L6226j7474M283K0516m0921J4492j3229J1408j6146
1657H25093j5467r409j7447M2589J926j8058K2114j9692P1619m5957j9290J7009
1645H35030K2225K6592L327n381J9486K2180k6614N5537l9998j7047J6009L4309
$$ y = [532577, 531469, 504910, 505574, 527299, 543418, 573365, 533692, 580218, 590484, 556442, 544718, 576144, 611914, 624128, 554812, 534296, 572678, 544964, 570768, 546773, 555660, 551324, 582886, 590007, 609219, 611150, 581137, 566524, 532576, 612526, 610481, 609976, 611708, 616286, 602001, 591503, 615995, 607765, 613859, 573199, 575115, 645043, 650950, 621145, 639605, 595280, 613173, 642478, 603870, 597549, 623426, 671627, 675796, 675897, 694103, 675517, 690593, 721588, 772364, 720075, 699568, 745338, 798634, 825938, 862164, 844690, 848973, 869489, 828568, 843060, 829831, 841239, 825093, 809626, 800217, 782770, 825359, 827285, 809227, 831341, 811649, 883268, 837311, 818021, 835030, 857255, 883847, 887174, 881793, 901279, 923459, 896845, 952382, 912384, 895337, 911346, 945655]
1633I45655k4672j5090l3228J7222L7928J8477k9135Q743o8081j0235J146J9717
1621H68447K9741m8906J8109k5832M966K4393l1313l287J1194p561o3070K4217
1609H01098j3767k8704k6639m4358J4636K055j4370k6840l1708L479l528m1015
1597E90339N2082k5904J8883J0970j4251J6564n6972j4862K5324j8073n556O5075
1585F43619l1513j5339J365l3598L4768Q241l6223n2104J2219K6537L1338k7079
1573E62231P626K2600K6684r7939n894L4275O820k528R952k3338k9350Q967j3357
1560E06749R186O506m1868J6876l6346k588P750J1895N9172o5498j9789N2944
1548E04989R161k0111Q447M43L643N2163o930j1425k0009k2124L2846q372p7p7418
$$ y = [945655, 920983, 905893, 872665, 889887, 927815, 946292, 917157, 925900, 857819, 847584, 848730, 868447, 898188, 849282, 867391, 841559, 846525, 870918, 839605, 836318, 847512, 839951, 776881, 801098, 787331, 758627, 731988, 687630, 702266, 704321, 689951, 663111, 631403, 634882, 631354, 590339, 642421, 616517, 635400, 646370, 632119, 648683, 591711, 576849, 602173, 584100, 578544, 643619, 612106, 596767, 598132, 564534, 599302, 607543, 571320, 519216, 531435, 557972, 589310, 562231, 569857, 592457, 619141, 521202, 515308, 549583, 556403, 553875, 563827, 540489, 511139, 520106, 506749, 515935, 522441, 480573, 497449, 461103, 458515, 466265, 478160, 537332, 471834, 452045, 504989, 514150, 494039, 502486, 502929, 506572, 558735, 551805, 540380, 520371, 498247, 531093, 522721, 522644, 445226]
1534D45226J1278L4220J176J2711q753l641Q1982l6391l4671M0704j824m0943
1522E01074O4766J7607j5644L6433o526k9868M6136J5296o6707k570O3515n88
1510F22924j2379O5937K6201P764K2418m455L6772m1723k557q65P4800L097m6189
1497G51745M3198n837l615Q7919L5544j4731r733j8379K4264P8062j437o293O760
1484I67467K2807R1761J2807L1800K4789O4259J8409K1305N0143r574N9909K6532
1472A382414L4496O5505R1007J1563m584P5398K3092Q4360J6953P7367M2337R511
1460A909419R2582N4648R5472N6129M7028J1576Q6633R4472N5723J04503M4111
1449B652296P6565O1875J35929Q5675O6164J01128J22085R9133J09948Q5082J40746
$$ y = [445226, 456504, 490724, 491900, 504611, 495858, 492217, 574199, 537808, 503137, 543841, 542017, 501074, 565840, 583447, 567803, 604236, 597710, 567842, 613978, 629274, 562567, 559997, 623512, 622924, 610545, 676482, 702683, 710447, 732865, 728410, 765182, 723459, 720902, 720037, 794837, 797934, 751745, 794943, 789106, 785491, 873410, 908954, 894223, 884490, 866111, 890375, 968437, 967000, 960707, 967467, 990274, 1082035, 1094842, 1126642, 1151431, 1215690, 1234099, 1255404, 1305547, 1295973, 1355882, 1382414, 1416910, 1482415, 1573422, 1584985, 1580401, 1655799, 1678891, 1763251, 1780204, 1857571, 1899908, 1909419, 2002001, 2056649, 2152121, 2208250, 2255278, 2266854, 2353487, 2447959, 2503682, 2608185, 2652296, 2728861, 2790736, 2926665, 3012340, 3078504, 3179632, 3301717, 3400850, 3510798, 3595880, 3736626]
1438C736626J05409Q9103J26685J22952J02887J25335R5891J06191J72450J04249
1428D887778J14347K30847J33088J40265J48832J31752J85187J84835K66525K62412
1418F685868K88412L39953K77207L33759M35405L88479M24630N32788M84857N62953
1408A0754311M94560N29021N04609L35474J93269R1055K6613k53614m59859o30535
1398A1584904p67035q56223q08862q31437p55272n82983m72377m65298m08948
1389E636469l54049l55986k59889k37736j56010j59218k06051j77233j76292j05153
1379C448852j29121o7106r4760p2463q1233o2418p7541p5970m787l2195l5192
1368B716066K5065M7337j8537M7950P883J10767Q1480K8579J51030K11677K73568
$$ y = [3736626, 3842035, 3931138, 4057823, 4180775, 4283662, 4408997, 4504888, 4611079, 4783529, 4887778, 5002125, 5232972, 5366060, 5506325, 5655157, 5786909, 5972096, 6156931, 6423456, 6685868, 6974280, 7314233, 7591440, 7925199, 8360604, 8749083, 9173713, 9706501, 10191358, 10754311, 11248871, 11777892, 12282501, 12617975, 12811244, 12902299, 12928912, 12675298, 12215439, 11584904, 10817869, 9961646, 9152784, 8321347, 7566075, 6983092, 6510715, 6045417, 5636469, 5282420, 4926434, 4666545, 4428809, 4272799, 4113581, 3907530, 3730297, 3554005, 3448852, 3319731, 3252625, 3157865, 3085402, 3004169, 2941751, 2864210, 2788240, 2783453, 2751258, 2716066, 2741131, 2788468, 2769931, 2817881, 2825764, 2936531, 3018011, 3046590, 3197620, 3409297, 3682865]
1357C682865L37867M49408O07789L96195k34197n72309n64701l73623l06706j84788
1347C237800j24178p3650m0557o6093K4107P7631L9222J08185J23097J06819K50959
1336C663342K70170M32300M38511P29917Q93562J261258N48291o97179j162523
1327F377649j127113p33183n23857m09501l93964k07106j40603j44525q2479p7441
1317B537877n8401l3475o568N1770L9498J09229J15131K55752L00955M11387N41279
1306D264434J42324m14674n87340n55381l66777k57041k42222j59469j66376j40185
1296A517293n3374r1067r5189o4858o6163k2691l4804l5966M758m1770j9171l4139
1284I62859o4552l6250k5133j346n3353l3106j7652j8129J55j5719j9219l2784
$$ y = [3682865, 4020732, 4470140, 5077929, 5474124, 5239927, 4667618, 4102917, 3729294, 3422588, 3237800, 3113622, 3039972, 2999415, 2933322, 2957429, 3035060, 3074282, 3182467, 3305564, 3412383, 3663342, 3933512, 4365812, 4804323, 5534240, 6427802, 7689060, 8237351, 7540172, 6377649, 5250536, 4517353, 3993496, 3583995, 3190031, 2982925, 2842322, 2697797, 2615318, 2537877, 2479476, 2446001, 2439433, 2491203, 2530701, 2639930, 2755061, 3010813, 3311768, 3723155, 4264434, 4406758, 3992084, 3404744, 2849363, 2482586, 2225545, 1983323, 1823854, 1657478, 1517293, 1463919, 1372852, 1277663, 1212805, 1146642, 1123951, 1089147, 1053181, 1057939, 1016169, 996998, 962859, 898307, 862057, 836924, 835578, 782225, 749119, 731467, 713338, 713493, 697774, 678555, 645771]
1272F45771l6757k9849n927L3708L9236l3208j337K8400m5149l0097m3976m6778
1260D74037L5799R101K1201j8229o564l2198K4788j1752j4660m5485j363R775
1248D44450J9257K8027m9158k0764k5270M0395J3676m5574l6101O212M5422P303
1236D27875Q260p323k9211k1094P792k2284M2069K1038M3328n5918k5505L8065
1224D27092k114m029J2828m101M5466m7811J585N5240j4675l1467o730K5024K0260
1211D76568k5794k4560Q537N4087l63n694N7422m0614O72J7129L2712l8931J2921
1198E24092R962L3488q532K5961L8232J2219l0670J3709M5072J3967m9094J6260
1186F44666L0163N0434M8306J9490l2222L2162O4577M1099O9496K7131p820L0402
$$ y = [645771, 609014, 579165, 573238, 606946, 646182, 612974, 611637, 640037, 594888, 564791, 520815, 474037, 509836, 518937, 540138, 521909, 515345, 483147, 507935, 496183, 481523, 436038, 434675, 444450, 463707, 491734, 442576, 421812, 396542, 436937, 450613, 405039, 368938, 375150, 420572, 427875, 436135, 428812, 399601, 378507, 386299, 364015, 406084, 427122, 470450, 414532, 389027, 427092, 424978, 420949, 433777, 429676, 475142, 427331, 428916, 484156, 469481, 438014, 431284, 456308, 476568, 450774, 426214, 434751, 488838, 488475, 482781, 540203, 499589, 500261, 517390, 550102, 511171, 524092, 534054, 567542, 559010, 584971, 623203, 635422, 604752, 618461, 663533, 677500, 628406, 644666, 674829, 725263, 773569, 793059, 760837, 792999, 857576, 898675, 968171, 995302, 987482, 1017884]
1174A017884R5299O6814L9947P4181K0019k1387J9930J109J5917N6309l472L2266
1162A414816L0332K7644l4893P2833L1480L5268J36253L6061J3695P3992R5923
1151A933404Q5612R0525O980N9425m1721j13301q9973p9038q7809n8711o549l7657
1139A661187n1191n8650K5307j3056q545M4455J2456p782k0337P947L4680m0638
1127A585833r0238m3183O646l7999m4997l1190o3878j02640k6076l6402j8060
1116A097816L7602o0125k9142m1225n1685j9756O394n4313m0385k7682r1474j0782
1104G15243l4927k6917p3693j5136j3635j0494R527o0291K0957k3674n7715p586
1092D21659j9863k9210J5072k0681O562P868l7898j379O773j6465J581o43m9286
$$ y = [1017884, 1113183, 1179997, 1219944, 1294125, 1314144, 1292757, 1312687, 1313796, 1329713, 1386022, 1382550, 1414816, 1445148, 1472792, 1437899, 1510732, 1542212, 1577480, 1713733, 1749794, 1763489, 1837481, 1933404, 2019016, 2109541, 2116521, 2175946, 2134225, 2020924, 1930951, 1851913, 1764104, 1705393, 1698844, 1661187, 1609996, 1551346, 1576653, 1563597, 1555052, 1599507, 1611963, 1604181, 1583844, 1591791, 1626471, 1585833, 1495595, 1452412, 1459058, 1421059, 1376062, 1344872, 1280994, 1178354, 1152278, 1115876, 1097816, 1135418, 1075293, 1046151, 1004926, 953241, 933485, 939879, 885566, 845181, 817499, 726025, 715243, 680316, 653399, 579706, 564570, 550935, 540441, 549968, 489677, 510634, 486960, 429245, 421659, 401796, 372586, 387658, 366977, 373539, 381407, 343509, 342130, 348903, 332438, 334019, 333376, 284090]
1079B84090k4426k1225j1406L1083P73o3398J4046J9642k304k0039L8808j8297
1067B27347q3317L2470K3569j1254N4175m8234k7308N8916m7752k4352k994R06
1055A52172L085l453n3112J526L8445j5295L2515J5539l9780m3472l8945M7394
1043I6619L2141J6305l5017l1097Q363L2082k1416n559L0912m1088m1641M2055
1031H2659m08k8600J9315J8574k7530R512J1905j1841j0413K5788l8041K2495
1019G3415k2391k5968K4537Q261l5851R646p04j7907O7241l9565L6260j9711j7427
1006C9836j1125Q168K0812l992J6917l3863o601q698K0240J5773k2879k3983O186
993A6791J8286R64r354j525K4616l4461r177K2307j9682N2078j1326l4398L2539
$$ y = [284090, 259664, 238439, 227033, 258116, 258889, 195491, 209537, 229179, 226875, 206836, 245644, 227347, 144030, 176500, 200069, 188815, 242990, 194756, 167448, 226364, 178612, 154260, 151266, 152172, 155257, 151804, 98692, 100218, 138663, 123368, 155883, 171422, 131642, 88170, 49225, 96619, 128760, 145065, 110048, 78951, 87314, 119396, 97980, 92421, 123333, 82245, 40604, 82659, 82251, 53651, 72966, 91540, 64010, 73522, 85427, 73586, 63173, 88961, 50920, 73415, 51024, 25056, 49593, 57854, 22003, 31649, 30945, 13038, 80279, 40714, 76974, 57263, 39836, 28711, 36879, 57691, 53699, 70616, 36753, 30152, 21454, 41694, 57467, 34588, 10605, 16791, 35077, 36041, 26687, 25162, 49778, 15317, 6140, 28447, 8765, 60843, 49517, 15119, 47658]
980D7658l5822j565K1245Q147k285k1661J0683m5037K940K2974k803K7371M1923
967G3768p0176L5786K8421k8482k0498M11O741k655k0753K2761l3225p436j4543
954b9880N3740O7818o1006p65J3749L0340m5539k8529K2059L2563m9473k0460
942a5383L8406k4712L7157O245m1596K8286j6341j4898J0636m3114K9344j254
930g224K0653R084J0186K9121q846m5421j3659M4160N280l6914o378j2849J7666
917D859p052l3419N25J0766K1589m322j9558k2548P070N6017j6015J1080j1326
904b334j9334J8882K5044k9225l1247J2106N9753q923m0438j7586k9483J1572
892e1213j2853L5223k3144O4415j1793M5777o1663p087l5539L8727j8929J3350
$$ y = [47658, 11836, 10271, 31516, 39663, 37378, 15717, 26400, -18637, -15697, 7277, 4474, 31845, 73768, 3592, 39378, 67799, 39317, 18819, 19230, 25971, 23316, 2563, 25324, -7901, -15337, -29880, 23860, 91678, 30672, 29907, 43656, 73996, 28457, -72, 21987, 54550, 5077, -15383, 23023, -1689, 35468, 41713, 117, 28403, 12062, -2836, 7800, -35314, -5970, -7224, 13429, 22513, 32699, 61820, 52974, 7553, -6106, 38054, 43334, 6420, 42, -12807, 4859, -2193, -35612, -35087, -24321, -2732, -7054, -26612, -49160, -42090, 13927, -2088, 8992, -2334, -21668, -2786, 22258, -6967, -38214, -26108, 33645, 24722, -15716, -33302, -62785, -51213, -64066, -28843, -51987, 12428, 635, 46412, -15251, -22338, -57877, -19150, -38079, -24729]
880b4729j0446r089J3689j7136k0766L1258J4238L3640n0661l0174m504L5563
868c9117M6903m3615J4657K2891K936k7659j4201M4160m4685M4147k5179o322
856b5084O682j4280m7328L5464K1376n8098l7752M3186K5306j0488O8612j1061
844c465m794o1792j201O7635R107O575k7402k0108j460n2808L8559M1763R170
831b21J957k4944k0706K9308j4815l628j2821J0720J4290k0814j0306K9920K4859
818B799L8422m5211k0645j5293j9061J7092K0944l1932o705j3198n3478L1258
806i5008P4666O995K7375n3795r675N3520N695k3868n7049J1783N3697l788l9661
793d9113J5475L0337l8279J1382j6913j3708l530N0660L9801p4376O102L1421
$$ y = [-24729, -35175, -44264, -30575, -47711, -68477, -37219, -22981, 10659, -40002, -70176, -74680, -39117, 7786, -35829, -21172, 1719, 4655, -23004, -37205, 6955, -37730, 6417, -18762, -25084, -18402, -32682, -80010, -44546, -23170, -81268, -119020, -75834, -50528, -61016, 7596, -3465, -8259, -70051, -71252, -3617, 5490, 12065, -15337, -35445, -36905, -89713, -51154, -9391, -221, 1736, -23208, -43914, -14606, -29421, -33049, -45870, -35150, -20860, -41674, -51980, -22060, 2799, 41221, -3990, -24635, -39928, -58989, -41897, -20953, -52885, -59590, -72788, -126266, -95008, -20342, -13347, 14028, -39767, -49442, 4078, 9773, -14095, -71144, -59361, -5664, -9452, -49113, -33638, -3301, -41580, -30198, -47111, -60819, -64349, -13689, 26112, -48264, -42162, -10741]
781a0741K4410J0910k8492J9415k7032R98J778K9186R787j6611k0446j966j8811
768b7615J4006L906j5687L0938m0702R298M1909M864n0552l3383N9435K4288l7968
755a7263j391K3175l2863M4861j1017n7627K9298P398m8212L5128k6920R935L9102
742f396J8003j6195K2510m6949P387k4785L972M0376m577l2989J7202n824K4734
729c531m3285J7385N8472l6050M8809r168l7123L1662n6415j8187L0006j0846
717b8271K687J0723j7486n5905J09263j6294n5650j4140N695N8052k5352m2694
705f9372J0637N5439k1188j1727L2660q391n776M9946Q923j09564P978O3991n5622
692e2066q379M1917J2200j4771Q887J5652l3255r206k7092J7151K6517K9251n951
$$ y = [-10741, 13669, 24579, -3913, 15502, -11530, -10532, -8754, 20432, 30219, 13608, -6838, -8804, -27615, -13609, -9703, -25390, 5548, -35154, -25856, 16053, 20917, -29635, -63018, -3583, 20705, -17263, -18654, 4521, -28342, 16519, 5502, -52125, -22827, -15429, -63641, -28513, -55433, -45498, -6396, 11607, -4588, 17922, -29027, -21640, -46425, -42453, -2077, -6654, -39643, -22441, -28265, -3531, -46816, -29431, 29041, -7009, 41800, 32632, -4491, 27171, -29244, -47431, -17425, -28271, -25584, -14861, -32347, -88252, 21011, 4717, -50933, -65073, -59378, -1326, -26678, -69372, -58735, -3296, -24484, -36211, -3551, -11942, -17718, 32228, 41151, -68413, -60435, 3556, -52066, -60445, -18528, -6328, -21099, -12212, 3440, -29815, -39021, -66113, -48962, -22445, 6806, 855]
679H55j7401n890p435K176K5790K472M1221o7643K1561M288J4065o653l492J3859
665A7773j8777j6542J2646k8868o585l7885L5751K6268j1517O3888K43m1350k2225
652b7180j5081q166L9956K4684l9587J4417L014M0482m0483J226N236L925N1800
639E4243J3592k5376k4559k4155l0491K3959M7889l0146L3559K5975n4628l1500
627b1638R112P7905j4967j5527r020M7880m2582j380N8816K2240l9270j2760M0215
614I9024J0204L7452k0517j2185k4325O3131P578L6313N059k4649k3910K2090
602A75265L5462P087J3617L4202m9365M9746k083M4403O600K7442K6845m7817
590C21404L0001L3939K1484j3625J1181K7653q060M0003L9439j4180J2301Q8083
$$ y = [855, -16546, -22436, -29871, -27695, -1905, 567, 41788, -25855, -4294, -6, 14059, 7406, 3914, 17773, -1004, -17546, -4900, -33768, -40353, -78238, -42487, -16219, -27736, 36152, 36395, -4955, -27180, -42261, -50427, -10471, 14213, -25374, -10957, -7943, 32539, -7944, -6718, -1482, 2443, 54243, 67835, 42459, 17900, -6255, -36746, -12787, 35102, 4956, 38515, 64490, 9862, -21638, -12526, 65379, 50412, 34885, 25865, 73745, 31163, 29783, 88599, 110839, 71569, 58809, 99024, 109228, 146680, 126163, 113978, 89653, 152784, 160362, 196675, 201734, 177085, 153175, 175265, 210727, 217814, 231431, 265633, 216268, 266014, 263931, 308334, 314934, 342376, 369221, 321404, 351405, 385344, 406828, 393203, 404384, 432037, 423977, 463980, 503419, 489239, 501540, 589623]
578E89623P0357K3082L8206j6493K0483Q7002K6757O1451J12190M2736J82184
567A237578O4852J25018J20284J25736J91657J71141J55081K00251K74125L80995
557C046718N17674O84946Q79172J084282J286995R74393j122594j763235j107334
548D481017q30548o30620m08386k99726k49881j97604j17163j32834j16494j00222
538A397539j69003j10251j44472j01066j7179n2740o0466n5366l7368n0893j8983
527E79752p3373o9832k5791j7612K3869k6420j3356l432n1041j2467P2437q2728
515C00006m9036j1989M8237j5940k9477J9358m9658K2343j5462n0185M4725J4618
503B27540l4611n289j4453o393p864k5798l0218O27P519n825J3749O1646P406
$$ y = [589623, 659980, 683062, 721268, 704775, 725258, 812260, 839017, 900468, 1012658, 1055394, 1237578, 1302430, 1427448, 1547732, 1673468, 1865125, 2036266, 2191347, 2391598, 2665723, 3046718, 3564392, 4249338, 5128510, 6212792, 7499787, 8474180, 7351586, 5588351, 4481017, 3650469, 3019849, 2611463, 2311737, 2061856, 1864252, 1747089, 1614255, 1497761, 1397539, 1228536, 1118285, 973813, 872747, 855568, 802828, 742362, 686996, 649628, 598735, 579752, 506379, 436547, 410756, 393144, 417013, 390593, 377237, 373805, 322764, 310297, 382734, 300006, 250970, 238981, 287218, 271278, 241801, 261159, 211501, 233844, 218382, 168197, 212922, 227540, 192929, 187640, 173187, 166794, 158930, 133132, 102914, 103541, 111060, 105235, 118984, 180630, 188036]
490A88036l8749J0256k8427J0447m9278Q55j3573k4957K1381J7887j3885m513
478G5480j3028k8734r315L9782j576l0868M4726m7807j9103P4273l0777M0550
466I3603n2910o2528L1375r359j8998O6146Q714l2834o032J5340M698j5302L4528
453E6441n2355k0489Q590N8342m6818Q410K7433j9083J9383m750n7448J2381K0734
440A0771N3074r992p6389K8646l2461M785K5940m7503M5366K55J2408n6881l809
427d5790L1363k9281Q8541o0004J0209k7268k2679J3614j1010Q437K305N2655
415A1092n0181j407O10K0562M762n2110M9619l4093R843M4162j5134k2308J9530
402a5053L255m525K5597K025K9057j6984m4251L0758P264J9032m6949P343J4891
$$ y = [188036, 149287, 159543, 131116, 141563, 92285, 93140, 79567, 54610, 75991, 93878, 79993, 75480, 62452, 33718, 24403, 64185, 62609, 31741, 76467, 28660, 9557, 83830, 53053, 93603, 40693, -21835, 9540, 181, -18817, 47329, 56043, 23209, 17177, 32517, 37215, 21913, 56441, 4086, -16403, -7813, 50529, 3711, 12121, 39554, 20471, 39854, 35104, -22344, -9963, 10771, 63845, 53853, -22536, 6110, -26351, -21566, 4374, -43129, 2237, 2492, 14900, -41981, -45790, -14427, -43708, 44833, -15171, -4962, -32230, -54909, -41295, -52305, -43868, -41563, 11092, -39089, -40496, -39886, -19324, -14562, -66672, -17053, -51146, -41303, 2859, -12275, -34583, -15053, -11798, -16323, 9274, 11299, 40356, 23372, -20879, 9879, 17143, 36175, -10774, -3431, 11460]
389A1460j0396m799n157l734K3702J5429k4442L8154k7699n3013K6146M1990R984
376C7625j6277L8084l9249j0390k6601M1898k5934m8466K0499L8565L8136j8508
364B9382J7537j4148m5244j1199K5941j1017J2381P736m8244n293M2230K0444
352B0506k3450K809J2266Q535Q687L456k1974L1547k6903k3244R90j6255K2145
339h85O084J1089K1588l2759m8724R054K6842n648K8496o6406j6380j752j6432
326h5833Q3387J0948m6804M9573K1224L5996P106p6548J470M1977K238k9311l2020
313a6597J2588J2694j4313k736K6124J6153l0969J3249L226N4360n7913o313k8582
300a9029R770L3728k8454j3927N3455k1715j3000k4255O1853o5905k2686O0201
$$ y = [11460, 1064, -3735, -8892, -12626, 11076, 26505, 2063, 40217, 12518, -40495, -14349, 27641, 37625, 21348, 59432, 20183, 9793, -16808, 25090, -844, -49310, -28811, 9754, 47890, 29382, 46919, 32771, -12473, -23672, 2269, -8748, 3633, 11369, -36875, -42168, 62, 20506, -2944, -135, 12131, 20666, 29353, 32809, 10835, 42382, 15479, -7765, -6775, -23030, -885, 5199, 16288, 37876, 5117, -43607, -34553, -7711, -13359, 15137, -51269, -67649, -69401, -85833, -2446, 8502, -38302, 11271, 32495, 68491, 75597, -951, 519, 42496, 44734, 15423, -16597, -4009, 8685, -5628, -8364, 17760, 33913, 2944, 16193, 19419, 73779, 15866, 9553, -19029, -9259, 24469, -3985, -17912, 35543, 13828, 828, -23427, 38426, -27479, -50165, 10036]
288A0036j7824j2840L7316K3363j29r15k818l7854r442j2392L4348J5262j5347
275A0764j8796j8794P4359m0716K9747l5184n278K7798r229j5326K1729L1200
263E2274p1739k2037J2602p095k9300L1794j1488N4231N479R723j5430k235k2180
250a5401N3943o455n7740K1856L8182L172p0296L1762J4349l7741M5238J8161
238C9030j4932K160l650J3479l0246j6408K7076l589k3847j2001R898J4786m4980
225d3224K6587R483K2818m414j8852M39r214J6346K0856j299P479J6240j8953
212B4292j8715K6814M5851k3052l0464m3010O9492l4254K8943l170j5764K1344
200D8307o6743M728M8042k3905o98J3986l503M725k8812K165J1613M3493o1827
$$ y = [10036, -7788, -20628, 16688, 40051, 39922, 39007, 36189, -1665, -11107, -23499, 10849, 26111, 10764, -8032, -26826, 47533, 6817, 36564, 1380, -3898, 23900, 14671, -655, 21074, 52274, -19465, -41502, -28900, -35995, -65295, -33501, -44989, 9242, 14721, 24444, 9014, 6779, -15401, 38542, 32087, -25653, -3797, 34385, 37557, -32739, -977, 13372, -24369, 20869, 39030, 24098, 26258, 22608, 36087, 5841, -10567, 16509, 12920, -10927, -22928, -13030, 1756, -43224, -16637, -7154, 15664, 11250, -7602, -7163, -16377, -31, 20825, 19526, 27005, 43245, 24292, 5577, 32391, 78242, 55190, 24726, -18284, 51208, 16954, 45897, 42727, 26963, 48307, -18436, -13708, 34334, 10429, 9731, 23717, 20214, 24939, -3873, -1708, 9905, 53398, -8429]
187h429L4199k706j1312K0437M7367L255l3328M558k0803k3220l9541r492K3084
174a5931q072O7903l7723J1971r781j337J1861j777J4133J0682k1187L0111j9968
161C0885m4639J146L6242j3692K8018n4006M7268k6175K3370K3943j6619K9131
149F4872l2147k073j5294j2580J6169j8570N020k9641O9L6722k3474J165J8940
136I178J6808j4519O614K1447l1726k5942O4366J8213p68l1294J9676J5596k3223
123D4426j8374M480j2166n389K7187j9586k7535K0664j758R73q669q308K519M675
109C139K1267M910r731j7370k1445L9143l1162J8194M183j0616J348l535J4147
96A2472r424O534r810l0489Q512j0835L8080J2720J0108j0864J3980J2825k0672
$$ y = [-8429, 25770, 23064, 11752, 32189, 79556, 82811, 49483, 54041, 33238, 10018, -29523, -39015, -15931, -24003, 43900, 6177, 18148, 8367, 7030, 18891, 17114, 31247, 41929, 20742, 50853, 30885, -13754, -12608, 23634, 9942, 37960, -16046, 31222, 5047, 28417, 52360, 35741, 64872, 32725, 30652, 15358, 2778, 18947, 377, 5397, -24244, -24175, 12547, -10927, -9762, 9178, 25986, 11467, 18081, 39528, 7802, -18140, 46226, 64439, 63671, 32377, 52053, 67649, 44426, 26052, 30532, 18366, 12977, 40164, 20578, -6957, 13707, 11949, 12922, 4253, -4055, -1536, 3139, 24406, 29316, 19585, 2215, -19230, 19913, -11249, 6945, 11128, 512, 1860, -1675, 12472, 3048, 9582, -228, -30717, -22205, -33040, 5040, 17760, 27868, 17004, 30984, 43809, 23137]
83B3137m734m911m2586P817j5794M4522K0603J0065j1048j3534N362N35K0522
70C9956l096j2131J1950K1508J4235k3977m0574J1531L2004K688j6049k011J0034
57D6068j6353L155k568l763k367j677J0509J7881l100n1002J582M6644l6883k4369
43a6243K8033r449M221J2685k3210J9116J6962j9753J4202J0049N500k1142l0693
30i722M4619k1029j3386L8125j8813P524M692J9062J205J1224m2037j291j4381
17E792R392L7911M967l5946J4741J333O05P769k7866j8023j3807L0796l667j3847
3A50o29J9688L6112
0E5321
$$ y = [23137, 18403, 13492, -29094, -21277, -37071, 7451, 28054, 38119, 27071, 13537, 18899, 19434, 39956, 36860, 24729, 36679, 58187, 72422, 48445, 7871, 19402, 51406, 54094, 38045, 36034, 46068, 29715, 32870, 30302, 26539, 24172, 22495, 33004, 50885, 47785, -3217, -1635, 45009, 8126, -16243, 11790, 2341, 6562, 19247, -3963, 15153, 32115, 12362, 26564, 36613, 42113, 20971, -9722, 34897, 13868, 482, 38607, 19794, 27318, 32010, 51072, 52277, 63501, 21464, 20173, 5792, 15184, 53095, 58062, 22116, 36857, 38190, 38795, 46564, 18698, 675, -13132, 17664, 13997, 150, -479, 19209, 55321]
$$ Imaginary data points
##PAGE= N=2
##DATA TABLE= (X++(I..I)), XYDATA
16383b467621O2911L4295K1213L1589J8771K9615M8528J6258J5109M318K9926
16372b155088L0368K6427J6844P059L9510L1246L249M2884L3903R528L7029L4029
16360a843012L6258M7775k129k9780K9356L2803O1279K8977j5131L9289L7743
16349a576572j1104K5964M9872k6432N819P3684J4940K3524L3429M2927K7432
16338a316517l206N0525J0605R996J5474K1318O768M1499K9494K5137M8191O177
16326a054539o497L5096M8010R783l66J9821L5214K9680M0614n559J1457K3282
16314h14004J1852M7575K1535Q945M4833J2284K1875M4438j3632M0484l4420L3280
16302e74955N111M0800N7725n821K0116K5197M0350j8033K2811j5112M9740M8532
$$ y = [-2467621, -2404710, -2370415, -2349202, -2317613, -2298842, -2269227, -2220699, -2204441, -2189332, -2185014, -2155088, -2124720, -2098293, -2081449, -2074390, -2034880, -2003634, -2000385, -1957501, -1923598, -1914070, -1877041, -1843012, -1806754, -1758979, -1761108, -1790888, -1761532, -1728729, -1667450, -1638473, -1653604, -1614315, -1576572, -1587676, -1561712, -1511840, -1538272, -1532453, -1458769, -1443829, -1420305, -1386876, -1343949, -1316517, -1319723, -1269198, -1258593, -1248597, -1233123, -1211805, -1205037, -1163538, -1134044, -1108907, -1060716, -1054539, -1061036, -1025940, -977930, -968147, -968513, -948692, -913478, -883798, -843184, -848743, -837286, -814004, -802152, -754577, -733042, -724097, -679264, -666980, -645105, -600667, -614299, -573815, -608235, -574955, -569844, -529044, -471319, -477140, -457024, -431827, -391477, -409510, -386699, -401811, -352071, -303539]
16290c03539K2386j4432L2696j399M0842J2361K7100R790K9977M246L5953M2697
16278f1322j9356K3047L7288k6679L203N0454l4365P3766L0206q964J8913K2288
16266A08479K6176k487J4083O3336J1409m1323J3364O8751L9304j8624n144J7605
16254B94929J5094q91L2640j0396K2825K8472K6505j5555j316M3940J6478N1112
16242E03837j7686N0522K1235n516l0015L9002N7194j3110j7304L9953J8655j1652
16230F35115L984M8210r369L2850K294J2991J2870j6983M0510K5774K3257K1174
16218H32677l5514J879O902J6861L8707K9355k2393J8810r941J5724J0730k0132
16206H83665K473j2662N1530M8174k6231j6845N9793M1752p137N148k8506Q449
$$ y = [-303539, -281153, -295585, -262889, -264288, -223446, -211085, -183985, -174195, -144218, -139972, -104019, -61322, -80678, -57631, -20343, -47022, -43819, 6635, -27730, 46036, 76242, 67278, 86191, 108479, 134655, 132168, 146251, 209587, 220996, 179673, 193037, 261788, 301092, 282468, 277324, 294929, 310023, 309132, 341772, 331376, 354201, 382673, 409178, 393623, 392307, 436247, 452725, 503837, 486151, 536673, 557908, 552392, 522377, 561379, 618573, 605463, 588159, 628112, 646767, 635115, 639099, 687309, 677940, 710790, 713084, 726075, 738945, 721962, 762472, 788246, 811503, 832677, 797163, 799042, 805944, 822805, 861512, 890867, 868474, 887284, 877343, 893067, 903797, 883665, 886138, 873476, 925006, 973180, 946949, 930104, 989897, 1031649, 1024512, 1029660, 1001154, 1009603]
16194A009603K9817j1645K7929Q814k6761j8411L4972P774P986K7223P6093m9295
16182A124099N9139K0527m2279J7407l1896j593P256J0763K4446L7331m1117N6408
16170A240491M7599m9750J5342l5087j5495l039J2857j326M9953q153K3831M7294
16158A324517J3817m3869M6374O504j8956K0411l4903l990K8021k3264j8054N0331
16146A346939M0383Q861k8459n206K018J7875J6214j8638j8630M2860k6555j65
16134A377497L5856m068J7291J983k2343Q34Q4103j1954j3250K6252l0627j2951
16122A448623O9107j7202o4532K877l74N4693k8120q057M4278K8935l3862j6472
16110A479894l6178Q0022r574K623j338j063p183k5206r809j2550L1943N303N7284
$$ y = [1009603, 1039420, 1027775, 1055704, 1064518, 1037757, 1019346, 1054318, 1062092, 1070078, 1097301, 1173394, 1124099, 1183238, 1203765, 1161486, 1178893, 1146997, 1145404, 1152660, 1163423, 1187869, 1225200, 1184083, 1240491, 1288090, 1238340, 1253682, 1218595, 1203100, 1200061, 1212918, 1211592, 1261545, 1253392, 1277223, 1324517, 1338334, 1294465, 1340839, 1347343, 1328387, 1348798, 1313895, 1309905, 1337926, 1314662, 1296608, 1346939, 1387322, 1396183, 1367724, 1362518, 1364536, 1382411, 1398625, 1379987, 1361357, 1404217, 1377662, 1377497, 1413353, 1409285, 1426576, 1428559, 1406216, 1407050, 1491153, 1479199, 1465949, 1492201, 1461574, 1448623, 1517730, 1500528, 1435996, 1438873, 1438499, 1493192, 1465072, 1457015, 1501293, 1530228, 1496366, 1479894, 1443716, 1523738, 1514164, 1516787, 1515449, 1514386, 1507203, 1481997, 1472188, 1459638, 1491581, 1496884, 1554168]
16097A554168o85l3354j0097K8419j42j2336K1813m0526P4477k3442j1034L4524
16085A581785m0051J581j848J8306p46J9521k1267L9597n7672k4413L2969l8539
16073A509223O9167P1396o9679k1034K4824l5366N1341Q92k9602M48K5663m7039
16061A550234j127K8483j7780k059M1838L6376k6810n2352M0156M5478o3876j5533
16049A563028L3418l8648j4840M2561j1394M0327l6666L4525l2679k0346Q514
16038A567800M3927J3596l9592k9338M1540p849P528M141N464K7741m7942N146
16026A592162J3231O289q600n8927N4406L6760J5473l3537j0276N082k776N583
16014A614870n7619K6416O4378J0873m5533m038J880L5744k7661l3150J6156N339
$$ y = [1554168, 1553483, 1520129, 1510032, 1538451, 1538309, 1525973, 1547786, 1507260, 1581737, 1558295, 1547261, 1581785, 1541734, 1543315, 1541467, 1559773, 1559027, 1578548, 1557281, 1596878, 1539206, 1514793, 1547762, 1509223, 1578390, 1649786, 1580107, 1559073, 1583897, 1548531, 1599872, 1600764, 1571162, 1571610, 1597273, 1550234, 1549107, 1577590, 1559810, 1557751, 1599589, 1635965, 1609155, 1556803, 1596959, 1642437, 1578561, 1563028, 1596446, 1557798, 1542958, 1585519, 1574125, 1614452, 1577786, 1612311, 1579632, 1559286, 1567800, 1611727, 1625323, 1585731, 1556393, 1597933, 1590084, 1597612, 1601753, 1607217, 1634958, 1587016, 1592162, 1605393, 1611682, 1603082, 1544155, 1598561, 1635321, 1650794, 1617257, 1606981, 1612063, 1609287, 1614870, 1557251, 1583667, 1648045, 1658918, 1613385, 1609347, 1611227, 1646971, 1619310, 1586160, 1602316, 1607655]
16002A607655m8833K8142J9493Q25J9308J7580l4248M485O216N645R866j2481
15990A623653k4865L359k6902j709M5479n2249k2062L5913K9016k9806J8716K9060
15978A627603M985m1369L6205J034p2338J3531J5298K5351Q025k6729K4215Q25
15966A616636j9768Q582K7226r249j3868L3369k5864o036Q491Q962l106J3061
15954A638436o064m4624K2459M4053j6904j4010L2616j9534l0979N4252l1230
15943A628471j3719L3140K9647m1967K8964l5285p678K0740K0960k8130m3863
15932A591280j2739N9573M5742j5761j8118l0294N861J681K4669l1952K2489o1641
15920A580790l6511K5169O0369q704K0398k4903R62J5051P734j7679M7502n2120
$$ y = [1607655, 1558822, 1586964, 1606457, 1607282, 1626590, 1644170, 1609922, 1614407, 1620623, 1626268, 1636134, 1623653, 1598788, 1602147, 1575245, 1573536, 1619015, 1566766, 1544704, 1580617, 1609633, 1579827, 1598543, 1627603, 1632588, 1591219, 1627424, 1628458, 1556120, 1569651, 1584949, 1610300, 1618325, 1591596, 1615811, 1616636, 1596868, 1605450, 1632676, 1623427, 1609559, 1642928, 1617064, 1611028, 1619519, 1628481, 1625375, 1638436, 1632372, 1587748, 1610207, 1654260, 1637356, 1623346, 1655962, 1636428, 1605449, 1659701, 1628471, 1614752, 1647892, 1677539, 1635572, 1664536, 1629251, 1621573, 1642313, 1663273, 1635143, 1591280, 1578541, 1638114, 1683856, 1668095, 1649977, 1619683, 1625544, 1627225, 1651894, 1619942, 1642431, 1580790, 1544279, 1569448, 1629817, 1621113, 1641511, 1616608, 1617570, 1632621, 1640355, 1622676, 1670178, 1618058]
15908A618058k8653O2211J5264k8911J0411Q490l8413K8560o0890J2296O1298
15897A659721m133o4723L4376k409L7637o987j4389l1091K0772L765L6980J3282
15885A682801l773q1178L059L3443m2895M1913L1690r039p0722L636J8933M6352
15873A654220J043P535k2520L5795k8580q0086L2221M2054J3732J4459k6274L8468
15861A682067J6289p2297K5235P65l860l44J27J0025l6403J7210N4214K5327k6959
15848A691396j0306m2160N136L954P225p502J5638r066K8796L7271l3382m0491
15836A646509K8342L1028l8170m0085j3393M7804k4068l9125j539M3532j0700
15825A630135k6984N9846j1406k7087K7630j5457j6781K8596L4454L1344o0698
$$ y = [1618058, 1589405, 1651616, 1666880, 1637969, 1648380, 1656870, 1618457, 1647017, 1586127, 1598423, 1659721, 1655588, 1590865, 1625241, 1622832, 1660469, 1653482, 1639093, 1608002, 1628774, 1632539, 1669519, 1682801, 1679028, 1597850, 1600909, 1634352, 1591457, 1633370, 1665060, 1656021, 1585299, 1588935, 1607868, 1654220, 1655263, 1662798, 1640278, 1676073, 1647493, 1567407, 1599628, 1641682, 1655414, 1669873, 1643599, 1682067, 1698356, 1626059, 1651294, 1652059, 1648199, 1647855, 1647982, 1658007, 1621604, 1638814, 1693028, 1718355, 1691396, 1681090, 1638930, 1644066, 1648020, 1655245, 1647743, 1663381, 1654315, 1683111, 1720382, 1687000, 1646509, 1674851, 1705879, 1667709, 1627624, 1614231, 1662035, 1637967, 1598842, 1597303, 1640835, 1630135, 1603151, 1662997, 1651591, 1624504, 1652134, 1636677, 1619896, 1648492, 1682946, 1714290, 1653592]
15814A653592n0881L9824L5282k3958k4121q110J4707J5130k6898j476l330J2467
15802A632228L9759k4963j6091N6087l1465l1328M3072l6778J7068K2674j4601
15791A655662K6771k3479R689k007k8577J095o270m158k7458O1832J8929k4662
15779A657367K3542j4049l9164K8657K5875o447j0669J3135j2770n4692L5536
15768A646321r58N6241k0910n6290n051j1805K379O9764m5500n9544O6163j4495
15756A626315N5534M5893o4786q460m1640K7174J3537J787M913l1869J4424k4224
15744A618598O3024M2606l1539n489l9036K456j0893R092l848j8357L870J0369
15732A640853k5070j3221J0271J9277J7975J143k6817J0505k2414l50L3914k5620
$$ y = [1653592, 1602711, 1642535, 1677817, 1653859, 1629738, 1621628, 1636335, 1651465, 1624567, 1623091, 1619761, 1632228, 1671987, 1647024, 1630933, 1687020, 1655555, 1624227, 1667299, 1630521, 1647589, 1670263, 1655662, 1682433, 1658954, 1668643, 1666636, 1638059, 1639154, 1632884, 1628726, 1601268, 1663100, 1682029, 1657367, 1680909, 1666860, 1627696, 1656353, 1682228, 1675781, 1665112, 1678247, 1665477, 1610785, 1646321, 1645363, 1701604, 1680694, 1624404, 1619353, 1607548, 1609927, 1679691, 1634191, 1574647, 1640810, 1626315, 1681849, 1727742, 1662956, 1654496, 1612856, 1640030, 1653567, 1655354, 1660267, 1628398, 1642822, 1618598, 1681622, 1724228, 1692689, 1687200, 1648164, 1650620, 1639727, 1648819, 1644971, 1626614, 1630484, 1640853, 1615783, 1602562, 1612833, 1632110, 1650085, 1651228, 1624411, 1634916, 1612502, 1612152, 1646066, 1620446]
15720A620446J0036m0845K2895P789K3844K3167O434o285l6443J6260J2044N230
15708A664572k416o666kK3150R175o89R84q5595J6188L4377Q929J1970j2134o4495
15694A597348l665K3928J0015k0312K8427L9136m6250J3051l058L4644J0573j6102
15682A667735k8258N395J9124J0035k2721j2885N5491k6644l0525K2414K1217
15671A680378q073p1428R516K6499k3114j7911L4053L0207j3037k7546L1787M468
15659A655799K3937k1435J1191R968o168M2487m4680l8671J9901j6485m332J2685
15647A644197k4653j5317N9515J0700o821L568n2124K0256O5207K3445N325k9422
15635A703876j8717J3410o8L5503K867m1872p258j6440j5968k1212L786N0485
$$ y = [1620446, 1630482, 1589637, 1612532, 1620321, 1644165, 1667332, 1673766, 1667481, 1631038, 1647298, 1659342, 1664572, 1662156, 1655490, 1655488, 1678638, 1687813, 1687124, 1688108, 1602513, 1618701, 1653078, 1662007, 1673977, 1661843, 1597348, 1593683, 1617611, 1627626, 1607314, 1635741, 1674877, 1628627, 1641678, 1638620, 1673264, 1683837, 1667735, 1639477, 1644872, 1663996, 1674031, 1651310, 1638425, 1693916, 1667272, 1636747, 1659161, 1680378, 1672305, 1600877, 1610393, 1636892, 1613778, 1595867, 1629920, 1660127, 1647090, 1619544, 1651331, 1655799, 1679736, 1658301, 1669492, 1679460, 1673292, 1715779, 1671099, 1632428, 1652329, 1635844, 1631512, 1644197, 1619544, 1604227, 1663742, 1674442, 1667621, 1671189, 1619065, 1639321, 1704528, 1727973, 1733298, 1703876, 1685159, 1698569, 1698501, 1734004, 1736871, 1694999, 1687741, 1671301, 1655333, 1634121, 1637907, 1688392]
15623A688392q444M809j74l804j5271K573m323k0494J9624L5414l5700l4577J9733
15610A647758J5364k6775L3472m894L5326k995R773m7121J2088j1967o0604L4026
15598A633451M4507J6818n741m3090J0511j9116M8972j3554q7160M1817M7328
15587A674743M4161P171k9469l1198J6007m442l1578j0752L2235j7224J390j6296
15575A634748K0390K6821k6801k4885l5927J9971L2382L0319j3057K2178Q146
15564A694285k1850j0240J3354K8110l862o841k7565J7729j4857n3186N9148N0836
15552A725061m57j837q925j9569k2101K8026Q084l4114j3103M0606o2591J7937
15540A657017J4379j2927K5516K9863K017k1084k1587J2570j7521J540K7581p248
$$ y = [1688392, 1679948, 1684757, 1684583, 1680779, 1665508, 1668081, 1663758, 1643264, 1662888, 1698302, 1662602, 1628025, 1647758, 1663122, 1636347, 1669819, 1664925, 1700251, 1697256, 1707029, 1659908, 1671996, 1660029, 1599425, 1633451, 1677958, 1694776, 1689035, 1645945, 1656456, 1637340, 1686312, 1672758, 1585598, 1627415, 1674743, 1718904, 1726075, 1696606, 1665408, 1681415, 1676973, 1645395, 1634643, 1666878, 1649654, 1651044, 1634748, 1655138, 1681959, 1655158, 1630273, 1594346, 1614317, 1646699, 1677018, 1663961, 1686139, 1694285, 1672435, 1662195, 1675549, 1703659, 1699797, 1692956, 1665391, 1683120, 1668263, 1615077, 1674225, 1725061, 1724604, 1722767, 1713842, 1694273, 1672172, 1700198, 1708282, 1674168, 1661065, 1701671, 1639080, 1657017, 1671396, 1658469, 1683985, 1713848, 1715865, 1694781, 1673194, 1685764, 1668243, 1669783, 1697364, 1690116]
15528A690116M279k826J3893M953m3482N4492J4770p6781j4768P678j1899M253
15516A644678J9801L8609k3378J4192J0920r683M000l4308J0648j7678K8890K9523
15504A716214k2649L8671m3747J5850K4R681p443p619Q960n625k2260R037j0904
15491A678190K8011k0057j5505M3473J7022l6563k9682l2308N1798P6829p5067
15480A686141l9834J796L9398j8196L1498J5523J0658j0821k2777j3183J0118
15469A690321n3167N2044J2343l7374m1038K5454J5442O684L5194j9547k722k1279
15457A662355L0776L5984l5411K8864K8672m3618j1908J2270K7542q4631J275
15446A652170K7947P300r002L5205N5971q2875J941M1228k8992j3637l640m23
$$ y = [1690116, 1694395, 1691569, 1705462, 1710415, 1666933, 1721425, 1736195, 1659414, 1644646, 1652324, 1640425, 1644678, 1664479, 1703088, 1679710, 1693902, 1704822, 1695139, 1699139, 1664831, 1675479, 1657801, 1686691, 1716214, 1693565, 1732236, 1688489, 1704339, 1704363, 1714044, 1706601, 1698982, 1707942, 1702317, 1680057, 1689094, 1678190, 1706201, 1686144, 1670639, 1714112, 1731134, 1694571, 1664889, 1632581, 1684379, 1761208, 1686141, 1646307, 1648103, 1687501, 1669305, 1700803, 1716326, 1726984, 1716163, 1693386, 1680203, 1690321, 1637154, 1689198, 1701541, 1664167, 1623129, 1648583, 1664025, 1670709, 1705903, 1686356, 1683634, 1662355, 1693131, 1729115, 1693704, 1722568, 1751240, 1707622, 1695714, 1707984, 1735526, 1650895, 1652170, 1680117, 1687417, 1678415, 1713620, 1769591, 1686716, 1688657, 1729885, 1700893, 1687256, 1683616, 1683193]
15434A683193K0556k0017M2790J1558k4021l1641o875J3755K5850j4774M950j2340
15422A692984K0245j0514L3556m3425R342L7516L6681l1798l9952P782N639P951
15410A726007l1151r244K0256n6007J8182L1396m5051Q683j5419M0647J215N330
15398A694844r618L2240J9827k4702p221j3551J8620M4825l7507m1392j6640O3080
$$ y = [1683193, 1703749, 1683732, 1726522, 1738080, 1714059, 1682418, 1675543, 1689298, 1715148, 1700374, 1705324, 1692984, 1713229, 1702715, 1736271, 1692846, 1702188, 1739704, 1776385, 1744587, 1704635, 1712417, 1718056, 1726007, 1694856, 1685612, 1705868, 1649861, 1668043, 1699439, 1654388, 1663071, 1647652, 1688299, 1689514, 1694844, 1685226, 1717466, 1737293, 1712591, 1705370, 1691819, 1710439, 1755264, 1717757, 1676365, 1659725, 1722805]
$$ [...]
##END NTUPLES=NMR SPECTRUM
##END=
