##TITLE=1H_CG-1213-1
 CDCl3
 8 sc, 
 8.10.2024
##JCAMPDX= 6.0         $$ Bruker NMR JCAMP-DX V2.0
##DATA TYPE= NMR SPECTRUM
##DATA CLASS= NTUPLES
##ORIGIN= UXNMR, Bruker Analytische Messtechnik GmbH
##OWNER= root
$$ XWIN-NMR		Version 3.5
$$ Tue Oct  8 14:09:36 2024 Russian Standard Time (UT+4h)  she@DPX200
##.OBSERVE FREQUENCY= 200.1318
##.OBSERVE NUCLEUS= ^1H
##.ACQUISITION MODE= SIMULTANEOUS
##.ACQUISITION SCHEME= undefined
##.AVERAGES= 8
##.DIGITISER RES= 18
##SPECTROMETER/DATA SYSTEM= spect
##.PULSE SEQUENCE= zg30
##.SOLVENT NAME= CDCl3
##.SHIFT REFERENCE= (INTERNAL, CDCl3, 0, 23.2656)
##AUDIT TRAIL= $$ (NUMBER, WHEN, WHO, WHERE, WHAT)
$$ ##TITLE= Audit trail, XWIN-NMR		Version 3.5
$$ ##JCAMPDX= 5.01
$$ ##ORIGIN= Bruker BioSpin GmbH
$$ ##OWNER= she
$$ F:/spectra/data/she/nmr/H-F/1/pdata/1/auditp.txt
$$ ##AUDIT TRAIL=  $$ (NUMBER, WHEN, WHO, WHERE, WHAT)
(   1,<2024-10-08 14:08:17.37 +0400>,<she>,<DPX200>,
      <created by zg, POWCHK disabled, PULCHK disabled
       configuration hash MD5:
       00 E9 B6 7A A2 85 ED C7 34 08 36 98 17 FE 4E 26
       data hash MD5: 16K
       88 09 9F 18 67 76 3B 07 8C BD 90 31 BE 61 01 73>)
(   2,<2024-10-08 14:08:19.98 +0400>,<she>,<DPX200>,
      <Start of raw data processing
       efp BC_mod = 2 LB = 0.24 FT_mod = 6 PKNL = 1 PHC0 = -26507.14 PHC1 = 14.98747 SI = 16K 
       data hash MD5: 16K
       A2 44 36 09 4E 71 54 E6 59 15 1C 03 F0 F8 1C 0E>)
(   3,<2024-10-08 14:08:46.85 +0400>,<she>,<DPX200>,
      <pk PHC0 = 1.804173 PHC1 = -3.4 
       data hash MD5: 16K
       29 58 45 C5 32 1A 34 59 14 D2 A2 B9 FD C1 FA 9E>)
(   4,<2024-10-08 14:08:50.14 +0400>,<she>,<DPX200>,
      <abs ABSG = 5 
       data hash MD5: 16K
       A0 A9 6D 7E 44 99 93 D4 8A DA 0C 6E 0B 63 36 DC>)
$$ ##END=
$$ 
$$ hash MD5
$$ D9 A4 50 FE 1A 7C 61 F2 5D 86 A5 2E 8A 00 54 DB
##$RELAX= 
##$RELAX= 
##$RELAX= 
##$RELAX= 
##$RELAX= 
##$RELAX= 
$$ Bruker specific parameters
$$ --------------------------
##$DU= <F:/spectra>
##$EXPNO= 1
##$NAME= <H-F>
##$PROCNO= 1
##$TYPE= <nmr>
##$USER= <she>
##$AMP= (0..31)
100 100 100 100 100 100 100 100 100 100 100 100 100 100 100 100 100 100 
100 100 100 100 100 100 100 100 100 100 100 100 100 100 
##$AQSEQ= 0
##$AQ_mod= 1
##$AUNM= <au_zg>
##$AUTOPOS= <>
##$BF1= 200.13
##$BF2= 200.13
##$BF3= 200.13
##$BF4= 200.13
##$BF5= 200.13
##$BF6= 200.13
##$BF7= 200.13
##$BF8= 200.13
##$BYTORDA= 1
##$CFDGTYP= 0
##$CFRGTYP= 5
##$CHEMSTR= <none>
##$CNST= (0..31)
1 1 145 1 1 1 1 1 1 1 1 1 1 1 1 1 1 1 1 1 1 1 1 1 1 1 1 1 1 1 1 1 
##$CPDPRG= <>
##$CPDPRG1= <>
##$CPDPRG2= <>
##$CPDPRG3= <>
##$CPDPRG4= <mlev>
##$CPDPRG5= <mlev>
##$CPDPRG6= <mlev>
##$CPDPRG7= <mlev>
##$CPDPRG8= <mlev>
##$CPDPRGB= <>
##$CPDPRGT= <>
##$D= (0..31)
0 1.2 0 0 0 0 0 0 0 0.06 0 0.03 0 0 0 0 0.0002 0 0 0 0 0 0 0 0 0 0 0 0 
0 0 0 
##$DATE= 1728382096
##$DBL= (0..7)
120 120 120 120 120 120 120 120 
##$DBP= (0..7)
150 150 150 150 150 150 150 150 
##$DBP07= 0
##$DBPNAM0= <>
##$DBPNAM1= <>
##$DBPNAM2= <>
##$DBPNAM3= <>
##$DBPNAM4= <>
$$ [...]
##$SUBNAM3= <"">
##$SUBNAM4= <"">
##$SUBNAM5= <"">
##$SUBNAM6= <"">
##$SUBNAM7= <"">
##$SUBNAM8= <"">
##$SUBNAM9= <"">
##$SW= 24.0689170037331
##$SWIBOX= (0..15)
0 0 2 0 0 0 0 0 0 0 0 0 0 0 0 0 
##$SW_h= 4816.95568400771
##$TD= 16384
##$TD0= 1
##$TE= 0
##$TE2= 300
##$TE3= 300
##$TEG= 300
##$TL= (0..7)
0 120 120 120 120 120 120 120 
##$TP= (0..7)
150 150 150 150 150 150 150 150 
##$TP07= 0
##$TPNAME0= <>
##$TPNAME1= <>
##$TPNAME2= <>
##$TPNAME3= <>
##$TPNAME4= <>
##$TPNAME5= <>
##$TPNAME6= <>
##$TPNAME7= <>
##$TPOAL= (0..7)
0.5 0.5 0.5 0.5 0.5 0.5 0.5 0.5 
##$TPOFFS= (0..7)
0 0 0 0 0 0 0 0 
##$TUNHIN= 0
##$TUNHOUT= 0
##$TUNXOUT= 0
##$USERA1= <user>
##$USERA2= <user>
##$USERA3= <user>
##$USERA4= <user>
##$USERA5= <user>
##$V9= 5
##$VALIST= <valist>
##$VCLIST= <CCCCCCCCCCCCCCC>
##$VD= 0
##$VDLIST= <DDDDDDDDDDDDDDD>
##$VPLIST= <PPPPPPPPPPPPPPP>
##$VTLIST= <TTTTTTTTTTTTTTT>
##$WBST= 1024
##$WBSW= 4
##$XGAIN= (0..3)
0 0 0 0 
##$XL= 0
##$YL= 0
##$YMAX_a= 305616
##$YMIN_a= -258244
##$ZGOPTNS= <>
##$ZL1= 120
##$ZL2= 120
##$ZL3= 120
##$ZL4= 120
##$ABSF1= 23.25827
##$ABSF2= -0.8109169
##$ABSG= 5
##$ABSL= 3
##$ALPHA= 0
##$AQORDER= 0
##$ASSFAC= 0
##$ASSFACI= 0
##$ASSFACX= 0
##$ASSWID= 0
##$AUNMP= <proc_1d>
##$AZFE= 0.1
##$AZFW= 0.1
##$BCFW= 0
##$BC_mod= 2
##$BYTORDP= 0
##$COROFFS= 0
##$CY= -3
##$DATMOD= 1
##$DC= 0
##$DFILT= <>
##$DTYPP= 0
##$F1P= 0
##$F2P= 0
##$FCOR= 1
##$FTSIZE= 16384
##$FT_mod= 6
##$GAMMA= 0
##$GB= 0
##$INTBC= 1
##$INTSCL= 3.70164e-10
##$ISEN= 128
##$LB= 0.24
##$LEV0= 0
##$LPBIN= 0
##$MAXI= 10000
##$MC2= 0
##$MEAN= 0
##$ME_mod= 0
##$MI= 1.114404
##$NCOEF= 0
##$NC_proc= -6
##$NLEV= 6
##$NOISF1= 3.799351
##$NOISF2= 2.8
##$NSP= 0
##$NTH_PI= 0
##$NZP= 0
##$OFFSET= 23.26561
##$PC= 1
##$PHC0= -26505.34
##$PHC1= 11.58747
##$PH_mod= 1
##$PKNL= yes
##$PPARMOD= 0
##$PSCAL= 0
##$PSIGN= 0
##$REVERSE= no
##$SF= 200.129552343021
##$SI= 16384
##$SIGF1= 3
##$SIGF2= 2
##$SINO= 5.538805
##$SIOLD= 16384
##$SREGLST= <1H.CDCl3>
##$SSB= 0
##$STSI= 16384
##$STSR= 0
##$SW_p= 4816.95568400771
##$SYMM= 0
##$S_DEV= 0
##$TDeff= 16384
##$TDoff= 0
##$TI= <>
##$TILT= no
##$TM1= 0
##$TM2= 0
##$TOPLEV= 0
##$USERP1= <user>
##$USERP2= <user>
##$USERP3= <user>
##$USERP4= <user>
##$USERP5= <user>
##$WDW= 1
##$XDIM= 16384
##$YMAX_p= 392729711
##$YMIN_p= -241340
$$ End of Bruker specific parameters
$$ ---------------------------------
##NTUPLES= NMR SPECTRUM
##VAR_NAME=  FREQUENCY,     SPECTRUM/REAL,   SPECTRUM/IMAG
##SYMBOL=    X,             R,               I
##VAR_TYPE=  INDEPENDENT,   DEPENDENT,       DEPENDENT
##VAR_FORM=  AFFN,          ASDF,            ASDF
##VAR_DIM=   16384,         16384,           16384
##UNITS=     HZ,            ARBITRARY UNITS, ARBITRARY UNITS
##FACTOR=    0.29402158847633, 1,            1
##FIRST=     4656.13606249597, 0,            0
##LAST=      -160.819621511737, 0,           0
##MIN=       -160.819621511737, -241340,     0
##MAX=       4656.13606249597, 392729711,    0
$$ Real data points
##PAGE= N=1
##DATA TABLE= (X++(R..R)), XYDATA
$$ [...]
5609H995779j98572j40292k08576l00449k30048j33381n4440j6861L7481J10610
5599G861251J78483J26640K17774K96871K78711M19616N12320N66365O22198P56884
5589A1837113P82063P06706M99159N92097Q08759Q89602O17774J66310M7039q8520
5579A6858102k35017l12921l40569k78431l25330n88410o32478l82784j89933
5570A3572229J6305J77075K50748J50452L273K06429J50438K72503M47235O89153
5560A5935840Q86343J022445J129921R37314L24792j09162k10331j59453k96457
5551A9461252n11527p39970r39623j027908p86266n30980l60372k48005j53626
5542A4162975r8276q8571l2397L3744J25455J93353K63567L11912K82883L17152
$$ y = [8995779, 8797207, 8656915, 8448339, 8147890, 7917842, 7784461, 7730021, 7713160, 7750641, 7861251, 8039734, 8166374, 8384148, 8681019, 8959730, 9379346, 9891666, 10458031, 11080229, 11837113, 12619176, 13325882, 13825041, 14417138, 15225897, 16115499, 16733273, 16899583, 16946622, 16858102, 16623085, 16310164, 15969595, 15691164, 15365834, 14777424, 14144946, 13762162, 13572229, 13588534, 13765609, 14016357, 14166809, 14170082, 14376511, 14526949, 14799452, 15246687, 15935840, 16822183, 17844628, 18974549, 19911863, 20236655, 20127493, 19917162, 19757709, 19461252, 18949725, 18209755, 17270132, 16242224, 15455958, 14924978, 14564606, 14316601, 14162975, 14064699, 13976128, 13943731, 13977475, 14102930, 14296283, 14559850, 14871762, 15154645, 15471797]
5532A5471797M42290N62760N81727P24882P98420J060610R92954J128908J244405
5523B3008753J567140J902175K483104L110482L632253M002254M643315M575795
5515D8925271K987742P74966k786k137002o550976n679284m193613k995444k162004
5506B8966870j369342r22293o04954m62747k25190j86565k76111k51190k26548
5497B4441930j20424O111K71337N68627P30179O00336M03513L37668N64906K60753
5487B8064936k62661o85676r14010j219874j396352j440795j266786j157549j107875
5478A8613358j037160r07017q66120o90313n54191m46355m46374k14357k57357
5469A3194114k06296k06470j53061k2417Q0025J39783R0747O8630l083K418r1746
$$ y = [15471797, 15914087, 16476847, 17058574, 17783456, 18581876, 19642486, 20635440, 21764348, 23008753, 24575893, 26478068, 28961172, 32071654, 35703907, 39706161, 44349476, 48925271, 51913013, 52687979, 52685193, 50548191, 43997215, 38317931, 34124318, 31128874, 28966870, 27597528, 26675235, 26070281, 25607534, 25382344, 25195779, 24919668, 24668478, 24441930, 24321506, 24327617, 24598954, 25167581, 25897760, 26498096, 26901609, 27239277, 27804183, 28064936, 27802275, 27116599, 26202589, 24982715, 23586363, 22145568, 20878782, 19721233, 18613358, 17576198, 16669181, 15803061, 15112748, 14558557, 14112202, 13665828, 13451471, 13194114, 12987818, 12781348, 12628287, 12605870, 12685895, 12825678, 12916425, 12985055, 12981972, 12984390, 12892644]
5458A2892644k38523k81166l29301l95512m24706k85973k30585k26800j90847
5449A0289231j21658j06922j44010j43322m5944o3482n0378K9171K9586J53893
5439I826165J60063O6873J42634J57377J06307J26963J92888K45943K82697K59183
5429A1567093K26484L04244M51708N80114N41900L94760J49594K6677K51619K14787
5419A4708980p7595m38739m28877l52939k62405j48145j19900l8246K3634K9220
5409A2894988J59712K18667L78473M81145O41563P78515J005151J210629J221088
5400A8989931Q49672K96653K01596K83629J53690l57063p82116q18359p26649
5391A8090984p36501o74982o32291m76698l77710k42786k17093j15724n4460R4823
$$ y = [12892644, 12654121, 12372955, 12043654, 11648142, 11223436, 10937463, 10706878, 10480078, 10289231, 10167573, 10060651, 9916641, 9773319, 9727375, 9663893, 9613515, 9642686, 9672272, 9826165, 9986228, 10053101, 10195735, 10353112, 10459419, 10586382, 10779270, 11025213, 11307910, 11567093, 11793577, 12097821, 12549529, 13129643, 13671543, 14066303, 14215897, 14242574, 14494193, 14708980, 14631385, 14192646, 13763769, 13410830, 13148425, 13000280, 12880380, 12842134, 12865768, 12894988, 13054700, 13273367, 13651840, 14132985, 14774548, 15553063, 16558214, 17768843, 18989931, 19839603, 20136256, 20337852, 20621481, 20775171, 20418108, 19635992, 18817633, 18090984, 17354483, 16679501, 16047210, 15570512, 15192802, 14950016, 14732923, 14617199, 14562739, 14657562]
5381A4657562J95720K49117M88446O30394P66813R35882J048712P13293K21588
5372A9907527j42449Q1177M02291M30575K63473J05985J88596P6173n15553q28606
5362A9969189n67557k31853k40576q07155j301332j055480p43823m98812m21561
5353A4101040j98388k6556K2484J65027K78667K41123J94895K55594L78581N36333
5343A5948800O42282Q96763R07613M52694M1541m47302o50525l69953m95060r64898
5333A5961955j273865r46258o94480l62503k46254k68166m68562n25613m51270
5324A0724984l27517j48761n7733m7730J10040J67316L45655M16590L57498J03163
5314A1643505l88859m55391l45307k32344m42505o73717o38811n90716m69504
$$ y = [14657562, 14853282, 15102399, 15590845, 16221239, 16988052, 17923934, 18972646, 19685939, 19907527, 19765078, 19846255, 20248546, 20679121, 20942594, 21048579, 21237175, 21313348, 20797795, 19969189, 19401632, 19169779, 18929203, 18122048, 16820716, 15765236, 15021413, 14522601, 14101040, 13902652, 13876096, 13898580, 14063607, 14342274, 14583397, 14778292, 15033886, 15412467, 15948800, 16591082, 17487845, 18395458, 18848152, 18889693, 18442391, 17791866, 17421913, 16926853, 15961955, 14688090, 13741832, 13047352, 12684849, 12438595, 12170429, 11701867, 11176254, 10724984, 10397467, 10248706, 10190973, 10143243, 10253283, 10420599, 10766254, 11182844, 11540342, 11643505, 11254646, 10799255, 10453948, 10221604, 9779099, 9105382, 8466571, 7875855, 7406351]
5305G406351l64743k73267k32917j85032j41588j76306j16895p9531j16972m4783
5295E674317l7919k6519j00783q4988k1890p3324r6573r7607k4257j189j4600
5284E094668m6857k9655O2563R481q95j0294L7856m6851j16864j17645j07131
5273D728376j05502l8396J9991m7865O295M8794M2253J42381J05111N8833Q4518
5262E044789N6183L6739j1540Q06K3979o2611q9786p2482j50202n7671l1429l1142
5250D655633m4160n4342N8461N4186Q7680J87560J72114J93414K42101K61622
5240E814269K77143L40177K86297K20993J11183M7662k316q6083k9277p6115j18601
5229F785332j62404j50525j51887j61826o7256k5272K3016R7653J63968J39324
$$ y = [7406351, 7041608, 6768341, 6535424, 6350392, 6208804, 6032498, 5915603, 5836072, 5719100, 5674317, 5636398, 5609879, 5509096, 5424108, 5402218, 5328894, 5232321, 5134714, 5110457, 5109268, 5094668, 5047811, 5018156, 5080719, 5090200, 5089305, 5079011, 5116867, 5070016, 4953152, 4835507, 4728376, 4622874, 4584478, 4604469, 4556604, 4562899, 4611693, 4653946, 4796327, 4901438, 4960271, 5044789, 5100972, 5137711, 5126171, 5126977, 5150956, 5088345, 4998559, 4926077, 4775875, 4718204, 4686775, 4655633, 4611473, 4557131, 4615592, 4669778, 4757458, 4945018, 5117132, 5310546, 5552647, 5814269, 6091412, 6431589, 6717886, 6938879, 7050062, 7097724, 7095408, 7009325, 6980048, 6903933, 6785332, 6622928, 6472403, 6320516, 6158690, 6091434, 6066162, 6089178, 6186831, 6350799, 6490123]
5219F490123L19978K69734K49842K16747P9847J47580K01090J38378K17531J44009
5209H474859J06775L7100j19785l19773m32092m55034m12661l13416k87715j62490
5199F115768p7159j2422K6070M4311J05659J50325J30319M8517P0385J02444Q5544
5188F789761P0503O2151R0423J45428K31639K50304L35762L56540J88984J62513
5178H684008j54420m02248m38037n74051n69337m16585k76730k57850j10259r8866
5168E385625j23762k3380k6260j1095j20868j15222q7121r9864r3558o2147q3831
5157D538517o0495r5637q8637m4576o1151r5199n5300m3477k4092L4385k2879
5146C981459N243l3245N4681N463N9913O6883M0272N5219L4616Q2451R2794J01260
$$ y = [6490123, 6810101, 7079835, 7329677, 7546424, 7626271, 7773851, 7974941, 8113319, 8330850, 8474859, 8581634, 8618734, 8498949, 8179176, 7747084, 7292050, 6879389, 6565973, 6278258, 6115768, 6038609, 6026187, 6052257, 6096568, 6202227, 6352552, 6482871, 6531388, 6601773, 6704217, 6789761, 6860264, 6922415, 7012838, 7158266, 7389905, 7640209, 7975971, 8332511, 8521495, 8684008, 8529588, 8127340, 7689303, 7115252, 6545915, 6129330, 5852600, 5594750, 5484491, 5385625, 5261863, 5238483, 5212223, 5201128, 5080260, 4965038, 4877917, 4778053, 4684495, 4622348, 4538517, 4478022, 4382385, 4293748, 4249172, 4188021, 4092822, 4037522, 3994045, 3969953, 4004338, 3981459, 3986702, 3953457, 4008138, 4013601, 4073514, 4140397, 4180669, 4235888, 4270504, 4352955, 4445749, 4547009]
5134D547009J78507K23235K66924K26480J27121N633j73452l29912l47656k87596
5124D436293k11708j32456j43672j12505m2143q8569j2774L104j7191j684Q5759
5113C762454R0610P7870J63302K04170L29723L92198M61283L82507K34169Q4915
5103F183201j77065l59413m66473m78627m72418l97144k98163j55246j75526r7852
5093C105274j41805r0464J8357l1777o3940m6453P680L6248L7828J00204J28304
5082C059456K25493K67292J53699M6634q1953j34051l07998k63492j70923j06103
5072B688054j27774j64999j39678l3175j13009j12777k9060p1800p7290q7393
5062A731099q9832o4511o9848l9644o0123K0097q7389l2200K5497n3015J3277
$$ y = [4547009, 4725516, 4948751, 5215675, 5442155, 5569276, 5574909, 5401457, 5071545, 4723889, 4436293, 4224585, 4092129, 3948457, 3835952, 3793809, 3705240, 3692466, 3695570, 3678379, 3676695, 3762454, 3853064, 3930934, 4094236, 4298406, 4628129, 5020327, 5481610, 5864117, 6098286, 6183201, 6006136, 5646723, 5180250, 4701623, 4229205, 3832061, 3533898, 3378652, 3203126, 3105274, 2963469, 2873005, 2891362, 2859585, 2795645, 2749192, 2756872, 2793120, 2830948, 2931152, 3059456, 3284949, 3552241, 3705940, 3752574, 3670621, 3536570, 3228572, 2965080, 2794157, 2688054, 2560280, 2395281, 2255603, 2222428, 2109419, 1996642, 1967582, 1895782, 1818492, 1731099, 1641267, 1576756, 1506908, 1467264, 1407141, 1427238, 1339849, 1307649, 1333146, 1280131, 1293408]
5051A293408m2304k4759l1632Q914K3718j1223j3529o3499k0151m3309l8004j9900
5039A017730j7033N8160m3133o6499l1833k3953k1302k3739K1263o2173n0177
5028G57311n9974o186k1710k6543j1205j8977R143m9449J6180K9142j6949m5923
5016E54860k4396m0960P8208L689j01o7548K6413L9772N4865o6061n6948K102
5004E03895k1524j4677O502k3411n1048L3681j5154p107m4382K9788o94p465m1204
4991C47200J0922j511M9279J6528m2030n5568J4825K2581l2309l5284m1789o095
4979B46749L0634R887Q436k0417k7138L1496l7200J0010j6405P669J0408P994
4967B62123o6140k9766j76J4711L6078n0627l0314rJ6828M1571j5828J367k6739
$$ y = [1293408, 1251104, 1226345, 1194713, 1203627, 1227345, 1216122, 1202593, 1139094, 1118943, 1075634, 1037630, 1017730, 1000697, 1058857, 1015724, 949225, 917392, 893439, 872137, 848398, 869661, 807488, 757311, 697337, 691151, 669441, 642898, 631693, 612716, 621859, 572410, 588590, 617732, 600783, 554860, 530464, 489504, 567712, 571401, 571300, 503752, 530165, 569937, 624802, 558741, 501793, 503895, 482371, 467694, 474196, 450785, 399737, 433418, 418264, 411157, 366775, 396563, 395869, 388404, 347200, 358122, 356611, 405890, 422418, 380388, 324820, 339645, 362226, 329917, 294633, 252844, 246749, 277383, 287270, 295706, 275289, 248151, 279647, 242447, 252457, 236052, 243721, 254129, 262123, 195983, 166217, 166041, 180752, 216830, 166203, 135889, 135880, 152708, 194279, 178451, 179818, 153079]
4954A53079n947J2525j2997o4172N5554K4560k6129q412o8979Q089P6930J1736
4942A55837l6977P49p5534N3926m09j1348L6044M4371r175k9578l472m259j6095
4929A04080M1650m9382k798J2115j7748j0937L0357K6240m7371l963J5247J6570
4917A14060M9997m4748K2859L273k2000R51J0260k4603m584K5325k2958N740l1491
4904H2081M0057p484K584k193j4355m8232L5398J1988o0213j7799O0511Q36Q076
4891I1255j6903l8797O3165L5861m630j8720l6077J3496K9934o666l6605l79p1
4878G4863M6799m2230j7980M6928k4009J7438p4426O761Q320l1200L2148P336
4866E0748n8809M5748L3146l3119j3927O4630n6861j8811M9590j2600o232j3764
$$ y = [153079, 147132, 159657, 146660, 82488, 138042, 162602, 136473, 128061, 59082, 67171, 144101, 155837, 118860, 119609, 44075, 98001, 97592, 86244, 122288, 166659, 157484, 127906, 124434, 120175, 104080, 145730, 96348, 93550, 105665, 87917, 76980, 107337, 133577, 86206, 82243, 97490, 114060, 164057, 119309, 142168, 145441, 123441, 124392, 134652, 110049, 105465, 130790, 107832, 113572, 82081, 122138, 114654, 117238, 115045, 100690, 52458, 87856, 99844, 39631, 21832, 82343, 83179, 91255, 74352, 35555, 98720, 134581, 129951, 111231, 75154, 88650, 118584, 111918, 75313, 74934, 74863, 121662, 79432, 61452, 108380, 84371, 101809, 27383, 34144, 42464, 11264, 43412, 50748, -8061, 37687, 70833, 37714, 23787, 88417, 31556, 12745, 62335, 49735, 43503, 29739]
4854B9739l2187J7869o202K9186m363J7959P5140m5617k0162R911l1704m1384
4842a815O3541j1123K3155m3718N184K0067Q539P096n791L0578j1268p127O494
4829H3812n4616K4866l0289J1276J05483p1123P2231L9174N075N551j1415p436
4817A72589O9244l710k4132j7122K5010N3392m5561k9275r506m1733J1368q663
4805A51901p3187L4827j2339L628K2660J2871j4297J6818j1946o6230N255K9286
4793I9247J7580J0491q198J7094J9354L2676P700K3832Q677m1208j3556k0893
4781A52796j7162m1141m8601m3763L1269N6843m552k1729j1814j0393n919O5271
4769A01105l0766m1967J3099M680k438p64k5332k8972j9936J1770m302J40J9943
$$ y = [29739, -2448, 15421, 9219, 38405, 34042, 52001, 127141, 81524, 61362, 71273, 39569, -1815, 61726, 50603, 73758, 30040, 35224, 55291, 63830, 70926, 65135, 95713, 84445, 77318, 83812, 29196, 54062, 23773, 35049, 140532, 69409, 141640, 180814, 185889, 191440, 180025, 172589, 241833, 238123, 213991, 196869, 221879, 275271, 229710, 200435, 190929, 149196, 160564, 151901, 78714, 113541, 101202, 104830, 127490, 140361, 126064, 142882, 130936, 64706, 69961, 99247, 116827, 127318, 119120, 136214, 155568, 188244, 195944, 219776, 228453, 187245, 173689, 152796, 135634, 94493, 45892, 2129, 33398, 90241, 85689, 63960, 52146, 41753, 35834, 101105, 70339, 28372, 41471, 46151, 43713, 42949, 17617, -11355, -31291, -19521, -23823, -23683, -3740]
4756c740J5607l5223j6J4427M0227k0767k7884M3018K1242n1096M3394L6717k3386
4743E2520l2662r892J8197j1134L2979J0715k1308l60M2262o0968M648p3913K1818
4730b7098L1748j6172M236j9793k357K3739M065n3983O5653K1021j5672k4102
4718h715j5484j4504M2143P040k4756J8713K2958O808m7714j3057K1006l173J4940
4705F205k81q105M4345o718k4328K5705j555r688m5414J511m546L350k0943l375
4691d3837L1575j1810N759m4547J1843L7843Q791L8218j0559j6446n0865J2297
4679c1738P3624n4871l5769K3929l4019L7020K4894R429q443l1399O44k5292M5132
4666f859l0325K5142N7948J2053k0422k3945j3996n0991K5676L3437m6147J7484
$$ y = [-3740, 11867, -23356, -23372, -8945, 31282, 10515, -17369, 25649, 46891, -4205, 39189, 75906, 52520, 19858, 9966, 28163, 17029, 50008, 60723, 39415, 39055, 81317, 20349, 24997, -48916, -27098, 4650, -11522, -7286, -27079, -29436, -5697, -1632, -55615, 10038, 31059, 15387, -8715, -24199, -38703, 3440, 10480, -14276, 4437, 27395, 34203, -13511, -26568, -5562, -8735, 6205, 5924, -2181, 42164, 35446, 11118, 36823, 35268, 25580, -19834, -18323, -22869, -19519, -40462, -43837, -12262, -24072, -18313, -62860, -51017, -13174, -4383, 33835, 23276, 6830, -44035, -31738, 41886, -12985, -48754, -24825, -58844, -21824, 3070, 12499, 4056, -27343, -26699, -51991, -6859, -37184, -12042, 45906, 57959, 37537, 13592, -404, -51395, -25719, 7718, -38429, -20945]
4654b0945J6583j4n8385J1125M4911j3967M073O3207M1233q0438n1562N6988j3947
4641a138K2719K0475r6082M3530l765J9328k245L2362m014o8224N8890J263J7407
4628D0506j3930J6626L8169J2645J2001q965k8863J0383k3803L000n3164J2184
4616A6789l021k9690J7184K8845K9811j5282L939j8063J8584j7657k6430R4527
4604I9536l389k8760j6619j2314M6535j520m8275N3201K424J9214J7809j626n9088
4591F7128J9958M2104j8754j7925m3302K5892j2033Q165N8044j8865j5246L3331
4579A28497o9086l223L3219J5164J4811l3926J3346K621m421L0708j3948N346
4567A19108k9408j2076J9790K8599K8147O899k9634L7747j1569j0249L25k195
$$ y = [-20945, -4362, -4376, -62761, -51636, -6725, -20692, -16619, 46588, 87821, 7383, -44179, 12809, -1138, 21581, 42056, -54026, -10496, -14261, 5067, 2822, 35184, 31170, -37054, 21836, 23099, 40506, 26576, 43202, 81371, 94016, 106017, 97052, 68189, 78572, 54769, 57769, 4605, 16789, 13768, -15922, 1262, 30107, 59918, 44636, 48575, 30512, 49096, 31439, 5009, 99536, 96147, 67387, 50768, 38454, 84989, 83469, 35194, 88395, 90819, 110033, 127842, 126216, 67128, 87086, 129190, 110436, 92511, 49209, 75101, 63068, 71233, 129277, 110412, 95166, 128497, 59411, 56188, 89407, 104571, 119382, 85456, 98802, 101423, 97002, 127710, 113762, 119108, 89700, 77624, 97414, 126013, 154160, 161059, 131425, 169172, 157603, 147354, 147679, 145484]
4555A45484k392k030K0016J3069j8918j8676j9355J8331K8968l8491R424N6725
4543A92155l1500j4498j3963K4345M6781n4379O97L4476K3649p925j5620l0404
4531A53814J1178L2671k9421l317k2366N0045l8509l9185j770L4767K9329R097
4519A86333q065j1670M3824m0465l6199R90N725Q918J7291L5197k8636L4613j8004
4506A89852j0020J8126k8937M7675L0718L1270l1442j5754j4785J4129M8071m173
4494B74730M4962j0868q069N7416q337L5866L7506L569O9974L5054L338J6268
4482E51409K5290l4406L7438J7508K1546O4019N0223M0766L7839O4521J6003l0940
4470H61216j6274M4080M293K851m3639O033L857l7003K5788L0597M5570q962R670
$$ y = [145484, 143092, 141062, 161078, 174147, 155229, 136553, 117198, 135529, 164497, 126006, 135430, 192155, 160655, 146157, 132194, 156539, 203320, 148941, 149638, 184114, 207763, 199838, 184218, 153814, 164992, 197663, 168242, 164925, 142559, 192604, 154095, 114910, 113140, 147907, 177236, 186333, 178268, 166598, 210422, 169957, 133758, 134748, 140473, 149391, 166682, 201879, 173243, 207856, 189852, 179832, 197958, 169021, 216696, 247414, 278684, 247242, 231488, 216703, 230832, 278903, 274730, 319692, 308824, 300755, 358171, 349834, 385700, 423206, 426775, 496749, 531803, 535141, 551409, 576699, 542293, 579731, 597239, 618785, 682804, 733027, 773793, 811632, 876153, 892156, 861216, 844942, 889022, 893315, 896166, 852527, 858560, 862417, 825414, 851202, 881799, 927369, 918407, 928077]
4457I28077q325k9826q96L5220m56M331j248P3979K1624k11j5270J0841L7198
4444A055038K8712L0200M0607L6244K4997R0225J22787K4012Q4507J33830Q8804
4433A759963J20281J49968J85538J78827K20550J48954N9946k2886k8036Q147
4423B781252K3726j11012k68913j97676j42646j75421m2727q8728j03304j5784
4413A658767m7560q9275k7049l3634m6625p6816N543L1006l9197j3894L2547Q295
4401A362108K6235M1565O5625P0984L7484M6398J01924M7502J47497K03733J73776
4390B324831K15462R8676R1555N5827J7991n97K6743j7122k05562j81800j47621
4379B278383q4126r8032p7812m1054o438J9269P405k1998K6049L3480K7496J1451
$$ y = [928077, 919752, 889926, 889030, 924250, 923794, 928125, 926877, 1000856, 1022480, 1022269, 1006999, 1017840, 1055038, 1083750, 1113950, 1154557, 1190801, 1215798, 1306023, 1428810, 1452822, 1537329, 1671159, 1759963, 1880244, 2030212, 2215750, 2394577, 2615127, 2764081, 2824027, 2801141, 2773105, 2781252, 2804978, 2693966, 2425053, 2227377, 2084731, 1909310, 1866583, 1777855, 1674551, 1658767, 1611207, 1521932, 1494883, 1461249, 1414624, 1337808, 1343351, 1374357, 1335160, 1321266, 1353813, 1362108, 1388343, 1429908, 1495533, 1566517, 1604001, 1650399, 1752323, 1799825, 1947322, 2151055, 2324831, 2540293, 2638969, 2730524, 2786351, 2804342, 2803745, 2830488, 2813366, 2607804, 2426004, 2278383, 2194257, 2096225, 2018413, 1977359, 1970921, 1990190, 1997595, 1975597, 2001646, 2035126, 2062622, 2074073]
4367B074073Q2495Q921L2640l691j3316k7079K3846N9459j4839L682P0189L7249
4355B333629N4636L9018L5104J5876M5067N3307J35065N3366K8236J79265J50651
4344C123220R8049J35373Q8461L7620Q6534Q2885L2560M7865J21678L1505J204
4333C886954o7800j03654j16629j24407j28408k07038j54788j47698j40859j10260
4323B585413o6944m213j04900l1868j234r391m9760n3710k5194m5798N577Q166
4311B206144k0164M434J3201r093j4212K981N113M0011K4183L6428L894l0803
4299B262117J2058M1017M0302L2214N0310O1084M9154O0739L8580J20767P3533
4288B841875J10957Q8162J57396J29492J49812J18912P0495P2478Q8423Q6023
$$ y = [2074073, 2156568, 2165489, 2198129, 2194438, 2181122, 2154043, 2177889, 2237348, 2222509, 2226191, 2296380, 2333629, 2388265, 2427283, 2462387, 2478263, 2523330, 2576637, 2711702, 2765068, 2793304, 2972569, 3123220, 3221269, 3356642, 3445103, 3482723, 3569257, 3652142, 3684702, 3732567, 3854245, 3885750, 3886954, 3819154, 3715500, 3598871, 3474464, 3346056, 3139018, 2984230, 2836532, 2695673, 2585413, 2518469, 2514256, 2409356, 2377488, 2376254, 2366863, 2317103, 2263393, 2238199, 2192401, 2197978, 2206144, 2185980, 2190414, 2203615, 2194522, 2180310, 2183291, 2188404, 2228415, 2252598, 2289026, 2292920, 2262117, 2274175, 2315192, 2355494, 2387708, 2438018, 2499102, 2548256, 2608995, 2647575, 2768342, 2841875, 2952832, 3040994, 3198390, 3327882, 3477694, 3596606, 3667101, 3739579, 3828002, 3914025]
4278C914025O3344Q8518J16860M7104N5846j14870j7338n6569l4704q3249j26768
4267C852199j40609j38245m7385j5702J2897j5743N7477O3793R1440J08704J18381
4256C947207N2305l3756o591p9197L454N443n683K9024L8987J07675J12813J50317
4244D321998J88870K20068L51988L31762M41615N08529O09753O34092N33951L10174
4234H452800m4153l70589o94074p69900o91358n99930n13898m07816l93888k56843
4224C710351k85621k77464k03526j57250j25912j16950j53151o7353o3586p0422
4214B189116o8803r1279o1934r7439r2666k9344n1602p6869p8731m1723o0401
4203A438325q5956m3934m1388o8178l2588n7412n767k6490l5945o2236K4537k0588
$$ y = [3914025, 3977369, 4065887, 4182747, 4229851, 4285697, 4170827, 4153489, 4096920, 4062216, 3978967, 3852199, 3711590, 3573345, 3525960, 3510258, 3523155, 3507412, 3564889, 3628682, 3720122, 3828826, 3947207, 3999512, 3965756, 3959165, 3879968, 3883422, 3888865, 3883182, 3912206, 3951193, 4058868, 4171681, 4321998, 4510868, 4730936, 5082924, 5414686, 5856301, 6364830, 6974583, 7608675, 8142626, 8452800, 8408647, 8038058, 7343984, 6574084, 5882726, 5282796, 4768898, 4361082, 3967194, 3710351, 3424730, 3147266, 2943740, 2786490, 2660578, 2543628, 2390477, 2323124, 2259538, 2189116, 2120313, 2029034, 1967100, 1869661, 1776995, 1747651, 1696049, 1619180, 1540449, 1498726, 1438325, 1352369, 1308435, 1267047, 1198869, 1166281, 1108869, 1103102, 1076612, 1040667, 978431, 1002968, 982380]
4191I82380l7519j0263p0476m9865k8976k1324k247l9697K4889k8330L696l027
4179G19241m9710N976K4253k496J3709m4045N778O516j7231k8077R035j8171K4554
4166F49332Q074J3373o7684J7326k6920j7556k6177j8149k7971j5331j2392j8944
4154D56981J6785m0978N575k6950K3652l5761O353k2093l0990m022l7504L010
4142C14058L5698J6933j2925j6907k2132k8568J6174m349P845k5289N828L6931
4130C23297j7628K978k6911q117m425M360r947l2520L1121K1506j241j1934L6256
4117C06795L814k9371k3208K3146j189J3881l1603J8275m5576k5297K2913j973
4105B30607j3235k8344L5099M276j8450m795K4375R50o282J1097m4528K1725k0264
$$ y = [982380, 944861, 934598, 864122, 814257, 785281, 763957, 761710, 722013, 746902, 718572, 722268, 719241, 669531, 675507, 699760, 697264, 710973, 666928, 672706, 679222, 661991, 633914, 642949, 624778, 649332, 657406, 670779, 603095, 620421, 593501, 575945, 549768, 531619, 503648, 488317, 475925, 456981, 473766, 432788, 438363, 411413, 435065, 399304, 405657, 383564, 352574, 348552, 311048, 314058, 349756, 366689, 353764, 336857, 314725, 286157, 302331, 297982, 305827, 280538, 286366, 323297, 305669, 308647, 281736, 273619, 269194, 273554, 263607, 231087, 262208, 283714, 282473, 270539, 306795, 310609, 281238, 258030, 281176, 279987, 293868, 262265, 280540, 234964, 209667, 232580, 230607, 217372, 189028, 224127, 228403, 209953, 205158, 229533, 230483, 224201, 235298, 190770, 212495, 192231]
4092A92231M5015k7605n636K1245M7933m8771m0789N8671J7860L558j0055M24
4080B54081k7929k5908L6651K1466o642J0570j2567m962J8127L231j2068o950
4068B47100k0438O710J8985L6294m3941N937l5377l6301M5532L7494K645N1488
4056C16128j9581l4205K2806R101K5013N9344k2295J1026K5187K544o9297p97
4044C24974J7308n0036M434m8249P432L0511k4411P0660j1057o3026J9403J0068
4032B88011m103R194j1962l1404J41j7301L5044k5273J2889M3676l3807K7009
4020B92114m1203j7415L8879R877n4892k2829O1916J8557k2414l6596K5992N8903
4008C10889j6812k8328K8611M8492j3892n3216O1870M946M8680j9204j0751q933
$$ y = [192231, 237246, 209641, 204005, 225250, 273183, 224412, 183623, 242294, 260154, 263712, 253657, 254081, 226152, 200244, 236895, 258361, 251719, 262289, 249722, 244760, 262887, 266118, 254050, 247100, 226662, 233372, 252357, 288651, 244710, 250647, 215270, 178969, 224501, 261995, 264640, 316128, 296547, 262342, 285148, 294249, 319262, 378606, 356311, 367337, 392524, 395068, 325771, 324974, 342282, 292246, 296680, 248431, 255863, 286374, 261963, 332623, 321566, 258540, 277943, 288011, 283908, 293102, 281140, 249736, 249877, 232576, 267620, 242347, 255236, 298912, 265105, 292114, 250911, 233496, 272375, 282252, 227360, 204531, 266447, 285004, 262590, 225994, 251986, 310889, 294077, 265749, 294360, 342852, 328960, 275744, 337614, 342560, 391240, 372036, 361285, 352352]
3996C52352O9993R597J6716j3442j8269k6084k0527l2697k436J9405j2404K28
3984C42432m4564l6394M6347M5119K7195p3243k1965O4959l2257l753K6677J0234
3972C50787J650m065K020j6263n8474O0327J6391M0467N4408j501K064j5500M1230
3959D73541M3602n5030M649N4081l6256O0850j8224n247N5236O233N8186k0140
3947F21481m2903k7709Q978J6353J0440j0681K845k846O9718j815o3448j5402
3935E65011M2484j2865K5140M7896K266M8110J5687o023L3704n8775n885Q5105
3923G81855j4293k460O2156l5107L8773K9566R691K4629P4757N8314J6403P1312
3911A115596Q5034N2545Q9932J28887Q2536N6034N3025M3503J5664j6827k6951
$$ y = [352352, 422345, 431942, 448658, 435216, 416947, 390863, 370336, 337639, 335203, 354608, 342204, 342432, 297868, 261474, 307821, 352940, 380135, 306892, 284927, 349886, 317629, 313876, 340553, 350787, 352437, 348372, 350392, 334129, 275655, 335982, 352373, 392840, 447248, 445747, 447811, 432311, 473541, 517143, 462113, 466762, 520843, 484587, 545437, 527213, 521966, 577202, 583435, 641621, 621481, 578578, 550869, 559847, 576200, 586640, 575959, 578804, 575958, 645676, 643861, 580413, 565011, 607495, 594630, 619770, 667666, 669932, 718042, 733729, 727706, 761410, 702635, 696750, 781855, 767562, 765102, 827258, 792151, 830924, 860490, 870181, 894810, 969567, 1027881, 1044284, 1115596, 1200630, 1253175, 1343107, 1471994, 1554530, 1610564, 1663589, 1707092, 1722756, 1705929, 1678978]
3900A678978N434m1214J937n0385p2376q9105j3273k6654p0911n3681o537k3667
3888A238546o8310J9939n3557m8277L1635l4871J097J0133l3988N1555R617N5341
3876A178860K6358j795K3000P31J341Q4188K3806k3249M3984M3572K3127P3069
3864A496992J1687J06292M0613P0299J35327O6423L7436O7497O2417Q5911J03466
3853B284360O9784l3689o2260J3326k8024p7837q0290j18209j04751K98j25452
3842A737256j09288r7303l5503k5015r9633p2716q403J5192m8906n3121J7271
3831A219831o2684K2600j5272j6018N9281K2822k3993n5776N8299K8275m6489
3820A190876l2753l025p631M2676m2887m1382L0325K8409k1137l8698l4628j0686
$$ y = [1678978, 1684412, 1643198, 1645135, 1594750, 1522374, 1433269, 1419996, 1393342, 1322431, 1268750, 1262213, 1238546, 1170236, 1190175, 1136618, 1088341, 1119976, 1085105, 1086202, 1096335, 1062347, 1113902, 1123519, 1178860, 1205218, 1203423, 1226423, 1227154, 1228495, 1312683, 1336489, 1313240, 1357224, 1400796, 1423923, 1496992, 1508679, 1614971, 1655584, 1725883, 1861210, 1927633, 1965069, 2032566, 2094983, 2180894, 2284360, 2354144, 2320455, 2258195, 2271521, 2243497, 2165660, 2085370, 1967161, 1862410, 1862708, 1737256, 1627968, 1530665, 1495162, 1470147, 1370514, 1297798, 1289395, 1304587, 1255681, 1202560, 1219831, 1157147, 1179747, 1164475, 1148457, 1207738, 1230560, 1206567, 1150791, 1209090, 1237365, 1190876, 1158123, 1155098, 1147467, 1190143, 1147256, 1105874, 1136199, 1164608, 1143471, 1104773, 1070145, 1059459]
3808A059459K9528l946p0313Q016P691m3878n108N8527k5116k0721p1362j9707
3796I03070P7954k8256P2698J5671K2166j3699L3950o543j9009K9768P8405j0927
3784A155248J2731k5756N6815P0003R2813N5323O4135Q7128M8371O3726K0422
3773A700959m2957o1499n3143J4711m4749Q876O0419O1518L5790L7057M7740o2436
3761A702286p2477N5154K9099L6272L1870R7074O0946o327Q7832N7937P6246L2599
3749B188511K502k3267n7267n7004R292k4621k0792K4939l0453k7410K9359M4224
3737B058013O0799N4741J12640L8943J2725k1989J0185L2598P7060N445Q0544
3726B521704O6826J58671K03342J47212J88755K91174L27860L12565K87075J81545
$$ y = [1059459, 1088987, 1085041, 1014728, 1022744, 1030435, 986557, 981449, 1039976, 1014860, 994139, 922777, 903070, 981024, 952768, 1025466, 1041137, 1063303, 1049604, 1083554, 1077011, 1058002, 1087770, 1166175, 1155248, 1167979, 1142223, 1199038, 1269041, 1361854, 1417177, 1481312, 1568440, 1616811, 1680537, 1700959, 1658002, 1596503, 1543360, 1558071, 1513322, 1522198, 1582617, 1644135, 1679925, 1716982, 1764722, 1702286, 1629809, 1684963, 1714062, 1750334, 1782204, 1879278, 1940224, 1933897, 2021729, 2079666, 2155912, 2188511, 2191013, 2167746, 2110479, 2053475, 2062767, 2038146, 2017354, 2042293, 2011840, 1984430, 2013789, 2058013, 2118812, 2173553, 2286193, 2325136, 2337861, 2315872, 2326057, 2358655, 2435715, 2441160, 2521704, 2588530, 2747201, 2950543, 3097755, 3286510, 3577684, 3905544, 4218109, 4505184, 4686729]
3716D686729m459j50106l08352k62288k73000k05114j36187j05170n3502l688
3706C184863n3291j9575p0420K2376M5777j6818M8922O4907j4656J2645R3325
3695C298055M3400J05239O1055N7769O0030P4939O9900N5888K5454J3731j33918
3684C731542j1348p5152j22943r4222j00564q1243q1496p7472k8426p3193J0945
3673B996428p4757j6124m9635m0905J5782k0579m9912K5292l5127j6943l4061
3662B699459j0608L1256k0438L4796M2991p59M1168K3269m740N5956K2594O3578
3650B978522N2917L1604O3899R5406N1900J02656P3420J3185J16263K0645O2071
3639C662488P1458P6884K5665m6088q025m8904k0566l9053L50n6176j02408o7926
$$ y = [4686729, 4682270, 4532164, 4223812, 3961524, 3688524, 3483410, 3347223, 3242053, 3188551, 3184863, 3131572, 3111997, 3041577, 3063953, 3109730, 3092912, 3141834, 3206741, 3192085, 3204730, 3298055, 3341455, 3446694, 3507749, 3565518, 3625548, 3700487, 3770387, 3826275, 3851729, 3865460, 3731542, 3720194, 3645042, 3522099, 3427877, 3327313, 3246070, 3164574, 3087102, 3058676, 2985483, 2996428, 2921671, 2905547, 2855912, 2815007, 2830789, 2810210, 2760298, 2785590, 2750463, 2733520, 2699459, 2688851, 2720107, 2699669, 2734465, 2777456, 2776697, 2817865, 2841134, 2836394, 2892350, 2914944, 2978522, 3031439, 3063043, 3126942, 3222348, 3274248, 3376904, 3450324, 3463509, 3579772, 3600417, 3662488, 3733946, 3810830, 3836495, 3790407, 3782382, 3733478, 3712912, 3673859, 3674209, 3618033, 3515625, 3447699]
3627C447699m9536o1605n9078p7129k6577q4431K4490l6768j4805m9951p5339
3616B936970n222j182k0260j8352k2816N044l5400L0276j3749K8525n7325M6473
3604B872982j9313N0939K8037M193P1980P0139P26J8331N3008J1437O0706J5893
3592C239058K8641N1377L3286N2900M5400Q69J09243N1880R0851P1337L8173Q8183
3580C901198R8074J01941J22260Q0805J65874O7762Q1724J22881j4295J35833
3570D864057J38020J22827J34332Q7136J51381J70121K24889K41754J92398K11488
3560F538403K35342K55713K49327K29641K71592K33919K57043K64684L18412L55974
3550I210050L71058L61511L86949L76117M53329M76645M42310N16553N67726N82625
$$ y = [3447699, 3398163, 3336558, 3277480, 3200351, 3173774, 3089343, 3113833, 3077065, 3062260, 3012309, 2936970, 2931748, 2930566, 2910306, 2891954, 2869138, 2874182, 2838782, 2869058, 2855309, 2883834, 2826509, 2872982, 2853669, 2904608, 2932645, 2936838, 3008818, 3078957, 3079683, 3098014, 3151022, 3162459, 3223165, 3239058, 3267699, 3319076, 3352362, 3405262, 3450662, 3451531, 3560774, 3612654, 3703505, 3774842, 3813015, 3901198, 3999272, 4101213, 4223473, 4304278, 4470152, 4537914, 4619638, 4742519, 4728224, 4864057, 5002077, 5124904, 5259236, 5346372, 5497753, 5667874, 5892763, 6134517, 6326915, 6538403, 6773745, 7029458, 7278785, 7508426, 7780018, 8013937, 8270980, 8535664, 8854076, 9210050, 9581108, 9942619, 10329568, 10705685, 11159014, 11635659, 12077969, 12594522, 13162248, 13744873]
3540A3744873O31362O18886O89467O01873O77560Q01495Q85411R30055R51915
3531B0532897R99089J091722J165450J184261J289689J427073J535324J650311
3523C0875816J783352J907711K207219K423230K793845L176388L609599M394755
3515E3171915N643681P324148Q714291R870959P753958J992795k588477m326644
3507H7556626l173833r24433J657729L787154N639665M713209J919433Q45246
3499A02020796J636567L904223M959791K538984j853381m768420m807490k689873
3491A00941197k31349J596122m49374l377080m379215l498764j180017J620899
3483I1042419L894016N385117K305510m316496r058755j0694507r623242p640035
$$ y = [13744873, 14376235, 14995121, 15684588, 16286461, 16964021, 17765516, 18650927, 19580982, 20532897, 21531986, 22623708, 23789158, 24973419, 26263108, 27690181, 29225505, 30875816, 32659168, 34566879, 36774098, 39197328, 41991173, 45167561, 48777160, 53171915, 58815596, 66139744, 74854035, 84724994, 92478952, 94471747, 91883270, 87556626, 84382793, 83458360, 85116089, 88903243, 94542908, 99256117, 101175550, 102020796, 103657363, 107561586, 112521377, 115060361, 113206980, 108438560, 103631070, 100941197, 100709848, 102305970, 101856596, 98479516, 94100301, 90601537, 89421520, 91042419, 94936435, 100321552, 102627062, 98310566, 89251811, 78557304, 68934062, 61294027]
3475F1294027n821703m590644l538763k802799k326798k418192k511556k578798
3467C4704774k336311k090277j743512j397619j185086j114509j013468r63119
3459B2860873q27040p74473p19764o43629n72059m53680l97144k72708k10948
3450A7989428k52084j39574q7370j13387M9273K6424M2780Q0674J31642K00292
3440A7928098J49092J57098K71629L41449K98130L69134M39489M20580N05076
3431B0879775O23553O37976P95647Q15046R61749J134168J223101J428243J523733
3422C0022991J616738J692880J663828J395881J275363J180951J208597J252695
3414D1309924P59030N4779m46179m75833L9584N66300J097045J698703K209826
$$ y = [61294027, 55472324, 50881680, 47342917, 44540118, 42213320, 39795128, 37283572, 34704774, 32368463, 30278186, 28534674, 27137055, 25951969, 24837460, 23823992, 22860873, 22033833, 21259360, 20539596, 19895967, 19323908, 18870228, 18473084, 18200376, 17989428, 17737344, 17597770, 17510400, 17397013, 17446286, 17472710, 17515490, 17596164, 17727806, 17928098, 18077190, 18234288, 18505917, 18847366, 19145496, 19514630, 19954119, 20374699, 20879775, 21503328, 22141304, 22936951, 23751997, 24713746, 25847914, 27071015, 28499258, 30022991, 31639729, 33332609, 34996437, 36392318, 37667681, 38848632, 40057229, 41309924, 42068954, 42123733, 41677554, 41201721, 41241305, 41807605, 42904650, 44603353, 46813179]
3405D6813179K349842K196233K105081K118638J917764Q92054p71438k248603
3397E5372750k926052k693055j885675j133732p90909r32621j334420j219072
3389D2457214o80447o5692M88980Q21593R29204M37560o88132j662519k395378
3380C9642383k829799k911663k717078k324181k051207j721243j336333j114254
3372B2636625j082583j130732j193729j150878j018970r42992p28595p09360o82004
3363A3996782n80289n19306m58004l92726m30392m04475l64555l96860l75242
3354A0074933l98136k23616k99408k55386k39147k05122j46600j85694j74018
3345G947806j91728j82747j13322r8820j12753j16448j17080j23549p8612o6370
$$ y = [46813179, 49163021, 51359254, 53464335, 55582973, 57500737, 58392791, 57621353, 55372750, 52446698, 49753643, 47867968, 46734236, 45943327, 45010706, 43676286, 42457214, 41776767, 41711075, 42200055, 43021648, 43950852, 44388412, 43700280, 42037761, 39642383, 36812584, 33900921, 31183843, 28859662, 26808455, 25087212, 23750879, 22636625, 21554042, 20423310, 19229581, 18078703, 17059733, 16116741, 15388146, 14678786, 13996782, 13416493, 12897187, 12439183, 12046457, 11616065, 11211590, 10847035, 10450175, 10074933, 9676797, 9453181, 9153773, 8898387, 8659240, 8454118, 8307518, 8121824, 7947806, 7756078, 7573331, 7460009, 7361189, 7248436, 7131988, 7014908, 6891359, 6812747, 6746377]
3335F746377p4010o0187o1688R209q4708p2928m8496n9722q0274o3713n0170r673
3323F090017M9212k6460J8248l5349k826l5938j4894o5616j1901k6030L246L2789
3311E974498N397O3432P1077R1818R2838Q8506J04981J07740M9723J04620N8642
3300F813272N5876P2720M9390R9199Q0611P2724J05403M8469O6917J00575K6923
3289G592079Q3374N1174K9452O1713J1918j3154q2274l3314M9246n859p1376n7029
3277G615950o2825o3434m625o344p2400k5362m5525r4067l0277j4754m1080o1520
3265G093737p9640j1497l5266L3500k4624j4321Q7309M5050N1737N6388P0452
3254G272825M8108N8789R7232O5433m1336O3937P2063J13212Q0406O7693L0502
$$ y = [6746377, 6672367, 6612180, 6550492, 6559701, 6474993, 6402065, 6353569, 6293847, 6213573, 6149860, 6099690, 6090017, 6139229, 6112769, 6131017, 6095668, 6092842, 6056904, 6042010, 5976394, 5964493, 5938463, 5941709, 5974498, 5979895, 6043327, 6114404, 6206222, 6299060, 6387566, 6492547, 6600287, 6650010, 6754630, 6813272, 6869148, 6941868, 6991258, 7090457, 7171068, 7243792, 7349195, 7397664, 7464581, 7565156, 7592079, 7675453, 7726627, 7756079, 7817792, 7829710, 7816556, 7734282, 7700968, 7750214, 7744355, 7672979, 7615950, 7553125, 7489691, 7485066, 7478722, 7406322, 7380960, 7335435, 7241368, 7211091, 7196337, 7155257, 7093737, 7014097, 7002600, 6967334, 7000834, 6976210, 6961889, 7049198, 7094248, 7145985, 7202373, 7272825, 7320933, 7379722, 7476954, 7542387, 7501051, 7564988, 7637051, 7750263, 7830669, 7898362, 7928864]
3243G928864k109Q0119J16756M4587Q4882L6388P8559P5094J00980J29219J14691
3232H788030Q1178J38944J26695N1098R1980J17706Q9272L3753K6263n5001j45467
3221I344451j17448m1497r0987k2266k7366n1832j4M8803O835M7377M5726J01881
3209I243663P1428J05019N9718N6354J25264Q6984O3852M0402j00809m0584j30431
3198I580860j9451O858K9030Q8804O1948J18959J27580N6945R6635M6731J16886
3187A0311785J62673J58666K51284J82260J82158J92108J36149P3448J45602J57094
3177A1953227J55050J54728K33563J11055M9991J61416O6948K4800J03165R7313
3167A3111256J16608J86430R6918J82183J85892K58365K81022K72312L36510M28612
$$ y = [7928864, 7926755, 8006874, 8123630, 8168217, 8253099, 8289487, 8368046, 8443140, 8544120, 8673339, 8788030, 8869208, 9008152, 9134847, 9185945, 9277925, 9395631, 9484903, 9518656, 9544919, 9489918, 9344451, 9227003, 9185506, 9094519, 9072253, 9044887, 8993055, 8993041, 9041844, 9048679, 9096056, 9141782, 9243663, 9315091, 9420110, 9479828, 9536182, 9661446, 9748430, 9812282, 9852684, 9751875, 9711291, 9580860, 9561409, 9568267, 9597297, 9686101, 9748049, 9867008, 9994588, 10051533, 10148168, 10194899, 10311785, 10474458, 10633124, 10884408, 11066668, 11248826, 11440934, 11577083, 11650531, 11796133, 11953227, 12108277, 12263005, 12496568, 12607623, 12657614, 12819030, 12885978, 12910778, 13013943, 13111256, 13227864, 13414294, 13511212, 13693395, 13879287, 14137652, 14418674, 14690986, 15027496, 15456108]
3157A5456108M31532M53065M56769M83898N49013O24482M57026M19078L53635
3148A9684606M03555L66899L65378L40553L13524L70348M37324N73315O23658
3139B3479160O39535P75352P77012Q36987Q83235Q34202Q21915Q10486R01384
3130C0759268R56061J003807J078635J202162J225942J380591J419163J583112
3122D0608741J729570J781831K007904K294419K639402K984469L316869L544942
3114F0908147L731556M102878M980879O316300Q221715J0008919J0970692P822343
3106A17063429J849455k241724l708836k295303M06696L009222M999584M771034
3098A23853557J676050j40876m23301J235653L477742M833166L172216p03419
$$ y = [15456108, 15887640, 16340705, 16797474, 17281372, 17830385, 18454867, 18911893, 19330971, 19684606, 20088161, 20455060, 20820438, 21160991, 21474515, 21844863, 22282187, 22855502, 23479160, 24118695, 24894047, 25671059, 26508046, 27391281, 28225483, 29047398, 29857884, 30759268, 31715329, 32719136, 33797771, 34999933, 36225875, 37606466, 39025629, 40608741, 42338311, 44120142, 46128046, 48422465, 51061867, 54046336, 57363205, 60908147, 64639703, 68742581, 73723460, 80039760, 88261475, 98270394, 109241086, 117063429, 118912884, 116671160, 112962324, 110667021, 111073717, 114082939, 119082523, 123853557, 125529607, 125388731, 124965430, 126201083, 129678825, 134511991, 137684207, 136980788]
3090A36980788l880901m416961k834880k23165K6867j816431k587190k225094
3082A19023033o33612R16277J765088K155608K211091j011047n561980q717532
3074A10146926j0228368r398335p676365n795960m290385l107592k085394j296620
3066F6267907q30586q00910j162918j542809j904949k556129l001825l154462
3058E1313319k999088k656722k296043j913583j615544j312417j032344q59229
3050C6628349o08804m98302m50003l36563j33762P3880J47669K43165K30931L31844
3040C5628404M99828N70396O28391N84542N00762M17156L70265L72866L71976
3031C9944586M96603O87159Q52879J108474J201894J311013J421601J365390J287160
$$ y = [136980788, 133099887, 128682926, 125848046, 125624881, 125651748, 123835317, 121248127, 119023033, 118389421, 119305698, 121070786, 123226394, 125437485, 124426438, 118864458, 110146926, 99918558, 90520223, 82843858, 77047898, 72757513, 69649921, 67564527, 66267907, 65437321, 64636411, 63473493, 61930684, 60025735, 57469606, 54467781, 51313319, 48314231, 45657509, 43361466, 41447883, 39832339, 38519922, 37487578, 36628349, 36019545, 35521243, 35071240, 34734677, 34600915, 34674795, 34822464, 35065629, 35296560, 35628404, 36128232, 36698628, 37327019, 37911561, 38412323, 38829479, 39199744, 39572610, 39944586, 40441189, 41128348, 41981227, 43089701, 44291595, 45602608, 47024209, 48389599, 49676759]
3022D9676759J116404N38006m23935j170365j763837j979863k015520k094238
3014D1883411k083099k179786k131468j998756j785362j616060j361819j129425
3006B7597636r48450q33515o30223n20151l60569l04659k82468o6436j9087K6672
2996B3658750j1911o3680J5707Q1092J32486J42384K58006L07061L55091L81222
2986B5256208M06068L89981M11014M54122N08840N00323O28325Q72504J191825
2977C0619210J585028J704437J714216J109835j7180q36463j007599p32106m18408
2968C3720970O590L91737O26726K20318k03091l13507P1276M52943P61926O52746
2958C6388634r8668p60854r03924p87530m64317o56938j162733j266611j190401
$$ y = [49676759, 50793163, 51331169, 50907234, 49736869, 47973032, 45993169, 43977649, 41883411, 39800312, 37620526, 35489058, 33490302, 31704940, 30088880, 28727061, 27597636, 26649186, 25815671, 25185448, 24665297, 24304728, 24000069, 23717601, 23651165, 23632078, 23658750, 23646839, 23583159, 23598866, 23679958, 23812444, 23954828, 24212834, 24519895, 24874986, 25256208, 25662276, 26052257, 26463271, 26917393, 27426233, 27926556, 28554881, 29427385, 30619210, 32204238, 33908675, 35622891, 36732726, 36715546, 35879083, 34871484, 34139378, 33720970, 33727560, 34119297, 34746023, 34966341, 34763250, 34449743, 34521019, 34973962, 35735888, 36388634, 36289966, 35529112, 34625188, 33837658, 33373341, 32716403, 31553670, 30287059, 29096658]
2949B9096658p95726k90937q4902K05996K23995k39524j143895j878061j939543
2940B3154061j750104j516168j348642j144051j037613q59581p98031o90323n99683
2931A3409865n58403m52285l80722m04243l81959m01763m56897l86550l07921
2922I679122l43843l21221k86550k89081k26252j94624k47827j83769j66647j52923
2912G266385j69234j63506j33382k00637r3837j49494j17441q9970j03850k02157
2902E842877j05468q5064q6067r9569n8311p6806q5589n0555q7604j8827j5673
2891E073344j36540l8741o4427j9654m4281l3747o9941k6214q262l7967j2765
2880D580805M016R030p1095j15620q7645L20r639j2693N8629K1198j6811O2972
$$ y = [29096658, 28300932, 28009995, 27925093, 28131089, 28355084, 28115560, 26971665, 25093604, 23154061, 21403957, 19887789, 18539147, 17395096, 16357483, 15497902, 14699871, 14009548, 13409865, 12851462, 12399177, 12018455, 11614212, 11232253, 10830490, 10373593, 9987043, 9679122, 9335279, 9014058, 8727508, 8438427, 8212175, 8017551, 7769724, 7585955, 7419308, 7266385, 7097151, 6933645, 6800263, 6599626, 6505789, 6356295, 6238854, 6148884, 6045034, 5842877, 5737409, 5652345, 5566278, 5466709, 5408398, 5331592, 5246003, 5195448, 5107844, 5089017, 5073344, 4936804, 4898063, 4833636, 4813982, 4769701, 4735954, 4666013, 4639799, 4631537, 4593570, 4580805, 4584821, 4593851, 4522756, 4407136, 4319491, 4319811, 4310172, 4297479, 4356108, 4377306, 4360495, 4423467]
2868D423467j5589O9368M9810M0116M3289P1153Q9530R1472K6793N1753P3953
2857E015115P8125J08166J16765K0816J02936K48013K34104L17710L35344K83032
2847F860126j40509l23434k90873k70667q6254m6018K646o0285L6479M8173K1262
2836E750646L3328L1748N5038L7044J4764l991J2457j289J3571M4119N3897R9922
2824F141254R6399J50618N9477J93609J05108K30306J29208J84595K67276K51069
2814G808919K15199L09975L43709L43908M37010M40655M91301N83007N75598N86975
2804A2136256N02163L78847K28243M9297j92978k14739l97288m04219m73772m10352
2794A1201458m64339m09568l10331k93749k55915k59113k03354o6674j09394r1576
$$ y = [4423467, 4407878, 4477246, 4527056, 4567172, 4610461, 4681614, 4771144, 4862616, 4889409, 4941162, 5015115, 5093240, 5201406, 5318171, 5338987, 5441923, 5689936, 5924040, 6241750, 6577094, 6860126, 6719617, 6396183, 6105310, 5834643, 5748389, 5702371, 5705017, 5644732, 5681211, 5729384, 5750646, 5783974, 5815722, 5870760, 5907804, 5922568, 5918577, 5931034, 5929745, 5943316, 5987435, 6041332, 6141254, 6237653, 6388271, 6447748, 6641357, 6746465, 6976771, 7105979, 7290574, 7557850, 7808919, 8024118, 8334093, 8677802, 9021710, 9458720, 9899375, 10390676, 10973683, 11549281, 12136256, 12638419, 13017266, 13245509, 13294806, 13101828, 12887089, 12489801, 12085582, 11611810, 11201458, 10737119, 10327551, 10017220, 9723471, 9467556, 9208443, 9005089, 8938415, 8829021, 8737445]
2784H737445j40786j27735o7085p2623m2745l438K990m898O5619N0555n1903L2925
2772H378321j18958n2110n1416n2621p4726q1403q8035r3674j03204j27206j90148
2761G344820p0959j10217l8691p6081p8299r1474j02339q199n8956o5011n0577
2750F594017j5490k1198m6261k2492l7801n1392j916r3882n3225p1647l1153n4835
2738F092725O8615k7838k2037m0954p8288j0815K7931R6014J10008l8097O6512
2727F243776K2253R9984J11640J36821N2267R0132Q4610P5257K1134O054N4450
2716F998378N5612K4140L0865n4436j0112m8231O7554k6090L4222j6912K5319
2705G080309K0379R9424K4473J76598J50193J74198J48436J76577J69552O3594
$$ y = [8737445, 8596659, 8468924, 8401839, 8329216, 8286471, 8283033, 8286023, 8281125, 8346744, 8397299, 8345396, 8378321, 8259363, 8207253, 8155837, 8103216, 8028490, 7947087, 7859052, 7765378, 7662174, 7534968, 7344820, 7273861, 7163644, 7124953, 7048872, 6970573, 6879099, 6776760, 6768561, 6709605, 6644594, 6594017, 6578527, 6557329, 6511068, 6488576, 6450775, 6399383, 6397467, 6303585, 6250360, 6178713, 6147560, 6092725, 6161340, 6133502, 6111465, 6070511, 5992223, 5981408, 6009339, 6105353, 6215361, 6177264, 6243776, 6266029, 6366013, 6477653, 6614474, 6666741, 6756873, 6841483, 6916740, 6937874, 6943928, 6998378, 7053990, 7078130, 7108995, 7054559, 7044447, 6996216, 7063770, 7037680, 7071902, 7054990, 7080309, 7100688, 7200112, 7224585, 7401183, 7551376, 7725574, 7874010, 8050587, 8220139, 8283733]
2695H283733m291J52651n6J22114Q2447Q8103J26809K03448J47232K51491J83071
2684I636752J91920K07942J91589J53566K28581J38516K46287K17378L92165L92236
2674A1996932M64168L87491M79566L27789L90246L66815M35168M37582N43881
2665A5829638O26677Q18566P48048P29570L80370L78596L98439M68344M08458
2656B0786706N09068M68892N47717N26562O24353O99204Q45673Q66412J089258
2647B6963845J220298J476928J585724J831051J809730J658539J361254J299904
2639C9207273J294331J447189J485632J744804J728099J869609J981824K225937
2631E2984698K451145K779134L039854L402029L921964M847064N818512O934012
$$ y = [8283733, 8279442, 8432093, 8432037, 8554151, 8636598, 8724701, 8851510, 9054958, 9202190, 9453681, 9636752, 9828672, 10036614, 10228203, 10381769, 10610350, 10748866, 10995153, 11212531, 11604696, 11996932, 12461100, 12848591, 13328157, 13655946, 14046192, 14413007, 14848175, 15285757, 15829638, 16456315, 17274881, 18022929, 18752499, 19132869, 19511465, 19909904, 20378248, 20786706, 21295774, 21764666, 22312383, 22838945, 23463298, 24162502, 25008175, 25874587, 26963845, 28184143, 29661071, 31246795, 33077846, 34887576, 36546115, 37907369, 39207273, 40501604, 41948793, 43434425, 45179229, 46907328, 48776937, 50758761, 52984698, 55435843, 58214977, 61254831, 64656860, 68578824, 73425888, 79244400, 86178412]
2623H6178412Q095759R425070J0416071J1881382J4518275J9089647K6469225
2616A86073841L6536632M7558223O0518762O2042253j745959n7975033o6135448
2609B66873271n1892833l5563902k6571697j9083636j5030971j2064963r693528
2602I6971741p733720o403542n153359m422406l453604k985756j581836r35900
2594F4301618o83595k562393l974925l879783l169357k808170k623699k564903
2586D2034793k042358j931029j580355j457619j125254j048157q23882q26072
2578C1200067o07039p19014n05705o03586m69960l65625k27282j76623k6000q218
2568B7491015J69271J86346K54296L50685N65321O18815O36646L12794M60252
$$ y = [86178412, 94274171, 103699241, 114115312, 125996694, 140514969, 159604616, 186073841, 222610473, 270168696, 330687458, 392729711, 390983752, 333008719, 266873271, 214980438, 179416536, 152844839, 133761203, 118730232, 106665269, 96971741, 89238021, 82834479, 77681120, 73258714, 69805110, 66819354, 65237518, 64301618, 63618023, 61055630, 57080705, 53200922, 50031565, 47223395, 44599696, 42034793, 39992435, 38061406, 36481051, 35023432, 33898178, 32850021, 32026139, 31200067, 30593028, 29874014, 29368309, 28764723, 28294763, 27929138, 27701856, 27525233, 27499233, 27491015, 27660286, 27846632, 28100928, 28451613, 29016934, 29635749, 30272395, 30585189, 31045441]
2559C1045441O99213J204574J699598K095397J952077J470071J953954K977375
2551D5097700L871608P64810m613644n530912m437571k990282k335130j634939
2543B8191640j274555q70316p77920l90174k53953j43377j19194N4469J0042l5674
2533B4390988n2119q5105j80513j29560j39732L4876j9818J70623K57794L59714
2523B4607148N15143P08338P91000J178218J186139K88895n93606l93534q8023
2514B8199718K03810M34851N91159O50259P92297Q06158Q86657R04250Q61407
2505C4330566P86195P70143P67001P60654Q24614Q45244P23522O32244N19846
2496D0960029N36403M42270M10053M84783K74278K27653J81960K22340K86804
$$ y = [31045441, 31744654, 32949228, 34648826, 36744223, 38696300, 40166371, 42120325, 45097700, 48969308, 49734118, 45120474, 39589562, 35151991, 32161709, 29826579, 28191640, 26917085, 26046769, 25268849, 24878675, 24624722, 24481345, 24362151, 24416620, 24426662, 24390988, 24338869, 24253764, 24073251, 23943691, 23803959, 23838835, 23819017, 23989640, 24247434, 24607148, 25122291, 25830629, 26621629, 27799847, 28985986, 29274881, 28681275, 28287741, 28199718, 28403528, 28838379, 29429538, 30079797, 30872094, 31678252, 32564909, 33469159, 34330566, 35116761, 35886904, 36653905, 37414559, 38239173, 39084417, 39807939, 40440183, 40960029, 41496432, 41938702, 42348755, 42833538, 43107816, 43335469, 43517429, 43739769, 44026573]
2487D4026573M75455O58027O85376O71837M87400J90322k33379n13445p82069
2478D5666097p23482l23995K57233R59259J751529K359188J934998j7907j454632
2469E0408288j868889k205035k330073k249338j787317j454757j051712q24509
2461C6636658o71756n28196l34303k40352r506O4901K51842L49718M25449N74517
2451C6518972P08543R04277J202107J535012J893053K047158K337655K658211
2443D9804988L386112M308306N576149P045427R378360J1920134J0963776k766231
2435I9617021j4271492j3984805j0392562p379099n564529l967776l039408k348923
2427C8668427j925034j421775j139925j060063q95944q71527p84780p66717o44056
$$ y = [44026573, 44502028, 45160055, 45845431, 46517268, 47004668, 47194990, 46961611, 46448166, 45666097, 44942615, 44618620, 44875853, 45835112, 47586641, 49945829, 51880827, 51862920, 50408288, 48539399, 46334364, 44004291, 41754953, 39967636, 38512879, 37461167, 36636658, 35964902, 35436706, 35102403, 34862051, 34852545, 34917446, 35169288, 35519006, 35944455, 36518972, 37227515, 38131792, 39333899, 40868911, 42761964, 44809122, 47146777, 49804988, 53191100, 57499406, 63075555, 70120982, 79499342, 91419476, 102383252, 99617021, 85345529, 71360724, 60968162, 53589063, 48024534, 44056758, 41017350, 38668427, 36743393, 35321618, 34181693, 33121630, 32225686, 31354159, 30569379, 29802662, 29158606]
2418B9158606m66886k50488j23683l1694O4254O3779J3806k2408j67322k94763
2408B7943201k14872k54645k32064j61482j23061n5568M4121J32336K40181M56912
2398B7775059P34502J026456J310626J818402J974824J048669j655630k964040
2390C1068868k178140j614780j176184r76124n07672k75181J4293K45112M33157
2381B5033349O32309R15635J281613J749343K513665L515112M411637M966278
2373D5018941M208772k84201m684600n924061n314775m045783l056347k317732
2365B3600214j970917j615946j345894j052729r47903p79821p58736n98846n67773
2356A3961649n06067m75703m41105l67226k82579k64446k49370j52870j73638
$$ y = [29158606, 28691720, 28441232, 28317549, 28285855, 28350109, 28413888, 28427694, 28405286, 28237964, 27943201, 27728329, 27473684, 27241620, 27080138, 26957077, 26901509, 26945630, 27077966, 27318147, 27775059, 28509561, 29536017, 30846643, 32665045, 34639869, 35688538, 34032908, 31068868, 28890728, 27275948, 26099764, 25123640, 24615968, 24340787, 24355080, 24600192, 25033349, 25665658, 26581293, 27862906, 29612249, 32125914, 35641026, 40052663, 45018941, 49227713, 48943512, 44258912, 38334851, 33020076, 28974293, 25917946, 23600214, 21629297, 20013351, 18667457, 17614728, 16666825, 15887004, 15128268, 14529422, 13961649, 13455582, 12979879, 12538774, 12171548, 11888969, 11624523, 11375153, 11222283, 11048645]
2347A1048645r0043j2291J9504J11224O8330K3544l59792m87172l86868k47691
2337I687390j96719k07689j51909j07212q1417m8569L07J2561K6648J8419j3316
2326H938494L7955O4208N6079Q2221L8080J1747Q7914J18567J43712J41347J61977
2315I882301J64854K18210K51175K72855J86355K16877K99739K33038K94810K59783
2305A2279997K82015K99405L14784L97962M43539L86941N42654O32095O05246
2296A6184638P07810P44682P84318Q98275R59243J174319J326721J520541J847327
2287B6147874K161527K432088K886510L148840L413417L505936L680327M472112
2279E1848631N486623O108203O052029N541401L149038k077023o935390q302863
$$ y = [11048645, 10958602, 10946311, 10965815, 11077039, 11145369, 11168913, 10809121, 10321949, 9935081, 9687390, 9490671, 9282982, 9131073, 9023861, 8942444, 8893875, 8894182, 8906743, 8933391, 8951810, 8938494, 8976449, 9040657, 9096736, 9178957, 9217037, 9228784, 9316698, 9435265, 9578977, 9720324, 9882301, 10047155, 10265365, 10516540, 10789395, 10975750, 11192627, 11492366, 11725404, 12020214, 12279997, 12562012, 12861417, 13176201, 13574163, 14017702, 14404643, 14947297, 15579392, 16184638, 16892448, 17637130, 18421448, 19319723, 20278966, 21453285, 22780006, 24300547, 26147874, 28309401, 30741489, 33627999, 36776839, 40190256, 43696192, 47376519, 51848631, 57335254, 63443457, 69495486, 75036887, 78185925, 76108902, 69173512, 60870649]
2271F0870649p425778o039557m729368l584079k838369k175184j720575j393851
2263C0963888j098215q01894n65792k92656J01899L51942O21895O41975K51850
2254C0174892m98252j322794j783942j808241j545364j365009j165645q50218
2246A9835427p58335o62651m30823l57037j16553q0708k2217j71586l86717o94342
2236A6154458p90738p07997o10586m32594l92754l55394l45756m25571l59043
2227A1734025k66281l49099l08887k61442k99236k13421j22867j33841j65913
2218I613038j24031l0529L869j339M7381P8101K18681J97793K67964L47797M91824
2207A1110549N24351M73913K83001J3904k48286l40383l51388k94584k45896l41265
$$ y = [60870649, 53444871, 47405314, 42675946, 39091867, 36253498, 34078314, 32357739, 30963888, 29865673, 29063779, 28497987, 28205331, 28307230, 28659172, 29281067, 29923042, 30174892, 29676640, 28353846, 26569904, 24761663, 23216299, 21851290, 20685645, 19835427, 19077092, 18414441, 17983618, 17626581, 17510028, 17429320, 17407103, 17235517, 16848800, 16154458, 15363720, 14655723, 14045137, 13612543, 13219789, 12864395, 12518639, 12093068, 11734025, 11467744, 11118645, 10809758, 10548316, 10249080, 10035659, 9912792, 9778951, 9613038, 9489007, 9458478, 9462347, 9461008, 9508389, 9586490, 9805171, 10002964, 10270928, 10618725, 11110549, 11634900, 12108813, 12391814, 12405718, 12157432, 11817049, 11465661, 11171077, 10925181, 10583916]
2197A0583916l99314m47705l43825k72901j45292p3824j1710j05899j52712j54274
2187H476460j39858m2405m1246m7253O3742J24661J62125J64842J81042J58356
2177I060466J82275K63604K65463K82546L06574J89603J57319J40177J57053R2883
2167A1097963J10705J72737K20463L56891N15486M24439M54303M56632M62859
2158A4272478N77999O11430P52170R63284J330108J772420K229043K590665K513105
2149B7612702J295577j087686k750497k895631k523554j965947j521016j200566
2141A4963382r68440r50780q22489p78970p31593o42370n80591m83959l45871
2132H658319l44541k98720k56053j48822j91287q8947p8973m0529m6389j01879
$$ y = [10583916, 10184602, 9736897, 9393072, 9120171, 8974879, 8901055, 8889345, 8783446, 8630734, 8476460, 8336602, 8294197, 8252951, 8205698, 8269440, 8394101, 8556226, 8721068, 8902110, 9060466, 9242741, 9506345, 9771808, 10054354, 10360928, 10550531, 10707850, 10848027, 11005080, 11097963, 11208668, 11381405, 11601868, 11958759, 12474245, 12898684, 13352987, 13809619, 14272478, 14850477, 15461907, 16214077, 17177361, 18507469, 20279889, 22508932, 25099597, 27612702, 28908279, 27820593, 25070096, 22174465, 19650911, 17684964, 16163948, 14963382, 13994942, 13044162, 12221673, 11442703, 10711110, 10068740, 9488149, 9004190, 8658319, 8313778, 8015058, 7759005, 7610183, 7418896, 7329949, 7250976, 7210447, 7164058, 7062179]
2122G062179l23014m01116l98858l13981k42272j74094k02046j83120j39767j65099
2112D518812q9842j02250o6155q4214K2981r241o1867k1990n0017q6212q1961
2101C888044j5675J7446j9912O0331J56658J66346j10444k70792k30565j84978
2091C456459j64030j18682q3318m0087q2926m7099k2649r0187r3208n1457k5055
2080B637761o797J2309o484j4943j5904n1389j8361l5523Q998Q314n4577k675
2068B460729M788P6411N9097j2835j5633N8391J2337l7222k6444M5925j8632N7397
2056B664309L3730N0463N0391Q4091m0675J2632J0582k5174k4845Q841M316n8484
2044B770177m7638p8523L1136j9611N1896M1708N3780J7194J0478M8291J0275
$$ y = [7062179, 6739165, 6338049, 5939191, 5625210, 5382938, 5208844, 5006798, 4823678, 4683911, 4518812, 4428970, 4326720, 4260565, 4176351, 4199332, 4190091, 4128224, 4106234, 4056217, 3970005, 3888044, 3872369, 3889815, 3869903, 3930234, 4086892, 4253238, 4142794, 3872002, 3641437, 3456459, 3292429, 3173747, 3090429, 3050342, 2967416, 2920317, 2897668, 2807481, 2714273, 2662816, 2637761, 2630964, 2643273, 2636789, 2621846, 2605942, 2554553, 2536192, 2500669, 2509667, 2517981, 2463404, 2460729, 2465517, 2541928, 2601025, 2588190, 2572557, 2630948, 2643285, 2606063, 2579619, 2625544, 2606912, 2664309, 2698039, 2748502, 2798893, 2882984, 2842309, 2854941, 2865523, 2840349, 2815504, 2824345, 2828661, 2770177, 2722539, 2644016, 2675152, 2655541, 2707437, 2749145, 2802925, 2820119, 2830597, 2878888, 2889163]
2033B889163N5665J04254J26381R0679J10180J67735R6129O8836M9081Q8450J46515
2022C993068J54260J87682K47270J46797N7872n0513k0484l6110j5766P2420K01880
2011D938376K16600K27899K63100K40666N2879j04282k73343k59564k45088k37241
2001D820002k47804j26351j22997n4253J6863L08Q8149J16497J30508N1839l9827
1990D632934p2250p7630o6507L3141J17904J06644K31783J96299J73241Q4578
1980E360137l3485j19166k22645j91725k25230j43284r3514j75451k03350k33336
1970C718951k56563k11466k15095j65860q2179j21472p3222k3476o2517o5208
1960B441893P956j4627J9159p5120J2665M529J4311J6231K7683O1432O5948J0733
$$ y = [2889163, 2944828, 3049082, 3175463, 3266142, 3376322, 3544057, 3640186, 3709022, 3758103, 3846553, 3993068, 4147328, 4335010, 4582280, 4729077, 4786949, 4736436, 4715952, 4679842, 4664076, 4736496, 4938376, 5154976, 5382875, 5645975, 5886641, 5939520, 5835238, 5561895, 5302331, 5057243, 4820002, 4572198, 4445847, 4322850, 4268597, 4285460, 4285768, 4373917, 4490414, 4620922, 4672761, 4632934, 4560684, 4483054, 4416547, 4449688, 4567592, 4674236, 4906019, 5102318, 5275559, 5360137, 5326652, 5207486, 4984841, 4793116, 4567886, 4424602, 4331088, 4155637, 3952287, 3718951, 3462388, 3250922, 3035827, 2869967, 2787788, 2666316, 2593094, 2569618, 2507101, 2441893, 2449849, 2435222, 2454381, 2379261, 2391926, 2396455, 2410766, 2426997, 2454680, 2516112, 2582060, 2592793]
1948B592793L228o4696j63303p5011j11173q7032q3554m5003q5839p1756L931
1937A812585m885K0456j9363k1711l946o3423l2613m8526J3682k8136l0765j0825
1925A582530m7309m4232n9758q2368p7058n275m4968q5090k6575l8525m8114l127
1913A020131L781m6230L912K1627j8311J604P222L173N6427M5007q511m2041Q618
1900A056409o6915m7376m1331p3305J6644r3098p4758K2103l7854L171K1362k0960
1888F64092m2190q067r445j0930k6167K1041j9176L48p301K0584l7877M615n1194
1875D98333M424K0346j7538j0123J9077p2869j5105j6647M4798k109j3224K4652
1863D64015m4718J9146R141m0645l9356m574k0267L6567Q752n0914k1881J586
$$ y = [2592793, 2596021, 2531325, 2368022, 2293011, 2181838, 2094806, 2011252, 1966249, 1880410, 1808654, 1812585, 1807700, 1828156, 1808793, 1787082, 1783136, 1719713, 1687100, 1638574, 1652256, 1624120, 1593355, 1582530, 1535221, 1490989, 1431231, 1348863, 1271805, 1266530, 1221562, 1136472, 1109897, 1071372, 1023258, 1020131, 1023912, 977682, 981594, 1003221, 984910, 986514, 993736, 996909, 1053336, 1098343, 1089832, 1047791, 1056409, 989494, 942118, 900787, 827482, 844126, 751028, 676270, 698373, 660519, 663690, 685052, 664092, 621902, 613835, 604390, 593460, 567293, 588334, 569158, 569506, 562205, 582789, 544912, 549527, 498333, 502757, 523103, 505565, 495442, 514519, 441650, 426545, 409898, 454696, 452587, 439363, 464015, 419297, 438443, 447584, 406939, 367583, 363009, 342742, 379309, 388061, 337147, 315266, 316852]
1851C16852j275L5966o9799R620k637r018N163K5249k5409j2403k1116k7861j9991
1838B03341M9774m649l3089K9686k3638O1522m8076M1079J5068K6249n9852o8235
1826A89180k5149N5137K7400n711m3131P608Q107L7800n7172n092J5795r271l550
1813A91951O885l0345n114P5778m5508K8816K0605j8927l2374K149j2606M3586
1801B24896n3156J8724j6149K4414L0930L706Q054N646p033r121J7038j6679l4356
1788A96914J380K7199k1798K0546j0333j8630M2285k710n2406m2182J5667J958
1776A57890N179L7103O60k2051k0232n2638N7129j3026j9470J1197n699K9837
1764A65879k4736m3638J4027l1049p985N3907J4336l397l0172l96K3487k3531
$$ y = [316852, 315577, 351543, 281744, 291364, 288727, 279709, 284872, 310121, 284712, 272309, 251193, 223332, 203341, 253115, 248466, 215377, 245063, 221425, 282947, 234871, 275950, 291018, 317267, 257415, 189180, 164031, 219168, 246568, 240857, 197726, 205334, 213441, 251241, 194069, 188977, 204772, 195501, 191951, 198836, 168491, 163377, 239155, 193647, 222463, 243068, 224141, 191767, 193916, 181310, 224896, 171740, 190464, 174315, 198729, 229659, 233365, 241419, 247065, 240032, 230911, 247949, 231270, 196914, 198294, 225493, 203695, 224241, 213908, 195278, 237563, 234853, 182447, 140265, 155932, 157890, 163069, 200172, 200832, 178781, 158549, 105911, 163040, 150014, 130544, 141741, 136042, 165879, 141143, 97505, 111532, 80483, 72498, 126405, 140741, 137344, 107172, 106776, 130263, 106732]
1752A06732K5574Q81P8714L8919o8325n2792j3401l7092J9673j0880N1927N9543
1740A99473J7951j12019n2992R467J1562k0310j5209P3430m1826K2678j7442Q429
1728H3192M609J0480j6292Q417m271J5289N972R928N1873j6039k0690m8986J3277
1715I6759m6251k4312O5202P0413l0055n0142o370M3302k4742q212K4871j2776
1703I7687n2821L8484K6994J1480l0670R079l4639J572L4169J7129k4701l3396
1691F0367P4680l4761R721m2137K4310L7511q4151M53r004K4207L8937k562j9160
1678G8411P385J398l1849O383k1830L2605O9848m8684j4392J721L0340J7464k9687
1665I9113q161j2352r607k4930p744J7758q545n3561M1279k2045J2429j5245O3953
$$ y = [106732, 132306, 133187, 211901, 250820, 182495, 129703, 116302, 79210, 98883, 88003, 139930, 199473, 217424, 105405, 52413, 61880, 73442, 53132, 37923, 111353, 69527, 92205, 74763, 83192, 87801, 98281, 81989, 90406, 86135, 101424, 107396, 117324, 169197, 153158, 132468, 83482, 96759, 50508, 26196, 91398, 161811, 131756, 81614, 75244, 118546, 93804, 85592, 110463, 97687, 44866, 83350, 110344, 121824, 91154, 100233, 65594, 67166, 101335, 118464, 93763, 60367, 135047, 100286, 110007, 67870, 92180, 129691, 45540, 45993, 36989, 61196, 100133, 97571, 78411, 85796, 87194, 55345, 61728, 39898, 72503, 142351, 93667, 79275, 80996, 111336, 128800, 99113, 90952, 78600, 68993, 44063, 36319, 54077, 45532, -8029, 33250, 11205, 23634, 8389, 72342]
1652G2342K8770k970l4651n2488Q5859l0421J0025K4741n5619m327L3648j5087
1640E9822K10k0634k7196M9252j7381J3982K1413N6432m0687l0275J6925K9304
1628A11167n444N55J6049m8876K5800q681q372j0945K098O0021M579m4021l8112
1615E5818Q195j1684K5319L0463l3127j9828J7393P539K0875j3397q183K317L9673
1602A21373q351J950l3505K060k2529K1159k5794L3667Q033M3562j6195m842J044
1589A21632k8295M2477o335p859J3657q40j7981L8059K9417j5712k5571K0481
1577A63130L5919K617N910J4780j6707n0686J8747J3271l1297k1213J1722L5327
1565A81520K351o2748M6002k5998j1946N7201n416l5240K9331j591l4433L587
$$ y = [72342, 101112, 98142, 63491, 11003, 96862, 66441, 76466, 101207, 45588, 41261, 74909, 59822, 60032, 39398, 12202, 61454, 44073, 58055, 79468, 135900, 95213, 64938, 81863, 111167, 105723, 106278, 122327, 73451, 99251, 90570, 82198, 71253, 73351, 133372, 137951, 93930, 55818, 64013, 52329, 77648, 108111, 74984, 55156, 72549, 80088, 100963, 87566, 79383, 81700, 121373, 113022, 114972, 81467, 83527, 60998, 82157, 56363, 90030, 98063, 141625, 125430, 120588, 121632, 93337, 135814, 129479, 121620, 135277, 134437, 116456, 154515, 183932, 168220, 142649, 163130, 199049, 201666, 207576, 222356, 205649, 154963, 173710, 186981, 155684, 134471, 146193, 181520, 183871, 121123, 167125, 141127, 129181, 186382, 180966, 145726, 175057, 173466, 139033, 142620]
1553A42620o836N0519Q254n259l464q942j6282l3943K637K9514j4980Q806J7520
1540A70164k7696k4347N9689k8781N7398q910n2328R019J125J1213k679J8100
1528A81967K0880L1320J1579p89J5644k1421j5253M1284p354j43P957k6923J1213
1515B49961q3580O4125M019J5169K1464j5551J910N2937l9045j3484J9637L2495
1503C10057n6123j8771J1758K4371l3121m5065M0866q273Q476M4086j3313M7768
1491C12716K267L7132j5043r408Q227k7569L4658O646p005J0949j0872J4551N1278
1478D08527k4743m351m513L207l954K9291O2091k2797K5508k7304o732L0697N9932
1465E24859K1451k9944r281L1522M4541J9170N010q217Q4363M5927O586P9689
$$ y = [142620, 135784, 186303, 194557, 189298, 185834, 176892, 160610, 126667, 129304, 158818, 143838, 152644, 170164, 142468, 118121, 177810, 149029, 206427, 197517, 145189, 154208, 155333, 166546, 163867, 181967, 202847, 234167, 245746, 244957, 260601, 239180, 223927, 265211, 257857, 257714, 265671, 238748, 249961, 166381, 230506, 234525, 249694, 271158, 255607, 257517, 310454, 271409, 257925, 277562, 310057, 253934, 235163, 246921, 271292, 238171, 193106, 233972, 225699, 234175, 278261, 264948, 312716, 314983, 352115, 337072, 327664, 335891, 308322, 342980, 349626, 342621, 353570, 342698, 357249, 408527, 383784, 379433, 374920, 378127, 374173, 403464, 465555, 442758, 468266, 440962, 434230, 464927, 524859, 546310, 516366, 507085, 538607, 583148, 602318, 607328, 599111, 683474, 729401, 735987, 815676]
1453H15676k0687j132N6699K6710j3938K4277K8387m8305N5642L241K4290O8637
1441A019497K8256K185k808N7140R2089J7067K3542P6667O8861O446N3953O2709
1429A505604L2422M5203J13399J3981L4233M0562O4445J4413Q1166J09497K7309
1418B082234O8292Q9403R4711J26801R6391J02561R9480J21976J59721J67475
1408C209045J30828J35933K03523J83697R9991R8373M3750p2596k07390j53906
1398C671248j78755q8992j76568j46296j09868j14458j30282j02864n105o1781
1388B556279m2978m7184j20107o8360Q535r0442k1696k1727l8203j6123n9923
1377B038071m6746r314k8332n9959J2416M569m0103M257j322O4713R1148J10898
$$ y = [815676, 794989, 793857, 850556, 877266, 863328, 887605, 915992, 867687, 923329, 926570, 950860, 1019497, 1047753, 1049938, 1047130, 1104270, 1196359, 1213426, 1236968, 1313635, 1382496, 1388942, 1442895, 1505604, 1538026, 1583229, 1696628, 1710609, 1744842, 1785404, 1849849, 1864262, 1945428, 2054925, 2082234, 2150526, 2239929, 2334640, 2461441, 2557832, 2660393, 2759873, 2881849, 3041570, 3209045, 3339873, 3475806, 3679329, 3863026, 3963017, 4061390, 4105140, 4032544, 3825154, 3671248, 3492493, 3403501, 3226933, 3080637, 2970769, 2856311, 2726029, 2623165, 2618060, 2556279, 2513301, 2466117, 2346010, 2277650, 2286185, 2195743, 2174047, 2152320, 2114117, 2097994, 2038071, 1991325, 1982011, 1953679, 1893720, 1906136, 1910705, 1870602, 1874859, 1873537, 1938250, 2029398, 2140296]
1365B140296J40646J3931j11361j42929j17692j34631m1843q1843q0502m5933
1355A538139o3834o663n4119N2918l2909K1031L6446j6989K9315J16827O3336
1344A683498J49314K06695K81518K69987p747j39851k67215l07053j69128j42998
1334A557020j27366m6381j08838l6341m4407o3388p2827j1432p55n448O2607o6396
1322A036048p17N0234P5505J33071J12274Q8618k107r0520j70045j38160j16735
1311I77466q6781p5357m7897p522l4811k1701k6145r623o110j4258J5609p4391
1299E88479n838J8551M97j9092j9138m481J8919j1993k2452m98m6983L4232o70
1286E29533n0806O655j32k2498l479k9564P8700J2191o1098m5871J168j2881k2389
$$ y = [2140296, 2280942, 2294873, 2183512, 2040583, 1922891, 1788260, 1746417, 1664574, 1584072, 1538139, 1474305, 1467642, 1413523, 1466441, 1433532, 1454563, 1491009, 1474020, 1503335, 1620162, 1683498, 1832812, 2039507, 2321025, 2591012, 2583265, 2443414, 2176199, 1869146, 1700018, 1557020, 1429654, 1383273, 1274435, 1238094, 1193687, 1130299, 1057472, 1046040, 1045285, 1039837, 1102444, 1036048, 1035331, 1085565, 1161070, 1294141, 1406415, 1495033, 1492926, 1402406, 1232361, 1094201, 977466, 890685, 815328, 767431, 759909, 725098, 703397, 677252, 667629, 661519, 647261, 662870, 588479, 582641, 601192, 601689, 582597, 563459, 558978, 577897, 565904, 543452, 542954, 495971, 530203, 529533, 478727, 485382, 485250, 462752, 459273, 429709, 508409, 520600, 459502, 413631, 414799, 401918, 379529]
1273C79529k2766P108K0412j1690k6235n8766k3630K4677J0345J8349l9310k357
1261B75666J2994j8719o0567k681N6310p391k4118k6391O9335J1523j8721k1635
1249B45605j6986j1111J0497l8800J6302L6345m2856j1061M4232l2791N658r34
1237B04100k5689j2784j4236K4473K250k224O870j911K4257Q604p1700M707L0030
1224A76747m295K8558R032Q236j9072o288K0293O347k1352k778M3910J8794k7025
1211B31107j5801L858k3983L5514K4538j0043L448L3969J685L626m0382K5888
1199B73424L848J8272o2515L2708N9300l1733J1196K3044n4063M4823M0309N3168
1187D11781m2895j8647M7943J1585L3822n8388K519L9047L9162N7411j8542L3935
$$ y = [379529, 356763, 363871, 384283, 372593, 346358, 287592, 263962, 288639, 298984, 317333, 278023, 275666, 288660, 269941, 209374, 206693, 263003, 255612, 231494, 205103, 274438, 285961, 267240, 245605, 228619, 217508, 228005, 189205, 205507, 241852, 198996, 187935, 232167, 199376, 205034, 204100, 178411, 165627, 151391, 175864, 178114, 175890, 182760, 180849, 205106, 213710, 142010, 146717, 176747, 172452, 201010, 210042, 218278, 199206, 192918, 213211, 219558, 198206, 195428, 239338, 258132, 231107, 215306, 219164, 195181, 230695, 255233, 245190, 248638, 282607, 284292, 287918, 247536, 273424, 277272, 295544, 233029, 265737, 325037, 293304, 304500, 327544, 273481, 318304, 358613, 411781, 368886, 350239, 398182, 409767, 443589, 385201, 387720, 426767, 465929, 523340, 504798, 538733]
1175E38733n7164R782P8267L7936n674j5490N5634L8233K9199J9987L5096J1053
1163G75592k3691K6415J08539J7706m0016k4684N4593L6593J2286L5437Q3909
1152A062679M9686L0492P2410M0386L1387R1293K987O2898K0602j6491n1519l2995
1140A363815n7502k8741l1974m112l432M8991J6287P7693L3558Q653K6806j7559
1128A432483O1126O0348N1100O967k0191J1108m223m8600o0970j8436k9183k4230
1116A417299m4647r784k2862O968M9270R922L0787n6720p7031k4583m2343o2693
1104A173583p3540q1268p6079k7935j05237m7395l1824k0045l0199j1276l8249
1093F30536m4088k2533l6056J714k1726k9867n1507j0394j5665K2160j4070q2783
$$ y = [538733, 481569, 491351, 569618, 607554, 601880, 586390, 642024, 680257, 709456, 729443, 764539, 775592, 751901, 778316, 886855, 904561, 864545, 839861, 894454, 931047, 943333, 978770, 1062679, 1112365, 1142857, 1215267, 1255653, 1287040, 1378333, 1381320, 1444218, 1464820, 1448329, 1396810, 1363815, 1306313, 1277572, 1245598, 1241486, 1238054, 1287045, 1303332, 1381025, 1414583, 1423236, 1450042, 1432483, 1493609, 1553957, 1605057, 1612024, 1591833, 1602941, 1598718, 1550118, 1489148, 1470712, 1441529, 1417299, 1372652, 1362868, 1340006, 1346974, 1396244, 1406166, 1436953, 1380233, 1303202, 1278619, 1236276, 1173583, 1100043, 1018775, 942696, 914761, 809524, 762129, 730305, 710260, 680061, 668785, 630536, 586448, 563915, 527859, 529573, 507847, 477980, 426473, 416079, 400414, 422574, 408504, 325721]
1081C25721K0920L938r97r701p2684r726o8288J4032p135N868K428o3514O0109
1068B00971m0784j6596M228J2512J832m2608J6497m1644l2555l31k1245K643L9854
1055H2774m8372j465M7703k9113n0998R055K7739j61m0246L926p676K4032Q063
1042B5261p401m1448J2784o014L4317j2177k9941J4896j4334m0673K0871j6188
1030f0047j5532n07P0037m6703Q391L8689k883O894J6619o4712N435J2817j2863
1017d4365o430j5868j1585K5609j8566j3768m723j7485K352k1186P6060l9414
1005h9369J0o887R989m664j557l2847L8397J6536j9082j3564o024o692M667M0345
991g0742k5658J2367k7752L3053j5892k3095M0288j6784j9923K7882j7299J3112
$$ y = [325721, 346641, 350579, 349582, 339881, 267197, 257471, 189183, 203215, 196080, 201948, 204376, 140862, 200971, 160187, 143591, 147819, 160331, 162163, 119555, 136052, 94408, 61853, 61522, 40277, 42920, 82774, 34402, 32937, 80640, 51527, 529, 9584, 37323, 37162, -3084, 842, -6834, 17198, 25261, 17860, -23588, -10804, -16818, 17499, 5322, -24619, -9723, -24057, -64730, -43859, -60047, -75579, -76086, -6049, -52752, -44361, -5672, -8555, -1661, 14958, -49754, -44319, -31502, -44365, -50795, -66663, -78248, -52639, -71205, -84973, -89696, -107181, -104829, -126015, -49955, -89369, -89359, -96246, -86257, -90921, -92478, -125325, -86928, -70392, -89474, -103038, -109062, -115754, -111087, -70742, -96400, -84033, -111785, -78732, -94624, -117719, -77431, -94215, -114138, -86256, -103555, -90443]
979i0443j3776K2085Q895n8407P442J0724O1991m4924J8565k2443J7488l5874
967a18677M0126l0255J9106j0999k2553p868J2210J8902k3325k9913k408O9348
955h6306K792J3242k6508m0161Q174N1398k9075m1943L4153l4895k2688J6952
943a54865N897M0694N4986q6493l1724r649M133j5145K9597N8261L239l3167N4507
930g9729j023j0278R901p3806k8168M4209J2370k8812J0204L2705m8581K0516
918a40492N0520o5973K5561P201m7505m595J9081L1379J6604L8047N5832m9888
906f4228l3093n5774j0789j604M0847k2083n453L3710k5140K0601R449o6911J9092
893a61376N4375K4249l901L676p796o0117R054l0001P250J0856L38J5250J4815
$$ y = [-90443, -104219, -82134, -73239, -131646, -124204, -113480, -51489, -96413, -77848, -100291, -82803, -118677, -78551, -108806, -89700, -100699, -123252, -131120, -118910, -100008, -123333, -153246, -155654, -86306, -83514, -70272, -96780, -136941, -128767, -77369, -106444, -148387, -114234, -149129, -171817, -154865, -148968, -108274, -53288, -139781, -171505, -181154, -177021, -192166, -162569, -104308, -101069, -134236, -79729, -80752, -91030, -81129, -154935, -183103, -138894, -126524, -155336, -145132, -112427, -161008, -140492, -89972, -155945, -130384, -123183, -170688, -175283, -156202, -124823, -108219, -70172, -14340, -64228, -97321, -153095, -163884, -165488, -124641, -146724, -152177, -118467, -143607, -123006, -113557, -180468, -161376, -107001, -82752, -86653, -82977, -90773, -150890, -141836, -171837, -164587, -153731, -153393, -138143, -123328]
880a23328L0516k9930j687M7367l0463n904N4541m9624J26n0255J0321k2034N0506
867a19848j8958K8571J5762J7336j6568l5374N693Q07n5589J6613P743K0895P1773
854f1144m3337j8366K5112m7765J4635j5193M306J4486K198l962L0412J278M019
841i3321j2357k5099j1687m1525L3119Q3277k8352K2946j0681m5584M120L97J909
828a22838K2526m686q5312J9191j1019M5863J4840L5226P295r444N490j6890m5208
815a44966J1959j4960r761J3056k377K4713j6482l3815L0600P030K6931K570J1205
802i4297k3549l6530J1718L1615L943J2643l5315j8658Q067P562j1649k3752l777
789a71979M541P611N5841j3187n0399J3062L1454o6085J8788j9686R2004l090
$$ y = [-123328, -92812, -122742, -124429, -77062, -107525, -113429, -58888, -108512, -108386, -158641, -148320, -170354, -119848, -138806, -110235, -94473, -77137, -93705, -129079, -123386, -122579, -178168, -161555, -153812, -132917, -61144, -104481, -122847, -97735, -145500, -130865, -146058, -141752, -127266, -125068, -129030, -98618, -97340, -93321, -105678, -130777, -142464, -183989, -150870, -67593, -95945, -72999, -83680, -129264, -125144, -124747, -122838, -100312, -104998, -190310, -171119, -182138, -136275, -121435, -86209, -78914, -88358, -82868, -99758, -144966, -133007, -147967, -157728, -144672, -147049, -122336, -138818, -172633, -142033, -135003, -108072, -105502, -94297, -117846, -154376, -142658, -111043, -107100, -94457, -129772, -148430, -140363, -132801, -144450, -168202, -171979, -167438, -159827, -103986, -117173, -167572, -154510, -123056, -189141, -170353, -190039, -98035, -101125]
777a01125P315p578P251J3383J8323o1174k9374J2310J8972R150k1522L275j6291
764a47085J9123K2577K7976j8469K8331N990m0909J608K5533j07526p21J0524
752a73048L053J3903O040K4900L2346O686j4273k6812J8552m7103K8127L8619
740h9010K4443L705j5507k0043n4349J421P882K7511M317k1041M9771J1691o8404
727a37613K7205K0118l4905M905k760N8164P981k0124l3174j3724N9917q1076
715a45086N3454K5493o677J5303m5895n1934P182L840j6811L8110p053L8353J1432
702h0289n6257l8296L3220P6303k1350P516J2091j9402j3108J3582R992J1339
690f4659k4166m1752P208j5461P266L64n283M0783o460N11K1163j4831R529J570
$$ y = [-101125, -93810, -101388, -94137, -80754, -62431, -123605, -152979, -140669, -121697, -112547, -134069, -130794, -147085, -127962, -105385, -77409, -95878, -67547, -61557, -102466, -100858, -75325, -182851, -183572, -173048, -169995, -156092, -150052, -125152, -92806, -86120, -100393, -127205, -108653, -155756, -127629, -89010, -64567, -60862, -76369, -96412, -150761, -149340, -141458, -113947, -109630, -130671, -80900, -69209, -137613, -110408, -90290, -125195, -120290, -123050, -64886, -56905, -77029, -110203, -123927, -64010, -145086, -91632, -66139, -72816, -57513, -103408, -155342, -148160, -144320, -161131, -123021, -130074, -91721, -80289, -136546, -174842, -141622, -65319, -86669, -79153, -67062, -86464, -99572, -85990, -75998, -64659, -88825, -130577, -123369, -138830, -131564, -131200, -136483, -95700, -102160, -101649, -80486, -95317, -85788, -84218]
676h4218m693m247M565N0472Q833n843P028q3138K3764L8408k8781q797r102K1824
662g3925J3119p4572L4890j756q698O47L876M2615m1245k2205P5923m2268m8952
649a42551N275O4272n225k7476q888O6363P126n7746M6579M1467n3832L3376O162
636b5098m9055q887K5133k4051J5008J8189J4541N181m070l1678L5599m4907j0785
623h4880O4144o903j8194M897J6901r438l2758Q102N8688j7972p874K6599L7341
610C8653n543M7m922m114M9673j5244k6645L0430J6831l519K1303j1983N8350
597A43317K4867j7046j3458L6821P474O862P615L6461j7019m4786P481L6211L4940
584B49740N9465K6730j7027M16N601P4851J5575Q737K0536K5417M1581K1619j1635
$$ y = [-84218, -88911, -93158, -88593, -38121, -29288, -35131, -28103, -111241, -87477, -49069, -77850, -86647, -95749, -73925, -60806, -135378, -100488, -102244, -110942, -110295, -106419, -63804, -105049, -127254, -51331, -93599, -142551, -137276, -73004, -78229, -105705, -114593, -48230, -41104, -98850, -52271, -10804, -64636, -31260, -25098, -74153, -83040, -57907, -81958, -66950, -48761, -34220, -29039, -33109, -64787, -29188, -74095, -84880, -20736, -27639, -45833, -40936, -24035, -33473, -66231, -58129, 559, -17413, -25287, 1312, 38653, 33110, 33157, 28235, 24121, 73794, 58550, 31905, 62335, 79166, 75647, 96950, 84967, 143317, 168184, 151138, 137680, 174501, 181975, 188837, 196452, 232913, 215894, 171108, 178589, 214800, 249740, 309205, 335935, 318908, 319324, 324925, 399776, 415351, 424088, 444624, 470041, 511622, 533241, 521606]
571E21606Q9807m5280M4375Q2209R5397M6972L1795P8205J41140R0289J43686
560A320201J08056J59655J85299J44138J18340K26044K24456M36055M48798O52448
550D023490Q08240J191545J113027Q60973p58346j710621j085054q28993n80099
541C034162m60485k61236k54544j20904j61700j31721j36410j26411j22792j83796
531A074163j16702l8828j18061n2798q8704m5892N059j8543k9332n8054n9223
520D53085K2828k7748j7162r8776r604l83k8862j4792l3527K4165K4605k5106
508B68723p5574j037j2998q141N053N478l4169k7092l1244Q415q540K3466n282
495A07058L2645o7033j8567O255L1296K9036m2985j6812k2676J4921j3870k0943
$$ y = [521606, 611413, 566133, 610508, 692717, 788114, 835086, 866881, 945086, 1086226, 1176515, 1320201, 1428257, 1587912, 1773211, 1917349, 2035689, 2261733, 2486189, 2922244, 3371042, 4023490, 4831730, 6023275, 7136302, 7997275, 7238929, 5528308, 4443254, 3614261, 3034162, 2573677, 2312441, 2057897, 1936993, 1775293, 1643572, 1507162, 1380751, 1257959, 1074163, 957461, 918633, 800572, 747774, 659070, 613178, 618237, 599694, 570362, 512308, 453085, 475913, 448165, 431003, 332227, 322623, 322240, 293378, 278586, 245059, 269224, 293829, 268723, 193149, 192112, 179114, 170973, 176026, 181504, 147335, 120243, 88999, 97414, 88874, 112340, 107058, 139703, 72670, 54103, 60358, 91654, 120690, 77705, 60893, 38217, 53138, 39268, 18325]
483A8325J1339K3277k2256J8505j4288j3035K0907n745j1302n343K7030K5996
471G3410n0480p594o418M7845l5149l9436k9629P0816l885J7866n6397k7485p359
458e3895N1265l2210O573M556J5423J0054R05l5072k9448J8526J2989O0565j704
445B8527K843L4361p5336l9059m937M0184L559l7462J6919j6874J724K5765L423
432a6363Q075L1914j5291m1785l0345M7091m0944m9940K3026M6063k7041m225
420f9765O4325n0399j2589J6420K9414k3794m7756q433M7385j0243m4252N6041
408e3646M595K3280j3171K9958l6180J3762k8204l577L8967K916j8995j0840k4445
395g5580J3435M7100L0703m3755m7588K0565J1280M4102p1936o225J9474J0520
$$ y = [18325, 29664, 52941, 30685, 49190, 34902, 21867, 42774, 37029, 25727, 20384, 47414, 73410, 22930, 15336, 8918, 56763, 21614, -17822, -47451, 23365, 19480, 37346, -19051, -46536, -53895, -2630, -34840, -28267, -23711, -8288, 1766, 2671, -32401, -61849, -43323, -30334, 30231, 28527, 31370, 65731, -9605, -48664, -53601, -13417, -9858, -47320, -30401, -47275, -45551, -19786, -16363, -8288, 23626, 8335, -33450, -63795, -16704, -57648, -107588, -84562, -38499, -65540, -69765, -5440, -55839, -68428, -52008, -22594, -46388, -94144, -102577, -55192, -65435, -109687, -53646, -49051, -25771, -38942, -8984, -45164, -31402, -59606, -63183, -24216, -21300, -40295, -51135, -75580, -62145, -15045, 15658, -28097, -75685, -55120, -43840, 262, -71674, -77899, -58425, -47905]
383d7905L9508m8853m529K595R351N8006K823O234n0162j1714J7952J1772n2362
370f7284R158J4300q728R7534m0130n0493j3039l382l111N5432k2534L2184j9301
357a9394n4700K8760M7357m420k8091o710K0028l9046K944L8595k887M971K800
344i793L2611j1115k3618J6180k0762m304j9653M5259l5304N070K8287j8243j1626
331b7011P276j6125M978K2567k9020m391N9668K4545o0404K0112j3822P716k4714
318b8625j0695L8118K105J41J8818j6834l7060J2693K2537O054j7063p83K5952
305A5358r54p724J1806K4924p9627J3893J3399j2208k5252M8337m0871r007N595
292d2331P3253J5646l8353n708O5454j6982p5406L696K0214L650m2175j3121J6644
$$ y = [-47905, -8397, -57250, -61779, -59184, -49833, 8173, 10996, 17230, -32932, -44646, -26694, -14922, -67284, -58126, -43826, -52554, 44980, 4850, -45643, -58682, -62064, -65175, -9743, -32277, -93, -19394, -74094, -45334, 2023, -2397, -30488, -37198, -17170, -56216, -53272, -14677, -17564, -12593, -9793, 22818, 11703, -11915, 4265, -16497, -20801, -40454, 4805, -30499, -25429, 2858, -15385, -27011, -19735, -35860, -30882, -8315, -37335, -41726, 17942, 42487, -17917, 2195, -11627, -3911, -28625, -39320, -1202, 903, 1044, 19862, 3028, -34032, -21339, 1198, 7252, -9811, -10594, 15358, 14404, 6680, 18486, 43410, -36217, -22324, -8925, -21133, -46385, 1952, -38919, -47926, -42331, 30922, 46568, 8215, 2507, 67961, 50979, -24427, -20731, -517, 3133, -39042, -52163, -35519]
279c5519N3128l6957k7249L6319M6238J3897J0945l5884o591J1577k0625j2M72
266I739j541L0397J4239r489m0388j234l0500K7805j2486J7230l8397N1822J2110
253B9307q230l6990l0607N1937L8617m5248J8277K9667k0945J9542j500n1151
241g324K2336J2247j6504j8312K65n729K8145L7751n59o778k5555L6509l2733
228B3759q379M856L7239j1025k7026n479R924n275k8201k226N8297k5350j2997
215H117k009l572j8985r30L1185Q392k2909K4399J495N0000p911r273L440J2953
201G4392j9595k1290L3006L2223j7160j3823l3916m2391K8969L0549J3699k7910
189C6753l1480K3555J6197k0360N0848j7387m8912M382M2702k0496j9248M019
$$ y = [-35519, 17609, -19348, -46597, -10278, 35960, 49857, 60802, 24918, 18327, 29904, 9279, 9267, 9739, 8198, 38595, 52834, 43345, 2957, 1723, -28777, -972, -13458, 3772, -34625, 17197, 29307, 21077, -15913, -46520, 5417, 44034, -1214, 17063, 46730, 25785, 45327, 43827, -7324, 15012, 27259, 10755, -7557, -7292, -13021, 15124, 52875, 52316, 45538, 19983, 56492, 23759, 15380, 20236, 57475, 46450, 19424, 13945, 23869, 18594, -9607, -11833, 46464, 21114, 8117, 6108, 2536, -16449, -17379, 13806, 22198, -711, 23688, 25183, 75183, 67272, 57999, 61439, 74392, 54797, 33507, 66513, 98736, 81576, 67753, 33837, -8554, 20415, 50964, 64663, 36753, 5273, 28828, 45025, 24665, 75513, 58126, 9214, 13596, 56298, 35802, 16554, 20573]
177B0573j4767L7257K1819P031P724O24k7087j5912J087k0447K4178L7131n231
164G3980o171Q91n3564L6791J802l3170n586O607K1844k5015k9298M3519J9972
151E2602k3669O016K8287k2733N962J5755j7907M988J4364J6800m6531L5389Q494
138G7817m2316j770L9666J1798k8045j3146l63P559j5320M4683j4355j212J1895
125G6891j0254J6697M608K6043J8587P40n6001k3554K8786N474l2613P999l182
112F0221k0046L8872J4521P165M464j8348n857K8135k0840k6100M423j1889M510
99E9231l6436M3971L1968l7873L3322j770j5950k6823j0989N767l635j7070M0068
86F3781M1327m5091o950K0366J9773l9689M9619J3397k1436q0435J8037J7141
$$ y = [20573, 5806, 43063, 64882, 71913, 79637, 80261, 53174, 37262, 38349, 17902, 42080, 79211, 73980, 67809, 68700, 15136, 51927, 53729, 20559, 14973, 21580, 43424, 18409, -10889, 32630, 52602, 28933, 34949, 63236, 40503, 46465, 62220, 44313, 49301, 63665, 80465, 33934, 69323, 77817, 35501, 33731, 73397, 85195, 57150, 44004, 43641, 51200, 35880, 80563, 66208, 64996, 76891, 66637, 83334, 87942, 113985, 132572, 133312, 77311, 53757, 82543, 88017, 55404, 63403, 60221, 40175, 79047, 93568, 100733, 105197, 86849, 80992, 109127, 88287, 62187, 66610, 54721, 59231, 22795, 66766, 98734, 60861, 94183, 92413, 76463, 49640, 38651, 44418, 40783, 23713, 63781, 105108, 60017, 53067, 73433, 93206, 53517, 103136, 116533, 95097, 14662, 32699, 49840]
74D9840M2897J9342r307m127L064j4167k6613L4527k7507K5437j1959M861k089
61H4199R473o617j2214j2766K4401k031q84n634r772L8991k0806L6723j5575k884
47A04604R363l0363L5649k5911J8087K1571m9620j2281K2891j0519K1240O17n591
34I9737l676J1603n2916N8302N530j5486M994k0856k4089J7570L4480j6418p646
21I1129L5669k379k3301J7902J6869j5084q755J4742j1378j7366j4280J6359J506
8A01633j3426L817J6231k1541P015N039J6139K6301
0A41208
$$ y = [49840, 92737, 112079, 102772, 98645, 101709, 87542, 60929, 95456, 67949, 93386, 81427, 86288, 84199, 93672, 87055, 74841, 62075, 86476, 84445, 83561, 77927, 68155, 107146, 86340, 123063, 107488, 104604, 113967, 83604, 119253, 93342, 111429, 133000, 83380, 71099, 93990, 83471, 104711, 105328, 99737, 96061, 107664, 54748, 113050, 118580, 103094, 108088, 87232, 63143, 80713, 115193, 98775, 91129, 126798, 124419, 101118, 119020, 135889, 120805, 112050, 126792, 115414, 98048, 83768, 100127, 101633, 88207, 92024, 108255, 86714, 93729, 98768, 114907, 141208]
$$ Imaginary data points
##PAGE= N=2
##DATA TABLE= (X++(I..I)), XYDATA
16383b062769N5851j3476M9619M61L6733K9511k288J5733K1668M3058P101K5515
16371a793283J6062K7100K9046M382M2042K2286Q500l737K9420K6498M2456N432
16359a543796K629L6501J2089J1084k045K1970K9930K7797k474L6716j5502O7606
16347a317495J9379J4162n646P0909K4793Q04J8789j6285M0229L9972K6408M9030
16335a034951J7035l3668N1378j2487M1191P705R866L4847k597J3231J9207K9058
16323h60185M1902j9853n6N7552L1259J634J2301J8305J486M0474L4716j8038
16311f58503L8035K2610K0706N7601k6609L5375j9062K5748L5895J3242J434J3049
16299d40479L0185J3480J9641J6765p353N0057J9969l7217O0979O136J0149o46
$$ y = [-2062769, -2006918, -2020394, -1970775, -1970314, -1933581, -1904070, -1906358, -1890625, -1868957, -1825899, -1818798, -1793283, -1777221, -1750121, -1721075, -1716693, -1674651, -1652365, -1643865, -1647602, -1618182, -1591684, -1549228, -1543796, -1541167, -1504666, -1492577, -1481493, -1483538, -1461568, -1431638, -1403841, -1406315, -1369599, -1385101, -1317495, -1298116, -1283954, -1289600, -1218691, -1193898, -1193094, -1174305, -1190590, -1150361, -1110389, -1083981, -1034951, -1017916, -1051584, -1000206, -1012693, -971502, -963797, -953931, -919084, -921681, -908450, -889243, -860185, -818283, -838136, -838192, -780640, -749381, -747747, -735446, -717141, -715655, -675181, -640465, -658503, -620468, -597858, -577152, -519551, -546160, -510785, -529847, -504099, -468204, -454962, -453528, -440479, -410294, -396814, -377173, -360408, -367761, -317704, -297735, -334952, -273973, -267837, -257688, -258334]
16287b58334L9660r782K3335J3931K6979k211L5546K43K4202N2536J6997J235
16275c5663O965j877M4957j6298J0082L8649k1504O0442N976M136m190K3120K4692
16262A39487O696K8173M8381q268O420J6099L2863p957k1280L1386L253J0682
16250B85935K0307r676K343O004K5546J1540K5481q515L7600m290k7903M6005
16238D10377L0658M8358J178K4858m2832J7455L6198j6089j8071N895K7506L4580
16226E60071M0173k1502k5493J2564K8383j410N6615k3708N7627K8027k1730J7675
16214G07292m2812O238J8301K6073K1279K6365m9150K1001L2872J7862R577J5961
16202H10859k1009J0592L4786K1784j4927k1996K3275J4565J2985O51M1618N343
$$ y = [-258334, -218674, -228456, -205121, -191190, -164211, -166422, -130876, -130633, -106431, -53895, -36898, -35663, -28698, -30575, 14382, -1916, 8166, 46815, 25311, 85753, 91729, 95865, 91675, 114795, 139487, 146183, 174356, 222737, 214469, 220889, 236988, 269851, 261894, 240614, 272000, 275253, 285935, 306242, 296566, 298909, 304913, 330459, 341999, 367480, 358965, 396565, 392275, 364372, 410377, 441035, 489393, 490571, 515429, 472597, 490052, 526250, 510161, 492090, 497985, 525491, 560071, 600244, 578742, 553249, 565813, 594196, 592786, 649401, 625693, 683320, 711347, 689617, 707292, 664480, 670718, 689019, 715092, 736371, 762736, 713586, 734587, 767459, 785321, 794898, 810859, 789850, 800442, 835228, 857012, 842085, 820089, 843364, 857929, 870914, 871565, 913183, 918526]
16190I18526J0554m9636J5194J6867J9680m4115J5220m333J6581L5332k6941L7333
16178I60262L2942j2313J765J4261j5296Q896K3082J2544P701k2048j0702M3918
16166A045012Q846l802q446K612N6964k0072O749j0782j7229K5395m5587k8477
16154A011183O6840l439M180K6468j5607L4737N255k591k3800K0364j6874L3534
16142A140250M1570M841n5546k4362L3194K2767J7969q511k3180J790N953j9590
16130A137145J6487j724l970L0385j2805L4089K707k6842k4498n402N7830j745
16118A201657k2039J5879M2154j8027J4180n7490K0577L199J640O5184j5335R598
16106A261177m4080q245K6841N492K1576o436m862K3883j7031P896N027k3288
$$ y = [918526, 929080, 879444, 894638, 911505, 931185, 887070, 902290, 897957, 914538, 949870, 922929, 960262, 993204, 980891, 982656, 996917, 981621, 990517, 1013599, 1026143, 1033844, 1011796, 1001094, 1045012, 1053858, 1050056, 1041610, 1044222, 1101186, 1081114, 1087863, 1077081, 1059852, 1085247, 1039660, 1011183, 1078023, 1074584, 1078764, 1105232, 1089625, 1124362, 1129617, 1127026, 1103226, 1123590, 1106716, 1140250, 1181820, 1186661, 1131115, 1106753, 1139947, 1162714, 1180683, 1172172, 1148992, 1150782, 1156735, 1137145, 1153632, 1151908, 1147938, 1178323, 1165518, 1199607, 1202314, 1175472, 1150974, 1145572, 1203402, 1201657, 1179618, 1195497, 1237651, 1219624, 1233804, 1176314, 1196891, 1200090, 1201730, 1266914, 1251579, 1261177, 1217097, 1208852, 1235693, 1241185, 1262761, 1256325, 1251463, 1275346, 1258315, 1266211, 1271238, 1247950]
16094A247950M9595j8979L1664r181m0143K0552L1556M912j8350J8508j2139J3556
16082A319501k2712n736k1136J4790K2503l7936N542L0761J0295N593l4722J991
16070A288734J6658l4794J2724j4930O4594K1050n8217k0123O766J0098j3581
16059A278979O9388r980m5813R909n2359O4918L2128O693j2810k2859L7189j7740
16047A337643l2158L9110j7350M3550j2783p0526M5027q866m326N885K7975l1617
16035A321564j3356k6202J4167l0787M9328M992L5449k9222k112M6950j0220j0731
16023A349820l2029K2472J8483l2238o05j6103o586J4454O8489M134l7293J8606
16011A371604j9093j6001M8752j9927R409J569j8967m003L0877J3185o0639j6208
$$ y = [1247950, 1297545, 1278566, 1310230, 1301049, 1260906, 1281458, 1313014, 1317926, 1299576, 1318084, 1305945, 1319501, 1296789, 1291053, 1269917, 1284707, 1307210, 1269274, 1274816, 1305577, 1315872, 1321465, 1286743, 1288734, 1305392, 1270598, 1283322, 1268392, 1332986, 1354036, 1295819, 1275696, 1282462, 1292560, 1278979, 1348367, 1338387, 1292574, 1302483, 1250124, 1315042, 1347170, 1353863, 1341053, 1318194, 1355383, 1337643, 1305485, 1344595, 1327245, 1370795, 1358012, 1287486, 1332513, 1323647, 1319321, 1325206, 1353181, 1321564, 1308208, 1282006, 1296173, 1265386, 1314714, 1319706, 1355155, 1325933, 1323821, 1370771, 1360551, 1349820, 1317791, 1340263, 1358746, 1326508, 1325903, 1309800, 1303214, 1317668, 1386157, 1390291, 1352998, 1371604, 1352511, 1336510, 1385262, 1365335, 1374744, 1376313, 1357346, 1353343, 1384220, 1397405, 1336766, 1320558]
15999A320558L1034L303Q562J0798p273R013j4644M025l8104R110K2659r316k0475
15986A329250j2780M5987k978l7250K8611J4380j6733k0289L1333k969o482j5033
15974A335047O565m452K8547j0679k3046J9386j528l5201o749L5145r205K857
15962A336687J7933o794j1176Q8566m9374l4887L1328l2016L2446J013m4821M8852
15950A377757k8776l6851q470O891K7136J0426L7123n3311P0433l80p7016K6115
15938A351077N3268p0411N6397j4362j6351J9692l3539l0743K9683Q188R390k1333
15926A340956J2291L3080k1711J3274k5080K0473k881O56J5603j1938k2938l7085
15914A314700L3328j558J1022q586K1667j4727k019K83L9650Q690n9425J1398
$$ y = [1320558, 1351592, 1354895, 1363457, 1374255, 1366982, 1375995, 1361351, 1365376, 1327272, 1336382, 1359041, 1349725, 1329250, 1316470, 1362457, 1359479, 1322229, 1350840, 1365220, 1348487, 1328198, 1359531, 1356562, 1350080, 1335047, 1341612, 1337160, 1365707, 1355028, 1331982, 1351368, 1349840, 1314639, 1307890, 1343035, 1333830, 1336687, 1354620, 1347826, 1336650, 1425216, 1375842, 1340955, 1372283, 1340267, 1372713, 1373726, 1328905, 1377757, 1348981, 1312130, 1303660, 1310551, 1337687, 1348113, 1385236, 1331925, 1402358, 1401978, 1324962, 1351077, 1404345, 1333934, 1390331, 1375969, 1359618, 1379310, 1345771, 1315028, 1344711, 1352899, 1362289, 1340956, 1353247, 1386327, 1364616, 1377890, 1352810, 1373283, 1370402, 1371058, 1386661, 1374723, 1351785, 1314700, 1348028, 1346470, 1357492, 1348906, 1370573, 1355846, 1353827, 1354110, 1393760, 1402450, 1343025, 1354423]
15902A354423R568N4982n4754m5551P655L6260j6541j3780q247J7135K4436m4113
15890A321473L737N112M0220l0187K4128J4834o2360m957M8333O649l4606J7650
15878A350026L7997O991j9072j3610m909J5982L8172l2525j1779m248l3345N3848
15866A383528k6120l5683n785L3706M5418j1525K4015j3435k4570L0963m0338
15855A360174J3566r831j6759K1060n310L091k7805K2804J8604j85K0058n2634
15843A346833k1330J3573n665M0169N520m5762K5842n590M3609L592J5687q675
15831A407803m8840j5377j2892L4623O4972o5710P726J0978l1800k60k0361j2728
15819A318134K4376K6294j1997L75M2460p4069Q557K1754j7919q30L374q480M4056
$$ y = [1354423, 1363991, 1418973, 1364219, 1318668, 1326323, 1362583, 1346042, 1332262, 1324015, 1341150, 1365586, 1321473, 1325210, 1330322, 1370542, 1340355, 1364483, 1379317, 1316957, 1312000, 1360333, 1366982, 1332376, 1350026, 1388023, 1395014, 1375942, 1362332, 1357423, 1373405, 1411577, 1379052, 1367273, 1363025, 1329680, 1383528, 1357408, 1321725, 1315940, 1349646, 1395064, 1383539, 1407554, 1394119, 1369549, 1400512, 1360174, 1373740, 1363909, 1347150, 1368210, 1362900, 1365991, 1338186, 1360990, 1379594, 1379409, 1399467, 1346833, 1325503, 1339076, 1333411, 1373580, 1379100, 1333338, 1359180, 1353590, 1397199, 1400791, 1416478, 1407803, 1358963, 1343586, 1330694, 1365317, 1430289, 1364579, 1372305, 1383283, 1351483, 1351223, 1330862, 1318134, 1342510, 1368804, 1356807, 1357182, 1399642, 1325573, 1334130, 1355884, 1337965, 1337135, 1340509, 1332029, 1376085]
15806A376085K2790m9037l0175O4662n652k825K6042K5427K5101o9532K0349n2338
15794A350897j6266J284J098r64N342P868K364J4385p94K5526K3121j868J23m7710
15780A364406Q716k6729N0574J0090m0341P578K4006k1081p380L0703j2196k7015
15768A361331l8606L0939M4498l8876K2230j265l0020m9506M1657l6246M8613
$$ y = [1376085, 1398875, 1349838, 1319663, 1384325, 1378673, 1375848, 1401890, 1427317, 1452418, 1382886, 1403235, 1350897, 1334631, 1335915, 1337013, 1336049, 1341391, 1349259, 1351623, 1366008, 1365214, 1390740, 1413861, 1411993, 1412116, 1364406, 1373122, 1346393, 1396967, 1407057, 1366716, 1374294, 1398300, 1377219, 1369839, 1400542, 1388346, 1361331, 1322725, 1353664, 1398162, 1359286, 1381516, 1380251, 1350231, 1300725, 1342382, 1306136, 1354749]
$$ [...]
##END NTUPLES=NMR SPECTRUM
##END=
