##TITLE=1H_CG-1212
 CDCl3
 8 sc, 
 13.9.2024
##JCAMPDX= 6.0         $$ Bruker NMR JCAMP-DX V2.0
##DATA TYPE= NMR SPECTRUM
##DATA CLASS= NTUPLES
##ORIGIN= UXNMR, Bruker Analytische Messtechnik GmbH
##OWNER= root
$$ XWIN-NMR		Version 3.5
$$ Fri Sep 13 14:05:20 2024 Russian Standard Time (UT+4h)  she@DPX200
##.OBSERVE FREQUENCY= 200.1318
##.OBSERVE NUCLEUS= ^1H
##.ACQUISITION MODE= SIMULTANEOUS
##.ACQUISITION SCHEME= undefined
##.AVERAGES= 8
##.DIGITISER RES= 18
##SPECTROMETER/DATA SYSTEM= spect
##.PULSE SEQUENCE= zg30
##.SOLVENT NAME= CDCl3
##.SHIFT REFERENCE= (INTERNAL, CDCl3, 0, 20.9738)
##AUDIT TRAIL= $$ (NUMBER, WHEN, WHO, WHERE, WHAT)
$$ ##TITLE= Audit trail, XWIN-NMR		Version 3.5
$$ ##JCAMPDX= 5.01
$$ ##ORIGIN= Bruker BioSpin GmbH
$$ ##OWNER= she
$$ F:/spectra/data/she/nmr/H-F/1/pdata/1/auditp.txt
$$ ##AUDIT TRAIL=  $$ (NUMBER, WHEN, WHO, WHERE, WHAT)
(   1,<2024-09-13 14:04:09.45 +0400>,<she>,<DPX200>,
      <created by zg, POWCHK disabled, PULCHK disabled
       configuration hash MD5:
       00 E9 B6 7A A2 85 ED C7 34 08 36 98 17 FE 4E 26
       data hash MD5: 16K
       72 A3 AC ED 58 03 6E 5D AA C0 FB 5C 6A AE 15 E5>)
(   2,<2024-09-13 14:04:11.39 +0400>,<she>,<DPX200>,
      <Start of raw data processing
       efp BC_mod = 2 LB = 0.24 FT_mod = 6 PKNL = 1 PHC0 = -26157.7 PHC1 = 11.58748 SI = 16K 
       data hash MD5: 16K
       8E 68 36 CD 84 DB 04 E6 7E 41 12 A3 8A A5 CE 02>)
(   3,<2024-09-13 14:04:31.75 +0400>,<she>,<DPX200>,
      <pk PHC0 = 0.1721841 PHC1 = -0.7999998 
       data hash MD5: 16K
       3F 04 03 DD 6A E8 05 14 AA 45 CC F6 ED 1D C5 22>)
(   4,<2024-09-13 14:04:35.20 +0400>,<she>,<DPX200>,
      <abs ABSG = 5 
       data hash MD5: 16K
       AA DF 0E 9F B9 21 85 A8 17 5C 82 F6 BE 1C D5 2F>)
(   5,<2024-09-13 14:04:39.35 +0400>,<she>,<DPX200>,
      <abs ABSG = 5 
       data hash MD5: 16K
       06 E5 FA 28 24 B6 07 AC 27 B8 54 82 EA 28 0A 36>)
$$ ##END=
$$ 
$$ hash MD5
$$ 30 1A 99 43 88 37 C1 AD DF 44 6F 86 9C EF FE 00
##$RELAX= 
##$RELAX= 
##$RELAX= 
##$RELAX= 
##$RELAX= 
##$RELAX= 
$$ Bruker specific parameters
$$ --------------------------
##$DU= <F:/spectra>
##$EXPNO= 1
##$NAME= <H-F>
##$PROCNO= 1
##$TYPE= <nmr>
##$USER= <she>
##$AMP= (0..31)
100 100 100 100 100 100 100 100 100 100 100 100 100 100 100 100 100 100 
100 100 100 100 100 100 100 100 100 100 100 100 100 100 
##$AQSEQ= 0
##$AQ_mod= 1
##$AUNM= <au_zg>
##$AUTOPOS= <>
##$BF1= 200.13
##$BF2= 200.13
##$BF3= 200.13
##$BF4= 200.13
##$BF5= 200.13
##$BF6= 200.13
##$BF7= 200.13
##$BF8= 200.13
##$BYTORDA= 1
##$CFDGTYP= 0
##$CFRGTYP= 5
##$CHEMSTR= <none>
##$CNST= (0..31)
1 1 145 1 1 1 1 1 1 1 1 1 1 1 1 1 1 1 1 1 1 1 1 1 1 1 1 1 1 1 1 1 
##$CPDPRG= <>
##$CPDPRG1= <>
##$CPDPRG2= <>
##$CPDPRG3= <>
##$CPDPRG4= <mlev>
##$CPDPRG5= <mlev>
##$CPDPRG6= <mlev>
##$CPDPRG7= <mlev>
##$CPDPRG8= <mlev>
##$CPDPRGB= <>
##$CPDPRGT= <>
##$D= (0..31)
0 1.2 0 0 0 0 0 0 0 0.06 0 0.03 0 0 0 0 0.0002 0 0 0 0 0 0 0 0 0 0 0 0 
0 0 0 
##$DATE= 1726221848
##$DBL= (0..7)
$$ [...]
##$SUBNAM3= <"">
##$SUBNAM4= <"">
##$SUBNAM5= <"">
##$SUBNAM6= <"">
##$SUBNAM7= <"">
##$SUBNAM8= <"">
##$SUBNAM9= <"">
##$SW= 24.0689170037331
##$SWIBOX= (0..15)
0 0 2 0 0 0 0 0 0 0 0 0 0 0 0 0 
##$SW_h= 4816.95568400771
##$TD= 16384
##$TD0= 1
##$TE= 0
##$TE2= 300
##$TE3= 300
##$TEG= 300
##$TL= (0..7)
0 120 120 120 120 120 120 120 
##$TP= (0..7)
150 150 150 150 150 150 150 150 
##$TP07= 0
##$TPNAME0= <>
##$TPNAME1= <>
##$TPNAME2= <>
##$TPNAME3= <>
##$TPNAME4= <>
##$TPNAME5= <>
##$TPNAME6= <>
##$TPNAME7= <>
##$TPOAL= (0..7)
0.5 0.5 0.5 0.5 0.5 0.5 0.5 0.5 
##$TPOFFS= (0..7)
0 0 0 0 0 0 0 0 
##$TUNHIN= 0
##$TUNHOUT= 0
##$TUNXOUT= 0
##$USERA1= <user>
##$USERA2= <user>
##$USERA3= <user>
##$USERA4= <user>
##$USERA5= <user>
##$V9= 5
##$VALIST= <valist>
##$VCLIST= <CCCCCCCCCCCCCCC>
##$VD= 0
##$VDLIST= <DDDDDDDDDDDDDDD>
##$VPLIST= <PPPPPPPPPPPPPPP>
##$VTLIST= <TTTTTTTTTTTTTTT>
##$WBST= 1024
##$WBSW= 4
##$XGAIN= (0..3)
0 0 0 0 
##$XL= 0
##$YL= 0
##$YMAX_a= 225116
##$YMIN_a= -219799
##$ZGOPTNS= <>
##$ZL1= 120
##$ZL2= 120
##$ZL3= 120
##$ZL4= 120
##$ABSF1= 21.00614
##$ABSF2= -3.062994
##$ABSG= 5
##$ABSL= 3
##$ALPHA= 0
##$AQORDER= 0
##$ASSFAC= 0
##$ASSFACI= 0
##$ASSFACX= 0
##$ASSWID= 0
##$AUNMP= <proc_1d>
##$AZFE= 0.1
##$AZFW= 0.1
##$BCFW= 0
##$BC_mod= 2
##$BYTORDP= 0
##$COROFFS= 0
##$CY= -3
##$DATMOD= 1
##$DC= 0
##$DFILT= <>
##$DTYPP= 0
##$F1P= 0
##$F2P= 0
##$FCOR= 1
##$FTSIZE= 16384
##$FT_mod= 6
##$GAMMA= 0
##$GB= 0
##$INTBC= 1
##$INTSCL= 3.70164e-10
##$ISEN= 128
##$LB= 0.24
##$LEV0= 0
##$LPBIN= 0
##$MAXI= 10000
##$MC2= 0
##$MEAN= 0
##$ME_mod= 0
##$MI= 1.114404
##$NCOEF= 0
##$NC_proc= -7
##$NLEV= 6
##$NOISF1= 3.799351
##$NOISF2= 2.8
##$NSP= 0
##$NTH_PI= 0
##$NZP= 0
##$OFFSET= 20.97382
##$PC= 1
##$PHC0= -26157.53
##$PHC1= 10.78748
##$PH_mod= 1
##$PKNL= yes
##$PPARMOD= 0
##$PSCAL= 0
##$PSIGN= 0
##$REVERSE= no
##$SF= 200.130010988246
##$SI= 16384
##$SIGF1= 3
##$SIGF2= 2
##$SINO= 5.538805
##$SIOLD= 16384
##$SREGLST= <1H.CDCl3>
##$SSB= 0
##$STSI= 16384
##$STSR= 0
##$SW_p= 4816.95568400771
##$SYMM= 0
##$S_DEV= 0
##$TDeff= 16384
##$TDoff= 0
##$TI= <>
##$TILT= no
##$TM1= 0
##$TM2= 0
##$TOPLEV= 0
##$USERP1= <user>
##$USERP2= <user>
##$USERP3= <user>
##$USERP4= <user>
##$USERP5= <user>
##$WDW= 1
##$XDIM= 16384
##$YMAX_p= 384352565
##$YMIN_p= -357198
$$ End of Bruker specific parameters
$$ ---------------------------------
##NTUPLES= NMR SPECTRUM
##VAR_NAME=  FREQUENCY,     SPECTRUM/REAL,   SPECTRUM/IMAG
##SYMBOL=    X,             R,               I
##VAR_TYPE=  INDEPENDENT,   DEPENDENT,       DEPENDENT
##VAR_FORM=  AFFN,          ASDF,            ASDF
##VAR_DIM=   16384,         16384,           16384
##UNITS=     HZ,            ARBITRARY UNITS, ARBITRARY UNITS
##FACTOR=    0.29402158847633, 1,            1
##FIRST=     4197.49077356394, 0,            0
##LAST=      -619.464910443769, 0,           0
##MIN=       -619.464910443769, -357198,     0
##MAX=       4197.49077356394, 384352565,    0
$$ Real data points
##PAGE= N=1
##DATA TABLE= (X++(R..R)), XYDATA
$$ [...]
5572C8304p5382L9352o8571J7745R682O0765k1412P6449n4400l2324j2690j1317
$$ 38304 -37078 2274 -66297 -48552 -38870 21895 483 76932 22532 -9792 -22482 -33799
5560c3799J3621O5651j05635L8509M2324j8143p9052l0120J06383n060L8219L757
$$ -33799 -20178 45473 -60162 -21653 20671 2528 -76524 -106644 -261 -5321 32898 36655
5548C6655r9077k5589Q0593k1503n4312m3044J92634m4311M2706j82779M5634
$$ 36655 -62422 -88011 -7418 -28921 -83233 -126277 66357 22046 64752 -118027 -72393
5537g2393O9817J08754j08283p1420l22N1065P3140j3290l9554k4314J4344N7342
$$ -72393 -2576 106178 -2105 -73525 -73847 -22782 50358 37068 -2486 -26800 -12456 44886
5525D4886j3066q5503p6165N7604k3116k6381J1431Q3714K7081o0871L2246M4723
$$ 44886 31820 -53683 -129848 -72244 -95360 -121741 -110310 -26596 485 -60386 -28140 16583
5513A6583j19341k3173J57890P2008n1178j25538P2839j10621m3485O7384K5785
$$ 16583 -102758 -125931 31959 103967 52789 -72749 90 -110531 -154016 -86632 -60847
5502f0847K4461l7454N9979p1922m520P0197m9496k3708k0923J27901N2344j09497
$$ -60847 -36386 -73840 -13861 -85783 -90303 -20106 -69602 -93310 -114233 13668 66012 -43485
5490d3485K4596n8141N2248m3399L2908j4207n2199N9217M803j25829J21182k107
$$ -43485 -18889 -77030 -24782 -68181 -35273 -49480 -101679 -42462 -37659 -163488 -42306 -44413
5478d4413J3483M3851m1858R5991N95l8068J6536J0284p6069j33619J35335K6522
$$ -44413 -30930 12921 -28937 67054 67649 29581 46117 56401 -19668 -153287 -17952 8570
5466H570l3114j3433m6299p091J9769j8437J3428P5198r2151p1488J16655M4419
$$ 8570 -24544 -37977 -84276 -91367 -71598 -90035 -76607 -1409 -93560 -165048 -48393 -3974
5454c974m2892L8208l849J3688j7675o0901n0359N4970l7160Q1233N926j5329
$$ -3974 -46866 -8658 -12507 1181 -16494 -77395 -127754 -72784 -109944 -28711 -22785 -38114
5442c8114p5495j9994L3986J7971o4550O5432O3912l3317N9985j0165o9310k762
$$ -38114 -113609 -133603 -99617 -81646 -146196 -80764 -16852 -50169 9816 -349 -69659 -72421
5430g2421q765K278o5949M6867J1153j3376L2547N0063o2521K1466L8535j2998
$$ -72421 -81186 -78908 -144857 -97990 -86837 -100213 -67666 -17603 -80124 -58658 -20123 -33121
5418c3121k8949j1155M9407p2110k3180O1583j20891N3250J01275m6418J49958
$$ -33121 -62070 -73225 -23818 -95928 -119108 -57525 -178416 -125166 -23891 -70309 79649
5407G9649q4953k2629p549l6148J05277j06486M4389n7951j3429l9388l1162J19064
$$ 79649 -5304 -27933 -35482 -71630 33647 -72839 -28450 -86401 -99830 -139218 -170380 -51316
5395e1316q192O907j3467L7887P9549r9766l3190K5787k0440P4469J2605l4322
$$ -51316 -59508 -52601 -66068 -28181 51368 -48398 -81588 -55801 -76241 -1772 10833 -23489
5383b3489L0589q9808K2572j6067R4845k8580q5788Q5259L2584m2506J2327k5383
$$ -23489 7100 -82708 -60136 -76203 18642 -9938 -95726 -10467 22117 -20389 -8062 -33445
5371c3445N967K075P1493j22483k0829j4782P0106K0970R658m044P1100K8742
$$ -33445 -27478 -25403 46090 -76393 -97222 -112004 -41898 -20928 -11270 -15314 55786 84528
5359H4528j02704l0326j0996J20319M6500k6252r2426J0930j6159n9220Q9487
$$ 84528 -18176 -48502 -59498 60821 107321 81069 -11357 -427 -16586 -75806 13681
5348A3681N0846j3341J1227p3343k1663l1079k410k3958k7296j959Q5791J1704
$$ 13681 64527 51186 62413 -10930 -32593 -63672 -66082 -90040 -117336 -119295 -33504 -21800
5336b1800J24166L6212K2279r3872j02973l6669j4647p6226R8315N2832n5895
$$ -21800 102366 138578 160857 66985 -35988 -72657 -87304 -163530 -65215 -12383 -68278
5325f8278N8065n163K2113J7096o5825J2837p385o4267R5843M7895m2106j187
$$ -68278 -10213 -15376 6737 23833 -41992 -29155 -36540 -100807 -4964 42931 825 -362
5313c62K1826r2423k7518P695N0271n8943L592J42357j12312L6924N1489n9789
$$ -362 21464 -70959 -98477 -90782 -40511 -99454 -95862 46495 -65817 -28893 22596 -37193
5301c7193m790M7721o1374n9192L6705N6901k6229L7872l3643R653J1198J2059
$$ -37193 -41983 5738 -55636 -114828 -78123 -21222 -47451 -9579 -43222 -33569 -22371 -10312
5289a0312J40873j44557n5888P187k6961M9417q4677J0636J04692K5734K9416
$$ -10312 130561 -13996 -69884 -62697 -89658 -40241 -124918 -114282 -9590 16144 45560
5278D5560r113l913j4899r114J25300n4047j02091j1667K6928K2674n1267L4943
$$ 45560 36447 32534 17635 8521 133821 79774 -22317 -33984 -7056 15618 -35649 -706
5266g06N1988j3824K0433r4700k0852k2395k3185J02084O6229l1758M3573j00368
$$ -706 51282 37458 57891 -36809 -57661 -80056 -103241 -1157 65072 33314 76887 -23481
5254b3481j9034m3596R2683P8973o2108k9237k4271m6632N6149Q9636r7775K297
$$ -23481 -42515 -86111 6572 85545 23437 -5800 -30071 -76703 -20554 69082 -28693 -26396
5242b6396m9131q633J20464J11715m9588n2407J0040k4348m8218M4539R4401j15260
$$ -26396 -75527 -84160 36304 148019 98431 46024 56064 31716 -16502 28037 122438 7178
5230G178k5901L4062K1638j8897m4897Q2128O662p3985R1735k7439k686J7533
$$ 7178 -18723 15339 36977 18080 -26817 55311 61973 -12012 79723 52284 49598 67131
5218F7131L4598j7681R747L2126p4011L4349K8775Q5507J053p4381J3197K981
$$ 67131 101729 84048 93795 125921 51910 86259 115034 200541 201594 127213 140410 143391
5206A43391L9524j30464P888K7440j19278J4052L6344j1245L0762o805M6960m4973
$$ 143391 182915 52451 60339 87779 -31499 -17447 18897 7652 38414 31609 78569 33596
5194C3596o0940J14644L8912P52q9890P5639j7204m1693Q7127O3272P2816j36012
$$ 33596 -27344 87300 126212 126964 37074 112713 95509 53816 140943 204215 277031 141019
5182A41019p3598Q0670J5505M0626o6807k6244j8601M0629M4122j6323p4227k2003
$$ 141019 67421 148091 163596 204222 137415 111171 92570 133199 177321 160998 86771 64768
5170F4768L5030R1062n1463m184P3586P2616J8963o3781O5216l2958M257l1033
$$ 64768 99798 190860 139397 135213 208799 281415 300378 236597 301813 268855 273112 242079
5158B42079q3393J32862m5751q6829J08754M6719j6759K7981L2500j6427m2711
$$ 242079 158686 291548 245797 158968 267722 314441 297682 325663 358163 341736 299025
5147B99025J12110k7437M707m6602l2290j6768P0405L1376K3877m1124Q760L3422
$$ 299025 411135 383698 388405 341803 309513 292745 363150 394526 418403 377279 386039 419461
5135D19461O0530m2371K0360n1797J68259l4792n4466o0387m0793K4554J00536
$$ 419461 479991 437620 457980 406183 574442 539650 485184 424797 384004 408558 509094
5124E09094Q9498r8060L3206m4060K0940q6346N2939R740L3935J38069Q360O4343
$$ 509094 598592 500532 533738 489678 510618 424272 477211 486951 520886 658955 667315 731658
5112G31658k0376j03009K4625l172l721J01720o0991k3584J8344j8l9255j01954
$$ 731658 711282 608273 632898 629726 626005 727725 666734 643150 661494 661476 622221 520267
5100E20267R7489N511P3167o8378j9721K4051L5671P845K4255n6241j3833j2281
$$ 520267 617756 623267 696434 628056 608335 632386 668057 675902 700157 643916 630083 617802
5088F17802l4918K1113O9076j09489o1948N6119j8179M6634K474m1428M821O3232
$$ 617802 582884 603997 673073 563584 501636 557755 539576 586210 588684 547256 552077 615309
5076F15309j258M5712m6810n1951j29359J26058O4477p3076N9069k873L99k8959
$$ 615309 614051 659763 612953 561002 431643 557701 622178 549102 608171 605298 605697 576738
5064E76738p2988j8085k1897O7173M575l0390Q0438N5229l2745k1528j7942m3097
$$ 576738 503750 485665 463768 530941 535516 505126 585564 640793 608048 586520 568578 525481
5052E25481O4516k6053P218L3913R9488m5048K2627L9540o244m8510K7885p2905
$$ 525481 589997 563944 571162 605075 704563 659515 682142 721682 715438 666928 694813 621908
5040F21908R6282J37316m8345q6220j5539P3808O8465n3017k2283O2130L9566
$$ 621908 718190 855506 807161 720941 705402 779210 847675 794658 772375 834505 874071
5029H74071k5117l8220K5454N6314N0823M2352m8453Q7943R51L816J00720o0118
$$ 874071 848954 810734 836188 892502 943325 985677 937224 1025167 1026118 1029934 1130654 1070536
5017A070536P5658M0522j00635J0162Q7783o6284N8978J29023j1501l0200R2370
$$ 1070536 1146194 1186716 1086081 1096243 1184026 1117742 1176720 1305743 1294242 1264042 1356412
5006A356412N6519n7807m7966J44839K5729J28637L3387j9659M6279L3564n2919
$$ 1356412 1412931 1355124 1307158 1451997 1477726 1606363 1639750 1620091 1666370 1699934 1647015
4995A647015m1193J27551o9867K6898j9785L2641N9606k228P3834r44k74J00924
$$ 1647015 1605822 1733373 1663506 1690404 1670619 1703260 1762866 1760638 1834472 1833528 1833254 1934178
4983A934178J25349J688M1924O4083r2023N0749J49043M0870N4595J30304j4076
$$ 1934178 2059527 2061215 2103139 2167222 2075199 2125948 2274991 2315861 2370456 2500760 2486684
4972B486684J9112J14253J64720j2103R5430O1339N5169K1347J02379J00107J52821
$$ 2486684 2505796 2620049 2784769 2772666 2868096 2929435 2984604 3005951 3108330 3208437 3361258
4961C361258R2410J45315N0289J83246J46735J12450K78089J59039R1413K08962
$$ 3361258 3453668 3598983 3649272 3832518 3979253 4091703 4369792 4528831 4620244 4829206
4951D829206J46417J98694K29036K10571K95290J54229K60557L44195L06558K55202
$$ 4829206 4975623 5174317 5403353 5613924 5909214 6063443 6324000 6668195 6974753 7229955
4941G229955J14832J60467K77613J90779K50088K58838K61775L76643M04818L90809
$$ 7229955 7344787 7505254 7782867 7973646 8223734 8482572 8744347 9120990 9525808 9916617
4931I916617L46973L68927M32359N47236M81986O07911O13358O14775O52749O95916
$$ 9916617 10263590 10632517 11064876 11612112 12094098 12702009 13315367 13930142 14582891 15278807
4921A5278807P55758N77838O87093O15757O59352O68053Q32166P41319R70634
$$ 15278807 16034565 16612403 17299496 17915253 18574605 19242658 20074824 20816143 21786777
4912B1786777R57700J299550J392621J537397J865423K179306K331759K407689
$$ 21786777 22744477 24044027 25436648 26974045 28839468 31018774 33350533 35758222
4904C5758222J964806J448473P07785J24871l13421n53208l21899l578K58902
$$ 35758222 37723028 39171501 39879286 40004157 39690736 39137528 38815629 38812051 39070953
4895C9070953O47756Q90300J192587J511037J688297K091286K579565L245470
$$ 39070953 39718709 40609009 41801596 43312633 45000930 47092216 49671781 52917251
4887E2917251L929165M697469N123781M924442M251845K521202O1323k568977
$$ 52917251 56846416 61543885 66667666 71592108 75843953 78365155 78426478 75857501
4879G5857501m132374m678053m373107l431366k486993j686452q71256m58812
$$ 75857501 71725127 67047074 62673967 59242601 56755608 55069156 54197900 53739088
4871E3739088O8778N30485Q39545J343101K050789K864158L467269L921703L799101
$$ 53739088 53807866 54338351 55177896 56520997 58571786 61435944 64903213 68824916 72624017
4862G2624017K734312Q81680j641277l750230n120064n365686n040063m325949
$$ 72624017 75358329 76240009 74598732 70848502 65728438 60362752 55322689 50996740
4854E0996740l354393k711254j925218j549114j182501j030944q84501q44933
$$ 50996740 47642347 44931093 43005875 41456761 40274260 39243316 38358815 37513882
4846C7513882o06556m26088K8753J41721O7282l15973q24434j410728k026623
$$ 37513882 36907326 36481238 36509991 36651712 36718994 36403021 35578587 34167859 32141236
4837C2141236k187597k083576k015868j519518j285019j077200q50114p38279
$$ 32141236 29953639 27870063 25854195 24334677 23049658 21972458 21122344 20384065
4829B0384065o53131o36158q45548r89845r80761r31336r71823r45431o83613
$$ 20384065 19730934 19094776 18249228 17259383 16278622 15347286 14375463 13430032 12746419
4820A2746419o24885n91167m71757m55274l74970l81455l47590k92591k44512
$$ 12746419 12121534 11530367 11058610 10603336 10228366 9846911 9499321 9206730 8962218
4811H962218j21352j56897m0717j67808j02579o5444j29191k63776j48669j61687
$$ 8962218 8840866 8683969 8643252 8475444 8372865 8307421 8178230 7914454 7765785 7604098
4801G604098k09494j30003j82036p2433n1366k9981j30000o8188l299j580j34318
$$ 7604098 7394604 7264601 7082565 7010132 6958766 6928785 6798785 6730597 6727298 6725718 6591400
4790F591400j8548J5886J09023K3186j635L8668K951k5213J0002J74112q2725
$$ 6591400 6572852 6588738 6697761 6720947 6719312 6757980 6760931 6735718 6745720 6919832 6837107
4779F837107j031O8451J54P4841J26996J65982J01930Q7700N7383J13671O9539
$$ 6837107 6836076 6904527 6904681 6979522 7106518 7272500 7374430 7462130 7519513 7633184 7702723
4768G702723J31290J49785J64038J71315K87926K87338J90236K33583K26431L37995
$$ 7702723 7834013 7983798 8147836 8319151 8607077 8894415 9084651 9318234 9544665 9882660
4758I882660L92403L25799M59896L39280K99056N00447L87881L83598K41780L67107
$$ 9882660 10275063 10600862 11060758 11400038 11699094 12199541 12587422 12971020 13212800 13579907
4748A3579907L82882M74219N98398O53776N96695N87574N04181L31444L11597
$$ 13579907 13962789 14437008 15035406 15689182 16285877 16873451 17377632 17709076 18020673
4739A8020673K91713K41403M30555O29511N14101P47119O95528P33600P26067
$$ 18020673 18312386 18553789 18984344 19613855 20127956 20875075 21570603 22304203 23030270
4730B3030270P81106Q34008J062607J236393J617062J954508K158327K547923
$$ 23030270 23811376 24645384 25707991 26944384 28561446 30515954 32674281 35222204
4722C5222204K663372K491849J980985J281853M47783n50711q95244q18346p30806
$$ 35222204 37885576 40377425 42358410 43640263 44088046 43537335 42642091 41823745 41092939
4713D1092939k48778J33038O49911J177067J782734K267461L057779L821828M503063
$$ 41092939 40844161 40977199 41627110 42804177 44586911 46854372 49912151 53733979 58237042
4704E8237042M855466M684767L950857K903016J284537n82486j954613l184728
$$ 58237042 63092508 67777275 71728132 74631148 75915685 75333199 73378586 70193858
4696G0193858l652573l728033l406658k720302j995771j146232k51346N27251
$$ 70193858 66541285 62813252 59406594 56686292 54690521 53544289 53292943 53820194
4688E3820194J324807K313049L212465M383867N460940N387162L570497P23908
$$ 53820194 55145001 57458050 60670515 65054382 70515322 75902484 79472981 80196889
4680H0196889j775926l810715m931938n207887m895159m701174m155606l515709
$$ 80196889 78420963 74610248 69678310 64470423 59575264 54874090 50718484 47202775
4672D7202775l042104k434543j738132j138688q08324l01125K83349O63653J331791
$$ 47202775 44160671 41726128 39987996 38849308 38040984 37739859 38023208 38686861 40018652
4663D0018652J527566J382988O92091m11223j524804k504705k944370l004507
$$ 40018652 41546218 42929206 43621297 43210074 41685270 39180565 36236195 33231688
4655C3231688k846481k217320j821462j494220j142591r45595o01671n89434k32061
$$ 33231688 30385207 28167887 26346425 24852205 23709614 22764019 22162348 21572914 21340853
4646B1340853j66196J06784J81741N7007j69101k78384k84697l55792m30649l98478
$$ 21340853 21174657 21281441 21463182 21520189 21351088 21072704 20788007 20432215 20001566 19603088
4636A9603088m46749l54489l08204k79507j73122m6359m0045l6958j45617k174
$$ 19603088 19156339 18801850 18493646 18214139 18041017 17994658 17954613 17917655 17772038 17769864
4626A7769864l77838l67085k75226k88304k21858j52770j53418k51875k31389
$$ 17769864 17392026 17024941 16749715 16461411 16239553 16086783 15933365 15681490 15450101
4617A5450101k4724K09352K07898K30609J26864N7702j55414l28774n33226o37368
$$ 15450101 15425377 15634729 15842627 16073236 16200100 16257802 16102388 15773614 15240388 14603020
4607A4603020n87729m53552l38782k76157k05894j16185O5522j8449J64109J39171
$$ 14603020 14015291 13561739 13222957 12946800 12740906 12624721 12690243 12671794 12835903 12975074
4597A2975074K70140M04343L65443M74947M42041O15525O11198L78502L85652
$$ 12975074 13245214 13649557 14015000 14489947 14931988 15547513 16158711 16537213 16922865
4588A6922865K74478K36539K94951K09283L03651K98083J61795J79020K63670
$$ 16922865 17197343 17433882 17728833 17938116 18241767 18539850 18701645 18880665 19144335
4579A9144335L33834N95583O75647O38127P03458R36877J124870J242806J150023
$$ 19144335 19478169 20073752 20749399 21387526 22090984 23027861 24152731 25395537 26545560
4570B6545560J246475J292393J497450J447812J481747J525964J578923J788588
$$ 26545560 27792035 29084428 30581878 32029690 33511437 35037401 36616324 38404912
4562C8404912K160925K492136K426682J840727N35757o78814j361355j513201
$$ 38404912 40565837 43057973 45484655 47325382 47861139 47182325 45820970 44307769
4554D4307769j173436o04844j40537M38324N61888P44303J013266J597112K382006
$$ 44307769 43134333 42529489 42388952 42827276 43389164 44133467 45146733 46743845 49125851
4545D9125851L076492L658699L670119K778217J162289l92163k024894l279463
$$ 49125851 52202343 55861042 59531161 62309378 63471667 63079504 61054610 57775147
4537E7775147l795551l831377l243173k702693k033263j290961r71319n58691
$$ 57775147 53979596 50148219 46905046 44202353 42169090 40878129 39906810 39348119
4529C9348119m05141q4781J73771O16286R21430P66091J26053j173432k441547
$$ 39348119 38942978 38858197 39031968 39648254 40569684 41335775 41461828 40288396 37846849
4520C7846849l067437l195129l090704k761711k295395j940968j666300j429697
$$ 37846849 34779412 31584283 28493579 25731868 23436473 21495505 19829205 18399508
4512A8399508j254788j193649q83334p56741p73092o48521p51435q10042n84586
$$ 18399508 17144720 15951071 15067737 14310996 13537904 12889383 12137948 11327906 10743320
4503A0743320n55387m88247l85302m36666l75582l51716k19336k19088l36681
$$ 10743320 10187933 9699686 9314384 8877718 8502136 8150420 7931084 7711996 7375315
4494G375315j88600j76660j91411k30609j63775j86634j39419j15685j79263j50409
$$ 7375315 7186715 7010055 6818644 6588035 6424260 6237626 6098207 5982522 5803259 5652850
4484E652850j08230j10782k35370o6564N5589j80605j16921l2647J1706j8685
$$ 5652850 5544620 5433838 5198468 5131904 5187493 5006888 4889967 4857320 4869026 4850341
4474D850341j07462j18847r6999Q050L251k032O369p3668M5219l7221k8487m6253
$$ 4850341 4742879 4624032 4527033 4535083 4538334 4536302 4542671 4469003 4514222 4477001 4448514 4402261
4462D402261R3933k8900k0723Q6166k2669M731M761m9942R500N8054J28587J7577
$$ 4402261 4496194 4467294 4446571 4532737 4510068 4514799 4519560 4469618 4479118 4537172 4665759 4683336
4450D683336M1881R1950Q2220J37540J00857J31932R5628J31765K76332L10817
$$ 4683336 4725217 4817167 4899387 5036927 5137784 5269716 5365344 5497109 5773441 6084258
4440F084258J68545K90517J94084K15872R3287K9068r9179j68161j24864j40383
$$ 6084258 6252803 6543320 6737404 6953276 7046563 7075631 6976452 6808291 6683427 6543044
4430F543044j19423m6259m379o347k6331L1503J9159P9294K00819J73859J91546
$$ 6543044 6423621 6377362 6372983 6366636 6340305 6371808 6390967 6470261 6671080 6844939 7036485
4419G036485K22509L53213L65026M24040L33418L38795L83952P5010j38235k94871
$$ 7036485 7258994 7612207 7977233 8401273 8734691 9073486 9457438 9532448 9394213 9099342
4409I099342m41770m67765l73933n27360l15900k88969k78516r9662k26395k36156
$$ 9099342 8657572 8189807 7815874 7288514 6972614 6683645 6405129 6305467 6079072 5842916
4399E842916q4933o7080q7103m581n2029K5484J93295J15109J03097l929J13767
$$ 5842916 5757983 5690903 5603800 5599219 5547190 5572674 5765969 5881078 5984175 5980246 6094013
4388F094013q7696m7159j37258k43719l22565l46792l33445k42891k47403k64656
$$ 6094013 6006317 5959158 5821900 5578181 5255616 4908824 4575379 4332488 4085085 3820429
4378C820429j69555q9745j68339j73211q0360K8375q3720j12359j2302J6623P6578
$$ 3820429 3650874 3561129 3392790 3219579 3139219 3167594 3083874 2971515 2959213 2975836 3052414
4367C052414q6833J07244O584J58278M6275J67447K63425O1031R8020o5684q7787
$$ 3052414 2965581 3072825 3079409 3237687 3283962 3451409 3714834 3775865 3873885 3808201 3720414
4356C720414k35908k05157j51019j10058n2478L1476L2678m2394j1010J03396
$$ 3720414 3484506 3279349 3128330 3018272 2965794 2997270 3029948 2987554 2976544 3079940
4346C079940p45N2783J48318J55327K68276K43108L37193M37791N76063P17953
$$ 3079940 3079195 3131978 3280296 3435623 3703899 3947007 4284200 4721991 5298054 6016007
4336F016007N71593L34371j40921n07054o01261n86579n16430m68034j56221k29392
$$ 6016007 6587600 6921971 6781050 6273996 5672735 5086156 4569726 4101692 3945471 3716079
4326C716079j87511p5005P023o7015j67965J13329Q614J65424K90547L09714L06079
$$ 3716079 3528568 3453563 3460586 3393571 3225606 3338935 3347549 3512973 3803520 4113234 4419313
4315D419313L66671N18827O16774P15529K07872j78775m10041n52381o90004n28995
$$ 4419313 4785984 5304811 5921585 6637114 6844986 6666211 6256170 5703789 5013785 4484790
4305D484790m34901l95191k16237k13432j18871j72435k10181j5397m5610o0953
$$ 4484790 4049889 3654698 3438461 3225029 3106158 2933723 2723542 2708145 2662535 2601582
4295B601582k1737j12405Q4779O6983O6701J86067J92397J80189J39008J8325
$$ 2601582 2579845 2467440 2552219 2619202 2685903 2871970 3064367 3244556 3383564 3401889
4285C401889j41217j94298k03148j38677j61533j16034k0178j06705q3751q3189
$$ 3401889 3260672 3066374 2863226 2724549 2563016 2446982 2426804 2320099 2236348 2153159
4275B153159j47278j03214o3882l113j06579j14736k4655r338j32367k5963L696
$$ 2153159 2005881 1902667 1838785 1835672 1729093 1614357 1589702 1580364 1447997 1422034 1425730
4264A425730J9866J03115N5773j59573J50462R5438L2884O1280Q4414Q8391J48889
$$ 1425730 1445596 1548711 1604484 1444911 1595373 1690811 1723695 1784975 1869389 1957780 2106669
4253B106669K3899j20272j23769n9655O6677j09237o0935m6086l0199q4571p7793
$$ 2106669 2130568 2010296 1886527 1826872 1893549 1784312 1723377 1677291 1647092 1562521 1484728
4242A484728o5425N5719k9122J213J12838o4849o5538l5466N5535J20169J14285
$$ 1484728 1419303 1475022 1445900 1447113 1559951 1495102 1429564 1394098 1449633 1569802 1684087
4231A684087K7716l9642N7273J18014n795L4853j41798p8478K8266N5772j42757
$$ 1684087 1711803 1672161 1729434 1847448 1841653 1876506 1734708 1656230 1684496 1740268 1597511
4220A597511j74576L849k9391r3090j37506o884J6920O6860l6651j34017O1655
$$ 1597511 1422935 1426784 1397393 1304303 1166797 1159913 1176833 1243693 1207042 1073025 1134680
4209A134680P3449l1900L4436j7822J9303j2819K2772N043j9592p8853N2800k1296
$$ 1134680 1208129 1176229 1210665 1192843 1212146 1199327 1222099 1227142 1207550 1128697 1181497 1160201
4197A160201j4198J1856J4483O932j4743P3376j25695L2523K3795k9454K6815
$$ 1160201 1146003 1157859 1172342 1179274 1164531 1237907 1112212 1144735 1168530 1139076 1165891
4186A165891o6323j0018p5218N5974M7602Q5169L3257j54048J467K03336R6585
$$ 1165891 1099568 1089550 1014332 1070306 1117908 1203077 1236334 1082286 1083753 1287089 1383674
4175A383674r2779L0488o1903j898L3576k8520j23214o3339J5224l9321O6790
$$ 1383674 1290895 1321383 1259480 1257582 1291158 1262638 1139424 1076085 1091309 1051988 1118778
4164A118778j1602n2330K1883N9910o365j26170Q3030J18109M583K4067o4328
$$ 1118778 1107176 1054846 1076729 1136639 1130274 1004104 1087134 1205243 1209826 1233893 1169565
4153A169565p137n5784R3410O3773l5359l305q2910J27337N8388P0587Q1752J6058
$$ 1169565 1162428 1106644 1200054 1263827 1228468 1225163 1142253 1269590 1327978 1398565 1480317 1496375
4141A496375J03529J45269M9485l8787O4933P8903J14122N5232J48472J75928
$$ 1496375 1599904 1745173 1794658 1755871 1820804 1899707 2013829 2069061 2217533 2393461
4131B393461O0116P4772L0559j69877j39247j428j13524J880o101L2591R3469
$$ 2393461 2453577 2528349 2558908 2389031 2249784 2248356 2134832 2136712 2130611 2163202 2256671
4120B256671r2735R6180N1099J0667j5134j56585l3318J5372l6002o3678J22106
$$ 2256671 2163936 2260116 2311215 2321882 2306748 2150163 2116845 2132217 2096215 2032537 2154643
4109B154643N9013N3618j0850K1338Q1209M152N8486k4637J42410j11076P6141
$$ 2154643 2213656 2267274 2256424 2277762 2358971 2363123 2421609 2396972 2539382 2428306 2504447
4098B504447J32258R0270J09538K3933j4451K3346J14784R0345p1508J99673J87989
$$ 2504447 2636705 2726975 2836513 2860446 2845995 2869341 2984125 3074470 3002962 3202635 3390624
4087C390624K2699J69774J17990K23755J64261J31944K73770L01955L26922M19691
$$ 3390624 3413323 3583097 3701087 3924842 4089103 4221047 4494817 4796772 5123694 5543385
4077E543385L77817M64147O29481Q74513R43789J323668J732626K022925J621629
$$ 5543385 5921202 6385349 7014830 7889343 8833132 10156800 11889426 13912351 15533980
4068A5533980k06702j192591j685615j638609j382693j166888q53267o14978n16857
$$ 15533980 15327278 14134687 12449072 10810463 9427770 8260882 7407615 6792637 6275780
4059F275780m40696k61944l23913k31444p3161k07227o7972q5196N1067L1190
$$ 6275780 5835084 5573140 5249227 5017783 4944622 4737395 4669423 4584227 4635294 4666484
4049D666484R6519Q0318P1178N8753K6449N8399M3737K43854J88872J31103J08047
$$ 4666484 4763003 4843321 4914499 4973252 4999701 5058100 5101837 5345691 5534563 5665666 5773713
4038E773713K21461L47060J78155J30674K36233L34340K95584K13295K90539L41230
$$ 5773713 5995174 6342234 6520389 6651063 6887296 7221636 7517220 7730515 8021054 8362284
4028H362284L84637M37287M89171N51989N90311P39647Q05231Q09531J075992
$$ 8362284 8746921 9184208 9673379 10225368 10815679 11555326 12360557 13170088 14246080
4019A4246080J392860J875199K363047K370795P22984l17378j153754j345779
$$ 14246080 15638940 17514139 19877186 22247981 22970965 22653587 21499833 20154054
4011B0154054j211126p25318n09196l60551p020k5215J61215L02075K63757M83150
$$ 20154054 18942928 18217610 17708414 17347863 17340843 17315628 17476843 17778918 18042675 18525825
4001A8525825O38074P62111P87795J016218J361423J409453J649171J951025J926250
$$ 18525825 19163899 19926010 20713805 21730023 23091446 24500899 26150070 28101095 30027345
3992C0027345K156187K241054K423769K601486K727424K388902J419533J46047
$$ 30027345 32183532 34424586 36848355 39449841 42177265 44566167 45985700 46131747
3984D6131747r97216j490845j487417j180057p61033k28843J28622O22031J053815
$$ 46131747 45134531 43643686 42156269 40976212 40215179 39986336 40114958 40736989 41790804
3975D1790804J420420K131634K686440L159218L458431L409238K561768J246637
$$ 41790804 43211224 45342858 48029298 51188516 54646947 58056185 60617953 61864590
3967F1864590m13753k186324l510167m174420m147239l574713k993280k233712
$$ 61864590 61450837 59264513 55754346 51579926 47432687 43857974 40864694 38630982
3959C8630982j581435j353245q98067o23900j03474L61485P07443R29695N90366
$$ 38630982 37049547 35696302 34798235 34174335 34070861 34432346 35139789 36069484 36659850
3950C6659850j60254j006528k180716k659032k645698k531556k197153j833314
$$ 36659850 36499596 35493068 33312352 30653320 28007622 25476066 23278913 21445599
3942B1445599j535872j468513j374713j268937j100068r05241q59957q47984o30612
$$ 21445599 19909727 18441214 17066501 15797564 14697496 13792255 12932298 12084314 11453702
3933A1453702n76730o10839m82597m43870k92949l97209l08130l56087l23588
$$ 11453702 10876972 10266133 9783536 9339666 9046717 8649508 8341378 7985291 7661703
3924G661703k08487k00784j07962k49179n5611o5452o9014j75145k5295Q4675
$$ 7661703 7453216 7252432 7144470 6895291 6839680 6774228 6705214 6530069 6504774 6589449
3914F589449q6039j2788Q9144J30341J27492K59677K34404K16635K65572N29462
$$ 6589449 6503410 6490622 6579766 6710107 6837599 7097276 7331680 7548315 7813887 8343349
3904H343349M81911L49501K54074O031k68472k14331j73216l1706p2570J04733
$$ 8343349 8825260 9174761 9428835 9434866 9166394 8952063 8778847 8747141 8674571 8779304
3894H779304N8177J38101P8268J04908j0344K99602K24949J04385K12394j64093
$$ 8779304 8837481 8975582 9053850 9158758 9148414 9448016 9672965 9777350 9989744 9825651
3884I825651k48046l70528k75729l31542k29275k53956l55268k15545k29056j80149
$$ 9825651 9577605 9207077 8931348 8599806 8370531 8116575 7761307 7545762 7316706 7136557
3874G136557k7693Q4273J04954J588j14064k61614m39688m54380n29792n19686
$$ 7136557 7108864 7193137 7298091 7299679 7185615 6924001 6484313 6029933 5500141 4980455
3864D980455n35126k24542l57503k67633k30317k34425j13081j79005j10116j54784
$$ 4980455 4445329 4220787 3863284 3595651 3365334 3130909 3017828 2838823 2728707 2573923
3854B573923j35233r4749j7287j08346p6463j44171m0191n082j01516k7452K8554
$$ 2573923 2438690 2343941 2326654 2218308 2141845 1997674 1957483 1952401 1850885 1823433 1851987
3843A851987n7767q5244L7781j0394K5165r1768m1085Q7155j81838m997o5574
$$ 1851987 1794220 1708976 1746757 1736363 1761528 1669760 1628675 1715830 1533992 1528995 1463421
3832A463421M1390l2921J8135m0180l3666J0090p9667n5910L3837M6639q3758
$$ 1463421 1504811 1471890 1490025 1449845 1416179 1426269 1346602 1290692 1324529 1371168 1287410
3821A287410L992j967J7762l6431o233j6681r8899l3671J00654m0128q9681m58
$$ 1287410 1291402 1289435 1307197 1270766 1264533 1247852 1148953 1115282 1215936 1175808 1086127 1085669
3809A085669R034o894J3146K7431k7695N4995r5262L764o3082j8922Q9856m9392
$$ 1085669 1094703 1087809 1100955 1128386 1100691 1155686 1060424 1064188 1001106 982184 1072040 1022648
3797A022648L842L4025k4092n2639J00625j6342L0413N5267m8407m8229M6377
$$ 1022648 1026490 1060515 1036423 983784 1084409 1068067 1098480 1153747 1105340 1057111 1103488
3786A103488k090o6057J6984l7842J22288J7036o557m1425k0027k2821q8514O7826
$$ 1103488 1101398 1035341 1052325 1014483 1136771 1153807 1147250 1105825 1085798 1062977 974463 1042289
3774A042289N6997p995J6121L8223k3168k3825K8562j5284j9650J19402M5035
$$ 1042289 1099286 1091291 1107412 1145635 1122467 1098642 1127204 1111920 1092270 1211672 1256707
3763A256707r0480j3058N3345L3679J5856L8318r6182L0091n6886r7839O4786
$$ 1256707 1166227 1153169 1206514 1240193 1256049 1294367 1198185 1228276 1171390 1073551 1138337
3752A138337k1810n1927k1613p8528K201J44452k1568K5858k4604m543L0526J1086
$$ 1138337 1116527 1064600 1042987 964459 966660 1111112 1089544 1115402 1090798 1086255 1116781 1127867
3740A127867k9988n6034j0634M3178O8581m2436o7045m3484O5336r8871n6110
$$ 1127867 1097879 1041845 1031211 1074389 1142970 1100534 1033489 990005 1055341 956470 900360
3729I00360N0600K9480n6768j4192o677R1253P5593K0119o8530r1729K8072N2723
$$ 900360 950960 980440 923672 909480 902803 994056 1069649 1089768 1021238 929509 957581 1010304
3717A010304n6261l6075l504m5524j7829J13353q3257R0164q9399o9718J38718
$$ 1010304 954043 917968 914464 868940 851111 964464 881207 971371 881972 812254 950972
3706I50972l850K5127j5912J2987j07j9024j7747m844o235J03968n6389M4478
$$ 950972 947122 972249 956337 969324 969217 950193 932446 927602 921367 1025335 968946 1013424
3694A013424N9216k7917N6799J5535l9223o3361J15834l7512j06697m8265J14405
$$ 1013424 1072640 1044723 1101522 1117057 1077834 1014473 1130307 1092795 986098 937833 1052238
3683A052238J9376n3395J15878o57k9127K8994P8556k4265o7815M5550k672O4608
$$ 1052238 1071614 1018219 1134097 1133440 1104313 1133307 1211863 1187598 1119783 1165333 1162661 1227269
3671A227269l2414p2278J03861o948M8273r0163O0872k1848P4415l868j7167L2215
$$ 1227269 1194855 1122577 1226438 1219490 1267763 1177600 1238472 1216624 1291039 1287171 1270004 1302219
3659A302219p23l6149J1311J66271q9845O0681J06631l8410M2034Q520j69m6503
$$ 1302219 1301496 1265347 1276658 1442929 1353084 1413765 1520396 1481986 1524020 1532540 1532371 1485868
3647A485868J9475p208Q7188k1711L1508O7449J08125j15928M2924l3126l0140
$$ 1485868 1505343 1498135 1585323 1563612 1595120 1662569 1770694 1654766 1697690 1664564 1634424
3636A634424o000M8546J21106p214N067N220k1839N6519J6252J2888N21N7471
$$ 1634424 1628424 1676970 1798076 1790862 1795929 1801149 1779310 1835829 1852081 1864969 1865490 1922961
3624A922961J54918j6708p2371J01278P8378J13610P1307M6857l132J02728N8060
$$ 1922961 2077879 2061171 1988800 2090078 2168456 2282066 2353373 2400230 2397098 2499826 2557886
3613B557886o6679R7725J01018J75271P7327l3214P3990J28916J06720J56339
$$ 2557886 2491207 2588932 2689950 2865221 2942548 2909334 2983324 3112240 3218960 3375299
3603C375299M3109R3769Q0365K17195J46233O7108Q0167P9349J32335K17109K33112
$$ 3375299 3418408 3512177 3592542 3809737 3955970 4023078 4103245 4182594 4314929 4532038 4765150
3592D765150J51448J26118J34855K21179J42605K95682K96192K33566L13044K50006
$$ 4765150 4916598 5042716 5177571 5398750 5541355 5837037 6133229 6366795 6679839 6929845
3582F929845K70760K19839M76002K98512L69080L48291N35147M09242L52296M78055
$$ 6929845 7200605 7420444 7896446 8194958 8564038 8912329 9447476 9856718 10209014 10687069
3572A0687069M70564M27794N32093O93880O65244O07158N99696P45940O86865
$$ 10687069 11157633 11585427 12117520 12811400 13476644 14083802 14683498 15429438 16116303
3563A6116303O57582O42994O62173O20292P80078R69794R19837J118805J085379
$$ 16116303 16773885 17416879 18079052 18699344 19479422 20449216 21369053 22487858 23573237
3554B3573237R74855O90326O26287L79104L29586K75709L51269N88301P27314
$$ 23573237 24548092 25238418 25864705 26243809 26573395 26849104 27200373 27788674 28515988
3545B8515988P69611P43554O26112J69844r2152m75122p59220o77088l81045k97956
$$ 28515988 29285599 30029153 30655265 30825109 30732957 30257835 29498615 28821527 28440482 28142526
3535B8142526j93468j9043j48239l94961n29428r42122j078407j171950j049094
$$ 28142526 27949058 27930015 27781776 27386815 26857387 25915265 24836858 23664908 22615814
3526B2615814j027231q58679o96720o18632o41947o85636q70235r00628q17821
$$ 22615814 21588583 20729904 20033184 19414552 18772605 18086969 17216734 16316106 15498285
3517A5498285q15965q30847p13326o43620o03431m85909n76947n23542m06037
$$ 15498285 14682320 13851473 13138147 12494527 11891096 11405187 10828240 10304698 9898661
3508I898661m51803m11871k58877m71975l85163k79021k73480l43408n6565j93567
$$ 9898661 9446858 9034987 8776110 8304135 7918972 7639951 7366471 7023063 6966498 6772931
3498F772931j79649j94282r4281j76779p0931j26014j15112M1954n8135j44920
$$ 6772931 6593282 6399000 6304719 6127940 6057009 5930995 5815883 5857837 5799702 5654782
3488E654782j17372O7159j00191K7457m7671o5889o7784L04N742K5107m3804P3742
$$ 5654782 5537410 5604569 5504378 5531835 5484164 5418275 5350491 5350795 5356537 5381644 5337840 5411582
3476E411582N4847R0625L1407M8157q2082Q1793n801n8192J44298J1256J10205
$$ 5411582 5466429 5557054 5588461 5636618 5554536 5636329 5630528 5572336 5716634 5727890 5838095
3465E838095J41550q892J12702K0186J18183M2002J03514K2889K2144K01488L2566
$$ 5838095 5979645 5970753 6083455 6103641 6221824 6263826 6367340 6390229 6412373 6613861 6646427
3454F646427K53114M7587M057J46593J52694K29150P0122N2531J87208J40133
$$ 6646427 6899541 6947128 6951185 7097778 7250472 7479622 7549744 7602275 7789483 7929616
3444G929616J85249Q7325K13880J45996K17571J09046Q4796J18541K84140J38656
$$ 7929616 8114865 8202190 8416070 8562066 8779637 8888683 8973479 9092020 9376160 9514816
3434I514816J45295K97323K66735J71639K33133K30735J94602J82137K03412L27482
$$ 9514816 9660111 9957434 10224169 10395808 10628941 10859676 11054278 11236415 11439827 11767309
3424A1767309J53289K00483K65510K79101K60327K56476K31750K70801L39760
$$ 11767309 11920598 12121081 12386591 12665692 12926019 13182495 13414245 13685046 14024806
3415A4024806K47380L01537K36662K11588K98854L29821K61992J97882K48915
$$ 14024806 14272186 14573723 14810385 15021973 15320827 15650648 15912640 16110522 16359437
3406A6359437L13137K64655K53620K12362J30875K22344J81828J24890J61321
$$ 16359437 16672574 16937229 17190849 17403211 17534086 17756430 17938258 18063148 18224469
3397A8224469J39602M5522J66325J0345n0411m1817k3445M5742r1050r7808J31673
$$ 18224469 18364071 18409593 18575918 18586263 18535852 18494035 18470590 18516332 18425282 18327474 18459147
3386A8459147k65026j79218k07755j30848k23035j73635k32771k70868j78261
$$ 18459147 18194121 18014903 17807148 17676300 17453265 17279630 17046859 16775991 16597730
3377A6597730l06988k13821k75588k45570l56021k17999j87562l05358j97979
$$ 16597730 16290742 16076921 15801333 15555763 15199742 14981743 14794181 14488823 14290844
3368A4290844k73404q9784k97307l10570j48864j90364k65715k05716j71059k72873
$$ 14290844 14017440 13927656 13630349 13319779 13170915 12980551 12714836 12509120 12338061 12065188
3358A2065188k11333k47335k18666k95684k18030k42368j74530l3339k13963k22319
$$ 12065188 11853855 11606520 11387854 11092170 10874140 10631772 10457242 10423903 10209940 9987621
3348I987621l24751j86333j64670l06958j25402j17954k15372k54610k27244j75439
$$ 9987621 9662870 9476537 9311867 9004909 8879507 8761553 8546181 8291571 8064327 7888888
3338G888888j89332j21385m3078j39753p6819k09850j17426j04130j41381j49859
$$ 7888888 7699556 7578171 7535093 7395340 7318521 7108671 6991245 6887115 6745734 6595875
3328F595875p5880j24079m4426m8398j17560p0156o0828j28221n5712r5836j06050
$$ 6595875 6519995 6395916 6351490 6303092 6185532 6115376 6054548 5926327 5870615 5774779 5668729
3317E668729n0906J2511L632l1654j16556r1958j07766J6095J7381m7126j14794
$$ 5668729 5617823 5630334 5633966 5602312 5485756 5393798 5286032 5302127 5319508 5272382 5157588
3306E157588K6208n1665n8833j8218l2349m8721K5413r915r5189l7692q9769K7224
$$ 5157588 5183796 5132131 5073298 5055080 5022731 4974010 4999423 4989508 4894319 4856627 4766858 4794082
3294D794082k4720n4178K1137r3695o9542N0476j473j288j428j27318l1246K8992
$$ 4794082 4769362 4715184 4736321 4642626 4573084 4623560 4622087 4620799 4619371 4492053 4460807 4489799
3282D489799j15146J7389L6572n3309m7112O0724k2623L209j33430M3761Q1525
$$ 4489799 4374653 4392042 4428614 4375305 4328193 4388917 4366294 4369503 4236073 4279834 4361359
3271D361359q4038L4654L2976j5310L7353k801l5573q0439p3471L6742k6768n440
$$ 4361359 4277321 4311975 4344951 4329641 4366994 4364193 4328620 4248181 4174710 4211452 4184684 4179244
3259D179244N7956K9518l795k8879Q3770J09546k8319K0593J5727K6221J14100
$$ 4179244 4237200 4266718 4262923 4234044 4317814 4427360 4399041 4419634 4435361 4461582 4575682
3248D575682j4352J1305P8055K9388N5788p9345L9258J66708K5266K3891O349
$$ 4575682 4561330 4572635 4650690 4680078 4735866 4656521 4695779 4862487 4887753 4911644 4917993
3237D917993k4501K5940J01042R8483Q2267M4680N9602P6094J32001n026J50107
$$ 4917993 4893492 4919432 5020474 5118957 5201224 5245904 5305506 5381600 5513601 5508575 5658682
3226E658682M9391N338Q3849k0171R0561K6942M2057j576P771q704M8771O7913
$$ 5658682 5708073 5713411 5797260 5777089 5867650 5894592 5936649 5935073 5942844 5934140 5982911 6050824
3214F050824p7556o6010m1475l5600k8402K6724k5597j57392r6116L9257O9713
$$ 6050824 5973268 5907258 5865783 5830183 5801781 5828505 5802908 5645516 5549400 5588657 5658370
3203E658370j9747M9793J52611o2488j3208O4600R1080j7723O1884N9199J11882
$$ 5658370 5638623 5688416 5841027 5778539 5765331 5829931 5921011 5903288 5965172 6024371 6136253
3192F136253M3136P6959R1849O7381l1907J06133J23770m4133k3008L6894J47447
$$ 6136253 6179389 6256348 6348197 6415578 6383671 6489804 6613574 6569441 6546433 6583327 6730774
3181F730774L2594r1208P5254J34769n2958J40959P044J37325J10720O718r454
$$ 6730774 6763368 6672160 6747414 6882183 6829225 6970184 6977228 7114553 7225273 7231991 7222537
3170G222537M6327P1357J08773J8896P45J69677J09086J3741J06920M5764P5253
$$ 7222537 7268864 7340221 7448994 7467890 7468635 7638312 7747398 7761139 7868059 7913823 7989076
3159G989076M9927J54097M7300J3387J83688J74107J83275K15655J84108J74098
$$ 7989076 8039003 8193100 8240400 8253787 8437475 8611582 8794857 9010512 9194620 9368718
3149I368718L10370L52348K05854K30978L36665L57116L70594M93517N96792M99839
$$ 9368718 9679088 10031436 10237290 10468268 10804933 11162049 11532643 12026160 12622952 13122791
3139A3122791N26665N09339M59241M64361L55567K80249K05136J83158K30731
$$ 13122791 13649456 14158795 14618036 15082397 15437964 15718213 15923349 16106507 16337238
3130A6337238K24279K94011K56770L65344L09535L26677K50657K02080R2181J0024
$$ 16337238 16561517 16855528 17112298 17477642 17787177 18113854 18364511 18566591 18658772 18668796
3120A8668796J49240J08299J71236J48476L91537M48806L76277M51210P20930
$$ 18668796 18818036 18926335 19097571 19246047 19637584 20086390 20462667 20913877 21634807
3111B1634807P39568Q58380R31224R19825J142459J256286J428250J516830J744807
$$ 21634807 22374375 23232755 24163979 25083804 26226263 27482549 28910799 30427629 32172436
3102C2172436J887118K071001K268169K548265K869374L101152L507179L890566
$$ 32172436 34059554 36130555 38398724 40946989 43816363 46917515 50424694 54315260
3094E4315260M141788M219588M173636L803099K905848J985763R21268K19765
$$ 54315260 58457048 62676636 66850272 70653371 73559219 75544982 76466250 76686015
3086G6686015l82438l91587m56716n12152j39102j00101l06819r11864j609606
$$ 76686015 76303577 75911990 75455274 74943122 74804020 74703919 74397100 73485236 71875630
3077G1875630k460464l186998l604128l955408l838913l756425l471083k945697
$$ 71875630 69415166 66228168 62624040 58668632 54829719 51073294 47602211 44656514
3069D4656514k670149k304999k102209j910348j668471j409539j320697j027035
$$ 44656514 41986365 39681366 37579157 35668809 34000338 32590799 31270102 30243067
3061C0243067p47106o87651o63242o91206o71394o35834o53239o67238o03843
$$ 30243067 29495961 28808310 28145068 27453862 26782468 26146634 25493395 24826157 24222314
3052B4222314o83753m64719m27726m24514k87956j84090r1502j28880K5209j5783
$$ 24222314 23538561 23073842 22646116 22221602 21933646 21749556 21658054 21529174 21554383 21538600
3042B1538600K639M8125J9183J67134K91922L78338K87472K85669L22199M85601
$$ 21538600 21541239 21589364 21608547 21775681 22067603 22445941 22733413 23019082 23341281 23826882
3032B3826882M22475L63723M38560M85627M92979M05332M98023N96330N55795
$$ 23826882 24249357 24613080 25051640 25537267 26030246 26435578 26933601 27529931 28085726
3023B8085726N71507O73869N78555O49600Q43879P36636P88114P94865R03491
$$ 28085726 28657233 29331102 29909657 30559257 31403136 32139772 32927886 33722751 34626242
3014C4626242R99307J058924J000544J081466J221527J192910J194257J356483
$$ 34626242 35625549 36684473 37685017 38766483 39988010 41180920 42375177 43731660
3006D3731660J418658J528279J665731J763507J841282K066712K198684K272442
$$ 43731660 45150318 46678597 48344328 50107835 51949117 54015829 56214513 58486955
2998E8486955K458463K783549L000906L218039L433346L807016M312088M434287
$$ 58486955 60945418 63728967 66729873 69947912 73381258 77188274 81500362 85934649
2990H5934649M747726N006989N335579N626582O085552O532404P370876Q100774
$$ 85934649 90682375 95689364 101024943 106651525 112737077 119269481 126640357 134741131
2982A34741131R005156R610805R992298R670789Q914871P445494N682140L813301
$$ 134741131 143746287 153357092 163349390 173020179 181935050 189380544 195062684 198875985
2974A98875985K547079J783749J678698J893266K355458K522475K190819J237627
$$ 198875985 201423064 203206813 204885511 206778777 209134235 211656710 213847529 215085156
2966B15085156j47159k162676m224523n969074p234582p688953p349667o427936
$$ 215085156 214937997 212775321 208550798 202581724 195347142 187658189 180308522 173880586
2958A73880586n317898l693554k339398q79172J67342J234405J945097K539085
$$ 173880586 168562688 164869134 162529736 161650564 161817906 163052311 164997408 167536493
2950A67536493L069057L027028K840058K474762J829684R31591j76564j443418
$$ 167536493 170605550 173632578 176472636 178947398 180777082 181708673 181532109 180088691
2942A80088691k237826k554556k518924k316393k168293j993457j961055k350816
$$ 180088691 177850865 175296309 172777385 170460992 168292699 166299242 164338187 161987371
2934A61987371l042069l549132m231719m812303n632313o180053o173717n913307
$$ 161987371 158945302 155396170 151164451 146352148 140719835 134539782 128366065 122452758
2926A22452758n103904n195455n556801n131884m498997l679442l718998l857164
$$ 122452758 117348854 112153399 106596598 101464714 96965717 93286275 89567277 85710113
2918H5710113l998005l806946l610058l152224k506773j928090j348169j133938
$$ 85710113 81712108 77905162 74295104 71142880 68636107 66708017 65359848 64225910
2910F4225910o44449j56961N60644J613990K348917K781024J65174k235969k867071
$$ 64225910 63581461 63424500 63985144 65599134 67948051 70729075 70894249 68658280 65791209
2901F5791209k756022k059379j127839m00706Q0319r8860m05214o70136r26561
$$ 65791209 63035187 60975808 59847969 59447263 59527582 59428722 59023508 58353372 57426811
2892E7426811r97418j028587r17087j075590q06984k49422K32839R56183Q55016
$$ 57426811 56429393 55400806 54483719 53408129 52601145 52351723 52584562 53540745 54395761
2883E4395761j053020k361539k606217k419670k004724j516904j240286q54652
$$ 54395761 53342741 50981202 48374985 45955315 43950591 42433687 41193401 40338749
2875D0338749n71209l52884k41452r5105J73950J95853L31170O05309Q33451J037859
$$ 40338749 39767540 39414656 39173204 39078099 39252049 39447902 39779072 40384381 41217832 42255691
2865D2255691J244897J331292J595946J989133K302631K676941L127976L317484
$$ 42255691 43500588 44831880 46427826 48416959 50719590 53396531 56524507 59841991
2857E9841991L424289L566618L375198L207764L064581K875304K340772J689308
$$ 59841991 63266280 66832898 70208096 73415860 76480441 79355745 81696517 83385825
2849H3385825J095478P57180J81885m43357j049185j712284k327176k974202l540228
$$ 83385825 84481303 85238483 85420368 84977011 83927826 82215542 79888366 76914164 73373936
2840G3373936m006878m434263m511931m460180m105000l681137l431825l107802
$$ 73373936 69367058 64932795 60420864 55960684 51855684 48174547 44742722 41634920
2832D1634920k772479k303541k038081j762953j515709j430107j164644j019138
$$ 41634920 38862441 36558900 34520819 32757866 31242157 29812050 28647406 27628268
2824B7628268r43916q37212p54688p26546o15755p27022n17331m51636m92138
$$ 27628268 26684352 25847140 25092452 24365906 23750151 23023129 22505798 22054162 21562024
2815B1562024n02458j74008k18438l18910k98181p6405j28999j85207r1109q0064
$$ 21562024 21059566 20885558 20667120 20348210 20050029 19973624 19844625 19659418 19568309 19488245
2805A9488245k44082k23730j94530j81213j89243l81177m14358m73507m28517
$$ 19488245 19244163 19020433 18825903 18644690 18455447 18074270 17659912 17186405 16757888
2796A6757888m40474l84072m83086l33672l70617l66967k24054r6369j54029k31969
$$ 16757888 16317414 15933342 15450256 15116584 14745967 14379000 14154946 14058577 13904548 13672579
2786A3672579r0925j68882j99095r6699r2096j19614j55592j7405j4592M6264
$$ 13672579 13581654 13412772 13213677 13116978 13024882 12905268 12749676 12732271 12717679 12763943
2776A2763943l4619J42138P0591J22629J9659R6771K47049J91130J04819K47080
$$ 12763943 12729324 12871462 12942053 13064682 13084341 13181112 13428161 13619291 13724110 13971190
2766A3971190L1804M0521K01388Q4034J27112L7333K43038J21596K80015J44073
$$ 13971190 14002994 14043515 14244903 14328937 14456049 14493382 14736420 14858016 15138031 15282104
2756A5282104r751j39584n423j066k3974K35952J29448J33459J55537J49981L24213
$$ 15282104 15272353 15132769 15127346 15126280 15102306 15338258 15467706 15601165 15756702 15906683 16230896
2745A6230896K84469M97010L90436K53595L63503K60472K97904L21430M72991
$$ 16230896 16515365 17012375 17402811 17656406 18019909 18280381 18578285 18899715 19372706
2736A9372706N92100O32354N79322O72112O03656N22356N96030O83631M46999
$$ 19372706 19964806 20597160 21176482 21848594 22452250 22974606 23570636 24254267 24701266
2727B4701266N60706N73621O27076O86993Q27387Q98632R50382Q56966Q56248
$$ 24701266 25261972 25835593 26462669 27149662 27977049 28875681 29826063 30683029 31539277
2718C1539277R35976R56446R47700J099335J244729J232998J424023J459216J445715
$$ 31539277 32475253 33431699 34379399 35478734 36723463 37956461 39380484 40839700 42285415
2709D2285415J437341J517671J610249J616231J490861J516275J389819J146335
$$ 42285415 43722756 45240427 46850676 48466907 49957768 51474043 52863862 54010197
2701E4010197J141766J283895J386732J702034J899896K276375K645618K907527
$$ 54010197 55151963 56435858 57822590 59524624 61424520 63700895 66346513 69254040
2693F9254040L315136L466712L964606M380155N050775N620385O079060O329989
$$ 69254040 72569176 76035888 80000494 84380649 89431424 95051809 101130869 107460858
2685A07460858O751225P604223R013670J0970211J3079193J4665011J4309646
$$ 107460858 114212083 121816306 130829976 141800187 154879380 169544391 183854037
2678A83854037J3930205J4616898J7590251K2828183K9474378L5574738L7180017
$$ 183854037 197784242 212401140 229991391 252819574 282293952 317868690 355048707
2671C55048707K6433287K870571k1203091l5952780l9789363l6411182k9954706
$$ 355048707 381481994 384352565 363149474 327196694 287407331 250996149 221041443
2664B21041443k3529889j8506430j5028358j2650684j1656509j1351580j1018878
$$ 221041443 197511554 179005124 163976766 151326082 139669573 128317993 117299115
2657A17299115j0505897r610385q331730p189582o258810n313819m648323m197236
$$ 117299115 106793218 97182833 88851103 81661521 75402711 70088892 65440569 61243333
2649F1243333l869672l435831l106022k989186k766970k500910k193354k171195
$$ 61243333 57373661 53937830 50831808 47842622 45075652 42574742 40381388 38210193
2641C8210193j871363j637431j803334j506320j499958j303499j297853j048077
$$ 38210193 36338830 34701399 32898065 31391745 29891787 28588288 27290435 26242358
2633B6242358q82995r45532q49406p69612p04762p63488q86352q16075p27823
$$ 26242358 25359363 24413831 23564425 22794813 22090051 21326563 20440211 19624136 18896313
2624A8896313p60335o42852m57704m48522m78760m84835m90103n02387m53812
$$ 18896313 18135978 17493126 17035422 16586900 16108140 15623305 15133202 14630815 14177003
2615A4177003m82688o19169m77295l29417k30321l44730m28100k45439k56278
$$ 14177003 13694315 13075146 12597851 12268434 12038113 11693383 11265283 11019844 10763566
2606A0763566l69913l12102k57981j98843l97839j70973j70811j90228j74731
$$ 10763566 10393653 10081551 9823570 9624727 9226888 9055915 8885104 8694876 8520145
2597H520145j37366j51562j73149k35335k91087j21708j78735k27935j21479l12550
$$ 8520145 8382779 8231217 8058068 7822733 7531646 7409938 7231203 7003268 6881789 6569239
2587F569239k77850j67015k17326j36322j31229j35701j80372j98688r3529j60997
$$ 6569239 6291389 6124374 5907048 5770726 5639497 5503796 5323424 5124736 5031207 4870210
2577D870210j35305j06956k47376l4232K4841l0714j27179n4977j02633n5882
$$ 4870210 4734905 4627949 4380573 4346341 4371182 4340468 4213289 4158312 4055679 3999797
2567C999797j13683m5916n3607k01969r2423l0323l2529j28822j51906Q7379j52021
$$ 3999797 3886114 3840198 3786591 3584622 3492199 3461876 3429347 3300525 3148619 3235998 3083977
2556C083977j04382l8022m7631l7117m1403j22173N3861K7404r6071N950j07826
$$ 3083977 2979595 2941573 2893942 2856825 2815422 2693249 2747110 2774514 2678443 2684393 2576567
2545B576567j148m5556N5760j94J13890M7575l4458L5846j06288o8034j73P1443
$$ 2576567 2575419 2529863 2585623 2585429 2699319 2746894 2712436 2748282 2641994 2573960 2573787 2645230
2533B645230j31336L5835J05849m1031L4691r6566J7440n3802n4076P0100N8950
$$ 2645230 2513894 2549729 2655578 2614547 2649238 2552672 2570112 2516310 2462234 2532334 2591284
2522B591284m0901r5268l3189J7520m1033l3264j9541N9057j1322M9042n5500
$$ 2591284 2550383 2455115 2421926 2439446 2398413 2365149 2345608 2404665 2393343 2442385 2386885
2511B386885j41518O9497j21409J6189p3040O5819O3660p540Q7748M207r628m6258
$$ 2386885 2245367 2314864 2193455 2209644 2136604 2202423 2266083 2258543 2346291 2350498 2340870 2294612
2499B294612P026m1376k3602j6581o033P8986P5973j9972L492l2906o5770L9519
$$ 2294612 2301638 2260262 2236660 2220079 2214046 2293032 2369005 2349033 2352525 2319619 2253849 2293368
2487B293368K0209J03034N5475o7771L182P5959O0394m0322r9307J54851o121
$$ 2293368 2313577 2416611 2472086 2404315 2407497 2483456 2543850 2503528 2404221 2559072 2552951
2476B552951j5257L4103q5061N8511k4247N0212M9272N1790n5957J07619K1415
$$ 2552951 2537694 2571797 2486736 2545247 2521000 2571212 2620484 2672274 2616317 2723936 2745351
2465B745351N7770J48337L3821Q7498K09509R1976J76101L0719n460j54707k85001
$$ 2745351 2803121 2951458 2985279 3072777 3282286 3374262 3550363 3581082 3575622 3420915 3135914
2454C135914k68588r7359j11842j19069m1581j04506l4683q8679j16996j11114
$$ 3135914 2867326 2769967 2658125 2539056 2497475 2392969 2358286 2269607 2152611 2041497
2444B041497j77308j13213n0825j72987l3414L2451r3621r5760L449q5349J6709
$$ 2041497 1864189 1750976 1700151 1527164 1493750 1526201 1432580 1336820 1340269 1254920 1271629
2433A271629K3054n2664j56573l2314Q9680j6156l4714j01098K7997K5852l6985
$$ 1271629 1294683 1242019 1085446 1053132 1142812 1126656 1091942 990844 1018841 1044693 1007708
2422A007708o2805o3184L4337o2351q4085l8993J6292N1338l9160N775l0740K9152
$$ 1007708 944903 881719 916056 853705 769620 730627 746919 798257 759097 764872 734132 763284
2410G63284J8227j22508N1573R206j15582K2000N7400M10p4946J09655o576m4332
$$ 763284 781511 659003 710576 719782 604200 626200 683600 684010 609064 718719 712143 667811
2398F67811j5796m8220n347k8219o780M7892O860l8081P2403m4609L1175j1384
$$ 667811 652015 603795 598448 570229 563449 611341 618201 580120 652523 607914 639089 627705
2386F27705j1223o8014L9682J4563j7373m6622J8926j2168n80k9184P4616o7078
$$ 627705 616482 548468 588150 602713 585340 538718 557644 545476 544896 515712 590328 523250
2374E23250m0810J11522r9837J9492L5255l394k8831j596p3149J3234l975o4305
$$ 523250 482440 593962 494125 513617 548872 545478 516647 515051 441902 455136 451161 386856
2362C86856M7659o459n725M1045J1596m5918P661k0614k2130J1690j13678k8452
$$ 386856 434515 428056 422331 463376 474972 429054 436715 416101 393971 405661 291983 263531
2350B63531P8998k4116L5029l7703m6107L6203o2164J8611M6432n1949M2789L7217
$$ 263531 342529 318413 353442 315739 269632 305835 243671 262282 308714 256765 299554 336771
2338C36771N034l754J0210k9515l0321j08209M2290J7108K9587j864l5916O2767
$$ 336771 341805 338051 348261 318746 288425 180216 222506 239614 269201 267337 231421 294188
2326B94188N2285q9500j6943k3534q1453O2057J6313P4571m6039K4730J9203j5315
$$ 294188 346473 256973 240030 216496 135043 197100 213413 287984 241945 266675 285878 270563
2314B70563M5827m8323j6977J410Q8870M7345l2120J443l8637J4467j26001r8153
$$ 270563 316390 268067 251090 252500 341370 388715 356595 358038 319401 333868 207867 109714
2302A09714N9245l7171L2187K5408J51j9305m7084j1751N4595K8722p2420L5663
$$ 109714 168959 131788 163975 189383 189534 170229 123145 111394 165989 194711 122291 157954
2290A57954R0857j2974r5437P1806n3243K7554m3743K1983L6195p8459l2047J152
$$ 157954 248811 235837 140400 212206 158963 186517 142774 164757 200952 122493 90446 91598
2278I1598m8508M8242N6636L5383k0458q8213R3348L5982k2372k4598J07818O7064
$$ 91598 43090 91332 147968 183351 162893 74680 168028 204010 181638 157040 264858 331922
2266C31922j44857J5544K9327J5837j19601m2742K2325j0744J5505L5297J9567
$$ 331922 187065 202609 231936 247773 128172 85430 107755 97011 112516 147813 167380
2255A67380r167Q4943J9381m8459j14183p207N1521P1994p0712l3623O7607l4294
$$ 167380 158213 243156 262537 214078 99895 92688 144209 216203 145491 111868 179475 145181
2243A45181J7240k0217l7405N9619j3911k886M450m3176k9857O26J19507o5372
$$ 145181 162421 142204 104799 164418 150507 147621 152071 108895 79038 79664 199171 133799
2231A33799j15099J06510N4373j6957N627j27908J5618J26425r8182R4453j58
$$ 133799 18700 125210 179583 162626 168253 40345 55963 182388 84206 178659 178501
2220A78501n4931L3496M9921j1815o1469k2880m622M0409J7959j081m0248j12585
$$ 178501 123570 157066 206987 195172 133703 110823 106201 146610 164569 163488 123240 10655
2208A0655N8449M7013j9227O2308J0882N3137J758l0199K0205L1508p5595K6626
$$ 10655 69104 116117 96890 159198 170080 223217 224975 194776 214981 246489 170894 197520
2196A97520k940O399o7872O8793q785R8226j5679M534K1747j74285L2168P9905
$$ 197520 194580 200979 133107 201900 193115 291341 275662 280196 301943 127658 159826 239731
2184B39731P4021m7129o1790m4493Q1251J7098O9010N711l2454m0536K010P202
$$ 239731 313752 266623 204833 160340 241591 258689 327699 333410 300956 260420 262430 269632
2172B69632M3252N7036o4087j4634M8480J00295j5239N3371m4643Q8007K1518
$$ 269632 312884 369920 305833 291199 339679 439974 424735 478106 433463 521470 542988
2161E42988K189j5050Q5342P3644K1330O4263p867J3549n8776R7437K774R7722
$$ 542988 545177 530127 615469 689113 710443 774706 766839 780388 721612 819049 821823 919545
2149I19545Q6548m7959K1484J21520O154J06796N8143j2289l3653J46289J19071
$$ 919545 1006093 958134 979618 1101138 1107292 1214088 1272231 1259942 1226289 1372578 1491649
2138A491649J00637p3832J6918J42292J56964P4994J58205M2361J32700K5169
$$ 1491649 1592286 1518454 1535372 1677664 1834628 1909622 2067827 2110188 2242888 2268057
2128B268057J74101J30839K32132K67449L19357L00086L50161L81825M04516N52952
$$ 2268057 2442158 2572997 2805129 3072578 3391935 3692021 4042182 4424007 4828523 5381475
2118E381475L77713N57020P45900P98873J044140J418567J896696K658326L487088
$$ 5381475 5759188 6316208 7062108 7860981 8905121 10323688 12220384 14878710 18365798
2109A8365798M143402k27140l332268l584540l301953k174136j641767j163016
$$ 18365798 22509200 22282060 18949792 15365252 12063299 9889163 8247396 7084380
2101G084380q86367n97493m84810l44920m40398m75772l39369l09970k89392k23123
$$ 7084380 6198013 5600520 5115710 4770790 4330392 3854620 3515251 3205281 2915889 2692766
2091B692766k36782j85572p4405j87177j87300j27571r4569o1942j57174r9639
$$ 2692766 2455984 2270412 2196007 2008830 1821530 1693959 1599390 1537448 1380274 1280635
2081A280635r9306j364k0108m1057O0337j29743j61297j626n277J8782r2340j11247
$$ 1280635 1181329 1179965 1159857 1118800 1179137 1049394 888097 886471 881194 899976 807636 696389
2069F96389J3463N5405o9146j62301K9829o3091N1807n4613K7048j0135M101K182
$$ 696389 709852 765257 696111 533810 563639 500548 552355 497742 524790 514655 518756 520938
2057E20938k2220m9170n3749P8323n2963j40518q934N3948l367m6331O4919J6809
$$ 520938 498718 449548 395799 474122 421159 280641 271707 325655 322288 275957 340876 357685
2045C57685k4458k7612l4935m2945K7892K1879j54414q426J07975K7156N9366
$$ 357685 333227 305615 270680 227735 255627 277506 123092 114666 222641 249797 309163
2034C09163n8300r407o4860q9145N9034j8258j5652m8838k1254J02334j1706r2200
$$ 309163 250863 241456 176596 87451 146485 128227 112575 63737 42483 144817 133111 40911
2022D0911J42455j7993M612q0712k2306m4161J2601O260L187m5208J32967j09612
$$ 40911 183366 165373 169985 89273 66967 22806 35407 41667 44854 -354 132613 23001
2010B3001q3973O2182O2527O09k0366K7536l6285l8885L5467Q0079l2236l1557
$$ 23001 -60972 1210 63737 64346 43980 71516 35231 -3654 31813 111892 79656 48099
1998D8099K5112l8670n8890L4833r367n0736M3297K1362R3232j11770j9006j5710
$$ 48099 73211 34541 -24349 10484 1117 -49619 -6322 15040 108272 -3498 -22504 -38214
1986c8214k7939Q9455N0132j42514K1631Q1467K9918O8355l5697J1766o2534M4085
$$ -38214 -66153 23302 73434 -69080 -47449 34018 63936 132291 96594 108360 45826 89911
1974H9911j7469l0668n0868N2547l664j3010N9351p0700J2719N6824l3533j16279
$$ 89911 72442 41774 -9094 43453 39789 26779 86130 15430 28149 84973 51440 -64839
1962f4839m4700l5500J38275M8189K3476m6940o4686O5204k4921J24988O094j07631
$$ -64839 -109539 -145039 -6764 41425 64901 17961 -46725 18479 -6442 118546 124640 17009
1950A7009j1174K7172m2559N4654j3744j4876k4233j12814L0491R3600k1036q6560
$$ 17009 5835 33007 -9552 45102 31358 16482 -7751 -120565 -90074 3526 -17510 -104070
1938a04070J4097L1083K2165L6678l2532K2822l0915M7077J4789K1422n2040m7415
$$ -104070 -89973 -58890 -36725 -47 -32579 -9757 -40672 6405 21194 42616 -9424 -56839
1926e6839M7108N9426o1260L6737N2137j2598p529N620l4562r730L7425n3574
$$ -56839 -9731 49695 -11565 25172 77309 64711 57182 62802 28240 18510 55935 2361
1914B361j1091k6225j2834L9357J71468n1666r0845J60631j76822P3075J9460
$$ 2361 -8730 -34955 -47789 -8432 163036 111370 20525 181156 4334 77409 96869
1903I6869n293l1770o0566l267m2333Q7069P5947q4333m8607k6761l6699P0399
$$ 96869 91576 59806 -760 -4027 -46360 40709 116656 32323 -16284 -43045 -79744 -9345
1891i345P8600r5613L8937K6266J939r6930O6828r189J5383m506j8050q2237P8172
$$ -9345 69255 -26358 12579 38845 40784 -56146 10682 1493 16876 12370 -5680 -87917 -9745
1878i745N402j0639N8056j1441J712k2588k6321p723q400l8224N5928J9814o4178
$$ -9745 -4343 -14982 43074 31633 33345 10757 -15564 -23287 -31687 -69911 -13983 5831 -58347
1865e8347J902N4363n0296j0375p916P330j21329J02428J3959J12452o1178j7298
$$ -58347 -56445 -2082 -52378 -62753 -70669 -63339 -184668 -82240 -68281 44171 -17007 -34305
1853c4305L965J6795j01424N6888J16569L7875o2298j34679K6229L5135M3902
$$ -34305 -30340 -13545 -114969 -58081 58488 96363 34065 -100614 -74385 -39250 4652
1842D652m5900r7514L8455n2459R6155K4449l7923k037j6806m0035O223k1378
$$ 4652 -41248 -138762 -100307 -152766 -56611 -32162 -70085 -72122 -88928 -128963 -122740 -144118
1830a44118K6367P6590l470r8814l6311O1876k2629R9174n783K5542j0118N9316
$$ -144118 -117751 -41161 -44631 -143445 -179756 -117880 -140509 -41335 -47118 -21576 -31694 27622
1818B7622j6434r8212J1894K7114R2460k9837K9692r1714m7669Q487Q8715M7851
$$ 27622 11188 -87024 -75130 -48016 44444 14607 44299 -47415 -95084 -86597 2118 49969
1806D9969k0323L652k8389l7043N2435n0672l5309p3688l6539N9295P7041p1298
$$ 49969 29646 33298 4909 -32134 20301 -30371 -65680 -139368 -175907 -116612 -39571 -110869
1794a10869j502K0987q362O51k8499K4690k5688R7830P0808j3217k358n4543o705
$$ -110869 -112371 -91384 -99746 -99095 -127594 -102904 -128592 -30762 40046 26829 24471 -30072 -36777
1781c6777o2138M9806j9473o7705M8085p996l3689O3840O4532m9003L8316n4557
$$ -36777 -98915 -49109 -68582 -136287 -88202 -96198 -129887 -66047 -1515 -50518 -12202 -66759
1769f6759K6089L5100o8704k0954l8172K3320P3621l7314l9776R0734n7725J9690
$$ -66759 -40670 -5570 -74274 -95228 -133400 -110080 -36459 -73773 -113549 -22815 -80540 -60850
1757f0850J10707l5132n4964o7249m5778N3865P563K7630R7790p9424p9143n1663
$$ -60850 49857 14725 -40239 -107488 -153266 -99401 -91838 -64208 33582 -45842 -124985 -176648
1745a76648O5093Q0859J5489n1711j2250m0910J8258O4291j3897N4400l3984M0119
$$ -176648 -111555 -30696 -15207 -66918 -79168 -120078 -101820 -37529 -51426 2974 -31010 9109
1733I109j3986m9682l7910p308O164K4890M6095m5977J0562j6141j6971n7543
$$ 9109 -4877 -54559 -92469 -99777 -93613 -68723 -22628 -68605 -58043 -74184 -91155 -148698
1721a48698J036m0462J44602j7146j43762L0275J20125M1423k1599k0147j5901
$$ -148698 -147662 -188124 -43522 -60668 -204430 -174155 -54030 -12607 -34206 -54353 -70254
1710g0254q0043Q2950K9692M430m4500j6729J274M1560M6698j0946k7301p2029
$$ -70254 -150297 -67347 -37655 -33225 -77725 -94454 -93180 -51620 -4922 -15868 -43169 -115198
1698a15198k4823J41367n9544L6048L1983j9515l3060j6532Q795J6222k6691o1178
$$ -115198 -140021 1346 -58198 -22150 9833 -9682 -42742 -59274 -50479 -34257 -60948 -122126
1686a22126K1328P2329q832M0603l6137K825l8244N8318k2728K8022r0730q6202
$$ -122126 -100798 -28469 -37301 3302 -32835 -30010 -68254 -9936 -32664 -4642 -95372 -181574
1674a81574O9205R9817M4850J4313k3082p4212M4548j3598Q24L845o5135r672
$$ -181574 -112369 -12552 32298 46611 23529 -50683 -6135 -19733 -18909 -15064 -80199 -89871
1662h9871P6855p5123K6530J0894L8854k7862o5718N9823J5575Q658K8757k9731
$$ -89871 -13016 -88139 -61609 -50715 -11861 -39723 -105441 -45618 -30043 -21385 7372 -22359
1650b2359n0848k6549R6162l7913k9250K3253R399M731K2137k5460O3519m9222
$$ -22359 -73207 -99756 -3594 -41507 -70757 -47504 -38105 -33374 -11237 -36697 26822 -22400
1638b2400O434k5249l5308l1626N9327J7429J2761r779p0901r83N4333o4652j2538
$$ -22400 -15966 -41215 -76523 -108149 -48822 -31393 -18632 -28411 -99312 -100295 -45962 -110614 -123152
1625a23152M4047Q8408o7792K830J0821L8978j02062L1912q6094R7079Q4786q6617
$$ -123152 -79105 9303 -58489 -55659 -44838 -5860 -107922 -76010 -162104 -65025 19761 -66856
1613f6856M0420p6866N3686J4643n3334q1170N5749J06117m2506J02412p2278
$$ -66856 -26436 -103302 -49616 -34973 -88307 -169477 -113728 -7611 -50117 52295 -19983
1602a9983j02981l4068J2905J69043n2965m2152j9803m5158L4805J6833o4377
$$ -19983 -122964 -157032 -144127 24916 -28049 -70201 -90004 -135162 -100357 -83524 -147901
1591a47901N8632M4746O262L7135p5382O5169q3297q2942L2872P3626L8096q7743
$$ -147901 -89269 -44523 -38261 -1126 -76508 -11339 -94636 -177578 -144706 -71080 -32984 -120727
1579a20727p7038Q8064O0218j095n006k0989J3210R479k7531J5986O1118j09157
$$ -120727 -197765 -109701 -49483 -50578 -55584 -76573 -63363 -53884 -81415 -65429 -4311 -113468
1567a13468k7998p7630J17103p148K2661J6825N1042L0791o9382N1858K7093p6646
$$ -113468 -141466 -219096 -101993 -109141 -86480 -69655 -18613 12178 -57204 -5346 21747 -54899
1555e4899k7301J2333N9993J3592j02100m3762J6354J4171M2987j14078Q0591
$$ -54899 -82200 -69867 -9874 3718 -98382 -142144 -125790 -111619 -68632 -182710 -102119
1544a02119J6266M897N9773j4197o990L6405k3713J6837O1851p5734n2056O3060
$$ -102119 -85853 -80956 -21183 -35380 -42370 -5965 -29678 -12841 49010 -26724 -78780 -15720
1532a5720l8049p3679M3080Q9244j19940L5525Q8642p0283N4369k8001k7374N6327
$$ -15720 -53769 -127448 -84368 4876 -115064 -79539 9103 -61180 -6811 -34812 -62186 -5859
1520e859l6166j6316l3865R892K9458M725J5659p3880j4310L1844L0830q2745
$$ -5859 -42025 -58341 -92206 -82314 -52856 -48131 -32472 -106352 -120662 -88818 -57988 -140733
1508a40733Q3847m0739N0567P797q9679l9232M5653K3255p2321P1325O3885j53932
$$ -140733 -56886 -97625 -47058 -39261 -128940 -168172 -122519 -99264 -171585 -100260 -36375 -190307
1496a90307Q8966L4331O9291o1617m0060M9324J5550m1261Q10m1425o6035P7614
$$ -190307 -101341 -67010 2281 -59336 -99396 -50072 -34522 -75783 -74973 -116398 -182433 -104819
1484a04819j2213J2904j08469R5528P9543p5336q7829J5354J59841K6096j0962
$$ -104819 -117032 -104128 -212597 -117069 -37526 -112862 -200691 -185337 -25496 600 -10362
1473a0362l7378p959L4572m8241n7671N0905O6554p0758R1616P5850k0345r0557
$$ -10362 -47740 -55699 -21127 -69368 -127039 -76134 -9580 -80338 11278 87128 66783 -23774
1461b3774Q187J6680p267J709R642n6138j3802j01160R3398J4082K4537J0697
$$ -23774 -15587 1093 -6174 -4465 5177 -50961 -64763 -165923 -72525 -58443 -33906 -23209
1449b3209j0190J9338O610O020j34534O7167k8037k7986J24814k2348J5393k8438
$$ -23209 -33399 -14061 -7451 -1431 -135965 -68798 -96835 -124821 -7 -22355 -6962 -35400
1437c5400k3333n516n9313O9802l8022P4930l374o8705n2678q5789J21147J36561
$$ -35400 -58733 -64249 -123562 -53760 -91782 -16852 -20226 -88931 -141609 -227398 -106251 30310
1425C0310O9256j11388p8537k2464l6701J1792M4069P4496q6330J2042J5195n8864
$$ 30310 99566 -11822 -90359 -112823 -149524 -137732 -93663 -19167 -105497 -93455 -78260 -137124
1413a37124J12211j4776r882N5237N508l4716k0258K5235L7655j4587n3825P2193
$$ -137124 -24913 -39689 -49571 5666 11174 -23542 -43800 -18565 19090 4503 -49322 22871
1401B2871L3113n2216q3806M7197J14093j02768m5977N7838k1470k6225o3296
$$ 22871 55984 3768 -80038 -32841 81252 -21516 -67493 -9655 -31125 -57350 -120646
1390a20646N363J5593K5936j9362J9497Q322L3417L5954P9619n0867p3688l3552
$$ -120646 -115283 -99690 -73754 -93116 -73619 -65297 -31880 4074 83693 32826 -40862 -74414
1378g4414j0489n2357P2130N1986L8029n4596P68Q9726k6j31450M348K7666p450
$$ -74414 -84903 -137260 -65130 -13144 24885 -29711 -28943 60783 60757 -70693 -66345 -38679 -46129
1365d6129m9834n3169J47469P705l1700j7705L1039K8372p8709j13034J08435
$$ -46129 -95963 -149132 -1663 6042 -25658 -43363 -12324 16048 -62661 -175695 -67260
1354f7260J5483L0476q331l8941O0868l0601O95k8266p8297N7070K1312j2260
$$ -67260 -51777 -21301 -29632 -68573 -7705 -38306 -37611 -65877 -144174 -87104 -65792 -78052
1342g8052n8927L0090j16482L3565J77953L4509n2438J4249p3210m4155M0563
$$ -78052 -136979 -106889 -223371 -189806 -11853 22656 -29782 -15533 -88743 -132898 -92335
1331i2335j3970M1849j9844j3111K2533l5624l8896N2469O9974k5645L8993j7521
$$ -92335 -106305 -64456 -84300 -97411 -74878 -110502 -149398 -96929 -26955 -52600 -13607 -31128
1319c1128l0244o3670Q9508L0139j34271Q0672J28895k5270j8142l4246J800k4582
$$ -31128 -61372 -125042 -35534 -5395 -139666 -58994 69901 44631 26489 -7757 -5957 -30539
1307c0539k3802j10047j2621J62097n6335J19244r6366K9125J1390k2266l430
$$ -30539 -54341 -164388 -177009 -14912 -71247 47997 -48369 -19244 -7854 -30120 -33550
1296c3550M2590j7134J9623L4416j45696j3552M0508O2539K4131j05711n6714
$$ -33550 9040 -8094 11529 45945 -99751 -113303 -72795 -10256 13875 -91836 -148550
1285a48550J14242J8992J8468r4657O8828l6931q6874M2799P5836p9449O7255
$$ -148550 -34308 -15316 3152 -91505 -22677 -59608 -146482 -103683 -27847 -107296 -40041
1274d0041K4690l1921m6283L5577L3706l6845O2849J6485N8825q8114P587p2144
$$ -40041 -15351 -47272 -93555 -57978 -24272 -61117 1732 18217 77042 -11072 -3485 -75629
1262g5629K9610J5896j6342j00807O9002m6657J00161M3181p7097o0837j866m0041
$$ -75629 -46019 -30123 -46465 -147272 -78270 -124927 -24766 18415 -58682 -119519 -121385 -161426
1250a61426R2967R4753j04531n2619K4827Q128j3912P3975k1976p0999J07949
$$ -161426 -68459 26294 -78237 -130856 -106029 -97901 -111813 -37838 -59814 -130813 -22864
1239b2864m5238q319p4727K3882k3846M4104O9917o8817k8015M253J9475j2290
$$ -22864 -68102 -76421 -151148 -127266 -151112 -107008 -37091 -105908 -133923 -129670 -110195 -122485
1227a22485l687L4438M1257K4635L0684o5387l0172K8206j5053R75K5448L3874
$$ -122485 -126172 -91734 -50477 -25842 4842 -60545 -90717 -62511 -77564 -76589 -51141 -17267
1215a7267P735n0306J6904o6650l2415l4921N9536J6641J20576l5210M8224j7512
$$ -17267 -9532 -59838 -42934 -109584 -141999 -176920 -117384 -100743 19833 -15377 32847 15335
1203A5335K0830m63j20247k4233j7514P1117r376L0117j02301N7782J53117r3249
$$ 15335 36165 35702 -84545 -108778 -126292 -55175 -64551 -34434 -136735 -78953 74164 -19085
1191a9085n1590N8793M4921L3600m5148o1439N7049m6969l2579q6404Q5500l3927
$$ -19085 -70675 -11882 33039 66639 21491 -39948 17101 -29868 -62447 -148851 -63351 -97278
1179i7278l3037K4094M0117N7759l9324m6836O3692n999O4397m2246K6463l0376
$$ -97278 -130315 -106221 -66104 -8345 -47669 -94505 -30813 -36812 27585 -14661 11802 -18574
1167a8574q5272k727n476J15454P6977j75602L842L5210j75830J9635J42986K9693
$$ -18574 -103846 -106573 -112049 3405 80382 -95220 -91378 -56168 -231998 -212363 -69377 -39684
1155c9684J7085n1810L3690j9413n6014L3153j6317L2425j128J4600K864L8021
$$ -39684 -22599 -74409 -40719 -60132 -116146 -82993 -99310 -66885 -68013 -53413 -50549 -12528
1143a2528L7897o6811J20925j23179j29364Q4792Q4936L2866r0822P1331K6600
$$ -12528 25369 -41442 79483 -43696 -173060 -88268 -3332 29534 -61288 10043 36643
1132C6643n1547M2983k0808q3483n2533M4200r7836k8321L4303J8845Q2217N0514
$$ 36643 -14904 28079 7271 -76212 -128745 -84545 -182381 -210702 -176399 -157554 -75337 -24823
1120b4823M2921r8798p5271r061k8024N684k8125R2958M9910j9506L8207q9723
$$ -24823 18098 -80700 -155971 -165032 -193056 -187372 -215497 -122539 -72629 -92135 -53928 -143651
1108a43651J14849R2127j9628j07037J3749J9556J7533o2935O5488N6831j17969
$$ -143651 -28802 63325 43697 -63340 -49591 -30035 -12502 -75437 -9949 46882 -71087
1097g1087K7563K3471m1614M1078N66L4675L977q065L512o763K215Q3138l8275
$$ -71087 -43524 -20053 -61667 -20589 -20023 14652 18629 10564 14076 7313 9528 92666 54391
1084E4391j25229P5774P836j8996M2461r0507J04090q7248L5909Q5397k7668j9239
$$ 54391 -70838 4936 12772 -6224 36237 -54270 49820 -37428 -1519 83878 56210 36971
1072C6971J320p3136P1945R887n4708o5669M514K3312j7726j7536k879l2175m1421
$$ 36971 38291 -34845 37100 46987 -7721 -73390 -68876 -45564 -63290 -80826 -83705 -115880 -157301
1059a57301L8451j2140O2178R8912n006j12479o3017q797K1339J39664K9127q6800
$$ -157301 -118850 -130990 -68812 30100 25094 -87385 -150402 -159199 -137860 1804 30931 -55869
1047e5869K5111R0248p2839n2623O0668L0837p5087J7824J7677j6812l1944J35310
$$ -55869 -30758 59490 -13349 -65972 -5304 25533 -49554 -31730 -14053 -30865 -62809 72501
1035G2501k4209p5592j9199J527j5364n1662P5628n8961P0489J739J0490L7989
$$ 72501 48292 -27300 -46499 -44972 -60336 -111998 -36370 -95331 -24842 -23103 -12613 25376
1023B5376o3193K0716o78r0000R0928o633o860p3653O9580O3457k2014r4535J8595
$$ 25376 -37817 -17101 -17779 -107779 -16851 -23484 -30344 -103997 -34417 29040 7026 -87509 -68914
1010f8914O8083K0959M9167k1152k3726r460j00795j84R5965p370r4607L4780
$$ -68914 -831 20128 69295 48143 24417 14957 -85838 -86022 9943 2573 -92034 -57254
998e7254K148j3873J02518q9680L537P8114r4210M8444Q5773m2488m9446R8129
$$ -57254 -55106 -68979 33539 -56141 -52604 25510 -68700 -20256 65517 23029 -26417 71712
986G1712o1958j4200n2742L7558N4221j48951L5142L3376k2373L7313j0772J3270
$$ 71712 9754 -4446 -57188 -19630 34591 -114360 -79218 -45842 -68215 -30902 -41674 -28404
974b8404j02216Q1215M4992N9310M0316q4293K0831L9393n814p3415k3168Q8781
$$ -28404 -130620 -49405 -4413 54897 95213 10920 31751 71144 65330 -8085 -31253 57528
962E7528K6252j30626N172P1016p1586j11247R6072L0061k3062q1038l7070P9027
$$ 57528 83780 -46846 -41674 29342 -42244 -153491 -57419 -27358 -50420 -131458 -168528 -89501
950h9501O0116m757N3676K4770m2059K5051L0198m0500q793l7351K4732r4872
$$ -89501 -29385 -34142 19534 44304 2245 27296 57494 16994 8201 -29150 -4418 -99290
938i9290J6098J11826L0411L9361r2051J415O2527j09344q8550K4171J20364J9285
$$ -99290 -83192 28634 59045 98406 6355 7770 70297 -39047 -127597 -103426 16938 36223
926C6223p9797P3302M412n8760L7266L2651q4355k6217K6648q474K9427k5592
$$ 36223 -43574 29728 34140 -24620 12646 45297 -39058 -65275 -38627 -47101 -17674 -43266
914d3266n0526M7615M0028n9008r9001J01127R1847M2944k4269o1849l1738L2297
$$ -43266 -93792 -46177 -6149 -65157 -164158 -63031 28816 71760 47491 -14358 -46096 -13799
902a3799j48808P568J56812O7336n5361j3346n0197m1775R2373J3183n7337j4067
$$ -13799 -162607 -155039 1773 69109 13748 402 -49795 -91570 803 13986 -43351 -57418
890e7418L3623L0552r6908n0732R0251L5919J3978Q4945r839j0487J4741r1690
$$ -57418 -23795 6757 -90151 -140883 -50632 -14713 -735 84210 74371 63884 78625 -13065
878a3065k6015n8149M4065L272r57j4469N0236K5538K401o7922j8759M5204j9041
$$ -13065 -39080 -97229 -53164 -49892 -50849 -65318 -15082 10456 12857 -55065 -73824 -28620 -47661
865d7661l6824M9447K0460j0156j9073J15612q8313J8208P1851l8764o1106j06475
$$ -47661 -84485 -35038 -14578 -24734 -43807 71805 -16508 1700 73551 34787 -26319 -132794
853a32794l5105J11596O6673J6463n0423p862K2295o6221P7869K7159j1182l1904
$$ -132794 -167899 -56303 10370 26833 -23590 -31452 -9157 -75378 2491 29650 18468 -13436
841a3436P0667K0399o7904J7620m8126j7045J274p0339L3715M6229N4880m5238
$$ -13436 57231 77630 9726 27346 -20780 -37825 -36551 -106890 -73175 -26946 27934 -17304
829a7304n6130O5635K8739j1930k3411l7047j9720R0845L8549o1112K0136m6120
$$ -17304 -73434 -7799 20940 9010 -14401 -51448 -71168 19677 58226 -2886 17250 -28870
817b8870k7172l8166k4977P0837R7851k8552O2955l1142r0311m5720o278O6127
$$ -28870 -56042 -94208 -119185 -48348 49503 20951 83906 52764 -37547 -83267 -89545 -23418
805b3418M9794m0316l8765j5610K4956Q3326k0662n7251J5992K349O0053J961
$$ -23418 26376 -13940 -52705 -68315 -43359 39967 19305 -37946 -21954 -19605 40448 42409
793D2409m3205O5548m5431J5848k3119J9457k9690k8612J1958l3215O8991K7986
$$ 42409 -796 64752 19321 35169 12050 31507 1817 -26795 -14837 -48052 20939 48925
781D8925m8055N052P0086l3369K7293Q363j70460P422P7298K5624m2460j7259
$$ 48925 870 5922 76008 42639 69932 78295 -92165 -84743 -7445 18179 -24281 -41540
769d1540L2453J0229N3700r3876m6794P2563P497P2925o2692R2422j8475J1516
$$ -41540 -9087 1142 54842 -39034 -85828 -13265 -5768 67157 4465 96887 78412 89928
757H9928j72725k1168J04720M9669m9032p9428Q793O7634j4868M1463j1475o0756
$$ 89928 -82797 -103965 755 50424 1392 -78036 -69243 -1609 -16477 24986 13511 -47245
745d7245Q2501J3881m3472q2729J29148j02495M0348j6773Q382N985N9182o0464
$$ -47245 35256 49137 5665 -77064 52084 -50411 -10063 -26836 -18454 -12469 46713 -13751
733a3751o8299N4396L928J47400n8561j55046R2000L0226J6768N5666j1242j02050
$$ -13751 -82050 -27654 -23726 123674 65113 -89933 2067 32293 49061 104727 93485 -8565
721h565q744L751l5673P1740J634j1527k1066o5416J10406k8133l6381N9014K4809
$$ -8565 -17309 -13558 -49231 22509 24143 12616 -8450 -73866 36540 8407 -27974 31040 55849
708E5849k3106l3978k2246J04234j5724l3161m5543M4078L2492O280P1164o1443
$$ 55849 32743 -1235 -23481 80753 65029 31868 -13675 30403 62895 69175 140339 78896
696G8896L966L8734n1276j1295j9428n5925O6692k7174l3451k7828K3128k7027
$$ 78896 82862 121596 70320 59025 39597 -16328 50364 23190 -10261 -38089 -14961 -41988
684d1988R947k6571M1757M767N2078l4129M9567L1563M0161l5486n8511l9170
$$ -41988 -32041 -58612 -16855 -12088 39990 5861 55428 86991 127152 91666 33155 -6015
672f015o7135J46097l1079J328J18281j16884j48450J08201n80Q9417M6717p4675
$$ -6015 -73150 72947 41868 43196 161477 44593 -103857 4344 3764 93181 139898 65223
660F5223n9176J1992Q117p7083K0621O1500K2236k8512O8777k7158p1167k6516
$$ 65223 6047 18039 26156 -50927 -30306 31194 53430 24918 93695 66537 -4630 -31146
648c1146L8883R6165M2540O059p5383K6630j01830Q3309m3124j7232n8441J62814
$$ -31146 7737 103902 146442 152501 77118 103748 1918 85227 42103 24871 -33570 129244
636A29244k2013j1126N4535j6595K5472j91175J5688l2749n7623P8208M7695J4018
$$ 129244 107231 96105 150640 134045 159517 -31658 -15970 -48719 -106342 -28134 19561 33579
624C3579O455K9584n7992j24832J39476m2941K4461O8062k811Q1276o7903L3373
$$ 33579 40034 69618 11626 -113206 26270 -16671 7790 75852 73041 154317 86414 119787
612A19787r1011j18144J17975o354L9076L369p9912N8361O2755q5436k3072j9421
$$ 119787 28776 -89368 28607 22253 61329 64698 -15214 43147 105902 20466 -2606 -22027
600b2027Q3271k2891n9195O5734m6618k4001R8306l419K2827m7317K8013k5696
$$ -22027 61244 38353 -20842 44892 -1726 -25727 72579 69160 91987 44670 72683 46987
588D6987L5051o7026P8898n3692r5884n1039N2699J4371k4460P7575L4975p811
$$ 46987 82038 15012 93910 40218 -55666 -106705 -54006 -39635 -64095 13480 48455 40644
576D0644j3912L865J01636K8319r8766r1227o3518Q7722P2075k8732o2582L3573
$$ 40644 26732 30597 132233 160552 61786 -29441 -92959 -5237 66838 38106 -24476 9097
564I097P1944m6344N6952L6812j8356m7172Q672R2012p7285n5619o2785R9102
$$ 9097 81041 34697 91649 128461 110105 62933 71605 163617 86332 30713 -32072 67030
552F7030P0172p4744n738j1598r0352L1169L5160n2799R0932M8925j06129J14383
$$ 67030 137202 62458 56720 45122 -45230 -14061 21099 -31700 59232 108157 2028 116411
540A16411Q71n1489j8349m5714P1686m7812K656N140J0117L5520M8612J4596O9252
$$ 116411 117282 65793 47444 1730 73416 25604 28260 33400 43517 79037 127649 142245 211497
527B11497p5396q8233k2746M376J14864p0685j7145n7763N4819m4858K3555j2165
$$ 211497 136101 47868 25122 29498 144362 73677 56532 -1231 53588 8730 32285 20120
515B0120J5753O0223l6500p4652L1500K8828M5622j34612R7975j6978O1740j2959
$$ 20120 35873 96096 59596 -15056 16444 45272 90894 -43718 54257 37279 99019 86060
503H6060m0040L2734J3358k7184R0667o4816l8988O7551J8861j07477l8673M7771
$$ 86060 46020 78754 92112 64928 155595 90779 51791 119342 138203 30726 -7947 39824
491C9824l7183J03862m9000l7855J7943J8994j7657M5759q4246N6618L1870p3916
$$ 39824 2641 106503 57503 19648 37591 56585 38928 84687 441 57059 88929 15013
479A5013N8415k070n6479K8469p2701J46798R5959k3933n8020r8256O0581L8627
$$ 15013 73428 71358 14879 43348 -29353 117445 213404 189471 131451 33195 93776 132403
467A32403L0204j4164j28590J10699o6471n9422J196R8586r3940L3131K991K1675
$$ 132403 162607 148443 19853 130552 64081 4659 5855 104441 10501 43632 46623 68298
455F8298r712K5833k8065k5342M8078J1970k5775k8406J3033O2829J5364q9456
$$ 68298 58586 84419 56354 31012 79090 91060 65285 36879 49912 112741 128105 38649
443C8649Q4987r3078j8305N9704N3618j54214J6141q520J47994p3821r4639L4723
$$ 38649 123636 30558 12253 71957 125575 -28639 -12498 -21018 126976 53155 -41484 -6761
431f761J00018p2649M2472J3959J4175l4067o9869O4902m4969R7081j05116J19236
$$ -6761 93257 20608 63080 77039 91214 57147 -12722 52180 7211 104292 -824 118412
419A18412k5898j36963M9675P2520o1591L5737n0937J14849O1818j6150j03709
$$ 118412 92514 -44449 5226 77746 16155 51892 955 115804 177622 161472 57763
408E7763l125L7947k4638L0355m1557J7755o7443K0627J4959K952q804l7178J50108
$$ 57763 54638 92585 67947 98302 56745 74500 7057 27684 42643 45595 36791 -387 149721
395A49721j26989K0583M1760K1652J1805j5058M883k2600L3293o7603o0250J77
$$ 149721 22732 43315 85075 106727 118532 103474 108357 85757 119050 51447 -8803 -8626
383h626Q9407L5034N571k8355o9794M093j1233L1279P5510p662q4039O679J04667
$$ -8626 80781 115815 121386 93031 23237 27330 16097 47376 122886 115224 31185 37864 142531
370A42531j23838N5142n0808R615L1825n5524J20454j04269o0751L1381Q1266
$$ 142531 18693 73835 23027 32642 64467 8943 129397 25128 -35623 -4242 77024
359G7024o9698N4519N0190j22537M2515j1741M8351o4759O0576K0933J05909p1786
$$ 77024 7326 61845 112035 -10502 32013 20272 68623 3864 64440 85373 191282 119496
347A19496j8621J3427j4555K9933o9267R7777l375l613o3775O0017l5485o873
$$ 119496 100875 114302 99747 129680 60413 158190 154815 151202 87427 147444 111959 105086
335A05086q027m5569P2418J4492q836j20302k265n4202O8501o1419N7085M2786
$$ 105086 97059 51490 123908 138400 129564 9262 6997 -47205 21296 -40123 16962 59748
323E9748j8568j2731J4098l2647J0663R7826O0063p2409o9723j3310J63451O2156
$$ 59748 41180 28449 42547 9900 20563 118389 178452 106043 36320 23010 186461 248617
311B48617j18434k4880k2658J8818j02410j8172Q1129L8080o0874j7475J7080
$$ 248617 130183 105303 82645 101463 -947 -19119 62010 100090 39216 21741 38821
300C8821N2569k49L0575m3971n73L0837l8995j3987j7913p7946L1499O6251k8237
$$ 38821 91390 91141 121716 77745 77172 108009 69014 55027 37114 -40832 -9333 56918 28681
287B8681n0633J31097K0047k7236L546o6243k0342P6560K0524q8984r830M5934
$$ 28681 -21952 109145 129192 101956 105502 39259 18917 95477 116001 27017 17187 63121
275F3121J07670k4963Q3051n3772n1356p4946K6234J7165j30208N5421P7684k2767
$$ 63121 170791 145828 228879 175107 123751 48805 75039 92204 -38004 17417 95101 72334
263G2334m1622j9517J5824Q6192j15964N1347J62442N813o8290o4951m1332q648
$$ 72334 30712 11195 27019 113211 -2753 48594 211036 216849 148559 83608 42276 33628
251C3628N8284Q2373o2485r7784M4036M5873m5436j10383L7280K7537n4122K2832
$$ 33628 91912 174285 111800 14016 58052 103925 58489 -51894 -14614 12923 -41199 -18367
239a8367O0797O8007o1895L7825n801N4276j4400K1195l5660K8238o797j4384
$$ -18367 42430 110437 48542 86367 80566 134842 120442 141637 105977 134215 127418 113034
227A13034N3643n7919L0718q5447L9790M8734P1970o4064j14301M4084L7568r2759
$$ 113034 166677 108758 139476 54029 93819 142553 214523 150459 36158 80242 117810 25051
215B5051n2004J14974j262k0336j66656O8360P664M6462J28429K872n0747N378
$$ 25051 -26953 88021 86759 66423 -100233 -31873 -24209 22253 150682 153554 102807 108185
203A08185l791l8345k9611M1042M7429k4821m8127j2198K8561L010K0693r7136
$$ 108185 104394 66049 36438 77480 124909 100088 51961 39763 68324 71334 92027 -5109
191e109M6057P5168m0075j26524j3484L4548Q9961N8764j0942m9872O807j5851
$$ -5109 40948 116116 76041 -50483 -63967 -29419 60542 119306 108364 58492 65299 49448
179D9448o731j9017O3098R1939j27483k5356O7762j00490M4996k3290q0920R3444
$$ 49448 42717 23700 86798 178737 51254 25898 93660 -6830 38166 14876 -66044 27400
167B7400p2890M38j2206k6866J05416l8326M6255M3973j4961l2403k7190k975
$$ 27400 -45490 -45052 -57258 -84124 21292 -17034 29221 73194 58233 25830 -1360 -4335
155d335n2343j1415n110Q2681P4805K04r0789m8765N785M6006k0489J04853o2352
$$ -4335 -56678 -68093 -73203 9478 84283 84487 -6302 -55067 -49282 -3276 -23765 81088 18736
142A8736j10767J6297N415N6287m2309N6368l4035l8515L42O1692J3396L443j556
$$ 18736 -92031 -75734 -70319 -14032 -56341 27 -34008 -72523 -72181 -10489 2907 6350 4794
129D794J3405m241k4990J2040N7811J460q9222l2714n7299j349J1022O291J8333
$$ 4794 18199 13958 -11032 1008 58819 60279 -28943 -61657 -118956 -120305 -109283 -102992 -84659
116h4659p631J5108m9408P222P9134K7195J4692o4022k3973n294O7600L1521l070
$$ -84659 -92290 -77182 -126590 -119368 -40234 -13039 1653 -62369 -86342 -91636 -24036 7485 4415
103D415Q203Q6023j5393j67511j7795L3238M0957l610r8673J8227J22690l3960
$$ 4415 12618 98641 83248 -84263 -102058 -68820 -27863 -31473 -130146 -111919 10771 -23189
91b3189R7031j16394j25912J33759l3337k3600j4026K9646L0819k4201n9089k7052
$$ -23189 73842 -42552 -168464 -34705 -68042 -91642 -105668 -76022 -45203 -69404 -128493 -155545
79a55545R4593p5584j9619o645j2735M168L5884m8228m692O5702K7353L2944j2017
$$ -155545 -60952 -136536 -156155 -162800 -175535 -171367 -135483 -183711 -188403 -122701 -95348 -62404 -74421
66g4421m1866m3482Q705N1175J2467m7085m8793K6132j764K290m582k2680N8322
$$ -74421 -116287 -159769 -151064 -99889 -87422 -134507 -183300 -157168 -158932 -156642 -161224 -183904 -125582
53a25582O3476l1369l7526l1450l895M2671q908m620J4350k9921q650O7951l5501
$$ -125582 -62106 -93475 -131001 -162451 -166346 -123675 -132583 -137203 -122853 -152774 -161424 -93473 -128974
40a28974m039l9620j7039N7666q0946m5164Q8981M9485l4589r3006L7533N6354
$$ -128974 -133013 -172633 -189672 -132006 -212952 -258116 -169135 -119650 -154239 -247245 -209712 -153358
28a53358n8543M0373L5018m9260l2675r9353N4203M1651j6533L9549j5357Q075
$$ -153358 -211901 -171528 -136510 -185770 -218445 -317798 -263595 -221944 -238477 -198928 -214285 -206210
16b06210m527O619l9450K3371m1380P28q533j5967P0468l216J1247r4918M1306
$$ -206210 -210737 -204118 -243568 -220197 -261577 -260849 -269382 -285349 -214881 -218097 -206850 -301768 -260462
3b60462m5808M9018j1851
$$ -260462 -306270 -257252 -269103
0b69103
$$ -269103
$$ Imaginary data points
##PAGE= N=2
##DATA TABLE= (X++(I..I)), XYDATA
16383b100333M081Q4025j4074L5503Q574P9565R937M0434o390N5181o212L6442
$$ -2100333 -2096252 -2012227 -2026301 -1990798 -1982224 -1902659 -1892722 -1852288 -1858678 -1803497 -1809709 -1773267
16371a773267P832l1904K0554P4498K2582n491Q6659N1144K559Q7343J1163L4604
$$ -1773267 -1765435 -1797339 -1776785 -1702287 -1679705 -1685196 -1598537 -1547393 -1544834 -1457491 -1446328 -1411724
16359a411724l808K6773M1158r798Q595O7736K0117k4912P648K532Q7968N7435
$$ -1411724 -1415532 -1388759 -1347601 -1357399 -1348804 -1281068 -1260951 -1285863 -1278215 -1275683 -1187715 -1130280
16347a130280k115m6176O7387P5813L0482q6450R2018P5615m6122r516J28014
$$ -1130280 -1132395 -1178571 -1111184 -1035371 -1004889 -1091339 -999321 -923706 -969828 -979344 -851330
16336h51330j6438Q014M8237k9450J45497P8121k6284k1489j9536P5652O873n490
$$ -851330 -867768 -859754 -811517 -840967 -695470 -617349 -643633 -665122 -684658 -609006 -602133 -607623
16324f07623J7887R6027l9405K7884K3760K5750J01522l4381j8850Q2168O2040
$$ -607623 -589736 -493709 -533114 -505230 -481470 -455720 -354198 -388579 -407429 -325261 -263221
16313b63221p9550N4174N314M7916P4853J9946l6417O4400L7707k100J7276M0287
$$ -263221 -342771 -288597 -283283 -235367 -160514 -140568 -176985 -112585 -74878 -76978 -59702 -19415
16301a9415k9767O8464M3836L6838k2917R8204l876J2335K0499j5278L0969K1047
$$ -19415 -49182 19282 63118 99956 77039 175243 171367 183702 204201 188923 219892 240939
16289B40939K168n8609N9124P1650L9939J5522j6837k4484O5450M0372N0345J3738
$$ 240939 243107 184498 243622 315272 355211 370733 353896 329412 394862 435234 485579 499317
16277D99317k7683Q688O2606j6003k8949N3179J8922l0641M698l865R6309k7705
$$ 499317 471634 480322 542928 526925 497976 551155 570077 539436 544134 540269 636578 608873
16265F08873M2480N3996K0735O9655m7274k8152R704L5305N4683J04982l6902
$$ 608873 651353 705349 726084 795739 748465 720313 730017 765322 820005 924987 888085
16254H88085o3958R3126l51K4776j7872r637M1469K9835O0675j8037j12946J17725
$$ 888085 824127 917253 916902 941678 923806 914169 955638 985473 1046148 1028111 915165 1032890
16242A032890m7464R9062R8408l4427P0994l9211J3749o76n4597k2101R9709l9178
$$ 1032890 985426 1084488 1182896 1148469 1219463 1180252 1194001 1193325 1138728 1116627 1216336 1177158
16230A177158N627N3660K9505K1421J24795o0938K9904l3234L660N9507M6254
$$ 1177158 1182785 1236445 1265950 1287371 1412166 1351228 1381132 1347898 1351558 1411065 1457319
16219A457319p867k4840p129K9058n983O2735M5351j33556O0644m4410l5984J34208
$$ 1457319 1449452 1424612 1417483 1446541 1440558 1503293 1548644 1415088 1475732 1431322 1395338 1529546
16207A529546j5133M592K4759o7453Q0610N43J28598k2113k512L1887J11061p4236
$$ 1529546 1514413 1519005 1543764 1476311 1556921 1557464 1686062 1663949 1661437 1693324 1804385 1730149
16195A730149L0396k3305j08615K7054n7660J03753l2656l0008N1495P4160K8623
$$ 1730149 1760545 1737240 1628625 1655679 1598019 1701772 1669116 1639108 1690603 1764763 1793386
16184A793386M044J3891J0468r5381Q5721J7142k3417M3890K2332R87j13434N7618
$$ 1793386 1797430 1811321 1821789 1726408 1812129 1829271 1805854 1849744 1872076 1873063 1759629 1817247
16172A817247R1210P548M1229J0662L0091M2450p5862M393j4060j28707R1875
$$ 1817247 1908457 1916005 1957234 1967896 1997987 2040437 1964575 1968968 1954908 1826201 1918076
16161A918076R1411n4414m11L3613N132R4827J7978o5713k3824L4624r3305N696
$$ 1918076 2009487 1955073 1954662 1988275 1993407 2088234 2106212 2040499 2016675 2051299 1957994 1963690
16149A963690j4162Q0595K2681J64212K0154q5538p6127p761N278o3203O5602
$$ 1963690 1949528 2030123 2052804 2217016 2237170 2151632 2075505 2067744 2073022 2009819 2075421
16138B075421m912p1070N8739K208J12570J1388m3253M4448m0474J17753m8840
$$ 2075421 2070509 1999439 2058178 2060386 2172956 2184344 2141091 2185539 2145065 2262818 2213978
16127B213978m6644R0176n1233l7286m1744r696J7959P200J00613m861O9709j27522
$$ 2213978 2167334 2257510 2206277 2168991 2127247 2117551 2135510 2142710 2243323 2238462 2308171 2180649
16115B180649N773J6376o1619j2801O4106M004M8139M5616n9111l9468R2276r2281
$$ 2180649 2186422 2202798 2141179 2128378 2192484 2196488 2244627 2290243 2231132 2191664 2283940 2191659
16103B191659k0187L2193m7236M1297J7647p9508K4248N1412P0947J5506m6197
$$ 2191659 2171472 2203665 2156429 2197726 2215373 2135865 2160113 2211525 2282472 2297978 2251781
16092B251781N1118O0006j31239J1781P309O7168q3482j1341j0375m7494M0688
$$ 2251781 2302899 2362905 2231666 2243447 2250756 2317924 2234442 2223101 2212726 2165232 2205920
16081B205920M1992N941N0702K8903J1086j22215j3395K1869N9643O765N2027
$$ 2205920 2247912 2253853 2304555 2333458 2344544 2222329 2208934 2230803 2290446 2297211 2349238
16070B349238k5912j6498m7076q298R4018o478j4042M0905J9258L9048L1604r0575
$$ 2349238 2323326 2306828 2259752 2251454 2345472 2338994 2324952 2365857 2385115 2424163 2455767 2365192
16058B365192r7200J25373p840j55369r1275P374K16834M1731K0807j19383K84
$$ 2365192 2267992 2393365 2385525 2230156 2138881 2146255 2363089 2404820 2425627 2306244 2306528
16047B306528K6842l4652r0864O8210J6311K514J8317K4477j0599Q8870o8870
$$ 2306528 2333370 2298718 2207854 2276064 2292375 2294889 2313206 2337683 2327084 2415954 2347084
16036B347084j1931p6719K2802m9347K8779M1140L648r277K7303N897L8925j3425
$$ 2347084 2335153 2258434 2281236 2231889 2260668 2301808 2305456 2296179 2323482 2329379 2368304 2354879
16024B354879j16816J04395l2779L351O7749K8479q4419J2425J0893m4745J3285
$$ 2354879 2238063 2342458 2309679 2313030 2380779 2409258 2324839 2337264 2348157 2303412 2316697
16013B316697K4453M3021J1175M553k4657l4496R1433k0026m8527P3795j9596
$$ 2316697 2341150 2384171 2395346 2399899 2375242 2340746 2432179 2412153 2363626 2437421 2417825
16002B417825K751j8611j3850r3097O4602k9377M7752J5281l230j16551P6888
$$ 2417825 2420576 2401965 2388115 2295018 2359620 2330243 2377995 2393276 2390046 2273495 2350383
15991B350383K6532L4940L9387n1164l2336k0814M2363M1371r5368O290m8818
$$ 2350383 2376915 2411855 2451242 2400078 2367742 2346928 2389291 2430662 2335294 2341584 2292766
15980B292766K4201N8145J3579J19538j20961l3127r2360J1520J43348K7679L235
$$ 2292766 2316967 2375112 2388691 2508229 2387268 2354141 2261781 2273301 2416649 2444328 2447563
15969B447563p8422o1751j4874N7081J3139L5605k3792n436n9179j8277L0603
$$ 2447563 2369141 2307390 2292516 2349597 2362736 2398341 2374549 2369113 2309934 2291657 2322260
15958B322260m9358O0419Q4159l1497n0768O693J24781J8713k3702o4228n0384
$$ 2322260 2272902 2333321 2417480 2385983 2335215 2341908 2466689 2485402 2461700 2397472 2347088
15947B347088j1373J0799q516j28J30649J4555p1881l4857p632l3302P2597l6783
$$ 2347088 2335715 2346514 2337998 2337870 2468519 2483074 2411193 2376336 2368704 2335402 2407999 2371216
15935B371216o3418L1023m040Q7670Q791r8837Q2912Q277o7692K0118m4503m0974
$$ 2371216 2307798 2338821 2334781 2422451 2431242 2332405 2415317 2423594 2355902 2376020 2331517 2290543
15923B290543J7619k9736J05306J7915k6135o8386O4274r2892J18641m0308N9133
$$ 2290543 2308162 2278426 2383732 2401647 2375512 2307126 2371400 2278508 2397149 2356841 2415974
15912B415974o2029q348P2111L8981p3521j020K6040J6431n3327K5387j4794N7679
$$ 2415974 2353945 2345597 2417708 2456689 2383168 2382148 2408188 2424619 2371292 2396679 2381885 2439564
15900B439564K6222n6405O105k8818k4850L4628l3447j508j6533L0804R6709n3845
$$ 2439564 2465786 2409381 2415486 2386668 2361818 2396446 2362999 2361491 2344958 2375762 2472471 2418626
15888B418626m6533P4267L4486p7979M999l7041k3664J18879m4299o8485o215
$$ 2418626 2372093 2446360 2480846 2402867 2407866 2370825 2347161 2466040 2421741 2353256 2347041
15877B347041l2568L267k9644M7036l74M511Q598M4668k9727K9637o4909j5517
$$ 2347041 2314473 2317740 2288096 2335132 2334758 2339269 2347867 2392535 2362808 2392445 2327536 2312019
15865B312019l360J6023R7333n704o1840m1569M7369L2709m1660M0250Q642O130
$$ 2312019 2308659 2324682 2422015 2416311 2354471 2312902 2360271 2392980 2351320 2391570 2400212 2406342
15853B406342O7248p1187m5770P0457L3437k0421q6549L6621n6302l9534N2539
$$ 2406342 2473590 2402403 2356633 2427090 2460527 2440106 2353557 2390178 2333876 2294342 2346881
15842B346881o7167N356Q1702O8302J4646j6188M5349j11431L6256J38207j63794
$$ 2346881 2279714 2285070 2366772 2435074 2449720 2433532 2478881 2367450 2403706 2541913 2378119
15831B378119l9474N0157O5915j03073l8484N0622n5763Q8037j9763m1309P6707
$$ 2378119 2338645 2388802 2454717 2351644 2313160 2363782 2308019 2396056 2376293 2334984 2411691
15820B411691J02844j24787L9994j25720n2748J04294J823o919Q8566l1679K7681
$$ 2411691 2514535 2389748 2429742 2304022 2251274 2355568 2357391 2350472 2439038 2407359 2435040
15809B435040K4018j30652O3428J17975k1939l6515L3282M3687j02125q5688K3920
$$ 2435040 2459058 2328406 2391834 2509809 2487870 2451355 2484637 2528324 2426199 2340511 2364431
15798B364431L33j1407Q561K7761N8535j4112o1193j1585M6884k1286r1416J710
$$ 2364431 2364764 2353357 2361918 2389679 2448214 2434102 2372909 2361324 2408208 2386922 2295506 2297216
15786B297216N2601M2752j5343K4636l3613l4858P5417J30411p7296q7080L367
$$ 2297216 2349817 2392569 2377226 2401862 2368249 2333391 2408808 2539219 2461923 2374843 2378210
15775B378210j7835J28267l7582L648o7080K8765J18705j18791m7092L1948P423
$$ 2378210 2360375 2488642 2451060 2454708 2387628 2416393 2535098 2416307 2369215 2401163 2408586
15764B408586J3072o597j4510j8870j39315N8817Q7577j367k4410Q4l4208N4356
$$ 2408586 2421658 2415061 2400551 2381681 2242366 2301183 2388760 2387393 2362983 2363067 2328859 2383215
15752B383215l2411j4792J13174j0771j27800P7531N8213m7978n0575N8932M6927
$$ 2383215 2350804 2336012 2449186 2438415 2310615 2388146 2446359 2398381 2347806 2406738 2453665
$$ [...]
##END NTUPLES=NMR SPECTRUM
##END=
