##TITLE=1H_CG-1212-1
 CDCl3
 8 sc, 
 13.9.2024
##JCAMPDX= 6.0         $$ Bruker NMR JCAMP-DX V2.0
##DATA TYPE= NMR SPECTRUM
##DATA CLASS= NTUPLES
##ORIGIN= UXNMR, Bruker Analytische Messtechnik GmbH
##OWNER= root
$$ XWIN-NMR		Version 3.5
$$ Fri Sep 13 13:58:49 2024 Russian Standard Time (UT+4h)  she@DPX200
##.OBSERVE FREQUENCY= 200.1318
##.OBSERVE NUCLEUS= ^1H
##.ACQUISITION MODE= SIMULTANEOUS
##.ACQUISITION SCHEME= undefined
##.AVERAGES= 8
##.DIGITISER RES= 18
##SPECTROMETER/DATA SYSTEM= spect
##.PULSE SEQUENCE= zg30
##.SOLVENT NAME= CDCl3
##.SHIFT REFERENCE= (INTERNAL, CDCl3, 0, 21.0061)
##AUDIT TRAIL= $$ (NUMBER, WHEN, WHO, WHERE, WHAT)
$$ ##TITLE= Audit trail, XWIN-NMR		Version 3.5
$$ ##JCAMPDX= 5.01
$$ ##ORIGIN= Bruker BioSpin GmbH
$$ ##OWNER= she
$$ F:/spectra/data/she/nmr/H-F/1/pdata/1/auditp.txt
$$ ##AUDIT TRAIL=  $$ (NUMBER, WHEN, WHO, WHERE, WHAT)
(   1,<2024-09-13 13:57:11.53 +0400>,<she>,<DPX200>,
      <created by zg, POWCHK disabled, PULCHK disabled
       configuration hash MD5:
       00 E9 B6 7A A2 85 ED C7 34 08 36 98 17 FE 4E 26
       data hash MD5: 16K
       46 00 3A 4E 7C B7 90 88 87 D5 16 32 A5 3F 9E D4>)
(   2,<2024-09-13 13:57:21.15 +0400>,<she>,<DPX200>,
      <Start of raw data processing
       efp BC_mod = 2 LB = 0.24 FT_mod = 6 PKNL = 1 PHC0 = -26006.64 PHC1 = 17.38748 SI = 16K 
       data hash MD5: 16K
       8E 6C 88 73 C8 67 46 F8 AF 18 B9 01 79 71 6E BF>)
(   3,<2024-09-13 13:57:52.39 +0400>,<she>,<DPX200>,
      <pk PHC0 = -151.0569 PHC1 = -5.8 
       data hash MD5: 16K
       37 F3 60 82 ED DC 1F 26 4A A6 AC 5C 95 F4 04 BD>)
(   4,<2024-09-13 13:57:55.67 +0400>,<she>,<DPX200>,
      <abs ABSG = 5 
       data hash MD5: 16K
       8E C7 3F F7 29 AB 51 DD B2 C5 46 79 50 F2 49 E3>)
(   5,<2024-09-13 13:58:24.46 +0400>,<she>,<DPX200>,
      <abs ABSG = 5 
       data hash MD5: 16K
       CE 0B DB D8 A5 D6 86 B4 96 7B AD 2A DC 3F F1 9A>)
$$ ##END=
$$ 
$$ hash MD5
$$ 40 1B 0B 39 A2 BD 5F 24 CF C6 57 04 1D 64 8A 14
##$RELAX= 
##$RELAX= 
##$RELAX= 
##$RELAX= 
##$RELAX= 
##$RELAX= 
$$ Bruker specific parameters
$$ --------------------------
##$DU= <F:/spectra>
##$EXPNO= 1
##$NAME= <H-F>
##$PROCNO= 1
##$TYPE= <nmr>
##$USER= <she>
##$AMP= (0..31)
100 100 100 100 100 100 100 100 100 100 100 100 100 100 100 100 100 100 
100 100 100 100 100 100 100 100 100 100 100 100 100 100 
##$AQSEQ= 0
##$AQ_mod= 1
##$AUNM= <au_zg>
##$AUTOPOS= <>
##$BF1= 200.13
##$BF2= 200.13
##$BF3= 200.13
##$BF4= 200.13
##$BF5= 200.13
##$BF6= 200.13
##$BF7= 200.13
##$BF8= 200.13
##$BYTORDA= 1
##$CFDGTYP= 0
##$CFRGTYP= 5
##$CHEMSTR= <none>
##$CNST= (0..31)
1 1 145 1 1 1 1 1 1 1 1 1 1 1 1 1 1 1 1 1 1 1 1 1 1 1 1 1 1 1 1 1 
##$CPDPRG= <>
##$CPDPRG1= <>
##$CPDPRG2= <>
##$CPDPRG3= <>
##$CPDPRG4= <mlev>
##$CPDPRG5= <mlev>
##$CPDPRG6= <mlev>
##$CPDPRG7= <mlev>
##$CPDPRG8= <mlev>
##$CPDPRGB= <>
##$CPDPRGT= <>
##$D= (0..31)
0 1.2 0 0 0 0 0 0 0 0.06 0 0.03 0 0 0 0 0.0002 0 0 0 0 0 0 0 0 0 0 0 0 
0 0 0 
##$DATE= 1726221431
##$DBL= (0..7)
$$ [...]
##$SUBNAM3= <"">
##$SUBNAM4= <"">
##$SUBNAM5= <"">
##$SUBNAM6= <"">
##$SUBNAM7= <"">
##$SUBNAM8= <"">
##$SUBNAM9= <"">
##$SW= 24.0689170037331
##$SWIBOX= (0..15)
0 0 2 0 0 0 0 0 0 0 0 0 0 0 0 0 
##$SW_h= 4816.95568400771
##$TD= 16384
##$TD0= 1
##$TE= 0
##$TE2= 300
##$TE3= 300
##$TEG= 300
##$TL= (0..7)
0 120 120 120 120 120 120 120 
##$TP= (0..7)
150 150 150 150 150 150 150 150 
##$TP07= 0
##$TPNAME0= <>
##$TPNAME1= <>
##$TPNAME2= <>
##$TPNAME3= <>
##$TPNAME4= <>
##$TPNAME5= <>
##$TPNAME6= <>
##$TPNAME7= <>
##$TPOAL= (0..7)
0.5 0.5 0.5 0.5 0.5 0.5 0.5 0.5 
##$TPOFFS= (0..7)
0 0 0 0 0 0 0 0 
##$TUNHIN= 0
##$TUNHOUT= 0
##$TUNXOUT= 0
##$USERA1= <user>
##$USERA2= <user>
##$USERA3= <user>
##$USERA4= <user>
##$USERA5= <user>
##$V9= 5
##$VALIST= <valist>
##$VCLIST= <CCCCCCCCCCCCCCC>
##$VD= 0
##$VDLIST= <DDDDDDDDDDDDDDD>
##$VPLIST= <PPPPPPPPPPPPPPP>
##$VTLIST= <TTTTTTTTTTTTTTT>
##$WBST= 1024
##$WBSW= 4
##$XGAIN= (0..3)
0 0 0 0 
##$XL= 0
##$YL= 0
##$YMAX_a= 350315
##$YMIN_a= -316265
##$ZGOPTNS= <>
##$ZL1= 120
##$ZL2= 120
##$ZL3= 120
##$ZL4= 120
##$ABSF1= 21.00614
##$ABSF2= -3.062994
##$ABSG= 5
##$ABSL= 3
##$ALPHA= 0
##$AQORDER= 0
##$ASSFAC= 0
##$ASSFACI= 0
##$ASSFACX= 0
##$ASSWID= 0
##$AUNMP= <proc_1d>
##$AZFE= 0.1
##$AZFW= 0.1
##$BCFW= 0
##$BC_mod= 2
##$BYTORDP= 0
##$COROFFS= 0
##$CY= -3
##$DATMOD= 1
##$DC= 0
##$DFILT= <>
##$DTYPP= 0
##$F1P= 0
##$F2P= 0
##$FCOR= 1
##$FTSIZE= 16384
##$FT_mod= 6
##$GAMMA= 0
##$GB= 0
##$INTBC= 1
##$INTSCL= 3.70164e-10
##$ISEN= 128
##$LB= 0.24
##$LEV0= 0
##$LPBIN= 0
##$MAXI= 10000
##$MC2= 0
##$MEAN= 0
##$ME_mod= 0
##$MI= 1.114404
##$NCOEF= 0
##$NC_proc= -6
##$NLEV= 6
##$NOISF1= 3.799351
##$NOISF2= 2.8
##$NSP= 0
##$NTH_PI= 0
##$NZP= 0
##$OFFSET= 21.00614
##$PC= 1
##$PHC0= -26157.7
##$PHC1= 11.58748
##$PH_mod= 1
##$PKNL= yes
##$PPARMOD= 0
##$PSCAL= 0
##$PSIGN= 0
##$REVERSE= no
##$SF= 200.13000451941
##$SI= 16384
##$SIGF1= 3
##$SIGF2= 2
##$SINO= 5.538805
##$SIOLD= 16384
##$SREGLST= <1H.CDCl3>
##$SSB= 0
##$STSI= 16384
##$STSR= 0
##$SW_p= 4816.95568400771
##$SYMM= 0
##$S_DEV= 0
##$TDeff= 16384
##$TDoff= 0
##$TI= <>
##$TILT= no
##$TM1= 0
##$TM2= 0
##$TOPLEV= 0
##$USERP1= <user>
##$USERP2= <user>
##$USERP3= <user>
##$USERP4= <user>
##$USERP5= <user>
##$WDW= 1
##$XDIM= 16384
##$YMAX_p= 473589999
##$YMIN_p= -280748
$$ End of Bruker specific parameters
$$ ---------------------------------
##NTUPLES= NMR SPECTRUM
##VAR_NAME=  FREQUENCY,     SPECTRUM/REAL,   SPECTRUM/IMAG
##SYMBOL=    X,             R,               I
##VAR_TYPE=  INDEPENDENT,   DEPENDENT,       DEPENDENT
##VAR_FORM=  AFFN,          ASDF,            ASDF
##VAR_DIM=   16384,         16384,           16384
##UNITS=     HZ,            ARBITRARY UNITS, ARBITRARY UNITS
##FACTOR=    0.29402158847633, 1,            1
##FIRST=     4203.95884415335, 0,            0
##LAST=      -612.996839854365, 0,           0
##MIN=       -612.996839854365, -280748,     0
##MAX=       4203.95884415335, 473589999,    0
$$ Real data points
##PAGE= N=1
##DATA TABLE= (X++(R..R)), XYDATA
$$ [...]
$$ plain form
5628 19815 -48818 -95265 -53681 -14402 -22515 -26058 -49584 12505 -1298 -4601 30298 25617 -7723
5615 -7723 -5637 38057 23237 -6558 14900 10765 35866 20127 -9080 18594 -12191 -35138
5603 -35138 -30114 -10979 -4854 -9942 -32699 -60086 -36183 9422 1003 -12772 -14821 -3707 -4188
5590 -4188 -57954 -23368 13983 -7892 -3561 -47844 -42175 -19845 -13799 30399 26976 25573 40920
5577 40920 -11674 54680 37433 47066 79963 56675 32304 43307 966 37341 50968 4914
5565 4914 24473 -5886 -60092 -22616 -25222 -24997 20856 67799 14663 -25747 -22698 -34917 -18994
5552 -18994 -11053 -13671 -31239 -53863 -36297 -20788 -24511 938 786 -22849 11695 55389 29281
5539 29281 52617 -37619 -53300 -67149 -54097 -17165 -16761 -2318 -14850 -1108 11797 5244
$$ packed form
5628A9815o8633m6447M1584L9279q113l543k3526O2089j3803l303L4899m681l3340
5615g723K086M3694j4820k9795K1458m135K5101j5739k9207K7674l0785k2947
5603c5138N024J9135O125n088k2757k7387K3903M5605q419j3775k049J1114m81
5590d188n3766L4586L7351k1875M331m4283N669K2330O046M4198l423j403J5347
5577D0920n2594O6354j7247R633L2897k3288k4371J1003m2341L6375J3627m6054
5565D914J9559l0359n4206L7476k606K25M5853M6943n3136m0410L049j2219J5923
5552a8994P941k618j7568k2624J7566J5509l723K5449j52k3635L4544M3694k6108
5539B9281K3336r0236j5681j3849J3052L6932M04J4443j2532J3742J2905o553
$$ plain form
5527 5244 -43785 -4466 -46543 -35524 20238 -7638 -16091 -24555 -53488 -67423 -17776 -41803
5515 -41803 -49297 -84432 -21388 -8742 -69470 -20386 -11680 18073 -28955 -25934 -40211 -25612
5503 -25612 -36377 -39772 -56005 -30824 29706 -4403 -9699 -33445 -9843 -21286 4491 14779
5491 14779 8386 -27058 -3548 13252 13133 -7658 -35164 -35232 -38548 -584 -20925 -31877 -11837
5478 -11837 -30164 -15800 -70012 -47955 -40266 -33876 6552 -34000 -54529 -33075 -5202 -28360
5466 -28360 -9890 -56025 -73859 -71038 -69114 -23097 -26057 -13124 -3770 25585 3148 14151 -8620
5453 -8620 -32316 6405 -37641 -830 7436 60510 11891 -45024 -57814 5372 -43276 -64388
5441 -64388 -52897 -59254 -16444 -4087 -40788 -56742 -22574 -44914 -6108 -33213 -41925 -103562
$$ packed form
5527E244m9029L9319m2077J1019N5762k7876q453q464k8933j3935M9647k4027
5515d1803p494l5135O3044J2646o0728M9084Q706K9753m7028L021j4277J4599
5503b5612j0765l395j6233K5181O0530l4109n296k3746K3602j1443K5777J0288
5491A4779o393l5444K3510J6800j19k0791k7506o8l316L7964k0341j0952K0040
5478a1837j8327J4364n4212K2057P689O390M0428m0552k0529K1454K7873k3158
5466b8360J8470m6135j7834K821J924M6017k960J2933R354K9355k2437J1003k2771
5453h620k3696L8721m4046L6811Q266N3074m8619n6915j2790O3186m8648k1112
5441f4388J1491o357M2810J2357l6701j5954L4168k2340L8806k7105q712o1637
$$ plain form
5429 -103562 -58055 -34070 -46780 -9969 -25439 1304 -55052 -14005 57344 3434 14414 11549
5417 11549 -33465 -51929 -6365 -17110 -68995 -70679 -48775 -46343 -5234 44400 -22393 -14322
5405 -14322 -59808 -22971 -17604 -19234 -10859 -22804 -20832 -29800 -25623 -17191 -10882 -59322 -45824
5392 -45824 -15611 -29610 -52742 -65193 -4630 -35598 -30491 -29900 -45225 -32758 -18642 -4850
5380 -4850 -13482 -8524 -39828 -3591 21139 33771 -15222 1454 -19021 3095 9252 -23536 -24197
5367 -24197 25301 19761 13754 4012 13479 15241 -22039 13 -34839 -46717 -20983 -38910 -41694
5354 -41694 -11864 -27219 -43960 10871 -18695 5808 -10373 -25617 -48131 8359 -4918 -18018
5342 -18018 -15552 -19107 -20260 2117 -14637 -27252 -3013 -11577 8969 -34543 -54837 -10693 -60026
$$ packed form
5429a03562M5507K3985j2710L6811j5470K6743n6356M1047P1349n3910J0980k865
5417A1549m5014j8464M5564j0745n1885j684K1904K432M1109M9634o6793Q071
5405a4322m5486L6837N367j630Q375j1945J972q968M177Q432O309m8440J3498
5392d5824L0213j3999k3132j2451O0563l0968N107N91j5325J2467J4116J3792
5380d850q632M958l1304L6237K4730J2632m8993J6676k0475K2116O157l2788o61
5367b4197M9498n540o007r742R467J762l7280K2052l4852j1878K5734j7927k784
5354d1694K9830j5355j6741N4831k9566K4503j6181j5244k2514N6490j3277j3100
5342a8018K466l555j153K2377j6754j2615K4239q564K0546m3512k0294M4144m9333
$$ plain form
5329 -60026 -31564 -13022 -67721 -46075 13937 19799 -1491 -4411 -32812 1781 -11507 -42849
5317 -42849 -12111 -44221 2215 -7282 12265 -15290 -7870 28333 17975 -19149 -36355 16301
5305 16301 28642 43063 25179 -8059 17044 67618 32076 29500 31180 22475 -8093 -26271
5293 -26271 -38264 5280 -38363 -19927 -9796 19695 11235 19994 20307 24677 2595 35231 16927
5280 16927 -3532 -35601 6326 -10100 -25601 37789 -8230 4554 5320 -1290 -3475 40080 9554
5267 9554 6519 5953 -17747 27184 8397 21306 -42259 -32729 47787 59914 -8969 13571 -14162
5254 -14162 14880 35196 -8136 -26398 -16492 -20869 35135 -34762 6496 -150 24309 54385
5242 54385 57896 11149 -49036 -10406 -16225 40676 38364 79964 82876 33944 67012 71333 64949
$$ packed form
5329f0026K8462J8542n4699K1646O0012N862k1290k920k8401L4593j3288l1342
5317d2849L0738l2110M6436r497J9547k7555P420L6203j0358l7124j7206N2656
5305A6301J2341J4421j7884l3238K5103N0574l5542k576J680q705l0568j8178
5293b6271j1993M3544m3643J8436J0131K9491q460Q759L13M370k2082L2636j8304
5280A6927k0459l2069M1927j6426j5501O3390m6019J2784P66o610k185M3555l0526
5267I554l035n66k3700M4931j8787J2909o3565R530Q0516J2127o8883K2540k7733
5254a4162K9042K0316m3332j8262R906m377N6004o9897M1258o646K4459L0076
5242E4385L511m6747o0185L8630n819N6901k312M1600K912m8932L3068M321o384
$$ plain form
5229 64949 34040 10091 59750 44987 80061 60826 95890 19529 13609 4121 -6334 64517
5217 64517 78723 63911 33105 37874 37572 52558 31380 61116 103402 76632 62822 93334
5205 93334 72105 20683 23260 59444 62085 53764 76348 97240 105767 55448 58188 74817 76220
5192 76220 93195 93605 83276 130314 116945 87726 33953 77587 117737 143796 109939 80638
5180 80638 85225 75121 76519 105892 102624 61945 41640 51917 91621 124516 107436 95066
5168 95066 117503 111916 49173 60775 97980 95421 149555 136878 96608 103577 96001 117586 110550
5155 110550 34604 64956 124684 86461 84891 120583 148763 128211 97718 122435 160033 155369
5143 155369 192267 198527 198289 202016 170652 207080 255862 201005 201595 207520 204313 177837 202695
$$ packed form
5229F4949l0909k3949M9659j4763L5074j9235L5064p6361n920r488j0455P0851
5217F4517J4206j4812l0806M769l02J4986k1178K9736M2286k6770j3810L0512
5205I3334k1229n1422K577L6184K641q321K2584K0892Q527n0319K740J6629J403
5192G6220J6975M10j0329M7038j3369k9219n3773M3634M0150K6059l3857k9301
5180H0638M587j0104J398K9373l268m0679k0305J0277L9704L2895j7080j2370
5168I5066K2437n587o2743J1602L7205k559N4134j2677m0270O969p576K1585p036
5155A10550p5946L0352N9728l8223j570L5692K8180k0552l0493K4717L7598m664
5143A55369L6898O260k38L727l1364L6428M8782n4857N90N925l207k6476K4858
$$ plain form
5130 202695 256649 246160 207815 217779 233510 247073 241015 268658 285573 251902 222078 197832
5118 197832 280963 259204 275469 270457 218031 263159 284965 281035 301421 302031 316112 348720
5106 348720 364709 326891 302889 285096 326673 343155 339718 363140 382774 372767 397365 415120
5094 415120 382464 396901 376727 411743 380173 338679 408878 440826 424556 404450 450142 438385
5082 438385 463970 442317 411304 386386 377345 342925 334418 374708 363881 372224 403328 431672
5070 431672 382614 359952 397601 402277 386234 438152 449631 426557 401763 440508 445383 400189
5058 400189 365744 384682 376256 356999 354646 332247 341903 301325 321081 386908 423358 391679
5046 391679 378225 383094 386327 368477 370397 363767 331858 332085 334391 363365 342307 349822 368977
$$ packed form
5130B02695N3954j0489l8345R964J5731J3563o058K7643J6915l3671k9824k4246
5118A97832Q3131k1759J6265n012n2426M5128K1806l930K0386O10J4081L2608
5106C48720J5989l7818k4002j7793M1577J6482l437K3422J9634j0007K4598J7755
5094D15120l2656J4437k0174L5016l1570m1494P0199L1948j6270k0106M5692j1757
5082D38385K5585k1653l1013k4918r041l4420q507M0290j0827Q343L1104K8344
5070D31672m9058k2662L7649M676j6043N1918J1479k3074k4794L8745M875m5194
5058D00189l4445J8938q426j9257k353k2399R656m0578J9756O5827L6450l1679
5046C91679j3454M869L233j7850J920o630l1909K27K306K8974k1058P515J9155
$$ plain form
5033 368977 405870 348860 373214 384080 398303 356987 336454 376490 388347 389524 382784 387202
5021 387202 350094 362631 405595 408079 404265 419188 431691 438122 443646 500432 456245 481044
5009 481044 483763 468049 461030 478487 514554 496881 442356 431035 546979 533375 494413 515438
4997 515438 536793 603770 602749 573779 614767 607002 564093 568975 586132 654456 637754 654502
4985 654502 629971 626956 654455 678163 663907 695405 723994 676815 660227 715713 771012 816899
4973 816899 751108 758984 761552 830052 820691 864913 877042 882604 899785 895922 935782 937707 945780
4960 945780 994979 943753 909273 996397 1023191 1019067 1059238 1060272 1077036 1139345 1193642 1224605
4948 1224605 1238276 1277980 1254054 1277309 1255023 1309635 1337252 1412515 1518030 1539033 1520676
$$ packed form
5033C68977L6893n7010K4354J0866J4223m1316k0533M0036J1857J177o740M418
5021C87202l7108J2537M2964K484l814J4923J2503O431N524N6786m4187K4799
5009D81044K719j5714p019J7457L6067j7673n4525j1321J15944j3604l8962K1025
4997E15438K1355O6977j021k8970M0988p765m2909M882J7157O8324j6702J6748
4985F54502k4531l015K7499K3708j4256L1498K8589m7179j6588N5486N5299M5887
4973H16899o5791P876K568O8500r361M4222J2129N562J7181l863L9860J925Q073
4960I45780M9199n1226l4480Q7124K6794m124M0171J034J6764O2309N4297L0963
4948A224605J3671L9704k3926K3255k2286N4612K7617P5263J05515K1003j8357
$$ plain form
4937 1520676 1557591 1586758 1667629 1724578 1750462 1833815 1927217 1996350 2068391 2160309 2241985
4926 2241985 2321111 2377045 2496442 2659258 2734408 2801255 2901989 3044564 3137216 3253322
4916 3253322 3378666 3482744 3613063 3647744 3746699 3944389 4017799 4129703 4258488 4428667
4906 4428667 4639380 4817260 5018509 5231083 5471180 5717160 5987327 6271688 6586074 6915689
4896 6915689 7161402 7514187 7832537 8156579 8443972 8712635 9077333 9438031 9797138 10274814
4886 10274814 10757266 11331473 11990750 12762222 13668227 14787156 16019231 17320700 18529447
4877 18529447 19605121 20310464 20748242 20902935 20811717 20634570 20458599 20396479 20369318 20511954
4867 20511954 20805039 21218146 21821501 22694909 23745094 25136663 26865551 29073606 31570691
$$ packed form
4937A520676L6915K9167Q0871N6949K5884Q3353R3402O9133P2041R1918Q1676
4926B241985P9126N5934J19397J62816P5150O6847J00734J42575R2652J16106
4916C253322J25344J04078J30319L4681R8955J97690P3410J11904J28785J70179
4906D428667K10713J77880K01249K12574K40097K45980K70167K84361L14386L29615
4896F915689K45713L52785L18350L24042K87393K68663L64698L60698L59107M77676
4886A0274814M82452N74207O59277P71472R06005J118929J232075J301469J208747
4877A8529447J075674P05343M37778J54693r1218j77147j75971o2120k7161J42636
4867B0511954K93085M13107O03355Q73408J050185J391569J728888K208055K497085
$$ plain form
4858 31570691 34305344 36927412 39001204 40243794 40413038 39524540 37934218 36142540
4850 36142540 34193287 32370147 30735685 29312767 28287135 27649547 27268613 27208967 27436086
4841 27436086 27990582 28935708 30255918 31878463 33680085 35245020 36297260 36542635 35794052
4832 35794052 34443105 32548047 30573744 28595291 26554233 24637661 23026410 21648580
4824 21648580 20527720 19623906 18828938 18170918 17692837 17325633 17041534 16893438 16852816
4815 16852816 16710587 16337410 15854402 15201430 14504408 13767074 13054036 12326636 11645091
4806 11645091 11010043 10410423 9945890 9543082 9207738 8786186 8343446 7944063 7540802
4797 7540802 7224518 6903616 6605594 6406089 6249798 6043853 5788139 5575222 5389240 5176094
$$ packed form
4858C1570691K734653K622068K073792J242590J69244q88498j590322j791678
4850C6142540j949253j823140j634462j422918j025632o37588l80934n9646K27119
4841B7436086N54496R45126J320210J622545J801622J564935J052240K45375p48583
4832C5794052j350947j895058j974303j978453k041058j916572j611251j377830
4824B1648580j120860r03814p94968o58020m78081l67204k84099j48096m0622
4815A6852816j42229l73177m83008o52972o97022p37334p13038p27400o81545
4806A1645091o35048n99620m64533m02808l35344m21552m42740l99383m03261
4797G540802l16284l20902k98022j99505j56291k05945k55714k12917j85982k13146
$$ plain form
4787 5176094 4986887 4795945 4691113 4559412 4412872 4319559 4234284 4145906 4081305 4061017
4777 4061017 3975678 3949126 3896675 3899330 3896195 3885388 3835291 3809391 3765300 3722680 3656602 3593403
4765 3593403 3557775 3571284 3472252 3406982 3389710 3377470 3381729 3343854 3366763 3392649 3399369 3441560
4753 3441560 3473546 3540740 3562732 3609221 3686417 3744264 3762773 3747812 3790503 3815051 3892799
4742 3892799 3984336 4052305 4132526 4229167 4317629 4401887 4468884 4607382 4781082 4906413 5009672
4731 5009672 5158739 5299693 5449299 5639145 5748042 5817245 5970489 6124509 6270902 6457950
4721 6457950 6611689 6809940 7096038 7362306 7555242 7729810 7933960 8086280 8245146 8453361
4711 8453361 8618221 8899822 9148991 9426826 9671346 9946193 10197120 10504768 10856545 11228638
$$ packed form
4787E176094j89207j90942j04832j31701j46540r3313q5275q8378o4601k0288
4777D061017q5339k6552n2451K655l135j0807n0097k5900m4091m2620o6078o3199
4765C593403l5628J3509r9032o5270j7272j2240M259l7875K2909K5886O720M2191
4753C441560L1986O7194K1992M6489P7196N7847J8509j4961M2691K4548P7748
4742C892799R1537O7969Q0221R6641Q8462Q4258O6997J38498J73700J25331J03259
4731E009672J49067J40954J49606J89846J08897O9203J53244J54020J46393J87048
4721F457950J53739J98251K86098K66268J92936J74568K04150J52320J58866K08215
4711H453361J64860K81601K49169K77835K44520K74847K50927L07648L51777L72093
$$ plain form
4701 11228638 11685633 12338057 12977367 13823607 14744239 15704168 16695343 17551583 18211343
4692 18211343 18654712 18925793 18993620 19164692 19328954 19597016 19912401 20405669 21104009 22129050
4682 22129050 23429436 25103579 27096681 29319717 31367140 33186443 34476645 35248915
4674 35248915 35515810 35296025 34645867 33581496 32410245 31330797 30338199 29437982 28728172
4665 28728172 28372362 28374700 28709110 29560722 31000617 33130089 35758576 38477692 40527087
4656 40527087 41414259 41170359 40176691 38575947 36559025 34259439 31865283 29648646 27647431
4647 27647431 25910587 24353415 23113800 22095749 21290364 20754160 20541379 20572326 20910242
4638 20910242 21388816 21985727 22449353 22499625 22120423 21312076 20253381 19069246 17792526
$$ packed form
4701A1228638M56995O52424O39310Q46240R20632R59929R91175Q56240O59760
4692A8211343M43369K71081O7827J71072J64262K68062L15385M93268O98340J025041
4682B2129050J300386J674143J993102K223036K047423J819303J290202P72270
4674C5248915K66895k19785o50158j064371j171251j079448r92598r00217p09810
4665B8728172l55810K338L34410Q51612J439895K129472K628487K719116K049395
4656D0527087Q87172k43900r93668j600744k016922k299586k394156k216637k001215
4647B7647431j736844j557172j239615j018051q05385n36204k12781L0947L37916
4638B0910242M78574N96911M63626N0272l79202q08347j058695j184135j276720
$$ plain form
4629 17792526 16520822 15362867 14285725 13402699 12679635 12107651 11611755 11219350 10992638
4620 10992638 10746311 10665680 10673302 10731896 10809640 10788091 10626690 10462625 10198371 9934637
4610 9934637 9757098 9579133 9431942 9382799 9332188 9308610 9282123 9333511 9364775 9385418 9410049
4599 9410049 9388509 9318144 9180818 9084579 8923055 8741868 8560863 8383934 8218616 8133147
4589 8133147 8025019 8051806 8024936 8132381 8208475 8227186 8189111 8105103 7891410 7661351 7434527
4578 7434527 7129425 7055342 6921565 6859696 6784717 6690850 6633614 6578253 6605910 6616963 6668718
4567 6668718 6770878 6874365 6949684 7081491 7280938 7526413 7736739 8031244 8316406 8516795
4557 8516795 8696879 8864980 8945185 9052478 9243480 9368180 9522508 9746927 10004400 10255529
$$ packed form
4629A7792526j271704j157955j077142q83026p23064n71984m95896l92405k26712
4620A0992638k46327q0631P622N8594P7744k1549j61401j64065k64254k63734
4610I934637j77539j77965j47191m9143n0611k3578k6487N1388L1264K0643K4631
4599I410049k1540p0365j37326r6239j61524j81187j81005j76929j65318q5469
4589H133147j08128K6787k6870J07445P6094J8711l8075q4008k13693k30059k26824
4578G434527l05102p4083j33777o1869p4979r3867n7236n5361K7657J1053N1755
4567F668718J02160J03487P5319J31807J99447K45475K10326K94505K85162K00389
4557H516795J80084J68101Q0205J07293J91002J24700J54328K24419K57473K51129
$$ plain form
4547 10255529 10505012 10856305 11218744 11631739 12124669 12634014 13158816 13705581 14235138
4538 14235138 14823292 15434598 16102593 16883473 17744325 18760965 19993600 21395785 22842199
4529 22842199 24032105 24742378 24939212 24862161 24652278 24382370 24085014 23926661 23956303 24165254
4519 24165254 24449886 24982536 25834918 27047469 28564079 30372049 32272131 33801432 34818449
4510 34818449 35094623 34787844 33792110 32205850 30416960 28763580 27216856 25753265 24647627
4501 24647627 23772240 23028188 22459440 22274026 22288689 22649716 23199329 23695898 23894737 23401114
4491 23401114 22451956 21131558 19668440 18153607 16587002 15110373 13864521 12786286
4483 12786286 11762211 10897850 10103680 9350321 8744016 8215124 7766614 7283199 6915731
$$ packed form
4547A0255529K49483L51293L62439M12995M92930N09345N24802N46765N29557
4538A4235138N88154O11306O67995P80880Q60852J016640J232635J402185J446414
4529B2842199J189906P10273J96834p7051k09883k69908k97356j58353K9642K08951
4519B4165254K84632N32650Q52382J212551J516610J807970J900082J529301J017017
4510C4818449K76174l06779r95734j586260j788890j653380j546724j463591j105638
4501B4647627q75387p44052n68748j85414J4663L61027N49613M96569J98839m93623
4491B3401114r49158j320398j463118j514833j566605j476629j245852j078235
4483A2786286j024075q64361p94170p53359o06305n28892m48510m83415l67468
$$ plain form
4474 6915731 6541100 6220097 5918704 5653926 5476758 5255310 4991300 4801852 4647133 4476099
4464 4476099 4338667 4212858 4052976 3920106 3779422 3674351 3620982 3552415 3444824 3375089
4454 3375089 3263913 3150122 3087433 3075255 2983022 2865665 2827626 2778083 2741996 2678930 2620825
4443 2620825 2578621 2526545 2497796 2467542 2475779 2453673 2381261 2366893 2358389 2398138 2359340 2364929
4431 2364929 2319939 2315813 2285185 2269864 2279048 2276031 2241595 2241811 2249222 2289026 2271587 2309951 2318805
4418 2318805 2324931 2410554 2542758 2614582 2647172 2731288 2799477 2852973 2806037 2777537 2768533 2768576
4406 2768576 2695462 2617587 2656389 2608391 2564493 2526375 2532077 2554802 2548807 2580898 2609702 2697046
4394 2697046 2723592 2780932 2847850 2973936 3092704 3285693 3360969 3400039 3399040 3390447 3310003
$$ packed form
4474F915731l74631l21003l01393k64778j77168k21448k64010j89448j54719j71034
4464D476099j37432j25809j59882j32870j40684j05071n3369o8567j07591o9735
4454C375089j11176j13791o2689j2178r2233j17357l8039m9543l6087o3066n8105
4443B620825m2204n2076k8749l0254Q237k2106p2412j4368q504L9749l8798N589
4431B364929m4990m126l0628j5321R184l017l4436K16P411L9804j7439L8364Q854
4418B318805O126Q5623J32204P1824L2590Q4116O8189N3496m6936k8500r004M3
4406B768576p3114p7875L8802m7998m3898l8118N702K2725n995L2091K8804Q7344
4394B697046K6546N7340O6918J26086J18768J92989P5276L9070r99q593q0444
$$ plain form
4383 3310003 3133388 3002345 2924066 2809520 2655744 2516659 2462025 2424143 2317875 2296954
4373 2296954 2282140 2246611 2232151 2221419 2194479 2224585 2253018 2275657 2336014 2334868 2332092 2319297
4361 2319297 2233392 2140411 2073683 2028516 1934004 1874791 1871556 1772188 1726993 1638192 1571468 1543993
4349 1543993 1546560 1507554 1462248 1448718 1402036 1365103 1417318 1398371 1417077 1440251 1548913
4338 1548913 1573225 1652703 1734567 1847365 1929519 1901494 1854959 1820410 1847090 1764973 1746393
4327 1746393 1665359 1656616 1614248 1580539 1560703 1606725 1616330 1643343 1698768 1785085 1854439 1938935
4315 1938935 2085148 2268185 2531434 2870837 3238504 3467519 3542439 3410555 3250285 3123287
4305 3123287 3018378 2823287 2596914 2405301 2273651 2177254 2111509 1991448 1940208 1944539
$$ packed form
4383C310003j76615j31043p8279j14546j53776j39085n4634l7882j06268k0921
4373B296954j4814l5529j4460j0732k6940L0106K8433K2639O0357j146k776j2795
4361B319297q5905r2981o6728m5167r4512n9213l235r9368m5195q8801o6724k7475
4349A543993K567l9006m5306j3530m6682l6933N2215j8947J8706K3174J08662
4338A548913K4312P9478Q1864J12798Q2154k8025m6535l4549K6680q2117j8580
4327A746393q1034q743m2368l3709j9836M6022R605K7013N5425Q6317O9354Q4496
4315A938935J46213J83037K63249L39403L67667K29015P4920j31884j60270j26998
4305C123287j04909j95091k26373j91613j31650r6397o5745j20061n1240M331
$$ plain form
4295 1944539 1866975 1891952 1948781 2057541 2167887 2349984 2550528 2829996 3200428 3492935
4285 3492935 3610244 3586965 3409788 3196857 3070059 2895315 2627886 2406670 2223876 2056081
4275 2056081 1935712 1813008 1692171 1659390 1641699 1641712 1615249 1546073 1546034 1605258 1648294 1757723
4263 1757723 1895523 1949739 2000181 1990975 1877080 1823287 1791429 1741691 1667552 1587790 1549541
4252 1549541 1518592 1417117 1386922 1286576 1251978 1201398 1157520 1105554 1073441 1071465 1100483
4241 1100483 1048569 1006254 1020092 952735 969667 968599 986053 988353 998327 1063331 1109447 1151676
4229 1151676 1205773 1217452 1222598 1210576 1206508 1211396 1163091 1170173 1148701 1123598 1060317 1027824
4217 1027824 929360 950801 961583 911011 933121 948703 906438 872193 899894 878431 856681
$$ packed form
4295A944539p7564K4977N6829J08760J10346J82097K00544K79468L70432K92507
4285C492935J17309k3279j77177k12931j26798j74744k67429k21216j82794j67795
4275B056081j20369j22704j20837l2781j7691J3k6463o9176l9N9224M3036J09429
4263A757723J37800N4216N0442r206j13895n3793l1858m9738p4139p9762l8249
4252A549541l0949j01475l0195j00346l4598n0580m3878n1966l2113j976K9018
4241A100483n1914m2315J3838o7357J6932j068J7454K300R974O5004M6116M2229
4229A151676N4097J1679N146j2022m068M888m8305P082k1472k5103o3281l2493
4217A027824r8464K1441J0782n0572K2110J5582m2265l4245K7701k1463k1750
$$ plain form
4206 856681 898767 979427 1020911 1079762 1031790 1011435 1034638 1018874 1022570 1036332 1006562 967440
4194 967440 918060 900541 837867 857025 829923 851540 854332 835166 822591 809307 813902 819315
4182 819315 823453 840675 841255 828551 835052 858855 864006 837262 850243 855354 843661 849030 814341
4169 814341 819492 819560 784112 788101 843247 820581 840084 819447 812062 803366 832971 856691 883129
4156 883129 847059 795897 810431 808162 806037 767954 826040 885816 842509 861205 906261 868498
4144 868498 898545 923718 879955 840295 848322 879926 858644 863737 823513 806139 851557 852203
4132 852203 900566 890713 893723 836833 890310 900827 840642 879829 923355 941550 926823 930296
4120 930296 925902 951753 1015542 1045759 1049846 1097310 1136077 1116080 1185686 1239382 1302524 1318045
$$ packed form
4206H56681M2086Q0660M1484N8851m7972k0355K3203j5764L696J3762k9770l9122
4194I67440m9380j7519o2674J9158k7102K1617K792j9166j2575j3284M595N413
4182H19315M138J7222N80j2704O501K3803N151k6744J2981N111j1693N369l4689
4169H14341N151O8l5448L989N5146k2666J9503k0637p385q696K9605K3720K6438
4156H83129l6070n1162J4534k269k125l8083N8086N9776m3307J8696M5056l7763
4144H68498L0047K5173m3763l9660Q027L1604k1282N093m0224j7374M5418O46
4132H52203M8363r853L010n6890N3477J0517o0185L9187M3526J8195j4727L473
4120I30296m394K5851O3789L0217M087M7464L8767j9997O9606N3696O3142J5521
$$ plain form
4108 1318045 1342773 1438163 1423467 1488795 1507362 1488719 1462646 1437118 1440159 1451411 1439580 1389392
4096 1389392 1412103 1399083 1414968 1444211 1492628 1526163 1552816 1550542 1543340 1554164 1540488 1546432
4084 1546432 1532965 1497824 1480977 1480688 1487469 1500192 1553642 1530801 1531191 1536362 1483254 1548073 1557540
4071 1557540 1590212 1631702 1647089 1667209 1741456 1754733 1779235 1807107 1849260 1912293 1914696 2010315
4059 2010315 2082345 2143342 2191428 2252943 2272917 2352452 2450751 2526971 2682984 2888672 3059772
4048 3059772 3197367 3484398 3868810 4343789 4887269 5522060 5752299 5733001 5501668 5176962
4038 5176962 5031070 4893127 4593333 4315572 4152828 3967784 3875565 3825247 3750178 3719214
4028 3719214 3707648 3706554 3746797 3787659 3865254 3936383 3959216 4093171 4241524 4317975 4420020
$$ packed form
4108A318045K4728R5390j4696O5328J8567j8643k6073k5528L041J1252j1831n0188
4096A389392K2711j3020J5885K9243M8417L3535K6653k274p202J0824j3676N944
4084A546432j3467l5141j6847k89O781J2723N3450k2841L90N171n3108O4819R467
4071A557540L2672M1490J5387K0120P4247J3277K4502K7872M2153O3033K403R5619
4059B010315P2030O0997M8086O1515J9974P9535R8299P6220J56013K05688J71100
4048C059772J37595K87031L84412M74979N43480O34791K30239j9298k31333l24706
4038E176962j45892j37943k99794k77761j62744j85044r2219n0318p5069l0964
4028C719214j1566j094M0243M0862P7595P1129K2833J33955J48353P6451J02045
$$ plain form
4017 4420020 4616688 4796165 5008407 5236040 5487006 5722270 6030089 6376110 6663681 7045132
4007 7045132 7429029 7874581 8386387 8901086 9523458 10285423 11218772 12454957 13837696
3998 13837696 15454131 17601956 20229907 23227704 25762493 26536938 25945113 25161033 24421758
3989 24421758 22930219 21332229 19669563 18178511 17130223 16363168 15399883 14419091 13668912
3980 13668912 13118964 12702728 12382983 12204493 12006741 11904474 11968960 12012224 12163051 12456357
3970 12456357 12792260 13229764 13692163 14211200 14846175 15486563 16256144 17151681 18098379
3961 18098379 19216470 20564301 22141938 23719680 25159277 26035875 26264756 26113278 25780808
3952 25780808 25406585 25054625 24741842 24536003 24567329 24732527 25171965 25949634 27045631
$$ packed form
4017D420020J96668J79477K12242K27633K50966K35264L07819L46021K87571L81451
4007G045132L83897M45552N11806N14699O22372P61965R33349J236185J382739
3998A3837696J616435K147825K627951K997797K534789P74445n91825p84080p39275
3989B4421758j491539j597990j662666j491052j048288p67055r63285r80792p50179
3980A3668912n49948m16236l19745j78490j97752j02267O4486M3264J50827K93306
3970A2456357L35903M37504M62399N19037O34975O40388P69581Q95537R46698
3961A8098379J118091J347831J577637J577742J439597Q76598K28881j51478l32470
3952B5780808l74223l51960l12783k05839L1326J65198M39438P77669J095997
$$ plain form
3943 27045631 28436891 30111009 31910194 33455874 34662406 35248379 35056359 34122259 32652907
3934 32652907 30881684 29106934 27403691 25850782 24576544 23520298 22561747 21916474
3926 21916474 21490430 21398821 21539346 21974078 22422163 22715638 22549178 21858261 20785646
3917 20785646 19586580 18336126 16967888 15645939 14414420 13344081 12368430 11509112
3909 11509112 10748072 10098554 9526391 9006308 8560988 8179874 7796534 7487737 7203144
3900 7203144 6931424 6704340 6524766 6355567 6258277 6132537 6013597 5907600 5850498 5825508
3890 5825508 5716093 5648342 5620019 5639083 5603608 5653463 5690923 5774658 5820734 5962834 6142166
3879 6142166 6331866 6648520 6986948 7199524 7330641 7347770 7303903 7285273 7193626 7141379
$$ packed form
3943B7045631J391260J674118J799185J545680J206532N85973j92020r34100j469352
3934C2652907j771223j774750j703243j552909j274238j056246r58551o45273
3926B1916474m26044r1609J40525M34732M48085K93475j66460o90917j072615
3917B0785646j199066j250454j368238j321949j231519j070339r75651q59318
3909A1509112p61040o49518n72163n20083m45320l81114l83340l08797k84593
3900G203144k71720k27084j79574j69199r7290j25740j18940j05997n7102k4990
3890E825508j09415o7751k8323J9064l5475M9855L7460Q3735M6076J42100J79332
3879F142166J89700L16654L38428K12576J31117J7129m3867j8630r1647n2247
$$ plain form
3869 7141379 7173508 7271573 7358606 7441258 7443108 7538126 7676520 7787195 7899494 7967227 8066061
3858 8066061 8035580 7943082 7854191 7730862 7622349 7467134 7313611 7163977 7069451 6995565
3848 6995565 6946792 6941673 6982306 7038739 7069495 7055626 6969319 6813331 6517126 6318068 6175024
3837 6175024 5921585 5728802 5544432 5444466 5335627 5307881 5205636 5123429 5163724 5106319
3827 5106319 5051688 5018132 5066995 5128648 5168172 5119231 5169592 5226037 5229477 5310961 5393718 5415317
3815 5415317 5507284 5602953 5674259 5725985 5816024 5865879 5937320 6038678 6116551 6218918 6315007
3804 6315007 6451869 6514450 6654479 6810487 6936626 7060824 7184815 7317416 7498147 7683906
3794 7683906 7824165 7975818 8145447 8284457 8434695 8610802 8846350 9009569 9244922 9451988
$$ packed form
3869G141379L2129R8065Q7033Q2652J850R5018J38394J10675J12299O7733R8834
3858H066061l0481r2498q8891j23329j08513j55215j53523j49634r4526p3886
3848F995565m8773n119M0633N6433L0756j3869q6307j55988k96205j99058j43044
3837F175024k53439j92783j84370r9966j08839k7746j02245q2207M0295n7405
3827E106319n4631l3556M8863O1653L9524m8941N0361N6445L440Q1484Q2757K1599
3815E415317R1967R5669P1306N1726R0039M9855P1441J01358P7873J02367R6089
3804F315007J36862O2581J40029J56008J26139J24198J23991J32601J80731J85759
3794G683906J40259J51653J69629J39010J50238J76107K35548J63219K35353K07066
$$ plain form
3784 9451988 9635938 9813926 10047663 10287206 10517711 10760273 11026203 11276636 11570930 11829284
3774 11829284 12076564 12368874 12684655 12970244 13297729 13660033 14000274 14358753 14758435
3765 14758435 15142812 15561870 15967658 16411322 16788190 17267694 17724017 18105449 18635401
3756 18635401 19159972 19709909 20246848 20888935 21419502 22047895 22722961 23395858 24052970
3747 24052970 24768384 25459460 26145404 26907901 27715741 28454452 29287914 30119574 30926960
3738 30926960 31718284 32542779 33366954 34157192 34961675 35725685 36458597 37121608 37827071
3729 37827071 38431138 38987953 39523261 39979163 40385253 40673356 40861800 41034855 41115138 41102670
3719 41102670 41012571 40846412 40516202 40191280 39774122 39259827 38665471 38014671 37325713 36594005
$$ packed form
3784I451988J83950J77988K33737K39543K30505K42562K65930K50433K94294K58354
3774A1829284K47280K92310L15781K85589L27485L62304L40241L58479L99682
3765A4758435L84377M19058M05788M43664L76868M79504M56323L81432N29952
3756A8635401N24571N49937N36939O42087N30567O28393O75066O72897O57112
3747B4052970P15414O91076O85944P62497Q07840P38711Q33462Q31660Q07386
3738C0926960P91324Q24495Q24175P90238Q04483P64010P32912O63011P05463
3729C7827071O04067N56815N35308M55902M06090K88103J88444J73055Q0283j2468
3719D1102670r0099j66159l30210l24922m17158n14295n94356o50800o88958p31708
$$ plain form
3709 36594005 35779397 34950959 34103328 33233922 32377195 31435166 30552458 29663684 28778172
3700 28778172 27914042 27027534 26213455 25396723 24627870 23921963 23125334 22390474 21672298
3691 21672298 21010335 20376201 19654057 19030570 18456954 17857525 17279715 16763706 16247822
3682 16247822 15763757 15281460 14835783 14357862 13928001 13535546 13126663 12766185 12430386
3673 12430386 12084863 11664294 11389025 11042220 10756010 10523980 10241994 9939154 9751787
3664 9751787 9443284 9200375 8987202 8759444 8567334 8361532 8167005 7988865 7839963 7652350
3654 7652350 7484833 7330785 7148777 7028166 6907816 6710037 6630338 6486483 6368496 6219823
3644 6219823 6098847 5978670 5927538 5813342 5693922 5615129 5507766 5443301 5329463 5254536
$$ packed form
3709C6594005q14608q28438q47631q69406q56727r42029q82708q88774q85512
3700B8778172q64130q86508q14079q16732p68853p05907p96629p34860p18176
3691B1672298o61963o34134p22144o23487n73616n99429n77810n16009n15884
3682A6247822m84065m82297m45677m77921m29861l92455m08883l60478l35799
3673A2430386l45523m20569k75269l46805k86210k32030k81986l02840j87367
3664I751787l08503k42909k13173k27758j92110k05802j94527j78140j48902j87613
3654G652350j67517j54048j82008j20611j20350j97779p9699j43855j17987j48673
3644F219823j20976j20177n1132j14196j19420p8793j07363o4465j13838p4927
$$ plain form
3634 5254536 5202420 5111174 5023224 4963432 4941546 4888072 4768384 4705590 4675315 4644669 4580557
3623 4580557 4505702 4481738 4448270 4421600 4334216 4253404 4256533 4239279 4225496 4201207 4194309 4110487
3611 4110487 4012954 4070052 4037673 3961424 3972220 3965786 3924089 3901310 3881990 3891094 3854049 3892789
3599 3892789 3918011 3941133 3931627 3920557 3956943 3941562 3981959 4006819 4032464 3993490 4045999 4112403
3587 4112403 4168985 4192035 4277565 4320590 4395165 4462307 4544944 4621489 4677965 4740539 4812291
3576 4812291 4975395 5026989 5130247 5283064 5371905 5485838 5594234 5761326 5960073 6145166
3566 6145166 6301576 6485430 6687723 6927850 7177786 7471992 7730338 8030481 8410935 8737953
3556 8737953 9181541 9608744 10079781 10585518 11046259 11561859 12179179 12801278 13492629 14235353
$$ packed form
3634E254536n2116r1246q7950n9792k1886n3474j19688o2794l0275l0646o4112
3623D580557p4855k3964l3468k6670q7384q0812L129j7254j3783k4289o898q3822
3611D110487r7533N7098l2379p6249J0796o434m1697k2779j9320R104l7045L8740
3599C892789K5222K3122r506j1070L6386j5381M0397K4860K5645l8974N2509O6404
3587D112403N6582K3050Q5530M3025P4575O7142Q2637P6545N6476O2574P1752
3576D812291J63104N1594J03258J52817Q8841J13933J08396J67092J98747J85093
3566F145166J56410J83854K02293K40127K49936K94206K58346L00143L80454L27018
3556H737953M43588M27203M71037N05737M60741N15600O17320O22099O91351P42724
$$ plain form
3546 14235353 15119450 16032085 17077719 18103261 19020000 19993110 20891686 21802270 22747837
3537 22747837 23783017 24968265 26307282 27698342 29142021 30508356 31689993 32691335
3529 32691335 33457189 34193430 34826670 35426137 36159038 36959536 37908583 38827117 39502060
3520 39502060 39885681 40014655 39793733 39308344 38673077 38043061 37542652 37075955 36644458
3511 36644458 36278447 35755544 34926103 33917547 32710618 31360838 29933907 28538938 27217687
3502 27217687 26004957 24860375 23756868 22714946 21609398 20477817 19350200 18159429
3494 18159429 17022317 15990707 15004669 14051923 13235750 12457348 11742935 11073152 10420915
3485 10420915 9885633 9301994 8751159 8308959 7854617 7424298 7021838 6669945 6348008
$$ packed form
3546A4235353Q84097R12635J045634J025542R16739R73110Q98576R10584R45567
3537B2747837J035180J185248J339017J391060J443679J366335J181637J001342
3529C2691335P65854P36241O33240N99467P32901Q00498R49047R18534O74943
3520C9502060L83621J28974k20922m85389o35267o30016n00409m66697m31497
3511C6644458l66011n22903q29441j008556j206929j349780j426931j394969j321251
3502B7217687j212730j144582j103507j041922j105548j131581j127617j190771
3494A8159429j137112j031610r86038r52746q16173p78402p14413o69783o52237
3485A0420915n35282n83639n50835m42200m54342m30319m02460l51893l21937
$$ plain form
3476 6348008 6051920 5796323 5553458 5375111 5123149 4928976 4775096 4569226 4431977 4280100
3466 4280100 4123116 3960777 3930330 3781303 3635634 3566585 3401361 3336219 3224128 3125980
3456 3125980 3069059 2969667 2890443 2822733 2781038 2734147 2631176 2596199 2536864 2519263 2435280
3445 2435280 2347657 2341036 2308683 2250255 2242465 2200918 2122965 2154535 2146305 2067937 2021585 2006547
3433 2006547 1951273 1939952 1821046 1798471 1781850 1815773 1832048 1772109 1711469 1721497 1735920
3422 1735920 1659046 1652849 1684804 1625522 1570646 1531767 1525479 1489549 1493605 1522856 1500099 1450342
3410 1450342 1472409 1505580 1480209 1482003 1409889 1388548 1380740 1389745 1390115 1378033 1350106 1364304
3398 1364304 1348468 1326737 1320926 1326027 1331052 1359653 1307352 1299268 1268286 1258060 1292950 1286854
$$ packed form
3476F348008k96088k55597k42865j78347k51962j94173j53880k05870j37249j51877
3466D280100j56984j62339l0447j49027j45669o9049j65224o5142j12091r8148
3456C125980n6921r9392p9224o7710m1695m6891j02971l4977n9335j7601q3983
3445B435280q7623o621l2353n8428p790m1547p7953L1570q230p8368m6352j5038
3433B006547n5274j1321j18906k2575j6621L3923J6275n9939o0640J0028J4423
3422A735920p6874o197L1955n9282n4876l8879o288l5930M056K9251k2757m9757
3410A450342K2067L3171k5371J794p2114k1341p808R005L70j2082k7927J4198
3398A364304j5836k1731n811N101N025K8601n2301q084l0982j0226L4890o096
$$ plain form
3386 1286854 1274809 1278030 1270615 1223322 1186299 1204434 1210205 1225939 1258477 1216050 1195433 1211148
3374 1211148 1228996 1233709 1266968 1234695 1204259 1186613 1178536 1228377 1187168 1165768 1197832 1214823
3362 1214823 1144181 1172004 1251588 1213491 1183511 1167971 1161200 1210484 1219677 1225945 1215188 1222397
3350 1222397 1271273 1292941 1272227 1267548 1259374 1318679 1316661 1338117 1344583 1349583 1385182 1400723
3338 1400723 1467320 1457496 1437020 1471941 1534385 1527602 1533675 1572673 1625290 1650252 1657193 1696529
3326 1696529 1700496 1676912 1712798 1686265 1693051 1671340 1686214 1675167 1625711 1642375 1638372 1643563
3314 1643563 1705224 1764952 1787144 1754017 1794107 1825600 1810523 1832232 1862373 1929175 1945315
3303 1945315 1956338 1984222 2057267 2048329 2050348 2034046 2077366 2123776 2100870 2097849 2108449 2126258
$$ packed form
3386A286854j2045L221p415m7293l7023J8135N771J5734L2538m2427k0617J5715
3374A211148J7848M713L3259l2273l0436j7646q077M9841m1209k1400L2064J6991
3362A214823p0642K7823P9584l8097k9980j5540o771M9284R193O268j0757P209
3350A222397M8876K1668k0714m679q174N9305k018K1456O466N000L5599J5541
3338A400723O6597r824k0476L4921O2444o783O073L8998N2617K4962O941L9336
3326A696529L967k3584L5886k6533O786k1711J4874j1047m9456J6664m003N191
3314A643563O1661N9728K2192l3127M0090L1493j5077K1709L0141O6802J6140
3303A945315J1023K7884P3045q938K019j6302M3320M6410k2906l021J0600J7809
$$ plain form
3291 2126258 2131770 2164228 2139576 2132770 2136889 2169800 2166740 2125196 2101124 2127319 2144088 2132331
3279 2132331 2149686 2196674 2217702 2198490 2219717 2275148 2243347 2273030 2303080 2281728 2286024 2303648
3267 2303648 2261415 2285120 2263123 2324292 2352342 2294275 2288702 2372717 2389358 2341170 2350417 2374097
3255 2374097 2367876 2348985 2396493 2409304 2414300 2435832 2428391 2398724 2439848 2459572 2515969 2548263
3243 2548263 2594385 2636859 2653458 2647844 2710103 2686727 2728522 2745214 2758364 2776155 2787721 2821311
3231 2821311 2862736 2941245 3036815 3098733 3107056 3162808 3177471 3234540 3243646 3207322 3254094 3320633
3219 3320633 3334668 3385170 3410700 3425332 3435963 3463475 3520011 3568942 3614721 3602055 3626814
3208 3626814 3697935 3741711 3756801 3823518 3877728 3898928 4027435 4130786 4217110 4294771 4337891
$$ packed form
3291B126258N512L2458k4652o806M119L2911l060m1544k4072K6195J6769j1757
3279B132331J7355M6988K1028j9212K1227N5431l1801K9683L0050k1352M296J7624
3267B303648m2233K3705k1997O1169K8050n8067n573Q4015J6641m8188R247K3680
3255B374097o221j8891M7508J2811M996K1532p441k9667M1124J9724N6397L2294
3243B548263M6122M2474J6599n614O2259k3376M1795J6692J3150J7791J1566L3590
3231B821311M1425P8509R5570O1918Q323N5752J4663N7069R106l6324M6772O6539
3219C320633J4035N0502K5530J4632J0631K7512N6536M8931M5779j2666K4759
3208C626814P1121M3776J5090O6717N4210K1200J28507J03351Q6324P7661M3120
$$ plain form
3197 4337891 4390379 4492502 4528730 4606295 4625880 4660109 4705428 4722375 4767341 4785704 4790662
3186 4790662 4811908 4813759 4847252 4869122 4859820 4879083 4902843 4976490 5006125 5071282 5089305 5191117
3174 5191117 5275485 5378604 5507338 5655342 5778538 5866417 5983417 6073986 6227348 6351895
3164 6351895 6441450 6533248 6598381 6623988 6686997 6808895 6905496 6987129 7018559 7080297 7163601
3153 7163601 7258228 7296313 7380809 7430695 7489258 7558779 7627584 7702026 7740893 7791365 7855586
3142 7855586 7959021 8099094 8181323 8277770 8440381 8584994 8721780 8948584 9112670 9271760
3132 9271760 9516907 9771612 10034723 10226056 10515683 10823858 11151612 11506650 11775007 12115505
3122 12115505 12475354 12838774 13223812 13612055 14150953 14663593 15163310 15792916 16476608
$$ packed form
3197D337891N2488J02123L6228P7565J9585L4229M5319J6947M4966J8363M958
3186D790662K1246J851L3493K1870r302J9263K3760P3647K9635O5157J8023J01812
3174E191117Q4368J03119J28734J48004J23196Q7879J17000R0569J53362J24547
3164F351895Q9555R1798O5133K5607O3009J21898R6601Q1633L1430O1738Q3304
3153G163601R4627L8085Q4496M9886N8563O9521O8805P4442L8867N0472O4221
3142G855586J03435J40073Q2229R6447J62611J44613J36786K26804J64086J59090
3132I271760K45147K54705K63111J91333K89627L08175L27754L55038K68357L40498
3122A2115505L59849L63420L85038L88243N38898N12640M99717O29606O83692
$$ plain form
3113 16476608 17155508 17830053 18501496 19240891 19965795 20678607 21416910 22244154 23030669
3104 23030669 23963344 25017373 26201401 27438900 28924939 30571117 32318890 34376041
3096 34376041 36730304 39370575 42463126 46046295 50088383 54389183 58792214 62982554
3088 62982554 66688660 69746065 71934367 73378117 74138135 74576552 74841482 75232254 75755461
3079 75755461 76362686 76939822 77093728 76702738 75742717 74075042 71764569 69041227 66169635
3070 66169635 63351312 60879383 58893913 57516169 56669412 56465774 56832957 57437848 58192312
3061 58192312 58899907 59383385 59450380 59221312 58715232 58021247 57309942 56632418 56144558 55729207
3051 55729207 55237888 54638932 53680052 52308419 50589734 48567050 46228435 43719227 41208421
$$ packed form
3113A6476608O78900O74545O71443P39395P24904P12812P38303Q27244P86515
3104B3030669R32675J054029J184028J237499J486039J646178J747773K057151
3096C4376041K354263K640271L092551L583169M042088M300800M403031M190340
3088F2982554L706106L057405K188302J443750P60018M38417K64930L90772N23207
3079G5755461O07225N77136J53906l90990r60021j667675k310473k723342k871592
3070F6169635k818323k471929j985470j377744q46757k03638L67183O04891P54464
3061E8192312P07595M83478O6995k29068n06080o93985p11305o77524m87860m15351
3051E5729207m91319n98956r58880j371633j718685k022684k338615k509208k510806
$$ plain form
3042 41208421 38808478 36594621 34563543 32805452 31232618 29860352 28650972 27631855
3034 27631855 26724619 25885793 25240765 24631739 24091706 23679517 23303965 23026704 22781622
3025 22781622 22623955 22504985 22423618 22344919 22311101 22364499 22469798 22566956 22732531 22971579
3015 22971579 23173335 23461421 23866526 24254280 24730919 25267770 25843171 26576096 27269482
3006 27269482 28073535 28932673 29860884 30866162 31955628 33152107 34434595 35753969 37151469
2997 37151469 38661545 40235536 41907170 43686455 45507615 47371714 49148398 50805817
2989 50805817 52316185 53563919 54570323 55422362 56136216 56716701 57331626 57964908 58716071
2980 58716071 59613665 60736596 62125582 63668805 65508746 67572335 69929250 72605694
$$ packed form
3042D1208421k399943k213857k031078j758091j572834j372266j209380j019117
3034B7631855r07236q38826o45028o09026n40033m12189l75552k77261k45082
3025B2781622j57667j18970q1367p8699l3818N3398J05299R7158J65575K39048
3015B2971579K01756K88086M05105L87754M76639N36851N75401P32925O93386
3006B7269482Q04053Q59138R28211J005278J089466J196479J282488J319374J397500
2997C7151469J510076J573991J671634J779285J821160J864099J776684J657419
2989E0805817J510368J247734J006404Q52039P13854N80485O14925O33282P51163
2980E8716071Q97594J122931J388986J543223J839941K063589K356915K676444
$$ plain form
2972 72605694 75566911 78844416 82500623 86636629 91204904 96282664 101933420 108383736
2964 108383736 115614706 123783138 133055775 143682252 155770010 169433828 184693461
2957 184693461 201452709 219211929 237304183 254998558 271540758 286338304 298890426
2950 298890426 309039138 317057756 323140179 327705403 331056742 333214531 334192941 333941547
2942 333941547 332175886 328483969 322700458 314764563 304741021 293012156 279887586 265703544
2934 265703544 251059894 236396375 222046092 208404541 195756939 184347071 174218768
2927 174218768 165504934 158305176 152547583 148193258 144996497 142878970 141589457 140833730
2919 140833730 140100359 139331716 138373772 137162357 135624625 133801091 131731131 129433511
$$ packed form
2972G2605694K961217L277505L656207M136006M568275N077760N650756O450316
2964A08383736P230970Q168432R272637J0626477J2087758J3663818J5259633
2957A84693461J6759248J7759220J8092254J7694375J6542200J4797546J2552122
2950B98890426J0148712Q018618O082423M565224L351339K157789R78410k51394
2942C33941547j765661l691917n783511p935895j0023542j1728865j3124570j4184042
2934B65703544j4643650j4663519j4350283j3641551j2647602j1409868j0128303
2927A74218768q713834p199758n757593m354325l196761k117527j289513p55727
2919A40833730p33371p68643r57944j211415j537732j823534k069960k297620
$$ plain form
2911 129433511 127148954 124969471 122781643 120661142 118537715 116415451 114182836 111834278
2903 111834278 109419229 106831048 104126427 101426893 98810297 96311136 94173518 91599070
2895 91599070 88357547 84554324 80499494 76539970 72632640 68830525 65354562 62264672
2887 62264672 59528491 57180998 55194742 53526689 52204008 51359337 50962389 50743521 50359783
2878 50359783 49917070 49917005 50164981 49931346 49481539 49011121 48895920 48875585 48583535 48141501
2868 48141501 47721750 47398914 47124535 46755629 46362035 46052021 45821716 45632575 45397940
2859 45397940 44942192 44057399 42917543 41895378 40939683 40048339 39295013 38798088 38598080
2850 38598080 38518138 38649771 38888688 39292458 39970177 40768499 41813059 43037049 44550574
$$ packed form
2911A29433511k284557k179483k187828k120501k123427k122264k232615k348558
2903A11834278k415049k588181k704621k699534k616596k499161k137618k574448
2895I1599070l241523l803223m054830l959524l907330l802115l475963l089890
2887F2264672k736181k347493j986256j668053j322681q44671l96948k18868l83738
2878E0359783m42713o5K47976k33635m49807m70418j15201k0335k92050m42034
2868D8141501m19751l22836k74379l68906l93594l10014k30305j89141k34635
2859D5397940m55748q84793j139856j022165r55695q91344p53326m96925k00008
2850C8598080p9942J31633K38917M03770O77719P98322J044560J223990J513525
$$ plain form
2841 44550574 46274912 48249054 50620042 53351945 56671929 60532082 64977851 70066503
2833 70066503 75831699 82237341 89203332 96442908 103805904 111095663 117693577 123354216
2825 123354216 127705400 130435151 131156738 129950122 126846662 122031077 115960497 108892985
2817 108892985 101241863 93470519 85784109 78349972 71576232 65335095 59788566 54814329
2809 54814329 50446670 46722732 43442979 40611354 38113035 35935077 33986184 32361868
2801 32361868 30892864 29552144 28435690 27363362 26381785 25485816 24679432 23941966 23235577
2792 23235577 22585856 22017852 21479479 20998056 20555768 20230588 19895318 19618112 19375962
2783 19375962 19262177 19057798 18871936 18711967 18463865 18188809 17930432 17636610 17281378
$$ packed form
2841D4550574J724338J974142K370988K731903L319984L860153M445769N088652
2833G0066503N765196O405642O965991P239576P362996P289759O597914N660639
2825A23354216M351184K729751P21587j206616l103460m815585o070580p067512
2817A08892985p651122p771344p686410p434137o773740o241137n546529m974237
2809E4814329m367659l723938l279753k831625k498319k177958j948893j624316
2801C2361868j469004j340720j116454j072328r81577q95969q06384p37466p06389
2792B3235577o49721n68004n38373m81423m42288l25180l35270k77206k42150
2783A9375962j13785k04379j85862j59969k48102k75056k58377k93822l55232
$$ plain form
2774 17281378 16791855 16380727 15917847 15481298 15143852 14833947 14484988 14194540 13933578
2765 13933578 13738726 13565331 13351291 13212373 13032612 12923645 12786666 12647111 12551546 12466091
2755 12466091 12421135 12431337 12384134 12370852 12365620 12396731 12390809 12446321 12550391 12694795 12847293
2744 12847293 12982830 13112262 13252143 13379523 13460412 13614758 13735666 13890139 14022967 14124206
2734 14124206 14261833 14347363 14368916 14401837 14494177 14557967 14647539 14755901 14957703 15190712
2724 15190712 15387721 15564803 15812300 16132900 16449504 16772428 17079122 17312971 17522232
2715 17522232 17714103 17960897 18234385 18639968 19122773 19656426 20252713 20878106 21551406
2706 21551406 22267814 23100066 23872409 24729721 25747317 26776613 27732549 28587204 29398303
$$ packed form
2774A7281378m89523m11128m62880m36549l37446l09905l48959k90448k60962
2765A3933578j94852j73395k14040j38918j79761j08967j36979j39555r5565q5455
2755A2466091m4956J0202m7203j3282n232L1111n922N5512J04070J44404J52498
2744A2847293J35537J29432J39881J27380Q0889J54346J20908J54473J32828J01239
2734A4124206J37627Q5530K1553L2921R2340O3790Q9572J08362K01802K33009
2724A5190712J97009J77082K47497L20600L16604L22924L06694K33849K09261
2715A7522232J91871K46794K73488M05583M82805N33653N96287O25393O73300
2706B1551406P16408Q32252P72343Q57312J017596J029296R55936Q54655Q11099
$$ plain form
2697 29398303 30282983 31150152 32072281 33034877 34085218 35180274 36386763 37605059 39014628
2688 39014628 40525776 42019777 43573957 45258189 47042725 48792114 50382405 51910668
2680 51910668 53417606 54903261 56539345 58362973 60483689 62981225 65817271 68994188
2672 68994188 72513112 76390089 80702501 85357761 90537338 96174492 102461991 109491872
2664 109491872 117462516 126594676 137116096 149160384 163162568 179615411 199136199
2657 199136199 222691325 251199114 285441681 327140449 376468626 427251650 462709225
2650 462709225 473589999 469592183 459465060 438570924 404723081 366221704 329252654
2643 329252654 294804659 263011703 234860498 210673962 189987778 172223056 156627148
$$ packed form
2697B9398303Q84680Q67169R22129R62596J050341J095056J206489J218296J409569
2688C9014628J511148J494001J554180J684232J784536J749389J590291J528263
2680E1910668J506938J485655J636084J823628K120716K497536K836046L176917
2672F8994188L518924L876977M312412M655260N179577N637154O287499P029881
2664A09491872P970644R132160J0521420J2044288J4002184J6452843J9520788
2657A99136199K3555126K8507789L4242567M1698768M9328177N0783024L5457575
2650D62709225J0880774l997816j0127123k0894136l3847843l8501377l6969050
2643C29252654l4447995l1792956k8151205k4186536k0686184j7764722j5595908
$$ plain form
2636 156627148 142862201 130598363 119619853 109754583 101063419 93515356 86855504 81081517
2628 81081517 76059724 71686403 67753470 64232409 60929026 57937333 55058439 52317770
2620 52317770 49728318 47250882 45042019 42968852 40984280 39181143 37456596 35848471
2612 35848471 34258305 32846851 31557410 30358815 29283124 28227995 27277711 26375313
2604 26375313 25477017 24565592 23761060 23006327 22222416 21511566 20797151 20121249 19537203
2595 19537203 18976807 18403949 17869515 17354188 16904334 16406174 15853985 15388063 14859291
2586 14859291 14316021 13781397 13264526 12828000 12446298 12097002 11769792 11518187 11279361
2577 11279361 11064001 10891824 10688709 10516000 10332879 10097172 9945840 9761997 9538259
$$ packed form
2636A56627148j3764947j2263838j0978510r865270q691164p548063o659852n773987
2628H1081517n021793m373321l932933l521061l303383k991693k878894k740669
2620E2317770k589452k477436k208863k073167j984572j803137j724547j608125
2612C5848471j590166j411454j289441j198595j075691j055129r50284r02398
2604B6375313q98296r11425q04532p54733p83911p10850p14415o75902n84046
2595A9537203n60396n72858n34434n15327m49854m98160n52189m65922n28772
2586A4859291n43270n34624n16871m36526l81702l49296l27210k51605k38826
2577A1279361k15360j72177k03115j72709j83121k35707j51332j83843k23738
$$ plain form
2568 9538259 9279222 9027575 8759190 8544598 8374521 8188157 7941926 7760161 7540241 7273072
2558 7273072 7107470 6906567 6747890 6582983 6409894 6244187 6065673 5942639 5767674 5603301
2548 5603301 5520735 5434619 5283053 5145551 5065302 4923282 4815407 4755486 4681596 4577169
2538 4577169 4560575 4507030 4419904 4400219 4347949 4302829 4321035 4273827 4264765 4268558 4240612 4263271
2526 4263271 4236557 4190321 4162210 4076178 4017495 3892005 3858406 3758461 3677379 3561312 3497902
2515 3497902 3478768 3388880 3326127 3232851 3231265 3154099 3085210 2981925 2947678 2864372 2822712
2504 2822712 2761288 2735112 2715962 2649789 2649211 2591370 2538330 2576274 2593837 2626750 2576339 2542674
2492 2542674 2514369 2546356 2533210 2504827 2552720 2555745 2563333 2539405 2533057 2518082 2510349 2521707
$$ packed form
2568I538259k59037k51647k68385k14592j70077j86364k46231j81765k19920k67169
2558G273072j65602k00903j58677j64907j73089j65707j78514j23034j74965j64373
2548E603301q2566q6116j51566j37502q0249j42020j07875n9921p3890j04427
2538D577169j6594n3545q7126j9685n2270m5120J8206m7208r062L793k7946K2659
2526D263271k6714m6236k8111q6032n8683j25490l3599r9945q1082j16067o3410
2515C497902j9134q9888o2753r3276j586p7166o8889j03285l4247q3306m1660
2504B822712o1424k6176j9150o6173n78n7841n3040L7944J7563L2913n0411l3665
2492B542674k8305L1987j3146k8383M7893L025P588k3928o348j4975p733J1358
$$ plain form
2480 2521707 2561859 2544497 2513361 2574199 2605895 2527884 2514834 2564434 2556583 2588350 2530740 2480394
2468 2480394 2472689 2416750 2393786 2375969 2313951 2279555 2285277 2301570 2278052 2256292 2314454 2318513
2456 2318513 2321792 2378949 2393968 2457008 2494703 2504338 2562149 2631103 2680576 2765340 2845380 2902629
2444 2902629 3006027 3162324 3371121 3595469 3812848 3986223 4104892 4098420 4102856 3993395
2434 3993395 3823207 3572892 3321727 3127021 2887782 2730708 2596247 2471539 2398965 2291120
2424 2291120 2149004 2090667 2040990 1918129 1824593 1744818 1715013 1601139 1545533 1490035 1434061
2413 1434061 1424907 1397913 1386542 1295037 1244658 1223271 1233083 1265856 1225717 1180432 1156016 1159729
2401 1159729 1108719 1049429 1073417 1049186 1049141 1052402 947198 966325 939554 926025 897656 886886
$$ packed form
2480B521707M0152j7362l1136O0838L1696p8011j3050M9600p851L1767n7610n0346
2468B480394p705n5939k2964j7817o2018l4396N722J6293k3518k1760N8162M059
2456B318513L279N7157J5019O3040L7695R635N7811O8954M9473Q4764Q0040N7249
2444B902629J03398J56297K08797K24348K17379J73375J18669o472M436j09461
2434C993395j70188k50315k51165j94706k39239j57074j34461j24708p2574j07845
2424B291120j42116n8337m9677j22861r3536p9775k9805j13874n5606n5498n5974
2413A434061r154k6994j1371r1505n0379k1387R812L2773m0139m5285k4416L713
2401A159729n1010n9290K3988k4231m5L261j05204J9127k6771j3529k8369j0770
$$ plain form
2389 886886 880920 877620 906599 882190 863091 894013 916670 873263 773537 782682 789505 804125
2377 804125 750645 740563 721089 669276 647345 682725 685705 665203 665180 618432 664728 649617
2365 649617 601661 587842 599789 624458 575102 557945 631865 586979 594632 587103 645812 666865
2353 666865 567048 538621 556451 533173 489383 498812 502295 462834 473916 490559 444051 429077
2341 429077 453762 411840 414424 398024 366150 361364 362629 346766 295635 307233 323979 325112
2329 325112 372701 374008 403117 389857 338486 360171 333906 332782 347591 311366 366741 274797
2317 274797 296915 320743 315646 303764 289080 317152 332016 351146 316708 322714 295422 339855
2305 339855 287342 293171 310445 291862 314147 307276 277528 246131 273021 282326 271915 280329
$$ packed form
2389H86886n966l300K8979k4409j9099L0922K2657m3407r9726R145O823J4620
2377H04125n3480j0082j9474n1813k1931L5380K980k0502k3m6748M6296j5111
2365F49617m7956j3819J1947K4669m9356j7157P3920m4886P653p529N8709K1053
2353F66865r9817k8427J7830k3278m3790R429L483l9461J1082J6643m6508j4974
2341D29077K4685m1922K584j6400l1874m786J265j5863n1131J1598J6746J133
2329C25112M7589J307K9109j3260n1371K1685k6265j124J4809l6225N5375r1944
2317B74797K2118K3828n097j1882j4684K8072J4864J9130l4438O006k7292M4433
2305C39855n2513N829J7274j8583K2285o871k9748l1397K6890R305j0411Q414
$$ plain form
2293 280329 249280 245582 277144 254761 247708 292761 325129 316691 320823 257482 259021 284351 262115
2280 262115 267209 297406 265461 254540 225795 187273 184637 241607 209044 225882 222135 227844
2268 227844 274340 245723 261512 256248 256148 231342 257213 252788 224645 225813 207890 183089 177528
2255 177528 206772 273918 217390 283065 283950 267581 223040 200148 213594 205386 221355 177128
2243 177128 226876 230477 196766 147725 167330 173285 224533 204685 205086 193343 208304 203307 185109
2230 185109 162065 168134 201380 151182 152287 154871 180116 182979 120212 155045 227254 188336
2218 188336 207631 239623 269118 259043 220697 174298 134744 171415 193194 175778 161943 194867
2206 194867 253648 219822 220954 207306 165747 162432 192560 220570 249174 198625 170520 137506
$$ packed form
2293B80329l1049l698L1562k2383p053M5053L2368q438M132o3341J539K5330k2236
2280B62115N094L0197l1945j0921k8745l8522k636N6970l2563J6838l747N709
2268B27844M6496k8617J5789n264j00k4806K5871m425k8143J168j7923k4801n561
2255A77528K9244O7146n6528O5675Q85j6369m4541k2892J3446q208J5969m4227
2243A77128M9748L601l3711m9041J9605N955N1248j9848M01j1743J4961m997j8198
2230A85109k3044O069L3246n0198J105K584K5245K863o2767L4833P2209l8918
2218A88336J9295L1992K9495j0075l8346m6399l9554L6671K1779j7416j3835L2924
2206A94867N8781l3826J132j3648m1559l315L0128K8010K8604n0549k8105l3014
$$ plain form
2194 137506 149067 160528 170380 204941 181792 217331 209750 197551 173794 141570 188629 167521
2182 167521 150858 175302 159500 169309 128637 174834 165743 200586 161569 164080 100079 90803
2170 90803 159593 157706 202043 166599 144586 181863 211464 156706 193335 175628 180206 203851
2158 203851 249132 232705 220597 213948 176277 222454 264952 269807 266534 238985 267622 300979
2146 300979 258014 251997 268887 263458 287377 276374 345691 364055 343484 354295 386182 405401
2134 405401 405982 404259 389148 400398 384862 437232 446525 406979 462030 487740 478918 489982 511864
2121 511864 548849 554724 564374 575561 586322 646138 659881 725836 753665 732198 769489 828504
2109 828504 849089 902357 975650 984556 991329 1134109 1184623 1314108 1430985 1527067 1634491
$$ packed form
2194A37506J1561J1461R852L4561k3149L5539p581j2199k3757l2224M7059k1108
2182A67521j6663K4444j5802R809m0672M6197r091L4843l9017K511o4001r276
2170I0803O8790j887M4337l5444k2013L7277K9601n4758L6629j7707M578K3645
2158B03851M5281j6427j2108o649l7671M6177M2498M855l273k7549K8637L3357
2146C00979m2965o017J6890n429K3919j1003O9317J8364k0571J0811L1887J9219
2134D05401N81j723j5111J1250j5536N2370R293l9546N5051K5710q822J1064K1882
2121E11864L6985N875R650J1187J0761N9816J3743O5955K7829k1467L7291N9015
2109H28504K0585N3268P3293Q906O773J42780N0514J29485J16877R6082J07424
$$ plain form
2098 1634491 1801463 1938241 2140192 2321567 2486325 2736746 3055370 3474065 4038498 4695778
2088 4695778 5787780 7138330 8928307 10331020 9549799 8324808 7236765 6073256
2080 6073256 4971726 4146026 3656595 3287332 2988794 2748839 2520167 2302330 2042483
2071 2042483 1811831 1612585 1503029 1376402 1251601 1185991 1138863 1092042 1028347 995607
2061 995607 951439 866402 815246 772893 745123 687117 691912 657349 611147 589520 514563 558096
2049 558096 535639 503206 488100 455939 406990 342907 357254 348610 332065 316406 275285 288017
2037 288017 287339 325914 316442 298921 282371 237311 245719 257827 238979 282796 272481 234993
2025 234993 188612 190033 210117 248565 215025 212097 222629 136799 127428 145638 169703 151976
$$ packed form
2098A634491J66972J36778K01951J81375J64758K50421L18624M18695N64433O57280
2088D695778J092002J350550J789977J402713p81221j224991j088043j163509
2080F073256j101530q25700m89431l69263k98538k39955k28672k17837k59847
2071B042483k30652j99246j09556j26627j24801o5610m7128m6821o3695l2740
2061I95607m4168q5037n1156m2353k7770n8006M795l4563m6202k1627p4957M3533
2049E58096k2457l2433j5106l2161m8949o4083J4347q644j6545j5659m1121J2732
2037B88017o78L8575r472j7521j6550m5060Q408J2108j8848M3817j0315l7488
2025B34993m6381J421K0084L8448l3540k928J0532q5830r371J8210K4065j7727
$$ plain form
2013 151976 162480 157221 157695 125205 157424 159152 175526 158445 125865 122999 109170 119429 91878
2000 91878 78195 102987 142894 155884 128039 99792 71453 40861 45919 86851 81054 119973
1988 119973 68878 62162 56171 83901 110624 85334 62434 97414 53798 83089 133392 70851
1976 70851 50098 44688 24521 104330 93864 27279 78920 73814 79516 64656 52072 44715 39091
1963 39091 -11611 31671 28624 42458 19914 24903 64238 32801 33403 -23868 2415 28900 40791
1950 40791 63451 37834 44775 52721 81681 23267 30347 61952 56429 47162 49143 33559 38686
1937 38686 89063 61786 81250 105256 12284 53719 61101 72191 26600 -19431 13333 8323
1925 8323 -51261 -27286 -19431 9654 -8852 -14401 -10475 -29004 -25816 15757 16491 5308 28805
$$ packed form
2013A51976J0504n259M74l2490L2219J728J6374j7081l2580k866j3829J0259k7551
2000I1878j3683K4792L9907J2990k7845k8247k8339l0592N058M0932n797L8919
1988A19973n1095o716n991K7730K6723k5290k2900L4980m3616K9291N0303o2541
1976G0851k0753n410k0167P9809j0466o6585N1641n106N702j4860j2584p357n624
1963C9091n0702M3282l047J3834k2544M989L9335l1437O02n7271K6283K6485J1891
1950D0791K2660k5617O941P946K8960n8414P080L1605n523r267J981j5584N127
1937C8686N0377k7277J9464K4006r2972M1435P382J1090m5591m6031L2764n010
1925H323n9584K3975P855K9085j8506n549L926j8529L188M1573P34j1183K3497
$$ plain form
1912 28805 -9999 -21956 -3565 -27757 7239 5495 32856 -1758 -57694 15170 7658 -25744
1900 -25744 -17595 -9913 27191 38319 -17011 41811 81866 57605 43801 62759 52893 75391
1888 75391 60012 21177 31123 68030 30388 28493 44617 8231 -10088 -9298 46084 23049 -2404
1875 -2404 -8970 44955 -4930 28499 30966 -5651 24830 37886 65960 51974 -15530 -7783 802
1862 802 -439 19585 -6564 77382 47847 15758 -10442 -5895 -26395 3917 -24331 -29371 39572
1849 39572 43981 41046 15629 3302 73102 15627 35529 -8535 -42585 -22583 3898 11062
1837 11062 46964 60110 37743 38084 -28262 -13736 6564 25843 -33237 -26504 -5735 -4470 14312
1824 14312 18387 31175 44642 31363 16853 54090 -5355 -54211 -38688 -47061 -30700 -4338
$$ packed form
1912B8805l8804j1957J8391k4192L4996j744K7361l4614n5936P2864p512l3402
1900b5744Q149P682L7104J1128n5330N8822M0055k4261j3804J8958r866K2498
1888G5391j5379l8835R946L6907l7642j895J6124l6386j8319P90N5382k3035k5453
1875b404o566N3925m9885L3429K467l6617L0481J3056K8074j3986o7504P747Q585
1862H02j241K0024k6149Q3946k9535l2089k6200M547k0500L0312k8248n040O8943
1849C9572M409k935k5417j2327O9800n7475J9902m4064l4050K0002K6481P164
1837A1062L5902J3146k2367L41o6346J4526K0300J9279n9080O733K0769J265J8782
1824A4312M075J2788J3467j3279j4510L7237n9445m8856J5523q373J6361K6362
$$ plain form
1812 -4338 4815 -7934 20033 13525 -35525 -28926 -32262 -33634 -14086 -62710 -13835 -27988 11182
1799 11182 18971 -18778 8150 -2223 -54639 -70474 -53265 -97566 -20948 -35664 -2906 -4164
1787 -4164 12769 -14928 -980 17133 -5656 36240 -30197 -22731 4856 -25784 -89019 -45212
1775 -45212 -5417 -27919 -43447 -15258 -2618 -6679 -9008 -17561 22486 -27442 -42887 -11407
1763 -11407 2216 9827 -22393 9921 -9683 -11563 16914 -3871 5023 22994 30431 -13002 -52714
1750 -52714 -46461 -42455 -33144 -26475 17711 1546 13730 22812 -14668 106 21365 -18899 162
1737 162 -1682 -15166 4438 -5102 -13606 -18220 -4268 14042 -10340 41553 -30684 -72862 -43905
1724 -43905 -101767 -38844 -21188 -17263 -2209 -14448 -23798 -23111 -49055 -17517 -6096 -23584 -54731
$$ packed form
1812d338R153j2749K7967o508m9050O599l336j372J9548m8624M8875j4153L9170
1799A1182P789l7749K6928j0373n2416j5835J7209m4301P6618j4716L2758j258
1787d164J6933k7697J3948J8113k2789M1896o6437P466K7587l0640o3235M3807
1775d5212L9795k2502j5528K8189J2640m061k329q553M0047m9928j5445L1480
1763a1407J3623P611l2220L2314j9604j880K8477k0785Q894J7971P437m3433l9712
1750e2714O253M006R311O669M4186j6165J2184R082l7480J4774K1259m0264J9061
1737A62j844j3484J9604r540q504m614J3952J8310k4382N1893p2237m2178K8957
1724d3905n7862O2923J7656L925J5054j2239r350O87k5944L1538J1421j7488l1147
$$ plain form
1711 -54731 -14059 -9663 13069 -61533 -55210 -13820 14941 -11218 -45058 -13116 -50112 -58775
1699 -58775 -25409 -57629 -65505 -36249 -26462 -2137 -34832 -19585 15309 22403 24521 -1887 -38713
1686 -38713 -17425 -23281 6488 30615 997 -33658 -6418 15240 -33549 -10640 -26476 -5328
1674 -5328 -1577 -31492 21466 -20243 3364 20867 -20864 -1713 -34357 -19584 -4270 -36595
1662 -36595 -17169 22056 19021 -44716 -41294 508 21341 -8426 -498 -29268 -18369 1169
1650 1169 -48004 -43111 5742 -1732 -41678 -95045 -79166 -10935 -30462 -70286 -44241 -43106 -25961
1637 -25961 -18660 -38560 -9474 -7471 -1146 35659 10888 6627 -2094 -301 9922 -16621 -69083
1624 -69083 -382 -30110 -34136 7359 -30254 -53347 -39081 -43277 -34261 -56749 -39619 -34637 3241
$$ packed form
1711e4731M0672M396K2732p4602O323M1390K8761k6159l3840L1942l6996q663
1699e8775L3366l2220p876K9256R787K4325l2695J5247L4894P094K118k6408l6826
1686c8713K1288n856K9769K4127k9618l4655K7240K1658m8789K2909j5836K1148
1674e328L751k9915N2958m1709K3607J7503m1731J9151l2644J4773J5314l2325
1662c6595J9426L9225l035o3737L422M1802K0833k9767P928k8770J0899J9538
1650A169m9173M893M8853p474l9946n3367J5879O8231j9527l9824K6045J135J7145
1637b5961P301j9900K9086K003O325L6805k4771m261q721J793J0223k6543n2462
1624f9083O8701k9728m026M1495l7613k3093J4266m196R016k2488J7130M982L7878
$$ plain form
1611 3241 -11108 -11817 -5468 -2509 -14950 -33535 -3614 -26548 -2855 1997 -22066 -31728 -59864
1598 -59864 -38663 -69958 -61307 -50721 -11140 6943 -7791 -11853 -32001 24327 19936 -20552
1586 -20552 -115506 -67261 -32134 -8065 -62470 -53758 -43913 -10609 -10786 -21444 14185 11700 -36132
1573 -36132 -63666 -83026 -115653 -49821 -21561 -68570 -43766 -29734 -4714 -42401 -4408 -97499
1561 -97499 -56447 -43765 -82912 -54131 -38967 -7311 -46862 3544 -1292 -35923 -22339 2880
1549 2880 -35178 -49327 -18166 -52724 -71982 -42565 -47688 -34109 -46781 -33345 -38995 -5018
1537 -5018 -38074 -145 -11710 -28497 16964 -8154 -23930 -31724 -23155 -32184 -29051 -32181 2068
1524 2068 5271 -33550 10364 7926 -55091 -28743 -43747 203 6819 -10973 -33230 -77864 -70603
$$ packed form
1611C241j4349p09O349K959j2441j8585K9921k2934K3693M852k4063r662k8136
1598e9864K1201l1295Q651J0586L9581J8083j4734m062k0148N6328m391m0488
1586b0552r4954M8245L5127K4069n4405Q712R845L3304j77j0658L5629k485m7832
1573c6132k7534j9360l2627O5832K8260m7009K4804J4032K5020l7687L7993r3091
1561i7499M1052J2682l9147K8781J5164L1656l9551N0406m836l4631J3584K5219
1549B880l8058j4149L1161l4558j9258K9417n123J3579j2672J3436n650L3977
1537e018l3056L7929j1565j6787M5461k5118j5776p794Q569r029L133l130L4249
1524B068L203l8821M3914k438o3017K6348j5004M3950O616j7792k2257m4634P261
$$ plain form
1511 -70603 -43761 -69312 -54334 -25499 -41108 -52443 -40933 -61935 -18324 -64913 -44983 4956
1499 4956 3586 -22187 -16840 -32165 -64980 -52967 -31698 -5799 -26281 -9040 3878 -35269
1487 -35269 -88718 -61299 -49620 -4332 35864 -5054 -21429 -19708 1430 20317 1069 25432
1475 25432 4015 -37759 -26587 -8450 -7437 481 -39709 -74436 -64241 -39677 -52075 -37617
1463 -37617 -42914 -34089 -25014 6171 20681 -3927 2480 11448 -18518 -736 -24330 4107 -14184
1450 -14184 -55957 -52446 -46012 -4631 -29618 -73659 -26950 14613 -8864 -2274 36108 23067
1438 23067 6507 32464 1338 -50874 -19643 -37138 -40230 -22803 -39619 -41808 15232 -11361
1426 -11361 -25032 -41550 -18625 -24355 -66415 -60909 -85641 -43075 -70353 -2257 37864 16260
$$ packed form
1511g0603K6842k5551J4978K8835j5609j1335J1510k1002M3611m6589J9930M9939
1499D956j370k5773N347j5325l2815J2013K1269K5899k0482J7241J2918l9147
1487c5269n3449K7419J1679M5288M0196m0918j6375J721K1138J8887j9248K4363
1475B5432k1417m1774J1172J8137J013P918m0190l4727J0195K4564j2398J4458
1463c7617n297Q825R075L1185J4510k4608O407Q968k9966J7782k3594K8437j8291
1450a4184m1773L511O434M1381k4987m4041M6709M1563k3477O590L8382j3041
1438B3067j6560K5957l1126n2212L1231j7495l092J7427j6816k189N7040k6593
1426a1361j3671j6518K2925n730m2060N506k4732M2566k7278O8096M0121k1604
$$ plain form
1414 16260 12128 -29424 -59435 -41875 1763 -25598 -24572 418 15004 -45427 -6949 -18498
1402 -18498 -32424 -12508 -1491 37484 -832 -67634 -27451 -44804 9561 50175 -11405 -30912
1390 -30912 -6026 22842 8487 -12396 -26988 -25337 -6468 27963 -12908 -31962 384 1750
1378 1750 -21766 -8996 40165 -36014 -55194 -15388 -27157 -108398 -78649 -1816 -57579 -39363
1366 -39363 -37947 1490 -2214 -37181 -29412 -25304 -32637 -17034 2377 31931 1094 -6566 -2860
1353 -2860 28023 28046 -39450 -71610 -11537 -7830 17105 9458 -18642 -3905 -8626 -62678 -75117
1340 -75117 -100719 -18703 -8182 5957 -4825 -19413 -35442 -45740 -91669 -65351 -64162 14356
1328 14356 20459 -45265 18318 28337 -27514 -9357 -25717 -70905 -68911 -24395 -56639 -48146
$$ packed form
1414A6260m132m1552l0011J7560M3638k7361J026K4990J4586o0431L8478j1549
1402a8498j3926J9916J1017L8975l8316o6802M0183j7353N4365M0614o1580j9507
1390c0912K4886K8868j4355k0883j4592J651J8869L4431m0871j9054L2346J366
1378A750k3516J2770M9161p6179j9180L9806j1769q1241K9749P6833n5763J8216
1366c9363J416L9437l704l4967P769M108p333J5603J9411K9554l0837p660L706
1353b860L0883K3o7496l2160O0073L707K4935p647k8100J4737m721n4052j2439
1340g5117k5602Q2016J0521J4139j0782j4588j6029j0298m5929K6318J189P8518
1328A4356O103o5724O3583J0019n5851J8157j6360m5188J994M4516l2244Q493
$$ plain form
1316 -48146 -37891 9253 19703 -14717 -23969 -35671 -79326 -87904 -38684 -19714 -40679 -40379 -46862
1303 -46862 -53393 -48711 -99329 -47020 -37413 -42752 -44232 -7494 -35991 -21013 -79009 -66519 -61690
1290 -61690 -53062 -86284 -59197 -47148 31547 17935 -9396 37872 26157 2638 25533 -6835
1278 -6835 -63172 -72656 -34966 -26091 -84844 -44130 29546 14603 -976 -43185 -1946 -22861
1266 -22861 -70625 -58485 -24305 -17996 -32066 -9887 -13999 -63490 -79059 -39018 -40796 -62205
1254 -62205 -75359 -31356 8730 10472 -45481 -13411 -35550 -13631 -656 -34431 -45862 -72535
1242 -72535 -21245 25614 3302 -6939 -17467 -78826 -84778 -57321 -22939 -49330 -33536 -73645
1230 -73645 -62646 -34828 -27378 -15265 15176 2659 -41789 32374 55874 57909 28689 -12467
$$ packed form
1316d8146J0255M7144J0450l4420r252j1702m3655q578M9220J8970k0965L00o483
1303d6862o531M682n0618N2309R607n339j480L6738k8497J4978n7996J2490M829
1290f1690Q628l3222K7087J2049P8695j3612k7331M7268j1715k3519K2895l2368
1278f835n6337r484L7690Q875n8753M0714P3676j4943j5579m2209M1239k0915
1266b2861m7764J2140L4180O309j4070K2179m112m9491j5569M0041j778k1409
1254f2205j3154M4003M0086J742n5953L2070k2139K1919J2975l3775j1431k6673
1242g2535N1290M6859k2312j0241j0528o1359n952K7457L4382k6391J5794m0109
1230g3645J0999K7818P450J2113L0441j2517m4448P4163K3500K035k9220m1156
$$ plain form
1218 -12467 -39971 -49371 -48728 -15853 38583 -10009 -30645 -45657 -38577 -28777 -42874 -36031 -23244
1205 -23244 -28029 -256 24185 19821 -11227 -27887 -51213 -28567 -26865 13351 -40645 -9744
1193 -9744 -4440 17911 -29189 -43975 -577 -946 9303 5686 6673 -14289 -48624 -31969 -2116
1180 -2116 -14950 -350 -24432 -13046 1856 -1622 -10160 -26149 -65160 -20739 -49824 -27401
1168 -27401 -77478 -8399 -9658 -36224 -41917 25171 -49472 104 41195 32611 -5621 -267 -29414
1155 -29414 -64615 -39633 -24038 -11891 19193 -27357 1007 -41087 2820 -30798 -40509 -48646
1143 -48646 -73287 -28672 19258 -22241 -46682 -337 -45000 -76284 -48051 -58165 -48716 -13242
1131 -13242 11306 -7911 -44082 -8339 -12028 -23888 -46150 -45904 -81288 -35934 -48542 -12054
$$ packed form
1218a2467k7504r400O43L2875N4436m8592k0636j5012P080R800j4097O843J2787
1205b3244m785K7773K4441m364l1048j6660k3326K2646J702M0216n3996L0901
1193i744N304K2351m7100j4786M3398l69J0249l617R87k0962l4335J6655K9853
1180b116j2834J4600k4082J1386J4902l478q538j5989l9011M4421k9085K2423
1168b7401n0077O9079j259k6566n693O7088p4643M9576M1091q584l8232N354k9147
1155b9414l5201K4982J5595J2147L1084m6550K8364m2094M3907l3618r711q137
1143d8646k4641M4615M7930m1499k4441M6345m4663l1284K8233j0114R449L5474
1131a3242K4548j9217l6171L5743l689j1860k2262K46l5384M5354j2608L6488
$$ plain form
1119 -12054 -13241 1116 -35163 -46560 -47652 -36368 -31690 -47931 -41460 -25343 -72010 -9907 -77916
1106 -77916 -97078 -48551 -43915 -41234 -10436 -32992 -10336 15949 16604 -12387 9444 9985 -6865
1093 -6865 8562 -23356 -36178 3849 -21449 -5459 34397 4847 -10224 -60214 -39509 -17570
1081 -17570 -53887 -49223 -53735 -59874 -37420 -17923 -5210 -43186 5208 600 -12931 -31919 -1001
1068 -1001 7609 13599 19193 -356 33162 6245 38189 44350 18090 13556 -7578 -59155 -16076
1055 -16076 -26795 -18203 -33132 -552 -22906 -19060 -43124 -55707 -14322 36853 4301 -60025
1043 -60025 -47414 -19614 -53286 2395 3023 -13674 -6963 1702 -8859 -16303 21285 -7509 19121
1030 19121 -22669 16908 -5604 5489 5842 38138 28808 -12283 -29082 -19572 -32892 -12831 -15266
$$ packed form
1119a2054j187J4357l6279j1397j092J1284M678j6241O471J6117m6667O2103o8009
1106g7916j9162M8527M636K681L0798k2556K2656K6285O55k8991K1831N41j6850
1093f865J5427l1918j2822M0027k5298J5990L9856k9550j5071m9990K0705K1939
1081a7570l6317M664m512o139K2454J9497J2713l7976M8394m608j3531j8988L0918
1068a001Q610N990N594j9549L3518k6917L1944O161k6260m534k1134n1577M3079
1055a6076j0719Q592j4929L2580k2354L846k4064j2583M1385N1175l2552o4326
1043f0025J2611K7800l3672N5681O28j6697O711Q665j0561p444L7588k8794K6630
1030A9121m1790L9577k2512J1093L53L2296r330m1091j6799R510j3320K0061k435
$$ plain form
1017 -15266 -52313 -1075 -2742 -3139 54477 49661 42117 -49110 10388 4791 -16688 -45277 -83572
1004 -83572 -26681 -15303 -31048 -54050 -50892 -39580 8192 -4830 7004 23409 -3353 -25368
992 -25368 -49494 -13668 -12545 -61774 -37394 -11549 41195 27103 -3151 -9817 14453 -6963
980 -6963 -14150 -48919 -5589 33325 11453 9792 -12402 -507 -32961 -34682 -34407 -15410 -21422
967 -21422 50629 55429 -5265 889 -35916 14769 -10323 -28212 -42314 -45589 15593 7436 17602
954 17602 -21129 -7308 -32305 -11113 -8939 6463 -10618 -7905 -15199 -7864 11377 -14991 -17491
941 -17491 11265 67 8570 -30474 -24933 -19442 -44903 -33365 -31050 -2679 822 61049 45828
928 45828 12357 -4887 -12 28416 -10854 -46778 -5151 28064 22356 -28124 -9561 -1087 37193
$$ packed form
1017a5266l7047N1238j667l97N7616m816p544r1227N9498n597k1479k8589l8295
1004h3572N6891J1378j5745k3002L158J1312M7772j3022J1834J6405k6762k2015
992b5368k4126L5826J123m9229K4380K5845N2744j4092l0254o666K4270k1416
980f963p187l4769M3330L8914k1872j661k2194J1895l2454j721K75J8997o012
967b1422P2051M800o0694O154l6805N0685k5092j7889j4102l275O1182q157J0166
954A7602l8731J3821k4997K1192K174J5402j7081K713p294P335J9241k6368k500
941a7491K8756j1198Q503l9044N541N491k5461J1538K315K8371L501O0227j5221
928D5828l3471j7244M875K8428l9270l5924M1627L3215n708n0480J8563Q474L8280
$$ plain form
915 37193 70788 42511 -38603 17639 -14847 -12691 -21751 -11748 42432 34087 -35137 -23045 12220
902 12220 169 8160 10968 22432 17258 13948 -37550 6103 32284 25045 -35955 -8141 63490
889 63490 31981 14238 23106 -38976 -25229 15302 18185 12660 82174 48372 43325 -31328 23014
876 23014 20178 -15649 16362 566 -6275 13285 7100 13430 46224 59870 42662 15610 -6112
863 -6112 24438 1948 -4729 60140 37483 30130 12547 56862 40314 -23861 -20397 954 -13684
850 -13684 -21268 -48816 2404 34905 9593 35069 10026 9946 15123 3855 19335 -18841 8814
837 8814 14293 33611 40971 93218 22963 23700 -16500 -12057 1224 -47187 -22893 -35250 -12127
824 -12127 -38897 -5117 37917 12722 93944 98392 72483 39503 7301 6065 -3546 13436 1453
$$ packed form
915C7193L3595k8277q1114N6242l2486K156r060J0003N4180q345o9224J2092L5265
902A2220j2051P991K808J1464n174l310n1498M3653K6181p239o1000K7814P1631
889F3490l1509j7743Q868o2082J3747M0531K883n525O9514l3802n047p4653N4342
876B3014k836l5827L2011j5796o841J9560o185O330L2794J3646j7208k7052k1722
863f112L0550k2490o677O4869k2657p353j7583M4315j6548o4175L464K1351j4638
850a3684p584k7548N1220L2501k5312K5476k5043q0N177j1268J5480l8176K7655
837H814N479J9318P360N2247p0255P37m0200M443J3281m8411K4294j2357K3123
824a2127k6770L3780M3034k5195Q1222M448k5909l2980l2202j236r611J6982j1983
$$ plain form
811 1453 38600 33930 -28587 -40399 -27875 -43303 -39222 -37437 -72135 -48960 -17274 5783 -17398
798 -17398 -2160 -711 40136 -1745 -19576 1858 -27364 -30665 1136 -13285 -3155 32264
786 32264 21013 34141 10677 -4123 23800 3505 42664 43208 -12380 14411 26413 69592
774 69592 50476 6216 29659 -40245 -11436 72402 49584 -48240 -31271 -17489 -56542 -15688
762 -15688 30151 24831 15365 15533 -8725 -9732 19598 32563 28072 -742 39416 39612 6827 53479
748 53479 14409 21288 -2689 -23971 14176 40784 -19102 -10622 -1946 17508 6261 52648 42442
735 42442 31764 9427 51208 67705 15854 30787 9123 -26848 4864 16938 30071 12746
723 12746 -28214 -50250 -22479 8204 2020 27593 3468 -3597 13060 12500 16610 15217 31584
$$ packed form
811A453L7147m670o2517j1812J2524j5428M081J785l4698K3175L1686K3057k3181
798a7398J5238J449M0847m1881j7831K1434k9222l301L1801j4421J0130L5419
786C2264j1251J3128k3464j4800K7923k0295L9159N44n5588K6791J2002M3179
774F9592j9116m4260K3443o9904K8809Q3838k2818r7824J6969J3782l9053M0854
762a5688M5839n320r466J68k4258j007K9330J2965m491k8814M0158J96l2785M6652
748E3479l9070O879k3977k1282L8147K6608n9886Q480Q676J9454j1247M6387j0206
735D2442j0678k2337M1781J6497n1851J4933k1664l5971L1712J2074J3133j7325
723A2746m0960k2036K7771L0683o184K5573k4125p065J6657n60M110j393J6367
$$ plain form
710 31584 -12772 -16017 -47920 -29010 -20399 23456 26102 4010 17654 38876 39525 16906 19615
697 19615 22989 22792 -5752 -56458 -17702 13401 23558 11712 -4750 12254 24913 31698 31980
684 31980 59722 13295 -11429 -46577 -14386 31462 24279 30223 -30306 -36841 -29626 12222 26373
671 26373 -3190 31048 3782 -20146 28691 15042 -38438 -4898 13251 -13760 -16059 -20705
659 -20705 -31567 -25495 42234 32094 -32942 -13075 -5497 25196 5303 -11860 44270 21833
647 21833 -31865 -788 -5888 15809 25561 10386 1541 12599 -4068 27551 67029 22942 -28037
634 -28037 -14093 35418 -6399 -40616 -1946 61163 62985 36943 14314 34183 45437 -1214
622 -1214 27494 6815 29022 45081 -22 9926 33733 21160 -10560 -44799 24695 14113
$$ packed form
710C1584m4356l245l1903J8910Q611M3855K646k2092J3644K1222O49k2619K709
697A9615L374j97k8544n0706L8756L1103J0157j1846j6462J7004J2659O785K82
684C1980K7742m6427k4724l5148L2191M5848p183N944o0529o535P215M1848J4151
671B6373k9563L4238k7266k3928M8837j3649n3480L3540J8149k7011k299m646
659b0705j0862O072O7729j0140o5036J9867P578L0693j9893j7163N6130k2437
647B1833n3698L1077n100K1697R752j5175q845J1058j6667L1619L9478m4087n0979
634b8037J3944M9511m1817l4217L8670O3109J822k6042k2629J9869J1254m6651
622a214K8708k0679K2207J6059m5103R948K3807j2573l1720l4239O9494j0582
$$ plain form
610 14113 -7208 -9364 -33011 -26370 26566 1834 66824 62086 54595 56901 38312 33200 -5186
597 -5186 63891 48182 -8413 16711 33378 8433 -30577 -42285 -14826 -21314 -59916 20890
585 20890 29951 45467 35425 45881 4172 -18563 -9908 21787 57907 49904 82414 -6406 -8626
572 -8626 -6219 50793 59474 11476 -44237 -39824 13463 -14834 13495 -18204 -25017 61135 54948
559 54948 66069 19242 -40952 -5996 14214 9068 -6107 -30747 -9379 13004 26160 19635
547 19635 87 12543 52893 59634 35964 30306 -21440 -42935 -15516 -16847 59068 21999 4034
534 4034 773 -3971 -15984 14836 28449 -11378 -15818 -6572 -6462 1319 27852 2572 1238 -18903
520 -18903 21996 -896 832 -31812 23878 56839 16241 42457 33254 20773 4198 24588
$$ packed form
610A4113k1321k156k3647O641N2936k4732O4990m738p491K306j8589n112l8386
597e186O9077j5709n6595K5124J6667k4945l9010j1708K7459o488l8602Q0806
585B0890R061J5516j0042J0456m1709k2735Q655L1695L6120q003L2510q8820k220
572h626K407N7012Q681m7998n5713M413N3287k8297K8329l1699o813Q6152o187
559E4948J1121m6827o0194L4956K0210n146j5175k4640K1368K2383J3156o525
547A9635j9548J2456M0350O741k3670n658n1746k1495K7419j331P5915l7069j7965
534D034l261m744j2013L0820J3613l9827m440R246J10P781K6533k5280j334k0141
520a8903M0899k2892J728l2644N5690L2961m0598K6216r203j2481j6575K0390
$$ plain form
508 24588 9062 31119 25258 -3526 -9835 23791 -41179 8283 6859 34429 21319 67795 -9810
495 -9810 -33334 -7198 -19034 -18311 32965 23426 -18764 -8238 -16341 34350 50699 64245 15364
482 15364 21566 24737 25991 30681 60425 33669 55747 -8019 14422 78923 86703 58118 59846
469 59846 51947 25550 37197 69036 80608 32728 73043 110950 88764 47279 36261 -14795
457 -14795 -10347 46294 -11426 28002 40174 84863 78760 52970 22263 33941 61936 67852 76030
444 76030 89871 54478 43059 71428 32728 24964 57600 43821 7868 -16494 -16638 9368 -13049
431 -13049 9849 11839 -21820 -43684 -6737 7739 32471 -1624 39762 51823 29281 63432
419 63432 7646 -5475 10198 30424 42211 20667 7003 21487 29671 45557 40475 32458 19778
$$ packed form
508B4588j5526K2057n861k8784o309L3626o4970M9462j424K7570j3110M6476p7605
495i810k3524K6136j1836P23N1276r539m2190J0526q103N0691J6349J3546m8881
482A5364O202L171J254M690K9744k6756K2078o3766K2441O4501P780k8585J728
469E9846p899k6397J1647L1839J1572m7880M0315L7907k2186m1485j1018n1056
457a4795M448N6641n7720L9428J2172M4689o103k5790l0707J1678K7995N916Q178
444G6030J3841l5393j1419K8369l8700p764L2636j3779l5953k4362j44K6006k2417
431a3049K2898J990l3659k1864L6947J4476K4732l4095M1386J2061k2542L4151
419F3432n5786j3121J5673K0226J1787k1544j3664J4484Q184J5886n082q017j2680
$$ plain form
406 19778 71619 78265 73426 23609 -10041 33994 32955 48826 32183 48176 65122 38906 23670
393 23670 -6675 74564 109962 80016 64820 47568 65543 62790 44254 46487 83549 40692
381 40692 35267 29841 60630 25521 86027 64602 28932 17751 20825 72329 87001 88393 100389
368 100389 64590 67047 71009 71217 48060 45728 4548 -21753 42513 17689 20312 43064 12665
355 12665 47684 52744 25847 53341 35953 69874 51142 9483 44638 34661 14852 73313
343 73313 19118 26246 49243 70582 41431 57820 67397 50279 72798 68650 67832 50742 59721
330 59721 8488 30387 59164 56562 77121 8064 65447 73952 53164 58045 63809 42270 43923
317 43923 79855 47487 37160 26115 15936 36563 50208 52864 25780 69037 43156 20835
$$ packed form
406A9778N1841O646m839m9817l3650M4035j039J5871j6643J5993J6946k6216j5236
393B3670l0345Q1239L5398k9946j5196j7252J7975k753j8536K233L7062m2857
381D0692n425n426L0789l5109O0506k1425l5670j1181L074N1504J4672J392J1996
368A00389l5799K457L962K08k3157k332m1180k6301O4266k4824K623K2752l0399
355A2665L5019N060k6897K7494j7388L3921j8732m1659L5155r977j9809N8461
343G3313n4195P128K2997K1339k9151J6389R577j7118K2519m148q18j7090Q979
330E9721n1233K1899K8777k602K0559o9057N7383Q505k0788M881N764k1539J653
317D3923L5932l2368j0327j1045j0179K0627J3645K656k7084M3257k5881k2321
$$ plain form
305 20835 -4781 -7565 6883 83601 35462 -43158 39140 51280 49673 77423 69766 58751 50979
292 50979 105517 65875 57280 77684 52185 61867 48278 57821 98212 58614 46326 94472 107995
279 107995 73877 65814 97226 75933 63031 46942 37156 17861 37782 64510 28614 78454
267 78454 58652 25885 3930 8619 40873 37179 44081 21864 43221 26265 32644 8660 31050
254 31050 7806 37463 54644 68143 57956 56441 72523 57245 33033 76446 40381 68864
242 68864 5206 7172 21577 70024 89883 103369 82046 48161 49765 70454 91740 87123 -4968
229 -4968 -12065 3072 27245 59156 66594 60168 24127 40728 49247 93820 96425 102323 52144
216 52144 31151 22930 70150 94465 33929 11729 53329 38256 76978 50459 94250 84721
$$ packed form
305B0835k5616k784J4448P6718m8139p8620Q2298J2140j607K7750p657j1015p772
292E0979N4538l9642q595K0404k5499R682j3589R543M0391l9598j2288M8146J3523
279A07995l4118q063L1412k1293j2902j6089r786j9295J9921K6728l5896M9840
267G8454j9802l2767k1955M689L2254l694O902k2217K1357j6956O379k3984K2390
254C1050k3244K9657J7181J3499j0187j515J6082j5278k4212M3413l6065K8483
242F8864o3658J966J4405M8447J9859J3486k1323l3885J604K0689K1286m617r2091
229d968p097J5137K4173L1911P438o426l6041J6601Q519M4573K605N898n0179
216E2144k0993q221M7220K4315o0536k2200M1600j5073L8722k6519M3791r529
$$ plain form
204 84721 49905 45917 58548 21028 47831 45062 81362 80971 49326 64784 60243 62842 67572
191 67572 21531 3478 66633 41978 55538 87792 64064 77117 62945 69734 52915 9453
179 9453 -1655 12640 77722 68169 74194 85101 77455 33608 56600 28203 30450 47783 39934
166 39934 61611 24956 -5071 36062 89579 93481 28737 51032 49356 53317 39542 66480 55448
153 55448 59763 76219 5275 35885 84374 66368 38136 60867 29553 43902 54724 22126
141 22126 -2404 40261 98869 84931 67107 65687 32681 32913 26378 27772 74834 66843 18953
128 18953 58419 66580 11651 37000 44211 76428 100663 97176 82700 44790 31327 48181 63482
115 63482 44962 30464 38141 49791 35171 44970 23226 49236 72892 82638 85159 94998 82891
$$ packed form
204H4721l4816l988J2631l7520K6803k769L6300l91l1645J5458m541K599M730
191F7572m6041j8053O3155k4655J3560L2254k3728J3053j4172O789j6819m3462
179I453j1108J4295O5082r553O025J0907p646m3847K2992k8397K247J7333p849
166C9934K1677l6655l0027M1133N3517L902o4744K2295j676L961j3775K6938j1032
153E5448M315J6456p0944L0610M8489j8006k8232K2731l1314J4349J0822l2598
141B2126k4530M2665N8608j3938j7824j420l3006K32o535J394M7062p991m7890
128A8953L9466Q161n4929K5349P211L2217K4235l487j4476l7910j3463J6854J5301
115F3482j8520j4498P677J1650j4620R799k1744K6010K3656R746K521R839j2107
$$ plain form
102 82891 42709 57179 68407 64485 63817 29729 1017 14825 36579 6113 38834 66481 61285
89 61285 50366 49655 58531 69948 44355 55348 66252 69308 70193 74849 61943 62175 66826 71917
75 71917 52411 28143 31038 60199 43827 19653 86400 91079 102270 74855 42009 50168 44552
62 44552 29751 69488 61304 47667 56789 50907 46969 39527 42183 87069 78917 46660 67603 84152
48 84152 75770 51434 39644 55533 62906 78040 50546 42466 63237 88058 73127 34979 62268
35 62268 79939 61819 57663 32493 26182 41899 32249 24065 33083 49592 78772 39702 29323
22 29323 33357 66897 89479 54495 29429 11583 35509 56336 37118 51116 90909 81206 85095
9 85095 74737 75896 42211 62661 58737 27109 50873 77340 59354
$$ packed form
102H2891m0182J4470J1228l922o68l4088k8712J3808K1754l0466L2721K7647n196
89F1285j0919p11Q876J1417k5593J0993J0904L056Q85M656j2906K32M651N091
75G1917j9506k4268K895K9161j6372k4174O6747M679J1191k7415l2846Q159n616
62D4552j4801L9737q184j3637R122n882l938p442K656M4886q152l2257K0943J6549
48H4152q382k4336j1790J5889P373J5134k7494q080K0771K4821j4931l8148K7289
35F2268J7671j8120m156k5170o311J5717r650q184R018J6509K9180l9070j0379
22B9323M034L3540K2582l4984k5066j7846K3926K0827j9218J3998L9793r703L889
9H5095j0358J159l3685K0450l924l1628K3764K6467j7986
$$ plain form
0 59354
$$ packed form
0E9354
$$ Imaginary data points
##PAGE= N=2
##DATA TABLE= (X++(I..I)), XYDATA
$$ plain form
16383 -2161086 -2107212 -2061456 -2058463 -2048358 -2020289 -1994598 -1951341 -1941048 -1938204 -1912348 -1887382 -1874083
16371 -1874083 -1844278 -1806933 -1773114 -1726913 -1738502 -1704452 -1665055 -1653895 -1628649 -1618117 -1598836
16360 -1598836 -1556604 -1558609 -1572621 -1489249 -1445164 -1435174 -1418262 -1430916 -1384380 -1327402 -1315774 -1287326
16348 -1287326 -1269589 -1215712 -1208832 -1192949 -1196063 -1140590 -1114586 -1123614 -1073035 -1065296 -1030756 -1002983
16336 -1002983 -984809 -997956 -991344 -927194 -917540 -924413 -870999 -843251 -802902 -795709 -755437 -717284
16324 -717284 -722174 -729260 -657581 -661053 -654220 -657156 -586391 -562349 -560450 -551843 -512698 -488124 -460042
16311 -460042 -423944 -444855 -441966 -392815 -359183 -373012 -348809 -342666 -300646 -284567 -241394 -258569
16299 -258569 -233121 -220798 -163320 -139988 -178292 -137109 -75360 -50010 -25599 -34165 -12322 -40199
$$ packed form
16383b161086N3874M5756K993J0105K8069K5691M3257J0293K844K5856K4966J3299
16371a874083K9805L7345L3819M6201j1589L4050L9397J1160K5246J0532J9281
16360a598836M2232k005j4012Q3372M4085R990J6912j2654M6536N6978J1628K8448
16348a287326J7737N3877O880J5883l114N5473K6004r028N0579P739L4540K7773
16336a002983J8174j3147O612O4150R654o873N3414K7748M0349P193M0272L8153
16324g17284m890p086P1679l472O833k936P0765K4042J899Q607L9145K4574K8082
16311d60042L6098k0911K889M9151L3632j3829K4203O143M2020J6079M3173j7175
16299b58569K5448J2323N7478K3332l8304M1183O1749K5350K4411q566K1843k7877
$$ plain form
16287 -40199 -34417 22149 61705 94035 75786 111167 114224 113976 141675 129520 151036 186180
16275 186180 227879 230853 270269 281260 279115 300971 339757 353020 337329 366181 345819 360588
16263 360588 398446 420871 453236 472903 506562 499450 547638 554138 537593 559108 554896 617841
16251 617841 613737 622261 626188 603127 644391 650228 720415 671269 671076 748745 774965 787874 766157
16238 766157 817298 834568 822446 805502 847534 841774 848381 843578 901682 986492 968729 958626
16226 958626 929366 961424 986062 963402 986770 1097516 1060085 1036442 1068393 1071803 1042253
16215 1042253 1064899 1076070 1108340 1114942 1077675 1137019 1155623 1172518 1164683 1173015 1180701 1202025
16203 1202025 1176638 1152276 1202421 1232927 1263850 1243561 1229680 1279288 1293987 1290504 1293999 1305243
$$ packed form
16287d0199N782N6566L9556L2330j8249L5381L057k48K7699j2155K1516L5144
16275A86180M1699K974L9416J0991k145K1856L8786J3263j5691K8852k0362J4769
16263C60588L7858K2425L2365J9667L3659p112M8188O500j6545K1515m212O2945
16251F17841m104Q524L927k3061M1264N837P0187m9146j93P7669K6220J2909k1717
16238G66157N1141J7270j2122j6944M2032n760O607m803N8104Q4810j7763j0103
16226I58626k9260L2058K4638k2660K3368J10746l7431k3643L1951L410k9550
16215A042253K2646J1171L2270O602l7267N9344J8604J6895p835Q332P686K1324
16203A202025k5387k4362N0145L0506L0923k0289j3881M9608J4699l483L495J1244
$$ plain form
16191 1305243 1293831 1333498 1369038 1352614 1304792 1340434 1354050 1344191 1403752 1387856 1374260
16180 1374260 1359429 1327728 1428668 1417833 1422301 1410230 1398427 1396217 1405004 1428485 1405183 1433679
16168 1433679 1476178 1465189 1457714 1507394 1515590 1521179 1513679 1552519 1549209 1553548 1548478 1553519 1559785
16155 1559785 1532048 1537547 1542818 1577225 1592459 1625194 1584436 1605176 1627686 1637149 1641335 1609689
16143 1609689 1624622 1632271 1601760 1609565 1655511 1623655 1639311 1676320 1640197 1655041 1710348 1725362
16131 1725362 1640906 1634369 1684561 1684496 1668141 1693641 1689955 1688603 1669608 1674263 1683897 1699202 1747509
16118 1747509 1767305 1781262 1729109 1737358 1756531 1726757 1741935 1778401 1743541 1745318 1772112 1797213
16106 1797213 1772166 1777537 1807448 1806821 1767967 1749911 1781974 1798196 1812059 1824450 1823415 1825392
$$ packed form
16191A305243j1412L9667L5540j6424m7822L5642J3616r859N9561j5896j3596
16180A374260j4831l1701J00940j0835M468j2071j1803k210Q787K3481k3302K8496
16168A433679M2499j0989p475M9680Q196N589p500L8840l310M339n070N041O266
16155A559785k7737N499N271L4407J5234L2735m0758K0740K2510R463M186l1646
16143A609689J4933P649l0511P805M5946l1856J5656L7009l6123J4844N5307J5014
16131A725362q4456o537N0192o5j6355K5500l686j352j8995M655R634J5305M8307
16118A747509J9796J3957n2153Q249J9173k9774J5178L6466l4860J777K6794K5101
16106A797213k5047N371K9911o27l8854j8056L2063J6222J3863J2391j035J977
$$ plain form
16094 1825392 1820907 1817008 1778413 1805554 1810275 1764541 1745047 1801161 1824697 1761490 1814706 1866842
16082 1866842 1833046 1866191 1867017 1846382 1876103 1844764 1846186 1829388 1848013 1818673 1803091 1843696
16070 1843696 1863388 1839326 1846189 1846084 1831909 1841379 1860059 1864808 1859548 1854000 1852900 1903926 1868293
16057 1868293 1841816 1865768 1850716 1848425 1817846 1854805 1864532 1847382 1849483 1840707 1880537 1867347
16045 1867347 1850573 1850727 1859533 1830210 1895137 1867879 1841391 1840697 1846951 1827713 1902366 1907111 1877331
16032 1877331 1885005 1859483 1840951 1833038 1835598 1857456 1892231 1917056 1882790 1849592 1896217 1865152
16020 1865152 1828936 1884747 1901012 1897076 1867318 1872740 1886242 1890477 1872647 1881388 1898949 1862820
16008 1862820 1884098 1910600 1895207 1870073 1850862 1852318 1858272 1873653 1907398 1912096 1872552 1896084
$$ packed form
16094A825392m485l899l8595K7141M721m5734j9494N6114K3536o3207N3216N2136
16082A866842l3796L3145Q26k0635K9721l1339J422j6798J8625k9340j5582M0605
16070A843696J9692k4062O863j05j4175R470J8680M749n260n548j100N1026l5633
16057A868293k6477K3952j5052k291l0579L6959R727j7150K101q776L9830j3190
16045A867347j6774J54Q806k9323O4927k7258k6488o94O254j9238P4653M745k9780
16032A877331P674k5522j8532p913K560K1858L4775K4825l4266l3198M6625l1065
16020A865152l6216N5811J6265l936k9758N422J3502M235j7830Q741J7561l6129
16008A862820K1278K6502j5393k5134j9211J456N954J5381L3745M698l9544K3532
$$ plain form
15996 1896084 1920249 1909811 1908109 1904718 1877186 1877879 1903130 1888555 1874031 1863052 1878745 1872747
15984 1872747 1868615 1834151 1836998 1892555 1891426 1869004 1926688 1901133 1935054 1917696 1946845 1975296
15972 1975296 1935947 1937667 1949672 1875861 1891748 1905868 1909527 1933187 1907713 1864535 1876907 1885519
15960 1885519 1932040 1932184 1908930 1920074 1919754 1905736 1854958 1905048 1919918 1867690 1868768 1874822
15948 1874822 1915842 1908120 1908678 1917410 1890840 1918457 1909287 1897745 1885414 1896688 1856894 1882266
15936 1882266 1887673 1880990 1900320 1916323 1882256 1901975 1871606 1881999 1885137 1854193 1833679 1891301
15924 1891301 1889022 1865467 1885255 1860248 1904860 1976302 1942793 1853160 1861018 1856553 1901785 1889736
15912 1889736 1935684 1890475 1888792 1883589 1873845 1905823 1894115 1912036 1917170 1934604 1906412 1929987
$$ packed form
15996A896084K4165j0438j702l391k7532O93K5251j4575j4524j0979J5693n998
15984A872747m132l4464K847N5557j129k2422N7684k5555L3921j7358K9149K8451
15972A975296l9349J720J2005p3811J5887J4120L659K3660k5474m3178J2372Q612
15960A885519M6521J44k3254J1144l20j4018n0778N0090J4870n2228J078O054
15948A874822M1020p722N58Q732k6570K7617r170j1542j2331J1274l9794K5372
15936A882266N407o683J9330J6003l4067J9719l0369J0393L138l0944k0514N7622
15924A891301k279k3555J9788k5007M4612P1442l3509q9633P858m465M5232j2049
15912A889736M5948m5209j683n203r744L1978j1708J7921N134J7434k8192K3575
$$ plain form
15900 1929987 1929047 1871337 1926993 1888267 1927900 1947566 1948535 1930246 1939342 1963549 1895541 1857718
15888 1857718 1891221 1925649 1917095 1922862 1911232 1883225 1892008 1931197 1931995 1934868 1900252 1919349
15876 1919349 1957339 1948231 1928900 1882502 1908079 1924308 1915288 1936590 1923323 1948463 1933812 1890777
15864 1890777 1926384 1912813 1914225 1880062 1848745 1939528 1929831 1882220 1897596 1924911 2002913 1988778
15852 1988778 1956342 1924473 1901724 1880589 1872953 1942462 1947749 1910187 1911657 1975421 1973751 1972545
15840 1972545 1954923 1923417 1877912 1899280 1891500 1936750 1927242 1933599 1951955 1915517 1913165 1923315
15828 1923315 1903779 1888554 1854719 1871266 1930729 1965539 1914924 1925274 1906379 1925214 1940148
15817 1940148 1918135 1927118 1933007 1897320 1949051 1913926 1909082 1922425 1902418 1924738 1922271 1949918
$$ packed form
15900A929987r40n7710N5656l8726L9633J9666R69j8289R096K4207o8008l7823
15888A857718L3503L4428q554N767j1630k8007Q783L9189P98K873l4616J9097
15876A919349L7990r108j9331m6398K5577J6229r020K1302j3267K5140j4651m3035
15864A890777L5607j3571J412l4163l1317R0783r697m7611J5376K7315P8002j4135
15852A988778l2436l1869k2749k1135p636O9509N287l7562J470O3764j670j206
15840A972545j7622l1506m5505K1368p780M5250r508O357J8356l6438k352J0150
15828A923315j9536j5225l3835J6547N9463L4810n0615J0350j8895J8835J4934
15817A940148k2013Q983N889l5687N1731l5125m844J3343k0007K2320k467K7647
$$ plain form
15805 1949918 1910316 1883636 1946194 1882304 1861169 1907305 1916622 1938996 1924728 1920054 1887880 1886423
15793 1886423 1927204 1900483 1933995 1955373 1934690 1910596 1885660 1948434 1941402 1897016 1841488
15782 1841488 1859728 1908398 1940687 1966865 1946038 1912345 1903544 1954693 1940264 1896845 1859361
15771 1859361 1870977 1914223 1916995 1912311 1911070 1948782 1960921 1984230 1928594 1931307 1946643 1947556
15759 1947556 1892741 1885927 1886941 1905348 1884978 1883358 1938797 1928105 1951102 1948555 1931695 1901993
15747 1901993 1891454 1924266 1909697 1939908 1911107 1921357 1866353 1927546 1968149 1970824 1990541
15736 1990541 1935421 1946321 1914498 1887584 1943016 1933797 1966764 1891677 1870889 1905522 1923366
15725 1923366 1935262 1928491 1881477 1899529 1910306 1894317 1939400 1932729 1996419 1956705 1952456 1961727
$$ packed form
15805A949918l9602k6680O2558o3890k1135M6136R317K2374j4268m674l2174j457
15793A886423M0781k6721L3512K1378k0683k4094k4936O2774p032m4386n5528
15782A841488J8240M8670L2289K6178k0827l3693q801N1149j4429m3419l7484
15771A859361J1616M3246K772m684j241L7712J2139K3309n5636K713J5336R13
15759A947556n4815o814J014J8407k0370j620N5439j0692K2997k547j6860k9702
15747A901993j0539L2812j4569L0211k8801J0250n5004O1193M0603K675J9717
15736A990541n5120J0900l1823k6914N5432r219L2967p5087k0788L4633J7844
15725A923366J1896o771m7014J8052J0777j5989M5083o671O3690l9714m249R271
$$ plain form
15713 1961727 1943077 1937823 1902849 1891917 1880577 1911831 1913156 1938654 1950335 1983748 1927593 1933823
15701 1933823 1912208 1895846 1905369 1928397 1968092 1946098 1947014 1914409 1908689 1954889 1969744 1977991
15689 1977991 1893381 1905922 1935723 1924648 1943477 1923044 1948801 1934411 1921869 1895919 1950518
15678 1950518 1969357 1943227 1943943 1914939 1942594 1930387 1910343 1943209 1917822 1982394 1969852 1974673
15666 1974673 1907725 1961834 1961913 1921291 1982634 1947846 1990184 1995109 1985229 1996766 1993290 2015781
15654 2015781 1944942 1959608 1949325 1969904 1977832 1971770 1962027 1915238 1902598 1956602 1962850 1961492
15642 1961492 2008131 1953637 1939774 1960178 1938978 1922722 1955514 2020909 1995444 2010380 2020646
15631 2020646 1938556 1967661 2002676 1918587 1932932 1945980 1987885 1947787 1935723 1939577 1980896
$$ packed form
15713A961727j8650n254l4974j0932j1340L1254J325K5498J1681L3413n6155O230
15701A933823k1615j6362R523K3028L9695k1994R16l2605n720M6200J4855Q247
15689A977991q4610J2541K9801j1075J8829k0433K5757j4390j2542k5950N4599
15678A950518J8839k6130P16k9004K7655j2207k0044L2866k5387O4572j2542M821
15666A974673o6948N4109P9m0622O1343l4788M2338M925r880J1537l476K2491
15654B015781p0839J4666j0283K0579P928o062r743m6789j2640N4004O248j358
15642A961492M6639n4494j3863K0404k1200j6256L2792O5395k5465J4936J0266
15631B020646q2090K9105L5015q4089J4345J3048M1905m0098j2064L854M1319
$$ plain form
15620 1980896 1948318 1951109 1931713 1927442 1917384 1909949 1953878 1957848 1921825 1932023 1946856 2001902
15608 2001902 1971051 1943230 1948265 1940620 1962809 1923948 1930812 1953265 1981104 1968293 1965630 1988026
$$ packed form
15620A980896l2578K791j9396m271j0058p435M3929L970l6023J0198J4833N5046
15608B001902l0851k7821N035p645K2189l8861O864K2453K7839j2811k663K2396
$$ [...]
##END NTUPLES=NMR SPECTRUM
##END=
