##TITLE=1H_CG-1211-B
 CDCl3
 8 sc, 
 5.9.2024
##JCAMPDX= 6.0         $$ Bruker NMR JCAMP-DX V2.0
##DATA TYPE= NMR SPECTRUM
##DATA CLASS= NTUPLES
##ORIGIN= UXNMR, Bruker Analytische Messtechnik GmbH
##OWNER= root
$$ XWIN-NMR		Version 3.5
$$ Thu Sep  5 13:49:20 2024 Russian Standard Time (UT+4h)  she@DPX200
##.OBSERVE FREQUENCY= 200.1318
##.OBSERVE NUCLEUS= ^1H
##.ACQUISITION MODE= SIMULTANEOUS
##.ACQUISITION SCHEME= undefined
##.AVERAGES= 8
##.DIGITISER RES= 18
##SPECTROMETER/DATA SYSTEM= spect
##.PULSE SEQUENCE= zg30
##.SOLVENT NAME= CDCl3
##.SHIFT REFERENCE= (INTERNAL, CDCl3, 0, 20.9694)
##AUDIT TRAIL= $$ (NUMBER, WHEN, WHO, WHERE, WHAT)
$$ ##TITLE= Audit trail, XWIN-NMR		Version 3.5
$$ ##JCAMPDX= 5.01
$$ ##ORIGIN= Bruker BioSpin GmbH
$$ ##OWNER= she
$$ F:/spectra/data/she/nmr/H-F/1/pdata/1/auditp.txt
$$ ##AUDIT TRAIL=  $$ (NUMBER, WHEN, WHO, WHERE, WHAT)
(   1,<2024-09-05 13:48:12.70 +0400>,<she>,<DPX200>,
      <created by zg, POWCHK disabled, PULCHK disabled
       configuration hash MD5:
       00 E9 B6 7A A2 85 ED C7 34 08 36 98 17 FE 4E 26
       data hash MD5: 16K
       E4 39 2D 32 7D 7E 3E FB 15 1A D3 83 71 96 D9 44>)
(   2,<2024-09-05 13:48:16.28 +0400>,<she>,<DPX200>,
      <Start of raw data processing
       efp BC_mod = 2 LB = 0.24 FT_mod = 6 PKNL = 1 PHC0 = -25993 PHC1 = 10.18748 SI = 16K 
       data hash MD5: 16K
       B6 7F FA C0 39 21 E3 96 F1 73 E1 79 90 C1 AB B2>)
(   3,<2024-09-05 13:48:35.46 +0400>,<she>,<DPX200>,
      <pk PHC0 = -1.653998 PHC1 = 4.6 
       data hash MD5: 16K
       22 6F 54 D9 97 B9 CB 33 DA 6C C9 79 7E B1 10 F2>)
(   4,<2024-09-05 13:48:39.37 +0400>,<she>,<DPX200>,
      <abs ABSG = 5 
       data hash MD5: 16K
       5D F5 B1 8D 14 1B 99 0F 6B E8 43 02 94 43 06 23>)
$$ ##END=
$$ 
$$ hash MD5
$$ D8 24 CC 16 74 89 2E 7F 5A C4 91 95 46 A7 FE C6
##$RELAX= 
##$RELAX= 
##$RELAX= 
##$RELAX= 
##$RELAX= 
##$RELAX= 
$$ Bruker specific parameters
$$ --------------------------
##$DU= <F:/spectra>
##$EXPNO= 1
##$NAME= <H-F>
##$PROCNO= 1
##$TYPE= <nmr>
##$USER= <she>
##$AMP= (0..31)
100 100 100 100 100 100 100 100 100 100 100 100 100 100 100 100 100 100 
100 100 100 100 100 100 100 100 100 100 100 100 100 100 
##$AQSEQ= 0
##$AQ_mod= 1
##$AUNM= <au_zg>
##$AUTOPOS= <>
##$BF1= 200.13
##$BF2= 200.13
##$BF3= 200.13
##$BF4= 200.13
##$BF5= 200.13
##$BF6= 200.13
##$BF7= 200.13
##$BF8= 200.13
##$BYTORDA= 1
##$CFDGTYP= 0
##$CFRGTYP= 5
##$CHEMSTR= <none>
##$CNST= (0..31)
1 1 145 1 1 1 1 1 1 1 1 1 1 1 1 1 1 1 1 1 1 1 1 1 1 1 1 1 1 1 1 1 
##$CPDPRG= <>
##$CPDPRG1= <>
##$CPDPRG2= <>
##$CPDPRG3= <>
##$CPDPRG4= <mlev>
##$CPDPRG5= <mlev>
##$CPDPRG6= <mlev>
##$CPDPRG7= <mlev>
##$CPDPRG8= <mlev>
##$CPDPRGB= <>
##$CPDPRGT= <>
##$D= (0..31)
0 1.2 0 0 0 0 0 0 0 0.06 0 0.03 0 0 0 0 0.0002 0 0 0 0 0 0 0 0 0 0 0 0 
0 0 0 
##$DATE= 1725529692
##$DBL= (0..7)
120 120 120 120 120 120 120 120 
##$DBP= (0..7)
150 150 150 150 150 150 150 150 
##$DBP07= 0
##$DBPNAM0= <>
##$DBPNAM1= <>
##$DBPNAM2= <>
##$DBPNAM3= <>
##$DBPNAM4= <>
##$DBPNAM5= <>
$$ [...]
##$SUBNAM3= <"">
##$SUBNAM4= <"">
##$SUBNAM5= <"">
##$SUBNAM6= <"">
##$SUBNAM7= <"">
##$SUBNAM8= <"">
##$SUBNAM9= <"">
##$SW= 24.0689170037331
##$SWIBOX= (0..15)
0 0 2 0 0 0 0 0 0 0 0 0 0 0 0 0 
##$SW_h= 4816.95568400771
##$TD= 16384
##$TD0= 1
##$TE= 0
##$TE2= 300
##$TE3= 300
##$TEG= 300
##$TL= (0..7)
0 120 120 120 120 120 120 120 
##$TP= (0..7)
150 150 150 150 150 150 150 150 
##$TP07= 0
##$TPNAME0= <>
##$TPNAME1= <>
##$TPNAME2= <>
##$TPNAME3= <>
##$TPNAME4= <>
##$TPNAME5= <>
##$TPNAME6= <>
##$TPNAME7= <>
##$TPOAL= (0..7)
0.5 0.5 0.5 0.5 0.5 0.5 0.5 0.5 
##$TPOFFS= (0..7)
0 0 0 0 0 0 0 0 
##$TUNHIN= 0
##$TUNHOUT= 0
##$TUNXOUT= 0
##$USERA1= <user>
##$USERA2= <user>
##$USERA3= <user>
##$USERA4= <user>
##$USERA5= <user>
##$V9= 5
##$VALIST= <valist>
##$VCLIST= <CCCCCCCCCCCCCCC>
##$VD= 0
##$VDLIST= <DDDDDDDDDDDDDDD>
##$VPLIST= <PPPPPPPPPPPPPPP>
##$VTLIST= <TTTTTTTTTTTTTTT>
##$WBST= 1024
##$WBSW= 4
##$XGAIN= (0..3)
0 0 0 0 
##$XL= 0
##$YL= 0
##$YMAX_a= 519603
##$YMIN_a= -445505
##$ZGOPTNS= <>
##$ZL1= 120
##$ZL2= 120
##$ZL3= 120
##$ZL4= 120
##$ABSF1= 20.97382
##$ABSF2= -3.095312
##$ABSG= 5
##$ABSL= 3
##$ALPHA= 0
##$AQORDER= 0
##$ASSFAC= 0
##$ASSFACI= 0
##$ASSFACX= 0
##$ASSWID= 0
##$AUNMP= <proc_1d>
##$AZFE= 0.1
##$AZFW= 0.1
##$BCFW= 0
##$BC_mod= 2
##$BYTORDP= 0
##$COROFFS= 0
##$CY= -3
##$DATMOD= 1
##$DC= 0
##$DFILT= <>
##$DTYPP= 0
##$F1P= 0
##$F2P= 0
##$FCOR= 1
##$FTSIZE= 16384
##$FT_mod= 6
##$GAMMA= 0
##$GB= 0
##$INTBC= 1
##$INTSCL= 3.70164e-10
##$ISEN= 128
##$LB= 0.24
##$LEV0= 0
##$LPBIN= 0
##$MAXI= 10000
##$MC2= 0
##$MEAN= 0
##$ME_mod= 0
##$MI= 1.114404
##$NCOEF= 0
##$NC_proc= -6
##$NLEV= 6
##$NOISF1= 3.799351
##$NOISF2= 2.8
##$NSP= 0
##$NTH_PI= 0
##$NZP= 0
##$OFFSET= 20.96941
##$PC= 1
##$PHC0= -25994.65
##$PHC1= 14.78748
##$PH_mod= 1
##$PKNL= yes
##$PPARMOD= 0
##$PSCAL= 0
##$PSIGN= 0
##$REVERSE= no
##$SF= 200.130011870655
##$SI= 16384
##$SIGF1= 3
##$SIGF2= 2
##$SINO= 5.538805
##$SIOLD= 16384
##$SREGLST= <1H.CDCl3>
##$SSB= 0
##$STSI= 16384
##$STSR= 0
##$SW_p= 4816.95568400771
##$SYMM= 0
##$S_DEV= 0
##$TDeff= 16384
##$TDoff= 0
##$TI= <>
##$TILT= no
##$TM1= 0
##$TM2= 0
##$TOPLEV= 0
##$USERP1= <user>
##$USERP2= <user>
##$USERP3= <user>
##$USERP4= <user>
##$USERP5= <user>
##$WDW= 1
##$XDIM= 16384
##$YMAX_p= 276336909
##$YMIN_p= -780215
$$ End of Bruker specific parameters
$$ ---------------------------------
##NTUPLES= NMR SPECTRUM
##VAR_NAME=  FREQUENCY,     SPECTRUM/REAL,   SPECTRUM/IMAG
##SYMBOL=    X,             R,               I
##VAR_TYPE=  INDEPENDENT,   DEPENDENT,       DEPENDENT
##VAR_FORM=  AFFN,          ASDF,            ASDF
##VAR_DIM=   16384,         16384,           16384
##UNITS=     HZ,            ARBITRARY UNITS, ARBITRARY UNITS
##FACTOR=    0.29402158847633, 1,            1
##FIRST=     4196.60826073856, 0,            0
##LAST=      -620.347423269147, 0,           0
##MIN=       -620.347423269147, -780215,     0
##MAX=       4196.60826073856, 276336909,    0
$$ Real data points
##PAGE= N=1
##DATA TABLE= (X++(R..R)), XYDATA
$$ [...]
7003E2914175J499495J108062J276680K230280L056399R95599p88973q46840q33096
$$ 52914175 54413670 55521732 56798412 59028692 62085091 63080690 62291717 61444877 60611781
6994F0611781l42150M90445Q67891J527415J766996K029136K495982L299739L824963
$$ 60611781 60269631 60760076 61627967 63155382 64922378 66951514 69447496 72747235 76572198
6985G6572198M595797N122689O359320P528335R259446J1193924J1735918J0719953
$$ 76572198 81167995 86290684 92650004 100178339 109437785 120631709 132367627 143087580
6977A43087580J0185058J1559564J0480675Q306180M603860o351034j1534800
$$ 143087580 153272638 164832202 175312877 183619057 188222917 181871883 170337083
6970A70337083j0845021r206814o444757l316319m09762K782025M549888M400033
$$ 170337083 159492062 150285248 143840491 140524172 140114410 142896435 147446323 151846356
6962A51846356L222616l2804j877750j419193Q50632M250780N563049M395305
$$ 151846356 155068972 155036168 153158418 151739225 152589857 156840637 162403686 166798991
6954A66798991M700673P692126R151597R228189J1444367Q788466K875313m951264
$$ 166798991 171499664 179191790 188343387 197571576 209015943 217804409 220679722 215728458
6946B15728458j1835533j3399415j1333047o634983k640845l87661k05042k016473
$$ 215728458 203892925 190493510 179160463 172525480 169884635 169496974 169291932 167275459
6938A67275459j983480Q40793J673790m613045r626122r619323q214959m779014
$$ 167275459 165291979 166132772 167806562 163193517 153567395 143948072 135733113 130954099
6930A30954099n893290r238177r758433r102444p388882n513353m066519k806433
$$ 130954099 125060809 115822632 106064199 96961755 89572873 84059520 79993001 77186568
6922G7186568k128315j289893m56135P44488J859832L330830J759728k275122
$$ 77186568 75058253 73768360 73312225 74056713 75916545 79247375 81007103 78731981
6914G8731981m214946m646770l724976k132979k861333m025804m342781l973732
$$ 78731981 74517035 69870265 66145289 64012310 61150977 57125173 52782392 48808660
6906D8808660l440312k878353k422410j840403j720431j488224j446602j179128
$$ 48808660 45368348 42489995 40067585 38227182 36506751 35018527 33571925 32392797
6898C2392797r11345o90815r09695o37244n49949p08820k89149j72885m34219
$$ 32392797 31481452 30790637 29880942 29243698 28693749 27984929 27695780 27522895 27088676
6889B7088676j82492j78237k88717j14313k16554q6566j31926J01389J51080J59576
$$ 27088676 26906184 26727947 26439230 26324917 26108363 26021797 25889871 25991260 26142340 26301916
6879B6301916M37467N26955M29948J99423L12225J13646N16200L41221L03285
$$ 26301916 26739383 27266338 27696286 27895709 28207934 28321580 28837780 29179001 29482286
6870B9482286K11268K52936M41186K64495N02123L69251M56862M70624N97726
$$ 29482286 29693554 29946490 30387676 30652171 31154294 31523545 31980407 32451031 33048757
6861C3048757O51467O92397J022647J059348J246660J646145J814218K063908
$$ 33048757 33700224 34392621 35415268 36474616 37721276 39367421 41181639 43245547
6853D3245547J989555K145310K488265L059873L534775M338625N189082N955890
$$ 43245547 45235102 47380412 49868677 52928550 56463325 60801950 65991032 71946922
6845G1946922O399340M297428K349730J997831K421809O21949k930163m024752
$$ 71946922 78346262 82643690 84993420 86991251 89413060 90035009 87104846 83080094
6837H3080094l883266k843576j754872n27484O90907J893315K860541M038538
$$ 83080094 79196828 76353252 74598380 74070896 74761803 76655118 79515659 83554197
6829H3554197N077167O022062M809075L847412M233689M906716M211021L047579
$$ 83554197 88631364 94653426 99462501 103309913 107543602 112450318 116661339 119708918
6821A19708918L764974M355651L569695J902696j070242l827910l960806k654115
$$ 119708918 123473892 127829543 131399238 133301934 132231692 128403782 124442976 121788861
6813A21788861j339186j856678k985674k736073j696399j69056J722798L731473
$$ 121788861 120449675 118592997 115607323 112871250 111174851 111005795 112728593 116460066
6805A16460066N653352P240966P541114Q406489J0272522J1210969R927063N037055
$$ 116460066 122113418 129354384 136895498 145301987 155574509 166785478 176712541 181749596
6797A81749596n98674m504999o540275p073919q232828p955361o426485n419359
$$ 181749596 181150922 176645923 170105648 163031729 154798901 146843540 140417055 134997696
6789A34997696n796073o916159o513255n500989m142127k874196j315089n3281
$$ 134997696 129201623 122285464 115772209 110271220 106129093 103254897 101939808 101886527
6781A01886527J418267K712460M558289O485996P881139R120116J0419763J0975779
$$ 101886527 103304794 106017254 110575543 117061539 124942678 134062794 144482557 155458336
6773A55458336Q995271N159751J392057l165682q923062j1702034j1650563j0578441
$$ 155458336 164453607 169613358 171005415 167839733 158916671 147214637 135564074 124985633
6765A24985633r585370q658100p729622o394824n695706n109106m284992l669672
$$ 124985633 115400263 106742163 99012541 92617717 86922011 81812905 77527913 73858241
6757G3858241l215418k612411j918168j159094l16681N30761J021039J403036
$$ 73858241 70642823 68030412 66112244 64953150 64636469 65167230 66188269 67591305
6749F7591305J724452K162745K749672K719714Q26290r23044k189467k342281
$$ 67591305 69315757 71478502 74228174 76947888 77774178 76851134 74661667 72319386
6741G2319386k305729l486250m738910n307300n423352m759041l926687l247174
$$ 72319386 70013657 66527407 61788497 56481197 51057845 46298804 42372117 39124943
6733C9124943k497050k295709j884693j519049j503320j124641r92933j030169
$$ 39124943 36627893 34332184 32447491 30928442 29425122 28300481 27307548 26277379
6725B6277379q52106r61427q76617p45356p21846o50320r47996q28269o64630
$$ 26277379 25425273 24463846 23587229 22841873 22120027 21469707 20521711 19693442 19028812
6716A9028812p33561p65416q15683p29440n96259n01520n22994l49378l38036
$$ 19028812 18295251 17529835 16714152 15984712 15388453 14886933 14363939 14014561 13676525
6707A3676525m34296l46612l79133l00920k16188j40817j79120k30134j30054
$$ 13676525 13242229 12895617 12516484 12215564 11999376 11858559 11679439 11449305 11319251
6698A1319251j68863l57818l24289j43097l02291l44316k50944k86077k09563
$$ 11319251 11150388 10792570 10468281 10325184 10022893 9678577 9427633 9141556 8931993
6689H931993r2402l76803j34915k36050L7727k09864n3955j47662r6734k99620
$$ 8931993 8839591 8462788 8327873 8091823 8129550 7919686 7865731 7718069 7621335 7321715
6679G321715l12452j53550j47760k16128j86672q6391l66891j20554j13784j39866
$$ 7321715 7009263 6855713 6707953 6491825 6305153 6218762 5851871 5731317 5617533 5477667
6669E477667l1507k02299K0893k48121j51545m4538j97889L6133j7581k21644
$$ 5477667 5446160 5243861 5264754 5016633 4865088 4820550 4622661 4658794 4641213 4419569
6659D419569q4477k36111j8826n4204j9410r4938j79140Q6095j14217m9220j31750
$$ 4419569 4335092 4098981 4080155 4025951 4006541 3911603 3732463 3818558 3704341 3655121 3523371
6648C523371R0111l84442j11084P4241n2503N067j79520r2673j07043L7594p7517
$$ 3523371 3613482 3229040 3117956 3192197 3139694 3144761 2965241 2872568 2765525 2803119 2725602
6637B725602J12353j63926j73007j5288k4677M981p2294r1909j5837J01094p5958
$$ 2725602 2837955 2674029 2501022 2485734 2461057 2466038 2393744 2301835 2285998 2387092 2311134
6626B311134k00974M4833J0374l2230k52976K4713R7671p4497m5072N5679J23141
$$ 2311134 2110160 2154993 2165367 2133137 1880161 1904874 2002545 1928048 1882976 1938655 2061796
6615B061796j00266p9983r6547R1110J0599N1576j38565L266o5948o4284N2514
$$ 2061796 1961530 1881547 1785000 1876110 1886709 1938285 1799720 1802986 1737038 1672754 1725268
6604A725268M1881P8969j26107Q232j274O5466n1973o1193j26142O827N5233l7324
$$ 1725268 1767149 1846118 1720011 1728243 1726969 1792435 1740462 1679269 1553127 1559954 1615187 1577863
6592A577863q496J50047o7137K4952k1199m3658l1757J50763J91026m1246j7161
$$ 1577863 1569367 1719414 1652277 1677229 1656030 1612372 1580615 1731378 1922404 1881158 1863997
6581A863997J74513P2464R4941K34390J15978Q2488J11592j73136n3008J60476
$$ 1863997 2038510 2110974 2205915 2440305 2556283 2638771 2750363 2577227 2524219 2684695
6571B684695M3620l8319r3934L0156j43354k62281j07654M7998n5024p8435L7421
$$ 2684695 2728315 2689996 2596062 2626218 2482864 2220583 2112929 2160927 2105903 2027468 2064889
6560B064889J061k64247J34629l8417k6649J27889N315J14354K16391m3935J85080
$$ 2064889 2065950 1801703 1936332 1897915 1871266 1999155 2004470 2118824 2335215 2291280 2476360
6549B476360L4132m9133j37667J88374L9824k4058j15912O9187j25026k05006
$$ 2476360 2510492 2461359 2323692 2512066 2551890 2527832 2411920 2481107 2356081 2151075
6539B151075o7943l1065j71018o0391j77060j0904J03668k728J4956J24835n1401
$$ 2151075 2083132 2052067 1881049 1820658 1643598 1632694 1736362 1733634 1748590 1873425 1822024
6528A822024r327P3265j85913J09372j9084l7438n4535j28456j00923L1532o0690
$$ 1822024 1812697 1885962 1700049 1809421 1790337 1752899 1698364 1569908 1468985 1500517 1439827
6517A439827k9025k1749n5902M8272P7093N5677k8132k10074L6385j57981J97481
$$ 1439827 1410802 1389053 1333151 1381423 1458516 1514193 1486061 1275987 1312372 1154391 1351872
6506A351872J34991l7144N5078l799J4849j29264J12290o7674J3830l132j06383
$$ 1351872 1486863 1449719 1504797 1500998 1515847 1386583 1498873 1431199 1445029 1441897 1335514
6495A335514j37232m8523o1216l218o919j33031N0096L1146j46427J27707j57358
$$ 1335514 1198282 1149759 1088543 1085325 1078406 945375 995471 1026617 880190 1007897 850539
6484H50539j23021L5459M3074M3779j7363j9549l2049J07071J3639q495K9214
$$ 850539 727518 762977 806051 849830 832467 812918 780869 887940 901579 893084 922298
6473I22298n6797N2811j36907M1350m7101k4707J43413k26451N1558r7604p9815
$$ 922298 865501 918312 781405 822755 775654 750947 894360 667909 719467 621863 542048
6462E42048q4871N7766o8429J15387j8219j04071J47783k3722J3757J6389N3394
$$ 542048 457177 514943 446514 561901 543682 439611 587394 563672 577429 593818 647212
6451F47212p2520K4461o2969k6573P9517N5523p4091j93332K9678K5501J2654
$$ 647212 574692 599153 536184 509611 589128 644651 570560 377228 406906 432407 445061
6440D45061j8806R8581r6151k1422M1763J01704j0759j06978R9242q7132l5148
$$ 445061 426255 524836 428685 407263 449026 550730 539971 432993 532235 445103 409955
6429D09955J34335l5380p8749l2397k2932J08916K8066o5187N6354L7831J14585
$$ 409955 544290 508910 430161 397764 374832 483748 511814 446627 502981 540812 655397
6418F55397P4593l8293j00820O0493J24733k743m6605L1201J50289M2692n9804
$$ 655397 729990 691697 590877 651370 776103 773360 726755 757956 908245 950937 891133
6407H91133k4104j9710J92932n1683O316J4582O0845N6760L6856j8506O4163J12541
$$ 891133 867029 847319 1040251 988568 994884 1009466 1070311 1127071 1163927 1145421 1209584 1322125
6395A322125o0966R1430J51925j0716J239J2604L0136K04938L1464n8710J99199
$$ 1322125 1261159 1352589 1504514 1493798 1495037 1507641 1537777 1742715 1774179 1715469 1914668
6384A914668J58366j3511j19604K56582J92948K49749L96617L86252K57185J15019
$$ 1914668 2073034 2059523 1939919 2196501 2389449 2639198 3035815 3422067 3679252 3794271
6374C794271M33372N23481L31771J868n7520L6578k7843J32598K3080k43398l39472
$$ 3794271 4227643 4751124 5082895 5084763 5027243 5063821 5035978 5168576 5191656 4948258 4608786
6363D608786j00560j68437m24203j90595j07641k570J01895q5105j28527j76438
$$ 4608786 4508226 4339789 3915586 3724991 3617350 3614780 3716675 3631570 3503043 3326605
6353C326605P4561K52221J08785P73J79298K18304J61749J56200m3760J17537
$$ 3326605 3401166 3653387 3762172 3762945 3942243 4160547 4322296 4478496 4434736 4552273
6343D552273J32346l1217j9056n1107l97657l25606m47777k71774p9904j65113
$$ 4552273 4684619 4653402 4634346 4583239 4185582 3859976 3412199 3140425 3060521 2895408
6333B895408k29950k60435j51957j16275j91440j00138k17100r9053q7132p2739
$$ 2895408 2665458 2405023 2253066 2136791 1945351 1845213 1628113 1529060 1441928 1369189
6323A369189j33599j60869j58230j31509J79428J05221o9781j06227L9351j34046
$$ 1369189 1235590 1074721 916491 784982 964410 1069631 999850 893623 932974 798928
6313G98928k82364J12781J18434j78294j9168L2207N5698n0583o1138m1664M4777
$$ 798928 516564 629345 747779 569485 550317 582524 638222 587639 526501 484837 529614
6302E29614l3891j37631J01649P096L6843r3245J5456m644J02997k03278l7205
$$ 529614 495723 358092 459741 466837 503680 410435 425891 421247 524244 320966 283761
6291B83761L1043q4111L9830J15052J54373j59037q8325k637k4908J72749m7045
$$ 283761 314804 230693 270523 385575 539948 380911 292586 289949 265041 437790 390745
6280C90745q1973o1468q5737N2117O780m8442j00774Q4314l5386O985O0492M0019
$$ 390745 308772 247304 161567 213684 220464 172022 71248 155562 120176 127161 187653 227672
6268B27672J09548p8410j92415J13203r4503m8259P7664J44326J3223j32278M8251
$$ 227672 337220 258810 66395 179598 85095 36836 114500 258826 272049 139771 188022
6257A88022M066l7212p1837p633K9462l5503R7486j48703O1225J21673j42462
$$ 188022 192088 154876 83039 75406 104868 69365 166851 18148 79373 201046 58584
6246E8584P2861j599m6407j08073Q862j10714J47728j33236L6272J04439J7517
$$ 58584 131445 129846 83439 -24634 -15772 -126486 21242 -111994 -75722 28717 46234
6235D6234J23033n5722l989q468o3149n677K1397J51893j12638J8964N3018j08224
$$ 46234 169267 113545 109556 101088 37939 32262 53659 205552 92914 111878 164896 56672
6223E6672o862R416p0154o4043P9384J7055j29764k6292J86097J09860j32587
$$ 56672 49810 59226 -10928 -74971 4413 21468 -108296 -134588 51509 161369 28782
6212B8782k14139J45588O4679q958r4242J0409j36517J72023N9724n1116O3835
$$ 28782 -185357 -39769 24910 15952 -78290 -67881 -204398 -32375 27349 -23767 40068
6201D0068J81652j25810n4632J17542j50251K3236J0740j68135o1814J63771J31495
$$ 40068 221720 95910 41278 158820 8569 31805 42545 -125590 -187404 -23633 107862
6190A07862M8201J1380J61933o9246l3796o7406K3851n1668r1093N394m3379m6343
$$ 107862 156063 167443 329376 260130 226334 158928 182779 131111 40018 45412 2033 -44310
6178d4310P847r9607J88683j41011N8132N1389M9848k7895j1681j3432n1470K09003
$$ -44310 -36463 -136070 52613 -88398 -30266 21123 70971 43076 31395 17963 -33507 175496
6166A75496m476j19036P506j94527J71728Q8709j54195j32297N4525R3287o3158
$$ 175496 171020 51984 59490 -135037 36691 125400 -28795 -161092 -106567 -13280 -76438
6155g6438M1859p3628J4480O9830J43098j45269m898j8688q9818O0397K4065j15875
$$ -76438 -34579 -108207 -93727 -23897 119201 -26068 -30966 -49654 -139472 -79075 -55010 -170885
6143a70885K66470p1340q4603L5252N4127K1591o4056p3101N4533l6744p229K06041
$$ -170885 95585 24245 -60358 -25106 29021 50612 -13444 -86545 -32012 -68756 -75985 130056
6131A30056j1907j48654R8088j27973J03936J3464M9739j73944J6267p8603N827
$$ 130056 118149 -30505 67583 -60390 43546 57010 106749 -67195 -50928 -129531 -123704
6120a23704O9997n4354q7290J8802J53097R9150m8925J1389n4755O7291j2213
$$ -123704 -53707 -108061 -195351 -176549 -23452 75698 26773 38162 -16593 50698 38485
6109C8485m8664r5569O4428K6434R540m8099L0457j7485j14129k2181N6058J60628
$$ 38485 -10179 -105748 -41320 -14886 -5346 -53445 -22988 -40473 -154602 -176783 -120725 39903
6097C9903l2328p5322J49350N4706l8216q3946J3189P2172L2894q8316j29392
$$ 39903 7575 -67747 81603 136309 98093 14147 27336 99508 132402 44086 -85306
6086h5306M8616m8440J06770n5108n2341N3092K06863q3384k6012M9758j830q2871
$$ -85306 -36690 -85130 21640 -33468 -85809 -32717 174146 90762 64750 114508 112678 29807
6074B9807J2745j44305j22326J74666k7273O5428l6668L4168Q5896r9157J62118
$$ 29807 42552 -101753 -224079 -49413 -76686 -11258 -47926 -13758 72138 -27019 135099
6063A35099L7816k6862j67578j38300J9874K64807j01848O7842q7101J10426K7399
$$ 135099 172915 146053 -21525 -159825 -139951 124856 23008 90850 3749 114175 141574
6052A41574j43630O6046l2207j13789p0479O1961L7395q3402M4499Q2588L758
$$ 141574 -2056 63990 31783 -82006 -152485 -90524 -53129 -136531 -92032 -9444 -5686
6041e686p7468r5053K9092K25185j80379Q465J8538j167r5363R8580J14022p7924
$$ -5686 -83154 -178207 -149115 76070 -104309 -95844 -77306 -78473 -173836 -75256 38766 -39158
6029c9158L5581P5866J20216j16710o8885L6965N2463j59114M0553J3261j81739
$$ -39158 -3577 72289 192505 75795 6910 43875 96338 -62776 -22223 -8962 -190701
6018a90701Q3094R3231j8739P124K7322L0363N0866M6855r6409j03682n1199k0380
$$ -190701 -107607 -14376 -33115 -25991 1331 31694 82560 129415 33006 -70676 -121875 -142255
6006a42255J00765O8844n9919N4665n0984o3741J46679O772l2808j1626n0246
$$ -142255 -41490 27354 -32565 22100 -28884 -92625 54054 60826 28018 16392 -33854
5995c3854j12818k8874O8756J26485N9452j88822p0733K1905n9967L8943P9079
$$ -33854 -146672 -175546 -106790 19695 79147 -109675 -180408 -158503 -218470 -179527 -100448
5984a00448N7562Q8692K5219k49504l0056K10950j23067N031m733m0859J22693
$$ -100448 -42886 45806 71025 -178479 -208535 2415 -120652 -115621 -120354 -161213 -38520
5973c8520j8467n8608J14359l7743J57224p2728o8628J0168l4908Q4699Q8307
$$ -38520 -56987 -115595 -1236 -38979 118245 45517 -23111 -12943 -47851 36848 125155
5962A25155k42119j25255J38083L9283O8396r3953L535J10904Q0367j15917j01671
$$ 125155 -116964 -242219 -104136 -64853 3543 -90410 -86875 24029 104396 -11521 -113192
5951a13192L5921m8139l842N1453K9845m921L0892R5751j79383p2196J38578N5652
$$ -113192 -77271 -125410 -129252 -77799 -47954 -52875 -21983 73768 -105615 -177811 -39233 16419
5939A6419q5168q6552O4494j92453R6631J32342j10503K00107j9959J90359n0215
$$ 16419 -68749 -155301 -90807 -283260 -186629 -54287 -164790 35317 15358 205717 155502
5928A55502k42946n060J0261k2862p1357M8966Q4089l7961J3956r9398J33999
$$ 155502 -87444 -92504 -82243 -105105 -176462 -127496 -43407 -81368 -67412 -166810 -32811
5917c2811O7564o6673j10717Q9808k0455O7552Q8555m8669N053k11473M782l5719
$$ -32811 34753 -31920 -142637 -52829 -73284 -5732 82823 34154 39207 -172266 -167484 -203203
5905b03203R7077K7241P8892j03297J76633l8304p0410j06130P2622J31608j59724
$$ -203203 -106126 -78885 7 -103290 73343 35039 -35371 -141501 -68879 62729 -96995
5894i6995O0369P4299j20276K0115N7413R363m0777O3618L8555n3047J03445j18460
$$ -96995 -36626 37673 -82603 -62488 -5075 4288 -36489 27129 65684 12637 116082 -2378
5882b378n8171M0689p319K5588j05511M0626m3516q8849Q0780J31811O0887o6676
$$ -2378 -60549 -19860 -27179 -1591 -107102 -66476 -109992 -198841 -118061 13750 74637 7961
5870G961M7871j34208j22348K42350j06751m6104o752o3770O0375J68121q1853
$$ 7961 55832 -78376 -200724 41626 -65125 -111229 -117981 -181751 -121376 46745 -35108
5859c5108n4222J0039r6721k727J35432J99062K6394j15371q9357O3385Q87k1041
$$ -35108 -89330 -79291 -176012 -178739 -43307 155755 182149 66778 -22579 40806 41693 20652
5847B0652m9489j13097K7971P8805K1750j7671O9905o5831N357P8890j07783p850
$$ 20652 -28837 -141934 -113963 -35158 -13408 -31079 38826 -27005 -21648 57242 -50541 -58391
5835e8391J49771N4342j01594J905p6256N5196J0297K7932k14342R7428l7669
$$ -58391 91380 145722 44128 46033 -30223 24973 35270 63202 -151140 -53712 -91381
5824i1381j10434J78266L6616m3427N6386L1776j22074k6432K5837m2292p4244
$$ -91381 -201815 -23549 13067 -30360 26026 57802 -64272 -90704 -64867 -107159 -181403
5813a81403O5690l4969k5322P6427J61122r5469J4842Q77j49698p7049J01406
$$ -181403 -115713 -150682 -176004 -99577 61545 -33924 -19082 -18205 -167903 -244952 -143546
5802a43546J97034o9493m7040N551Q7671J9565m1700q3590J52295l5881m7559
$$ -143546 53488 -16005 -63045 -57494 30177 49742 8042 -75548 76747 40866 -6693
5791f693p6821Q729N4915N4448J2029R5180p4670k2883l0648q9324O5818R2852
$$ -6693 -83514 -74785 -19870 34578 46607 141787 67117 44234 13586 -75738 -9920 82932
5779H2932O7993j13804q8291J14777r4672r1833M2695n9341L14183j12008M1890
$$ 82932 150925 37121 -51170 63607 -31065 -122898 -80203 -139544 174639 62631 104521
5768A04521m6723n3373j16338j1120K13473K6866j33829O0406j55458K1645M4946
$$ 104521 57798 4425 -111913 -123033 90440 117306 -16523 43883 -111575 -89930 -44984
5757d4984J1995J18829j01963n6496K508J02689o1573L2091J8036p728j28551
$$ -44984 -32989 85840 -16123 -72619 -70111 32578 -28995 3096 21132 13404 -115147
5746a15147Q9909J40289l7021o1065N002l6390J9526m0254j3022R8831k9297N1837
$$ -115147 -25238 115051 78030 16965 21967 -14423 5103 -35151 -48173 50658 21361 73198
5734G3198o4473m1814N4853j3111j29405L2109J36875j8492j12707J21127L3555
$$ 73198 8725 -33089 21764 8653 -120752 -88643 48232 29740 -82967 38160 71715
5723G1715m8733n8644M3413N5934k54650J08351o3689J30240J10380o4960N6451
$$ 71715 22982 -35662 7751 63685 -190965 -82614 -146303 -16063 94317 29357 85808
5712H5808m9944n6880l5431J18900J2993n5258j7267o6611J51756l7266q0557
$$ 85808 35864 -21016 -56447 62453 75446 20188 2921 -63690 88066 50800 -29757
5701b9757J2332j1856j508j0752j21084Q6776J07871p3499J4921J09607j23330
$$ -29757 -17425 -29281 -30789 -41541 -162625 -75849 32022 -41477 -26556 83051 -40279
5690d0279M102R7747J15020k53502M6558M790J23052p0021r7884N3858R996J80255
$$ -40279 -36177 61570 176590 -76912 -30354 -25564 97488 27467 -70417 -16559 -6563 173692
5678A73692j62001J9906r8012J2404J33201j5902P8390j5879o8104K9704l9156
$$ 173692 11691 31597 -66415 -54011 79190 63288 141678 125799 57695 87399 48243
5667D8243k7881l600k533Q9472J5827j9761m2077K1831J2058P8734n0428j80659
$$ 48243 20362 16762 14229 103701 119528 99767 57690 79521 91579 170313 119885 -60774
5655f0774K7114L6055k7350L186K8000N763K3629j9815M8187M7859j04928m401
$$ -60774 -33660 2395 -24955 -21769 6231 11994 35623 15808 63995 111854 6926 2525
5643B525R4853K476k8281n7922p1861P5301M0818q0835J43403O0948j43366j4176
$$ 2525 97378 99854 71573 13651 -58210 17091 57909 -22926 120477 181425 38059 23883
5631B3883J76526o2884Q6983o0127n1453k781l8464R1985P272j97299N536l806
$$ 23883 200409 137525 224508 164381 112928 110147 71683 163668 170940 -26359 -20823 -24629
5619b4629K1830k701M1310J16245R8040L4810q9214r2231Q1766O1156j2521p8271
$$ -24629 -2799 -5500 35810 152055 250095 284905 195691 103460 185226 246382 233861 155590
5607A55590K12828j4144J45589j43306n7295m0385j38277R4895L8038j43755L1880
$$ 155590 368418 354274 499863 356557 299262 258877 120600 215495 253533 109778 141658
5596A41658N0390M7267p4173m1542J24980m6527j30012N3195J35799P4239j09923
$$ 141658 192048 239315 165142 123600 248580 202053 72041 125236 261035 335274 225351
5585B25351j99769M5984j12089j08961J97512j0759q0588P5716M4351L5459m746
$$ 225351 25582 71566 -40523 -149484 48028 37269 -43319 32397 76748 112207 107461
5574A07461J158o1254N1516n2547L4419N1545j69587r122J6180K9409m5076L098
$$ 107461 108619 47365 98881 46334 80753 132298 -37289 -46411 -30231 -822 -45898 -42800
5562d2800J29131N0073p5163l5158j04786k2716M1028J46043j0659k96836J7111
$$ -42800 86331 136404 61241 26083 -78703 -101419 -60391 85652 74993 -221843 -204732
5551b04732J59832Q4171K6644J12215j58926j2686M7785j2740j760L3049m6201
$$ -204732 -44900 39271 65915 178130 19204 6518 54303 41563 39803 72852 26651
5540B6651K5929J26623L4416j0030k8677k78000Q1225M8030J08371l840j02066
$$ 26651 52580 179203 213619 203589 174912 -103088 -21863 26167 134538 130698 28632
5529B8632K7391p8305l9346N4207J18622o9132Q0J0566O8864j8760p7978K9020
$$ 28632 56023 -22282 -61628 -7421 111201 42069 42149 52715 121579 102819 24841 53861
5517E3861n4774J13873m6393R9267K0940M2399j19372l4547M5669j06512J04659
$$ 53861 -913 112960 66567 165834 186774 229173 109801 75254 120923 14411 119070
5506A19070l8746p6599j56809l2344K62528n3181J3142j52431L83925l0297q5290
$$ 119070 80324 3725 -153084 -185428 77100 23919 37061 -115370 268555 238258 152968
5495A52968J0618j35869q94q8212O854J11032k4173q9962P9052j0393J2445n7789
$$ 152968 163586 27717 26823 -61389 -54535 56497 32324 -57638 21414 11021 23466 -34323
5483c4323O5241j434m357J07970K2434j50027K8043k6826K16641j8152q8100o50
$$ -34323 30918 29484 25127 133097 155531 5504 33547 6721 223362 205210 117110 116460
5471A16460J0201n0388n2523J37436N3156L0331j54910P2926n1996m7892L6818
$$ 116460 126661 76273 23750 161186 214342 244673 89763 162689 110693 62801 99619
5460I9619N0131K8396j6838Q9029j96337J5876m4642j04139K7173M3141N6767
$$ 99619 149750 178146 161308 250337 54000 69876 25234 -78905 -51732 -8591 48176
5449D8176m6059J59559l9971O3267J0826j30675J5485K140J18309j40711r54M2309
$$ 48176 2117 161676 121705 184972 195798 65123 80608 82748 201057 60346 59392 101701
5437A01701K8674j19846L6563J29538o9133J7439R2932j65813o1224J11878M6982
$$ 101701 130375 10529 47092 176630 107497 124936 217868 52055 -9169 102709 149691
5426A49691Q4752L8664L3264j08238o7827n550p0436J39052o4454n8059q882N4327
$$ 149691 234443 273107 306371 198133 130306 124756 54320 193372 128918 70859 61977 116304
5414A16304O3596l7892J8499j24689L8452k4070p0612R2655k8617j004n3737K43257
$$ 116304 179900 142008 160507 35818 74270 50200 -20412 72243 43626 42622 -11115 232142
5402B32142O6111M4857l2476j23204p2172M4623m1670j60499Q7409O7313L825
$$ 232142 298253 343110 310634 187430 115258 159881 118211 -42288 45121 112434 116259
5391A16259l3534L3994l1521P1406m5218j9206L9679J04154j10728J63678J0600
$$ 116259 82725 116719 85198 156604 111386 92180 131859 236013 125285 288963 299563
5380B99563j30109r3348P7620J7867N0286P6352j56642k0400k8137N8148k1955
$$ 299563 169454 76106 153726 171593 221879 298231 141589 121189 93052 151200 129245
5369A29245J0236J81072N2983k73960N8705K7809k4921J34663p6285n7426l641
$$ 129245 139481 320553 373536 99576 158281 186090 161169 295832 219547 162121 158480
5358A58480J39936J405j58283o0099R1919j8530Q8464K3373K0798m0806j45155
$$ 158480 298416 299821 141538 81439 173358 154828 243292 266665 287463 246657 101502
5347A01502J51606q8776L2444R5193N5673j23328K2265K9814L9508P5140j34853
$$ 101502 253108 164332 196776 291969 347642 224314 246579 276393 315901 391041 256188
5336B56188L36J69661m5116j0012L5956O1322q9086N4143O6331q2011J61490L4295
$$ 256188 256524 426185 381069 371057 407013 468335 379249 433392 499723 417712 579202 613497
5324F13497j32671J8373l373l9107N0825m5347o65P3766R3478m9702M1917n5000
$$ 613497 480826 499199 495826 456719 507544 462197 461532 535298 628776 579074 620991 565991
5312E65991R4416N676k891O0623P9119o165r8660j35833O6401j4357M125J73569
$$ 565991 660407 666083 663192 723815 802934 796769 698109 562276 628677 614320 618445 792014
5300G92014j04285J29513r0266k0901l8932N3907Q0480l1233K3749L4669j6781
$$ 792014 687729 817242 726976 706075 667143 721050 801530 770297 794046 828715 811934
5289H11934J9206k4502o8315L3331J4926l923K5303j27682R7747j05314J4184
$$ 811934 831140 806638 738323 771654 786580 782657 807960 680278 778025 672711 686895
5278F86895M8548O5420m7518p3169m6397L8975j44254O1760J27768q1106n8816
$$ 686895 735443 800863 753345 680176 633779 672754 528500 590260 718028 636922 578106
5267E78106l342J49373j20534j27352J34320M5163j03757m1401n988N7502R5191
$$ 578106 574764 724137 603603 476251 610571 655734 551977 510576 504588 562090 657281
5256F57281N5936p4060j00689J09672J03338q5358m3717J26604J5098j26836P9032
$$ 657281 713217 639157 538468 648140 751478 666120 622403 749007 764105 637269 716301
5245G16301M185q3244O6576J92551k9508L0772Q3729o6711l643J3579l2744J25141
$$ 716301 720486 637242 703818 896369 866861 897633 981362 914651 911008 924587 891843 1016984
5233A016984Q3062r1537j59119L2010j03143J89153m2073M1510J1226N2079M2308
$$ 1016984 1100046 1008509 849390 881400 778257 967410 925337 966847 978073 1030152 1072460
5222A072460K171j60116J35474L1543m8603j0001l1539J54200K1793j06079k4099
$$ 1072460 1074631 914515 1049989 1081532 1032929 1022928 991389 1145589 1167382 1061303 1037204
5211A037204j76460L1222M7345K01544L6228p8829q8754R459J95666l0730j8184
$$ 1037204 860744 891966 939311 1140855 1177083 1098254 1009500 1018959 1214625 1183895 1165711
5200A165711J55322r457o9209j10419J35211L2498K4488O9865R4547l869J90020
$$ 1165711 1321033 1311576 1242367 1131948 1267159 1299657 1324145 1394010 1488557 1484688 1674708
5189A674708k9268j26254J12146M3601k3572R6961l3548m4899r9571L349K08044
$$ 1674708 1645440 1519186 1631332 1674933 1651361 1748322 1714774 1669875 1570304 1573653 1781697
5178A781697K14349j02862J10502J37927l9317M2047J6270N5497M9627J90462
$$ 1781697 1996046 1893184 2003686 2141613 2102296 2144343 2160613 2216110 2265737 2456199
5168B456199j28412L9394j33435J26979J60872K2112n0915J2496O4559q3546p0333
$$ 2456199 2327787 2367181 2233746 2360725 2521597 2543709 2492794 2505290 2569849 2486303 2415970
5157B415970J2417m6914J88722J43910J3135M6750R2488r9887J43289J53587J95726
$$ 2415970 2428387 2381473 2570195 2714105 2727240 2773990 2866478 2766591 2909880 3063467 3259193
5146C259193k59M8995n5906J43554J01437J98576j69045k4885J40609J35134L8338
$$ 3259193 3258934 3307929 3252023 3395577 3497014 3695590 3526545 3501660 3642269 3777403 3815741
5135C815741J12987J65216J51568K33014n0080J45509K01819J79025K00106J33113
$$ 3815741 3928728 4093944 4245512 4478526 4428446 4573955 4775774 4954799 5154905 5288018
5125E288018O2850K53859K51957k0915J85584J35381L99465J76066K11115K48150
$$ 5288018 5350868 5604727 5856684 5835769 6021353 6156734 6556199 6732265 6943380 7191530
5115G191530M15926M38751L47885K29315M87381L52632L79409M31899L57188N83515
$$ 7191530 7607456 8046207 8394092 8623407 9110788 9463420 9842829 10274728 10631916 11215431
5105A1215431N25019O69906O74693O12912Q89443Q32798J006749J171522J182554
$$ 11215431 11740450 12410356 13085049 13697961 14587404 15420202 16426951 17598473 18781027
5096A8781027J422167J193421Q15407P78440J086097J326577J596615J928417
$$ 18781027 20203194 21396615 22212022 22990462 24076559 25403136 26999751 28928168
5088B8928168K603925L359951L814855M320564N034537L459096M08164j147783
$$ 28928168 31532093 34892044 38706899 43027463 48062000 51521096 51929260 50781477
5080E0781477j520730j021890j61464J132638K296268L359737K591248Q80923
$$ 50781477 49260747 48238857 48077393 49210031 51506299 54866036 57457284 58338207
5072E8338207R78048J319033K619378K979012J743951k90126p91614r42451r5190
$$ 58338207 59316255 60635288 63254666 66233678 67977629 67687503 66895889 65953438 65858248
5063F5858248J247496J996567R25971K24135R37599K089535L843751O256050Q343029
$$ 65858248 67105744 69102311 70028282 70252417 71190016 73279551 77123302 83379352 91722381
5054I1722381Q054314J911982m426077o877861o980694m987019k914244n63050
$$ 91722381 99776695 101688677 97262600 90384739 83404045 78417026 75502782 74939732
5046G4939732J644305K120873J1624o29244p9021J171439K179116J218631j742281
$$ 74939732 76584037 78704910 78716534 78087290 78008269 79179708 81358824 82577455 80835174
5037H0835174l756250m007049k949201j115750N59414m09722k664926l048085
$$ 80835174 77078924 73071875 70122674 69006924 69566338 69156616 66491690 63443605
5029F3443605k573627j096869L58744K144424L368091K437071k134546n772941
$$ 63443605 60869978 59773109 60131853 62276277 65644368 68081439 65946893 60173952
5021F0173952p109282o642089n379781m273345l445476k813325k216487k034357
$$ 60173952 53064670 46422581 41042800 36769455 33323979 30510654 28294167 26259810
5013B6259810j606061j435721j377094j210286j063776r87165p74163p65194p00455
$$ 26259810 24653749 23218028 21840934 20630648 19566872 18579707 17805544 17040350 16339895
5004A6339895o39694m09246m75079n60750m50096k94540l45980m73549j43067
$$ 16339895 15700201 15290955 14815876 14255126 13805030 13510490 13164510 12690961 12547894
4995A2547894l20298l10399k84677l27879k78994j20675j46663k99787j27538
$$ 12547894 12227596 11917197 11632520 11304641 11025647 10904972 10758309 10458522 10330984
4986A0330984k11960j28944l6607j63540j57225j71733j78603K24920n9755k21982
$$ 10330984 10119024 9990080 9953473 9789933 9632708 9460975 9282372 9507292 9447537 9225555
4976I225555l0642O4615j14520J04439J0954J2959m6524P0190J50466J0530K1872
$$ 9225555 9194913 9259528 9145008 9249447 9260401 9273360 9226836 9297026 9447492 9458022 9479894
4965I479894M3159J16033Q9930K80864m0451J13023K64322J78457J60240J10498
$$ 9479894 9523053 9639086 9729016 10009880 9969429 10082452 10346774 10525231 10685471 10795969
4955A0795969J23604o9050J24050K96034J73039K10082K54392K93526R1265L89092
$$ 10795969 10919573 10850523 10974573 11270607 11443646 11653728 11908120 12201646 12292911 12682003
4945A2682003N46723L34535L66976N67087L32564L15629N54269K83344N12214
$$ 12682003 13228726 13563261 13930237 14497324 14829888 15145517 15699786 15983130 16495344
4936A6495344N53588L36628M35013N87673N59004O13019P89324Q13408Q95701
$$ 16495344 17048932 17385560 17820573 18408246 18967250 19580269 20369593 21183001 22078702
4927B2078702J004092J209991J256645J517791J520706J744835J953915K114907
$$ 22078702 23082794 24292785 25549430 27067221 28587927 30332762 32286677 34401584
4919C4401584K605903K860661L037225K933559K759440J987824J086152K17369
$$ 34401584 37007487 39868148 42905373 45838932 48598372 50586196 51672348 51889717
4911E1889717n04330r43045p64335m81701K63219O49597J124536J880735K366126
$$ 51889717 51385387 50442342 49678007 49196306 49459525 50109122 51233658 53114393 55480519
4902E5480519K857741L537642M209234M837311N487954O014553O228788N393393
$$ 55480519 58338260 61875902 66085136 70922447 76410401 82424954 88653742 94047135
4894I4047135L750733J333554j547937l678087m364786l985840k895476j819587
$$ 94047135 97797868 99131422 97583485 93905398 89540612 85554772 82659296 80839709
4886H0839709j297924j014742o30286m89901k88117K32944O09617J171162K009763
$$ 80839709 79541785 78527043 77896757 77406856 77118739 77351683 77961300 79132462 81142225
4877H1142225K418181K603083K090189Q00055n71957j731723j981117j734906
$$ 81142225 83560406 86163489 88253678 89053733 88481776 86750053 84768936 83034030
4869H3034030j050312k22714M14030P02559L55500l21292j419306k979800l976823
$$ 83034030 81983718 81761004 82175034 82877593 83233093 82911801 81492495 78512695 74535872
4860G4535872m781740m785246m248808l660901k934156k515335j741779j226812
$$ 74535872 69754132 64968886 60720078 57059177 54125021 51609686 49867907 48641095
4852D8641095q01988m56150j50828M73047P18491Q17956J170141J001743K90345
$$ 48641095 47839107 47382957 47232129 47705176 48423667 49241623 50411764 51413507 51703852
4843E1703852o25927j479285k519897l024728l007079l087187k696894k594380
$$ 51703852 51077925 49598640 47078743 44054015 41046936 37959749 35262855 32668475
4835C2668475k257223j890619j750403j438676j147265j153701j238008j003897
$$ 32668475 30411252 28520633 26770230 25331554 24184289 23030588 21792580 20788683
4827B0788683q36877p50043p24441n89430o96013o20273m88358l73860m77111
$$ 20788683 19951806 19201763 18477322 17887892 17191879 16571606 16083248 15709388 15232277
4818A5232277l69654j89552k71207l57015j83035J28115k85476l00424p5837k20759
$$ 15232277 14862623 14673071 14401864 14044849 13861814 13989929 13704453 13404029 13328192 13107433
4808A3107433k29607k04154j60504M040j70090k13848j2700J4722p5002m9348
$$ 13107433 12877826 12673672 12513168 12517208 12347118 12133270 12120570 12135292 12060290 12010942
4798A2010942J71596J00788J94364J7927P7529j5532K02602J29029K00948K07475
$$ 12010942 12182538 12283326 12477690 12495617 12573146 12557614 12760216 12889245 13090193 13297668
4788A3297668K18387K81526L67830Q8883K22538Q6187j3262L0243J19889J54994
$$ 13297668 13516055 13797581 14165411 14254294 14476832 14563019 14549757 14580000 14699889 14854883
4778A4854883J77581Q8380L46873L89129K16587M39127M00973N00217M93158N39431
$$ 14854883 15032464 15120844 15467717 15856846 16073433 16512560 16913533 17413750 17906908 18446339
4768A8446339N22433Q70323L97087K25382L76873R6464L04603L22511L39434N30440
$$ 18446339 18968772 19839095 20236182 20461564 20838437 20934901 21239504 21562015 21901449 22431889
4758B2431889O06834O73421P63542O83327J032049J082668J037385J151154J229921
$$ 22431889 23038723 23712144 24475686 25159013 26191062 27273730 28311115 29462269 30692190
4749C0692190J329169J422587J413283J207914J446846J502153J799589K209458
$$ 30692190 32021359 33443946 34857229 36065143 37511989 39014142 40813731 43023189
4741D3023189K607825K719046L638044M354325N395942O146884O449829N754522
$$ 43023189 45631014 48350060 51988104 56342429 61738371 67885255 74335084 80089606
4733H0089606L779442R37177j314704k039568j239295m98115J016412K242119
$$ 80089606 83869048 84806225 83491521 81451953 80212658 79714543 80730955 82973074
4725H2973074L319927M374726M763288M062517L136366K059386J390320K078195
$$ 82973074 86293001 90667727 95431015 99493532 102629898 104689284 106079604 108157799
4717A08157799M071900O077979O562601K837714j478726m608094o529446o406049
$$ 108157799 112229699 118307678 124870279 127707993 126229267 121621173 115091727 108685678
4709A08685678n191829l138103j197261O90344K296800M139770N134028L239560
$$ 108685678 103493849 100355746 99158485 99848829 102145629 106285399 111419427 114658987
4701A14658987M98419j593228l397686l916432l620964k587478k095521k450085
$$ 114658987 115157406 113564178 110166492 106250060 102629096 100041618 97946097 95496012
4693I5496012l168693l876720m094939l505582k842768j859552q71494K01852
$$ 95496012 92327319 88450599 84355660 80850078 78007310 76147758 75276264 75478116
4685G5478116J048129K103078L044364L415080L432050L460527L375891L013189
$$ 75478116 76526245 78629323 81673687 85088767 88520817 91981344 95357235 98370424
4677I8370424O60873l004777m164644m109315l278537j325828k89452R33574J844866
$$ 98370424 99031297 96026520 91861876 87752561 84474024 83148196 82858744 83792318 85637184
4668H5637184N93263j96489M12454J101689K232718K835256K185929j09522j728478
$$ 85637184 86230447 86033958 86446412 87548101 89780819 92616075 94802004 94692482 92964004
4659I2964004k101906j265376k5317L13351q34304n37185K7402J221549J614756
$$ 92964004 90862098 89596722 89571405 89884756 89050452 88513267 88540669 89762218 91376974
4650I1376974K486770L626774M270700L471898J471184J382435K515988K101649
$$ 91376974 93863744 97490518 101761218 105233116 106704300 108086735 110602723 112704372
4642A12704372j361636m733336o151196n490880l729539j736380J5065J850761
$$ 112704372 111342736 106609400 100458204 94967324 91237785 89501405 89516470 91367231
4634I1367231J339806r67810j418889p48290R79864K589603K669338L62682k741910
$$ 91367231 92707037 91739227 90320338 89572048 90551912 93141515 95810853 96173535 93431625
4625I3431625m003076l691606k207382p13306k264661l738996l824904l576814
$$ 93431625 89428549 85736943 83529561 82816255 80551594 76812598 72987694 69410880
4617F9410880k089460n20946J076917K418533K150263j204947m715088o163287
$$ 69410880 67321420 66800474 67877391 70295924 72446187 71241240 66526152 60362865
4609F0362865o350204n465407m312307l380682k693498k276011j789818j682793
$$ 60362865 54012661 48547254 44234947 40854265 38160767 35884756 34094938 32412145
4601C2412145j095778j031632q07000p69031o36352n07569m73348l11685k04162
$$ 32412145 31316367 30284735 29477735 28708704 28072352 27564783 27091435 26779750 26575588
4592B6575588k43058k57372j06960m80981n73066n09169m86463m51858k64476
$$ 26575588 26332530 26075158 25968198 25487217 24914151 24404982 23918519 23466661 23202185
4583B3202185l19600m62605j92186Q6381J85089J51580K35621K91374N76996O90922
$$ 23202185 22882585 22419980 22227794 22314175 22499264 22650844 22886465 23177839 23754835 24445757
4573B4445757O75323N03216M34645m7428n07786r38284j417416j317713j375475
$$ 24445757 25121080 25624296 26058941 26011513 25503727 24565443 23148027 21830314 20454839
4564B0454839j251485r89326q85167o88700k89968l77212j69372R1249l94186
$$ 20454839 19203354 18214028 17328861 16640161 16350193 15972981 15803609 15894858 15500672
4555A5500672l12482k06709m01384l12048m19186n82438n10140p95544n86061
$$ 15500672 15188190 14981481 14580097 14268049 13848863 13266425 12756285 11960741 11374680
4546A1374680m37774m20197m15308k74113k67082r5071m56835Q461q671j97835
$$ 11374680 10936906 10516709 10101401 9827288 9560206 9465135 9008300 9016761 9008090 8810255
4536H810255j29613j70471j81968k14862m2005k57776k19005m73619k05553j94198
$$ 8810255 8680642 8510171 8328203 8113341 8071336 7813560 7594555 7120936 6915383 6721185
4526F721185j29780j50024o0892j77316k62487p3051j42304k19394j20705q4631
$$ 6721185 6591405 6441381 6380489 6203173 5940686 5867635 5725331 5505937 5385232 5300601
4516E300601Q2515p3383k61224J38653M7732j58173q6289J06594P5334k32083
$$ 5300601 5383116 5309733 5048509 5187162 5234894 5076721 4990432 5097026 5172360 4940277
4506D940277j01409L3959k33035j33134p9523O9157j22362r3240r8172m7533P7178
$$ 4940277 4838868 4872827 4639792 4506658 4427135 4496292 4373930 4280690 4182518 4134985 4212163
4495D212163k8168j92383O5561Q6935M7582J12901j60176m5351J62454n5556k17546
$$ 4212163 4183995 3991612 4057173 4144108 4191690 4304591 4144415 4099064 4261518 4205962 3988416
4484C988416P5444p391m9552j25208J18767k055j44824j47634Q5554p2012n5844
$$ 3988416 4063860 4056469 4006917 3881709 4000476 3998421 3853597 3705963 3791517 3719505 3663661
4473C663661j0252Q6210P1815k0195J66360P1512J33300P1915J43672K05453K00236
$$ 3663661 3653409 3739619 3811434 3791239 3957599 4029111 4162411 4234326 4377998 4583451 4783687
4462D783687M82204L99929j15514m55204m34199j86721l53129k34675l08024j75325
$$ 4783687 5265891 5665820 5550306 5095102 4660903 4474182 4121053 3886378 3578354 3403029
4452C403029o3408J31302k19325k00087o7462n6095L9529k488J839L7442j2634
$$ 3403029 3339621 3470923 3251598 3051511 2984049 2927954 2967483 2964995 2966834 3004276 2991642
4441B991642j5770j45522k6520k58981J35023J47450j39888P1000p2867m4198
$$ 2991642 2975872 2830350 2803830 2544849 2679872 2827322 2687434 2758434 2685567 2641369
4431B641369M5772M5524j92206N6543J56967n0313q4936J13827K8259l0834o7888
$$ 2641369 2687141 2732665 2540459 2597002 2753969 2703656 2618720 2732547 2760806 2729972 2662084
4420B662084O1858K16835k9373J66222J50029J55536r6010j87606l79445m3451
$$ 2662084 2723942 2940777 2911404 3077626 3227655 3383191 3287181 3099575 2720130 2676679
4410B676679K4599o826k6359l4081J47239j10554o2091N8564J01576k47406N6242
$$ 2676679 2701278 2694452 2668093 2634012 2781251 2670697 2608606 2667170 2768746 2521340 2577582
4399B577582p0784l3714P2486p8737o2098Q7529j25045J83575j11085N0612L9655
$$ 2577582 2506798 2473084 2545570 2466833 2404735 2492264 2367219 2550794 2439709 2490321 2529976
4388B529976j9923P1995J4344n0425K3986k8921K01186q6586r0450l5558K01580
$$ 2529976 2510053 2582048 2596392 2545967 2569953 2541032 2742218 2655632 2565182 2529624 2731204
4377B731204J95893p6344K8730J18096p6434K18248J21847K10118Q0077J75798
$$ 2731204 2927097 2850753 2879483 2997579 2921145 3139393 3261240 3471358 3551435 3727233
4367C727233J80239J90658J81378M18197K78929m2554J08410j88873k68525k59811
$$ 3727233 3907472 4098130 4279508 4697705 4976634 4934080 5042490 4853617 4585092 4325281
4357D325281k57974o2006L9119o000j37156J32072J42110K23906R5917K24398
$$ 4325281 4067307 4005301 4044420 4038420 3901264 4033336 4175446 4399352 4495269 4719667
4347D719667L06208L38029L36790L64400P69822O50735Q95055J103758Q57586
$$ 4719667 5025875 5363904 5700694 6065094 6834916 7485651 8380706 9484464 10342050
4338A0342050M72908m15648p28817r53195q45728p73588o19747k79373l08847
$$ 10342050 10814958 10399310 9670493 8717298 7871570 7097982 6478235 6198862 5890015
4329E890015k03032j91332k08914o344o2842L3947J95080J69381K3514K28756
$$ 5890015 5686983 5495651 5286737 5280393 5217551 5251498 5446578 5615959 5639473 5868229
4319E868229M79941N47618P12915P74933J012598P70347K5966o74960q61364r12350
$$ 5868229 6348170 6895788 7608703 8383636 9396234 10166581 10192547 9517587 8656223 7743873
4309G743873q92171p78379l40128k46078j80575l47722k29871j54506j4422j13289
$$ 7743873 6851702 6073323 5733195 5487117 5306542 4958820 4728949 4574443 4560021 4446732
4299D446732J13017j53812L2062K3514L06346J39452J38650Q9057M06182K30377
$$ 4446732 4559749 4405937 4437999 4461513 4767859 4907311 5045961 5135018 5541200 5771577
4289E771577J38970j33562k54986j93862k88257k74292k28514r0749P4132r3456
$$ 5771577 5910547 5776985 5521999 5328137 5039880 4765588 4537074 4446325 4520457 4427001
4279D427001n3676k15549q2135j66407j01807l9078n2410m26r2477K6158J25150
$$ 4427001 4373325 4157776 4075641 3909234 3807427 3768349 3715939 3715513 3623036 3649194 3774344
4268C774344j34188Q2407J61021P8882K5548j4423J87000J13119P8596K47878
$$ 3774344 3640156 3722563 3883584 3962466 3988014 3973591 4160591 4273710 4352306 4600184
4258D600184J87525j5318R4749J04067p7068O9031q8570k2222j9370j67431l0353
$$ 4600184 4787709 4772391 4867140 4971207 4894139 4963170 4874600 4852378 4833008 4665577 4635224
4247D635224J83912j36124J00409Q829O7596O3921R3654J55011K38592K02446
$$ 4635224 4819136 4683012 4783421 4792250 4859846 4923767 5017421 5172432 5411024 5613470
4237E613470K76944J73960J50701J91180M07849J10580K29573L69928K96322J78447
$$ 5613470 5890414 6064374 6215075 6406255 6814104 6924684 7154257 7524185 7820507 7998954
4227G998954L29005K26551K16020M55125K76750J61631L25328J22221L67691M32184
$$ 7998954 8327959 8554510 8770530 9225655 9502405 9664036 9989364 10111585 10479276 10911460
4217A0911460L12484M41880P00633M69390O95985M03934O61073R60857N52948
$$ 10911460 11223944 11665824 12366457 12835847 13531832 13935766 14596839 15557696 16110644
4208A6110644P95144J096400R37823J112753J259114J456067J462858J583165
$$ 16110644 16905788 18002188 18940011 20052764 21311878 22767945 24230803 25813968
4200B5813968J596789J934845J937243K465308K593908L211266L943104N372045
$$ 25813968 27410757 29345602 31282845 33748153 36342061 39553327 43496431 48868476
4192D8868476O208915K858486R34913J350439J873233M326617N804569Q364557
$$ 48868476 55077391 57935877 58870790 60221229 62094462 66421079 72225648 80590205
4184H0590205J1082696J4632405J8319721K8502606K3691618j0585824k1896327
$$ 80590205 91672901 106305306 124625027 153127633 176819251 166233427 144337100
4177A44337100k5090418k2168401j5492524j1261960p992506o238096m901534
$$ 144337100 119246682 97078281 81585757 70323797 62331291 56093195 51191661
4170E1191661m140514l115772k640151k559020k413803k320927k125541j880455
$$ 51191661 47051147 43935375 41295224 38736204 36322401 34001474 31875933 29995478
4162B9995478j432926r21617m85172p13074o67691l96933m94816k63736o2334
$$ 29995478 28562552 27640935 27155763 26442689 25774998 25378065 24883249 24619513 24557179
4153B4557179p8561L1665J24464K14276Q0059K86578K71561J50393N93203Q39109
$$ 24557179 24478618 24510283 24634747 24849023 24929082 25215660 25487221 25637614 26230817 27069926
4143B7069926Q85947R89780J439989J785125J870867K376669L424949K176043
$$ 27069926 27955873 28945653 30385642 32170767 34041634 36418303 39843252 42019295
4135D2019295r19010j504302k020284j256280m84039J6864M41232J123318R35349
$$ 42019295 41100285 39595983 37575699 36319419 35835380 35852244 36293476 37416794 38352143
4126C8352143J325296J364536J670541J658704K248576K203086K224481K015324
$$ 38352143 39677439 41041975 42712516 44371220 46619796 48822882 51047363 53062687
4118E3062687K840080L505789M441487N134227O338299P248830R163536J0720756
$$ 53062687 55902767 59408556 63850043 68984270 75322569 82571399 91734935 102455691
4110A02455691J4269630J8432609K4750944L1242185M7267055L7918795j6501798
$$ 102455691 116725321 135157930 159908874 191151059 238418114 276336909 259835111
4103B59835111l4776556m0737059l5688113k5491688j8802366j3478185r998736
$$ 259835111 225058555 184321496 148633383 123141695 104339329 90861144 80862408
4096H0862408q333798o966237n638107m721222l656172l926253l401360l238086
$$ 80862408 72528610 65562373 59924266 55203044 51546872 47620619 44219259 40981173
4088D0981173l241224k582770k037923j573315j189675j130803p58312n70564
$$ 40981173 37739949 35157179 33119256 31545941 30356266 29225463 28467151 27896587
4080B7896587l93500m19586o68138l82447k1300L13316R46629J720140J193940
$$ 27896587 27503087 27083501 26415363 26032916 26011616 26324932 27271561 28991701 30185641
4071C0185641j427485k339599k674791k131795j664947j408593j090590q37560
$$ 30185641 28758156 26418557 23743766 21611971 19947024 18538431 17447841 16610281
4063A6610281r48517p96903p99065o89662o80901m65065l85769m72153l18373
$$ 16610281 15661764 14864861 14065796 13376134 12695233 12230168 11844399 11372246 11053873
4054A1053873m48513k77581j2982m17529J3092k32649q0219l58480r6141M4681
$$ 11053873 10605360 10327779 10314797 9897268 9910360 9677711 9597492 9239012 9142871 9187552
4044I187552J26730M3760j0074O9346r5708j53936n0423m6642q8514O0808j3122
$$ 9187552 9314282 9358042 9347968 9417314 9321606 9167670 9117247 9070605 8982091 9042899 9029777
4033I029777o7434K16557L42047L66335L85927L44550L25721M56900P08877J116457
$$ 9029777 8962343 9178900 9520947 9887282 10273209 10617759 10943480 11400380 12109257 13225714
4023A3225714J460414K001113K636248L246417J70256j906991k821692k737737
$$ 13225714 14686128 16687241 19323489 22569906 22740162 20833171 18011479 15273742
4015A5273742k238973j761962j152538r64152q72270n45612m15479m61680n39831
$$ 15273742 13034769 11272807 10120269 9156117 8283847 7738235 7322756 6861076 6321245
4006F321245j53869k37874m68720k54558k43475l77872l5614k97160k06628l4668
$$ 6321245 6167376 5929502 5460782 5206224 4962749 4584877 4549263 4252103 4045475 4010807
3996D010807j90581j46912j54479j86912K06289j75689j17965o0713j059r2119
$$ 4010807 3820226 3673314 3518835 3331923 3538212 3362523 3244558 3183845 3182786 3090667
3986C090667j27087L3348j15917j81291K1448J72039j66683N6951j04678q1752
$$ 3090667 2963580 2996928 2881011 2699720 2721168 2893207 2726524 2783475 2678797 2597045
3976B597045K8519j95069l8255j51836l8821j73832J18058l584l1585P0162j27273
$$ 2597045 2625564 2430495 2392240 2240404 2201583 2027751 2145809 2142225 2110640 2180802 2053529
3965B053529j57017k3108r4373O625J63012L6412k12930J5495p6746l5985L7841
$$ 2053529 1896512 1873404 1779031 1785656 1948668 1985080 1772150 1787645 1710899 1674914 1712755
3954A712755r568O3778M5864r2491N4910j43696J7760J21757m8771O0196O9030
$$ 1712755 1703187 1766965 1812829 1720338 1775248 1631552 1649312 1771069 1722298 1782494 1851524
3943A851524J0342J83691j15334n330M3760k14416j14604j50373R3915M940j75728
$$ 1851524 1861866 2045557 1930223 1924893 1968653 1754237 1639633 1489260 1583175 1588115 1412387
3932A412387j12478J1649O1421N2727r0980n1743K4437j12765O7883n3413k03426
$$ 1412387 1299909 1311558 1372979 1425706 1334726 1282983 1307420 1194655 1262538 1209125 1005699
3921A005699J09298n6747j59248o3371N9273N0453K7475j13774N1099Q3634K5998
$$ 1005699 1114997 1058250 899002 835631 894904 945357 972832 859058 910157 993791 1019789
3910A019789j19519O3365n7904O7934r5127L0777l3447k4443m7191J75385p7141
$$ 1019789 900270 963635 905731 973665 878538 909315 875868 851425 804234 979619 902478
3899I02478P088k4210Q875o8202M1037q2759J54246j91o0792Q2325m2710L381
$$ 902478 909566 885356 894231 826029 867066 784307 938553 938362 877570 959895 917185 920566
3887I20566r891m8961K5469O6056j6564o0986J93275j66116L003J01868Q4211
$$ 920566 910675 861714 887183 953239 936675 875689 1068964 902848 905851 1007719 1091930
3876A091930k8229O3573N142l6109J48124J13340j4996J38759L79172J84430L9399
$$ 1091930 1063701 1127274 1132416 1096307 1244431 1357771 1342775 1481534 1860706 2045136 2084535
3865B084535l13483k63118j91228r3927j18119q6692j54606p4615N1148q1831
$$ 2084535 1771052 1507934 1316706 1222779 1104660 1017968 863362 788747 839895 758064
3855G58064J23628k26792O3159j4128j24768P5138J40058j36140p7906O7805j33407
$$ 758064 881692 654900 718059 703931 579163 654301 794359 658219 580313 648118 514711
3844E14711R9483J05689j10832N2909Q6615r9363K8230J18799m7563K1455l4413
$$ 514711 614194 719883 609051 661960 748575 649212 677442 796241 748678 770133 735720
3833G35720j74634O1411j61005m0562J10644r0122K1548N9753p2785L3817K4485
$$ 735720 561086 622497 461492 420930 531574 441452 463000 522753 449968 483785 508270
3822E08270n2261j33691M5270P725J46482M672j03961l1228J00445M5686Q0957
$$ 508270 456009 322318 367588 375313 521795 526467 422506 391278 491723 537409 618366
3811F18366k9513p4931q3915O7475J529p9775j00573K3705Q1952J38658j17030
$$ 618366 588853 513922 430007 497482 499011 419236 318663 342368 424320 562978 445948
3800D45948J00751N8057p9172j4623j8215m2958j00571Q6845n2278J50263j12294
$$ 445948 546699 604756 525584 510961 492746 449788 349217 436062 383784 534047 421753
3789D21753q0156k8686J21216P3476r2510p8861k6479J10566j48499J4730O1135
$$ 421753 341597 312911 434127 507603 415093 336232 309753 420319 271820 286550 347685
3778C47685J01529m2212k94O2205R4276m6419r3568M5222P152j01313J24575K7984
$$ 347685 449214 407002 406708 468913 563189 516770 423202 468424 475576 374263 498838 526822
3766E26822j98645L6212m4767j39851J60009l0834R3336q0289J30726k34669o9712
$$ 526822 328177 364389 319622 179771 339780 308946 402282 321993 452719 218050 148338
3755A48338K82245n6744j46578J35673r2410R1242J3856R8818k5243p695N647
$$ 148338 430583 373839 227261 362934 270524 361766 375622 474440 449197 441502 447149
3744D47149j8525L0741k15267M875m1168Q9108M0049M202j11527M2004O0032j9931
$$ 447149 428624 459365 244098 248973 207805 296913 336962 341164 229637 271641 331673 311742
3732C11742l6143J10386j07436R2197j43748M6040K4385N6698M6784N4294N6393
$$ 311742 275599 385985 278549 370746 226998 273038 297423 354121 400905 455199 511592
3721E11592n8555m3693m7593m1159P3411j20283P031j0766P506R5371J29503q5599
$$ 511592 453037 409344 361751 320592 394003 273720 280751 269985 277491 372862 502365 416766
3709D16766k010j79854N3290O827K7801K2480L3803J9937j3272k7360P5715m8020
$$ 416766 414756 234902 288192 295019 322820 345300 379103 399040 385768 358408 434123 386103
3697C86103o3028P7263j54335L4672J15585k8936J9633j01114J02915K4034M0916
$$ 386103 323075 400338 246003 280675 396260 367324 386957 285843 388758 412792 453708
3686D53708J75564j77734O9442Q8058k3815l1814J17076j01024j0058r1023j52536
$$ 453708 629272 451538 520980 609038 585223 553409 670485 569461 559403 468380 315844
3675C15844J5188J88810l1223M6727n8143l9337M4650R360j03852K9238j02269
$$ 315844 331032 519842 488619 535346 477203 437866 482516 491876 388024 417262 314993
3664C14993N7643k5116M6002P2730k5005q9099J05594k7189J15478L2720p1713
$$ 314993 372636 347520 393522 466252 441247 352148 457742 430553 546031 578751 507038
3653E07038Q6142j76242L464J7075J101J41175n8739N0620J7452O0057n5040p9438
$$ 507038 593180 416938 420402 437477 438578 579753 521014 571634 589086 649143 594103 514665
3641E14665N6049L7013o5391q0697j49007J35691m5011m3110J74251k11846J59156
$$ 514665 570714 607727 542336 461639 312632 448323 403312 360202 534453 322607 481763
3630D81763R4758j85294K9873o68J2106R0118j26572j8032p4082J60416J06309
$$ 481763 576521 391227 421100 420432 432538 522656 396084 378052 303970 464386 570695
3619E70695L663N7230k8745j08469M1527L3304P9255M8220l0247k530L5766q488
$$ 570695 574358 631588 602843 494374 535901 569205 648460 696680 666433 663903 699669 691181
3607F91181J29965L2239r2798Q0603J54780J8034J7888j17744l9303j40022n3994
$$ 691181 821146 853385 760587 841190 995970 1014004 1031892 914148 874845 734823 680829
3596F80829R7173K1903P9621K629J01870o454k06458k2635m920L8448L083p7560
$$ 680829 778002 799905 879526 882155 984025 977571 771113 748478 743558 782006 785089 707529
3584G07529j2239l7097M2160O947r2499J40473K1791J76898k5492p8348m3465
$$ 707529 695290 658193 700353 707300 614801 755274 777065 953963 928471 850123 806658
3573H06658p5066N0610p5465N3629L068n2569K6985R4063o8186l946l5175R6104
$$ 806658 731592 782202 706737 760366 763434 710865 737850 831913 763727 759781 724606 820710
3561H20710j0224Q5496J12449k28963O9740m9559p2915J15657p6621n5633O3603
$$ 820710 810486 895982 1008431 779468 849208 799649 726734 842391 765770 710137 773740
3550G73740J77656j41958k5173J65841q6449M7749J04069j4017r7164l9557J07973
$$ 773740 951396 809438 784265 950106 863657 911406 1015475 1001458 904294 864737 972710
3539I72710L4456J9795N6383m8157Q0722R249J81455L6650r775j70679N4237P57
$$ 972710 1007166 1026961 1083344 1035187 1115909 1125158 1306613 1343263 1333488 1162809 1217046 1217803
3527A217803l6196J97991j61864p2745L8781r8393K7069K01685M0170k22694j19832
$$ 1217803 1181607 1379598 1217734 1144989 1183770 1085377 1112446 1314131 1354301 1131607 1011775
3516A011775Q4600N8842J44373r3858r795R460J4315L8651k4284Q6374O8164j27654
$$ 1011775 1096375 1155217 1299590 1205732 1195937 1205397 1219712 1258363 1234079 1320453 1388617 1260963
3504A260963J11029m661J332M8026j15492L4409R1930Q1180j57885J11894l8456
$$ 1260963 1371992 1367331 1368663 1416689 1301197 1335606 1427536 1508716 1350831 1462725 1424269
3493A424269k0070j8543Q2450q0569L5121o649J76655j1774p9133J95664j39999
$$ 1424269 1404199 1385656 1468106 1387537 1422658 1416009 1592664 1580890 1501757 1697421 1557422
3482A557422L7529j13719J49981M3689q8114K9587J32409q0719M7703N0410p2812
$$ 1557422 1594951 1481232 1631213 1674902 1586788 1616375 1748784 1668065 1715768 1766178 1693366
3471A693366p7235J16346q3398n1039j2038Q2447Q5743O9798j24007Q7719K6429
$$ 1693366 1616131 1732477 1649079 1598040 1586002 1668449 1754192 1823990 1699983 1787702 1814131
3460A814131Q1371k5331j57853J26225l2964O3311L4112p6718P0959N5029j42630
$$ 1814131 1895502 1870171 1712318 1838543 1805579 1868890 1903002 1826284 1897243 1952272 1809642
3449A809642J74907m7479R0484j30235P1804O5156N2263P6685q99M3740n330m5363
$$ 1809642 1984549 1937070 2027554 1897319 1969123 2034279 2086542 2163227 2162328 2206068 2200738 2155375
3437B155375r9212K8982P0283J12829o4170K9548K1692J07114Q7095L4837R2995
$$ 2155375 2056163 2085145 2155428 2268257 2204087 2233635 2255327 2362441 2449536 2484373 2577368
3426B577368O0940P6907J65807j27638O7988R1917j21122J36286K1691J07994
$$ 2577368 2638308 2715215 2881022 2753384 2821372 2913289 2792167 2928453 2950144 3058138
3416C058138K4249K32438O0697k0871J39572m1418P1986J18853K66499j3774R1680
$$ 3058138 3082387 3314825 3375522 3354651 3494223 3452805 3524791 3643644 3910143 3896369 3988049
3405C988049J474J01643n7480J85328J60457N8495L3143J02568J67803J33474
$$ 3988049 3989523 4091166 4033686 4219014 4379471 4437966 4471109 4573677 4741480 4874954
3395D874954L76308Q6973J41575M54004J57058L78064M03393K96268M14786L73602
$$ 4874954 5251262 5338235 5479810 5933814 6090872 6468936 6872329 7168597 7583383 7956985
3385G956985O25350R20759M84697J29819o4741j25303O4327q404J72144L70755
$$ 7956985 8582335 9503094 9987791 10117610 10052869 9927566 9991893 9983489 10155633 10526388
3375A0526388N10001P17846N77653M33039R1456O2452J98386J42789K40398J87772
$$ 10526388 11036389 11754235 12331888 12764927 12856383 12918835 13117221 13260010 13500408 13688180
3365A3688180L81271O89011J053722J203486J312015J27683r98888j163264j072547
$$ 13688180 14069451 14758462 15812184 17015670 18327685 18455368 17456480 16293216 15220669
3356A5220669p11849l20218j99827r0760p1986L0570J80381M4834k95140l69667
$$ 15220669 14508820 14188602 13988775 13898015 13826029 13856599 14036980 14081814 13786674 13417007
3346A3417007n64417m99100l36347j77291N2163J62608J55129J90887L853l99035
$$ 13417007 12852590 12353490 12017143 11839852 11892015 12054623 12209752 12400639 12404492 12005457
3336A2005457o08364l72483m09502m96617k13581j17797k80462k45791l20044
$$ 12005457 11397093 11024610 10615108 10118491 9904910 9787113 9506651 9260860 8940816
3327H940816k11498l0089K5313k04118J372j31923l6394j56029O7168p1796J4327
$$ 8940816 8729318 8699229 8724542 8520424 8521796 8389873 8353479 8197450 8264618 8192822 8207149
3316H207149l0411n9446j16933j93239j83557n6265J47266m3663j85949p7317
$$ 8207149 8176738 8117292 8000359 7807120 7623563 7567298 7714564 7670901 7484952 7407635
3306G407635p2717j14746N4606j10514p0505k0632r1756k654r7611m7816j25169
$$ 7407635 7334918 7220172 7274778 7164264 7093759 7073127 6981371 6978717 6881106 6833290 6708121
3295F708121o6599J005j08928J26853J0488K1484r3672j7397m1811j70291l7351
$$ 6708121 6641522 6642527 6533599 6660452 6670940 6692424 6598752 6581355 6539544 6369253 6331902
3284F331902k6660k6693P6995j02905Q7579j31211O6558k2429J0208L7867j41313
$$ 6331902 6305242 6278549 6355544 6252639 6340218 6209007 6275565 6253136 6263344 6301211 6159898
3273F159898j09788N7784N1944j0077k7765p4273m1040j18922p8765m5741j56098
$$ 6159898 6050110 6107894 6159838 6149761 6121996 6047723 6006683 5887761 5808996 5763255 5607157
3262E607157J44561M0359R8097q4923q080K1633L7218J7702o5633K1835q9169
$$ 5607157 5751718 5792077 5890174 5805251 5797171 5818804 5856022 5873724 5808091 5829926 5740757
3251E740757j08965R383J43765p8806J4845O2724Q1823K3247j49962O746q4951
$$ 5740757 5631792 5641175 5784940 5706134 5720979 5783703 5865526 5888773 5738811 5745557 5660606
3240E660606R3730J12367n1592m5359k0441j6222m576r6499j59953r3902J93519
$$ 5660606 5754336 5866703 5815111 5769752 5749311 5733089 5728513 5632014 5472061 5378159 5571678
3229E571678J17976K3382p998q277q7408J11483p0381j71422N5717L586L0727
$$ 5571678 5689654 5713036 5705038 5696761 5609353 5720836 5650455 5479033 5534750 5538336 5569063
3218E569063o7113L6431J14761M2264q9554k16236R8729N7651r2824J39078o5487
$$ 5569063 5501950 5538381 5653142 5695406 5605852 5389616 5488345 5545996 5453172 5592250 5526763
3207E526763K0821q6182R4495J08570k6032P208J06872j51907l670N9629m6819
$$ 5526763 5547584 5461402 5555897 5664467 5638435 5645643 5752515 5600608 5596938 5656567 5609748
3196E609748K0957K3926M5964J94018j3073n093N4141j0947J11326r9462J0520
$$ 5609748 5630705 5654631 5700595 5894613 5881540 5876447 5930588 5919641 6030967 5931505 5942025
3185E942025R6065R8454J22148n2421j17387K11630N548j02345Q9622N7465M9722
$$ 5942025 6038090 6136544 6258692 6206271 6088884 6300514 6306062 6203717 6293339 6350804 6400526
3174F400526l8179J09732o8589m255j28982J75314k6549J10936J87672r4450p0341
$$ 6400526 6362347 6472079 6403490 6399235 6270253 6445567 6419018 6529954 6717626 6623176 6552835
3163F552835K41214o1829j39595K19521q5557M8990J959J51129J5790k7161j25744
$$ 6552835 6794049 6732220 6592625 6812146 6726589 6775579 6777538 6928667 6944457 6917296 6791552
3152F791552J20037K7105m1138m6912N3310p5418J60612o7547k5008K01874M8329
$$ 6791552 6911589 6938694 6897556 6850644 6903954 6828536 6989148 6921601 6896593 7098467 7146796
3141G146796j21081L3076J30081J3396k2803j81559J96310j33936L7472n7714
$$ 7146796 7025715 7058791 7188872 7202268 7179465 6997906 7194216 7060280 7097752 7040038
3131G040038L338k1721R4693M4881J32673n5687j9911K3834o2233m0004N2455
$$ 7040038 7043376 7021655 7116348 7161229 7293902 7238215 7218304 7242138 7179905 7139901 7192356
3120G192356K6047J11077l9442J09152J7341j01497P7949M0607P8970j42847P4661
$$ 7192356 7218403 7329480 7290038 7399190 7416531 7315034 7392983 7433590 7512560 7369713 7444374
3109G444374m3825Q6406n5553o9467J8964J28419R6007M9695o6628o0718K40756
$$ 7444374 7400549 7486955 7431402 7361935 7380899 7509318 7605325 7655020 7588392 7527674 7768430
3098G768430J38960j21363q223J52598J04416K4090K52503J712N2094Q9521P6030
$$ 7768430 7907390 7786027 7777804 7930402 8034818 8058908 8311411 8313123 8365217 8454738 8530768
3087H530768K85100J03962J28889J07514P1012J8334K19457J31094j07707J42774
$$ 8530768 8815868 8919830 9048719 9156233 9227245 9245579 9465036 9596130 9488423 9631197
3077I631197O3152M349M2384J67781J68231P6992o0401P3174J77304J59299J43324
$$ 9631197 9694349 9698698 9741082 9908863 10077094 10154086 10093685 10166859 10344163 10503462 10646786
3066A0646786L14427K17395K82803J72527J05139J18811J56247J62050K63208
$$ 10646786 10961213 11178608 11461411 11633938 11739077 11857888 12014135 12176185 12439393
3057A2439393K04832K1196L0617J29323J20217O9651J11337K1534J26002K68017
$$ 12439393 12644225 12665421 12696038 12825361 12945578 13015229 13126566 13148100 13274102 13542119
3047A3542119L22926J79030J80903K83526L52967K33299J54078K35195L52129
$$ 13542119 13865045 14044075 14224978 14508504 14861471 15094770 15248848 15484043 15836172
3038A5836172J98422L30614M28575K45609M02267L71715K52582K60988M14329
$$ 15836172 16034594 16365208 16793783 17039392 17441659 17813374 18065956 18326944 18741273
3029A8741273L47414K37109L96548L59922L57747N36661M58790M19680N05201
$$ 18741273 19088687 19325796 19722344 20082266 20440013 20976674 21435464 21855144 22360345
3020B2360345M26603P42943M48131O66755N96356O62825P49603P06053O71699
$$ 22360345 22786948 23529891 23978022 24644777 25241133 25903958 26653561 27359614 28031313
3011B8031313R42572P07965Q49946J077148Q75463O74689Q70325J075468R04756
$$ 28031313 28973885 29681850 30531796 31608944 32484407 33159096 34029421 35104889 36009645
3002C6009645J127122R68555J029684J143663R64900J101015J283645J302514
$$ 36009645 37136767 38105322 39135006 40278669 41243569 42344584 43628229 44930743
2994D4930743J000437J305468J432846J520584J785601J704103J697374J483387
$$ 44930743 45931180 47236648 48669494 50190078 51975679 53679782 55377156 56860543
2986E6860543K006903J884452K268114K188148K382418K786999K911087L110268
$$ 56860543 58867446 60751898 63020012 65208160 67590578 70377577 73288664 76398932
2978G6398932L540068L910684M262465M841497N254515N682044O418715O744121
$$ 76398932 79939000 83849684 88112149 92953646 98208161 103890205 110308920 117053041
2970A17053041P078038P293567P308578O813997N813263L791691P89001k584666
$$ 117053041 124131079 131424646 138733224 145547221 151360484 155152175 155941176 153356510
2962A53356510n203567o564754p140578o847818o158225n473854m697369m087137
$$ 153356510 148152943 141588189 134447611 127599793 121441568 115967714 111270345 107183208
2954A07183208l697817l374077k815144k353272k129823j430735j163958j340710
$$ 107183208 103485391 100111314 97296170 94942898 92813075 91382340 90218382 88877672
2946H8877672j920196k047038k383426k132156j944800j887648k264767k274731
$$ 88877672 86957476 84910438 82527012 80394856 78450056 76562408 74297641 72022910
2938G2022910k087703k171890j915417j858157j600167j446474j424387j151541
$$ 72022910 69935207 67763317 65847900 63989743 62389576 60943102 59518715 58367174
2930E8367174p74522q68075p20818j39239q2606N37433J133575Q01351r94497
$$ 58367174 57592652 56724577 56003759 55864520 55781914 56319347 57452922 58254273 57259776
2921E7259776j853779k451711k810050k338489k010774j892922j899658j381851
$$ 57259776 55405997 52954286 50144236 47805747 45794973 43902051 42002393 40620542
2913D0620542j288844r25517q86098q08947o02941p62959n54077k79545l17756
$$ 40620542 39331698 38406181 37520083 36711136 36108195 35345236 34791159 34511614 34193858
2904C4193858j76542l53432J2599L67361M84067K11471j52913q21046j306507
$$ 34193858 34017316 33663884 33676483 34043844 34527911 34739382 34586469 33765423 32458916
2895C2458916j298885j422051r92363p86695q52316o82888m60652o28570m87538
$$ 32458916 31160031 29737980 28745617 27958922 27106606 26423718 25963066 25334496 24846958
2886B4846958m76691m78049l87485m84733k10997l20852m48935l10076l80024
$$ 24846958 24370267 23892218 23504733 23020000 22809003 22488151 22039216 21729140 21349116
2877B1349116k52947o5069l19968k93551m79715k54775m1766j95155r2170l14349
$$ 21349116 21096169 21031100 20711132 20417581 19937866 19683091 19641325 19446170 19354000 19039651
2867A9039651l92499k01484j34579j22852j66322m50147r9315j26800n9308j97116
$$ 19039651 18647152 18445668 18311089 18188237 18021915 17571768 17472453 17345653 17286345 17089229
2857A7089229p2777q7741k52217j11910r4437m0907j69520M9058j84314k57063
$$ 17089229 17016452 16928711 16676494 16564584 16470147 16429240 16259720 16308778 16124464 15867401
2847A5867401m2232p3740j94020j87562P01R8078r7127k69719l1912j66923k12228
$$ 15867401 15825169 15751429 15557409 15369847 15370548 15468626 15371499 15101780 15069868 14902945 14690717
2836A4690717r8475o8471j70026j34997q8518j59520j53591j01889j51131j60770
$$ 14690717 14592242 14523771 14353745 14218748 14130230 13970710 13817119 13715230 13564099 13403329
2826A3403329j11879j71360j17178j16193m4902j62738M9240j39835p2771j83863
$$ 13403329 13291450 13120090 13002912 12886719 12841817 12679079 12728319 12588484 12515713 12331850
2816A2331850k25351O0076j31304l3378j45241k82901r4802j94873j36549p4680
$$ 12331850 12106499 12166575 12035271 12001893 11856652 11573751 11478949 11284076 11147527 11072847
2806A1072847m8915j25210j29281k08299k8561O6347k11576J3519L3547j1184
$$ 11072847 11023932 10898722 10769441 10561142 10532581 10598928 10387352 10400871 10434418 10423234
2796A0423234j04286O3147J48445j69667K8059P4811J06089j66441m171L8599
$$ 10423234 10318948 10382095 10530540 10360873 10388932 10463743 10569832 10403391 10399220 10437819
2786A0437819O8191k8636J39793o3122l8607J49772J37868K9810J62097J66772
$$ 10437819 10506010 10477374 10617167 10554045 10515438 10665210 10803078 10832888 10994985 11161757
2776A1161757J30788J13164J78635K73101L08798K43334L7499K19881J89613K24755
$$ 11161757 11292545 11405709 11584344 11857445 12166243 12409577 12447076 12666957 12856570 13081325
2766A3081325J30026J70543L47157J19257J20910K65256O4526K26742K64045K45380
$$ 13081325 13211351 13381894 13729051 13848308 13969218 14234474 14299000 14525742 14789787 15035167
2756A5035167J94373K59280J75262L47649L20960L23288N15305L71133M12575
$$ 15035167 15229540 15488820 15664082 16011731 16332691 16655979 17171284 17542417 17954992
2747A7954992O84261O99491O84034M86673P50664L81818N90658N39048P45515
$$ 17954992 18639253 19338744 20022778 20509451 21260115 21641933 22232591 22771639 23517154
2738B3517154Q61847Q90333R23522R57418J030903Q16974R08199Q98241P57379
$$ 23517154 24379001 25269334 26192856 27150274 28181177 28998151 29906350 30804591 31561970
2729C1561970P81693O76758M30108M62653M43491P91294N55502P09286R02036
$$ 31561970 32343663 33020421 33450529 33913182 34356673 35147967 35703469 36412755 37314791
2720C7314791R59153J074196J165981J354223J701799J784863J777188J954738
$$ 37314791 38273944 39348140 40514121 41868344 43570143 45355006 47132194 49086932
2712D9086932K146587K360700K125942J777154O80464J9954r51688j687027j776949
$$ 49086932 51233519 53594219 55720161 57497315 58177779 58197733 57246045 55559018 53782069
2703E3782069j488257j096423o95372l21162L7631M13102Q40825R60050J022810
$$ 53782069 52293812 51197389 50502017 50180855 50218486 50631588 51472413 52432463 53455273
2694E3455273J199622J278848J221799R98250R71393P38596J62850m93783j049002
$$ 53455273 54654895 55933743 57155542 58153792 59125185 59863781 60026631 59532848 58483846
2685E8483846j413879j697297j925045k234480j936823j634584j471844j056864
$$ 58483846 57069967 55372670 53447625 51213145 49276322 47641738 46169894 45113030
2677D5113030q74060m71071l05248j15416k02529k28636n24303p29426q68486
$$ 45113030 44238970 43767899 43462651 43347235 43144706 42916070 42391767 41662341 40793855
2668D0793855j201886j297514j632682j858532j726227j706415j522712j522974
$$ 40793855 39591969 38294455 36661773 34803241 33077014 31370599 29847887 28324913
2660B8324913j402605j354210r43739r14704r54592q78064q00591o96967o72568
$$ 28324913 26922308 25568098 24624359 23709655 22755063 21876999 21076408 20379441 19706873
2651A9706873n54511m17174n76413n17452n09724n30590o84428o56036n55532
$$ 19706873 19152362 18735188 18158775 17641323 17131599 16601009 15916581 15260545 14705013
2642A4705013n39904n66105m03904k06863l93678l22668l58166l41912l68378
$$ 14705013 14165109 13599004 13195100 12988237 12594559 12271891 11913725 11571813 11203435
2633A1203435k98577l93314m33604k43292j34350k09664k23708J6957j82279j32808
$$ 11203435 10904858 10511544 10077940 9834648 9700298 9490634 9266926 9283883 9101604 8968796
2623H968796k79629j74848l9019j81817j74345l20977j68420j95177k06671j97097
$$ 8968796 8689167 8514319 8475300 8293483 8119138 7798161 7629741 7434564 7227893 7030796
2613G030796j38630l28216j02737l0995k36030k60102Q2807q1235j65583m6444
$$ 7030796 6892166 6563950 6461213 6430218 6194188 5934086 6016893 5935658 5770075 5723631
2603E723631j18650n4584m7182j59788j08898n0162n8176l12920p4343r6890k05952
$$ 5723631 5604981 5550397 5503215 5343427 5234529 5184367 5126191 4813271 4738928 4642038 4436086
2592D436086L2931j58182q8445j03042k7760j10002j57499m1920j11167j63891
$$ 4436086 4469017 4310835 4222390 4119348 4091588 3981586 3824087 3782167 3671000 3507109
2582C507109N8495r873j3102k01846M609l062o7304j03977o1065p3354j0842o7494
$$ 3507109 3565604 3555731 3542629 3340783 3345392 3342330 3275026 3171049 3109984 3036630 3025788 2958294
2570B958294l7520m3374j49946o3944N2033p3033O7788r0875j45264j6074J6183
$$ 2958294 2920774 2877400 2727454 2663510 2715543 2642510 2710298 2619423 2474159 2458085 2474268
2559B474268J09309l44268J22383j45632O8589R0223k11453J7241J44497j24310
$$ 2474268 2583577 2239309 2361692 2216060 2284649 2374872 2163419 2180660 2325157 2200847
2549B200847j01471M447m1603J15469j88397j04802m6762L0496Q9727N4905j55778
$$ 2200847 2099376 2103823 2062220 2177689 1989292 1884490 1837728 1868224 1957951 2012856 1857078
2538A857078l661n302J02151m0263j57503J01560J4821k7610L2297K1166j82527
$$ 1857078 1853417 1848115 1950266 1910003 1752500 1854060 1868881 1841271 1873568 1894734 1712207
2527A712207j2729N0267l7576k7379L4338q4236r4435m551M3557J23163n880p5600
$$ 1712207 1699478 1749745 1712169 1684790 1719128 1634892 1540457 1535906 1579463 1702626 1696746 1621146
2515A621146L0601r8321N3907K4388N9868L505j64021M8658j06223L3998J74136
$$ 1621146 1651747 1553426 1607333 1631721 1691589 1695094 1531073 1579731 1473508 1507506 1681642
2504A681642r0882j0039k3334M3774k6522N704l4228j46190k3971Q7069q901m2909
$$ 1681642 1590760 1580721 1557387 1601161 1574639 1580343 1546115 1399925 1375954 1463023 1454122 1411213
2492A411213j1940m9548L9290j09409L2847J84710r3802N726L9306L9126K3277
$$ 1411213 1399273 1349725 1389015 1279606 1312453 1497163 1403361 1409087 1448393 1487519 1510796
2481A510796n3301R1016k65470o1477J7362J43992j02408P3291k8463j40067L6891
$$ 1510796 1457495 1548511 1283041 1221564 1238926 1382918 1280510 1353801 1325338 1185271 1222162
2470A222162L7859Q563o8691J32453j13806j0546J08630n9170m6661j12587n7869
$$ 1222162 1260021 1268584 1199893 1332346 1218540 1207994 1316624 1257454 1210793 1098206 1040337
2459A040337R443K5313K7847k1569j415M1390M491p89o1643k31778M9112O0357
$$ 1040337 1049780 1075093 1102940 1081371 1079956 1121346 1125837 1125048 1063405 831627 880739 941096
2447I41096k122k6551r8882L5459J42165j29710R9210l8979j22902N7690O4826
$$ 941096 938974 912423 813541 849000 991165 861455 960665 921686 798784 856474 921300
2436I21300N2804m7125o8989r7154L2559J00547j14432N5795P0730q1442r5647
$$ 921300 974104 926979 857990 760836 793395 893942 779510 835305 906035 824593 728946
2425G28946Q4523j63438K6555J89640o6524k5572J24681P4587k6618k44851k426
$$ 728946 813469 650031 676586 866226 799702 774130 898811 973398 946780 701929 699503
2414F99503L0405N7432l2707k5928n3527k3009P8247p9502M5963j04840N6602
$$ 699503 729908 787340 754633 728705 675178 652169 730416 650914 696877 592037 648639
2403F48639M9845l752m1390p610k47527N1407R4888R7154p68k3410q3172k4858
$$ 648639 698484 694732 653342 645732 398205 449612 544500 641654 640886 617476 534304 509446
2391E09446J4911p2802N0285k2901l3669p561j0304L430J02745j987j52603O4005
$$ 509446 524357 451555 501840 478939 445270 437709 427405 430835 533580 531593 378990 442995
2379D42995o7644K7597K37671p0304q2172N7622k0683N3730j28971j22841J41941
$$ 442995 375351 402948 640619 570315 488143 545765 525082 578812 449841 327000 468941
2368D68941Q3570r1524l3638J16288o8194L7244j43003o2706n7132J04023m6558
$$ 468941 552511 460987 427349 543637 475443 512687 369684 306978 249846 353869 307311
2357C07311N1026P6757p1956Q3746n0424q6388J6804M4627q3125L1317K3815j25393
$$ 307311 358337 435094 363138 446884 396460 310072 326876 371503 288378 319695 343510 218117
2345B18117M7169j60078J83524j13137Q9311O9387o0437P1007q1252M3201O966
$$ 218117 265286 105208 288732 175595 264906 334293 273856 344863 263611 306812 313778
2334C13778J0460M1392O3543j73188q2400p6282J36509o2464N2845l03P4181k5490
$$ 313778 324238 365630 429173 255985 173585 97303 233812 171348 224193 223890 298071 272581
2322B72581K17432P884j45716k15799J22729J0395m2775l3560Q2432P9355J8445
$$ 272581 490013 497897 352181 136382 259111 269506 226731 193171 275603 354958 373403
2311C73403o1648Q2823K3755J47617j33746r6233p577j82391K798m8694j5708
$$ 373403 311755 394578 418333 565950 432204 335971 328394 146003 148801 100107 84399
2300H4399L68K25974j23488m1187L8761Q214o7495n364L1171M2632n0865K7810
$$ 84399 84767 310741 187253 146066 184827 193041 125546 120182 151353 193985 143120 170930
2288A70930j07082N7881R9955R2478j1751k0820m8794j05362Q4702m9236m2329
$$ 170930 63848 121729 221684 314162 302411 281591 232797 127435 212137 162901 120572
2277A20572J3582M495N7094q9575K18889o6087k16543Q7882m8264M0633j3179
$$ 120572 134154 138649 195743 106168 325057 258970 42427 130309 82045 122678 109499
2266A09499M1838J0954L5686k8958j06257M5963J70701P702J11547L4626j59878
$$ 109499 151337 162291 197977 169019 62762 108725 279426 287128 398675 433301 273423
2255B73423j19381m2642p7444J29860J290k4286J27077j01279L630K8597q0384
$$ 273423 154042 111400 33956 163816 165106 140820 267897 166618 170248 198845 118461
2244A18461j2367k8950P5864O5052j29433k4812o375m3656j7259J19183Q3522
$$ 118461 106094 77144 153008 218060 88627 63815 57440 13784 -3475 115708 199230
2233A99230K7182p341r378r9917P5925J68823k55835N2095j10667Q4349j1647
$$ 199230 226412 219071 209693 109776 185701 354524 98689 150784 40117 124466 112819
2222A12819k03051J86570P2259p3493k23O6951J82928j26388L9827P839j29416
$$ 112819 -90232 96338 168597 95104 94881 161832 344760 218372 258199 266038 136622
2211A36622O3062P1877o9719J31265j23891k04804J94615j04470O8939p1152J03963
$$ 136622 199684 271561 201842 333107 209216 4412 199027 94557 163496 92344 196307
2200A96307L7414J15928r2680J19400M7582k9511j55549q3309k6110J35911j26
$$ 196307 233721 349649 256969 376369 423951 394440 238891 155582 129472 265383 265257
2189B65257M007O1105J06562j09294j19083J76437K22562j08268j14451j49696
$$ 265257 269264 330369 436931 327637 208554 384991 607553 499285 384834 235138
2179B35138O5005M8815J6999m8187l8567M0627J32137j00890m5047J01674l9618
$$ 235138 300143 348958 365957 317770 279203 319830 451967 351077 306030 407704 368086
2168C68086P294J05626k7720J18491N6914J10100j81043K62967J40967n6148O1817
$$ 368086 375380 481006 453286 571777 628691 738791 557748 820715 961682 905534 967351
2157I67351J6365K56548j02073R5806J2231J13130o0008J58424N1592M7797Q8468
$$ 967351 983716 1240264 1138191 1233997 1246228 1359358 1299350 1457774 1509366 1557163 1645631
2146A645631j14317O5644K29693Q6960L1882J35609J49049K31960K4528l467K21472
$$ 1645631 1531314 1596958 1826651 1913611 1945493 2081102 2230151 2462111 2486639 2483172 2704644
2135B704644K87920J47507K64257K18965K25556J46166L17686J72002L09918L36893
$$ 2704644 2992564 3140071 3404328 3623293 3848849 3995015 4312701 4484703 4794621 5131514
2125E131514K61878N17981M38978Q27863P03744P45522O01327P72949J223287
$$ 5131514 5393392 5911373 6350351 7178214 7881958 8627480 9228807 10001756 11225043
2116A1225043J538784J716567K471172L237601L944548N902526P726658n56752
$$ 11225043 12763827 14480394 16951566 20189167 24133715 30036241 37762899 37206147
2108C7206147n156080n568812n354741l713164k910819j862020j546680r78070
$$ 37206147 32050067 26481255 21126514 17413350 14502531 12640511 11093831 10115761
2100A0115761r66699p17998m28256m96671q13017o75380n46402m19631m54750
$$ 10115761 9149062 8431064 8002808 7506137 6693120 6017740 5471338 5051707 4596957
2091D596957m56883m97146k57108J906j48511k77879j13170j54428k07062k32068
$$ 4596957 4140074 3642928 3385820 3387726 3239215 2961336 2848166 2693738 2486676 2254608
2081B254608j53303o7409j23872k16203O8493M5690j86664p5432J33855n5344
$$ 2254608 2101305 2033896 1910024 1693821 1762314 1808004 1621340 1545908 1679763 1624419
2071A624419j52236j66236K3601Q007n1715q5961l5148o5388m6274k35587l4423
$$ 1624419 1472183 1305947 1329548 1337555 1285840 1199879 1164731 1099343 1053069 817482 783059
2060G83059J39605M7922j55608J3698m3090k1208M4691K9896L9367N2425n5869
$$ 783059 922664 970586 814978 828676 785586 764378 809069 838965 878332 930757 874888
2049H74888r2503q5191k5097R953N735o4280R0630j83804O2155q9677k4137J55553
$$ 874888 782385 697194 672097 682050 687785 623505 714135 530331 592486 502809 478672 634225
2037F34225p6373J12630k14937K6301j25605o4284J14465q8700l728O8704J62002
$$ 634225 557852 670482 455545 481846 356241 291957 406422 317722 313994 382698 544700
2026E44700j15011o487k3424j44880L5558n2690J20247J8984q3601J07188m4341
$$ 544700 429689 423202 399778 254898 290456 237766 358013 376997 293396 400584 356243
2015C56243j32992Q8353J302r6817j38359N5450J2895K6125J34640q7463l7842
$$ 356243 223251 311604 312906 216089 77730 133180 146075 172200 306840 219377 181535
2004A81535N2185N5733l2981j16687q0291J14154J85567Q0602j42215q7128J0045
$$ 181535 233720 289453 256472 139785 59494 173648 359215 439817 297602 210474 220519
1993B20519P621j75517Q6898P5631P7735j9120j10217O4414L7654q4904q9193
$$ 220519 228140 52623 139521 215152 292887 273767 163550 227964 265618 180714 91521
1982I1521l1648R2852L0215J9821q9460L6129M7381n7310N5932m2597q4347O535
$$ 91521 59873 152725 182940 202761 113301 149430 196811 139501 195433 152836 68489 75024
1970G5024Q2385Q125j35300n8597K43276j2199j67055L1574N5627K7448K3065
$$ 75024 157409 165534 30234 -28363 214913 202714 35659 67233 122860 150308 173373
1959A73373n9048R6481j6448M1079O865K3527q5574j62027n0726R9385k4535n113
$$ 173373 114325 210806 194358 235437 242302 265829 180255 18228 -32498 66887 42352 37239
1947C7239K6122P2707m9915p988j3243O753q6122j8267K00981j38755R0974r7466
$$ 37239 63361 136068 86153 78165 64922 71675 -14447 -32714 168267 29512 120486 23020
1935B3020J38814q5613M072m0153O1634L7808M3840M3741j29490N7168o0466k2787
$$ 23020 161834 76221 80293 40140 101774 139582 183422 227163 97673 154841 94375 71588
1923G1588j2106p296p2572M1828j3326P9912J00252o9728J9987L4062j06186P6647
$$ 71588 59482 52186 -20386 21442 8116 88028 188280 118552 138539 172601 66415 143062
1911A43062K0551Q0414n778Q3143m3645j19471Q2190J5341j17499j11707O7154
$$ 143062 163613 244027 238249 321392 277747 158276 240466 255807 138308 26601 93755
1900I3755J18417n6197j61615J9450K7628n8957J26648J4686m4043p9636J14366
$$ 93755 212172 155975 -5640 13810 41438 -17519 109129 123815 79772 136 114502
1889A14502M4048p4766k0502q3798M5929J63921o3432p2287r9075k8246J03299
$$ 114502 158550 83784 63282 -20516 25413 189334 125902 53615 -45460 -73706 29593
1878B9593j03684Q9965k4169j740j18326L7119J65013K4656N0529m3284P328k02585
$$ 29593 -74091 15874 -8295 -10035 -128361 -91242 73771 98427 148956 105672 113000 -89585
1866h9585O5930l189l1813J9673p042L0760j7959o2853o4737J07826J56897r2379
$$ -89585 -23655 -26844 -58657 -38984 -46026 -15266 -33225 -96078 -160815 -52989 103908 11529
1854A1529K0608m6555p9746O7802J24904j13050j10317K22557n2830J7794j57907
$$ 11529 32137 -14418 -94164 -26362 98542 -14508 -124825 97732 44902 62696 -95211
1843i5211O632N8469N6857o6962K9335O5220P9600o0449o5998J6047m9190R830
$$ -95211 -88579 -30110 26747 -40215 -10880 54340 133940 73491 7493 23540 -25650 -15820
1831a5820M6447p7590j95737J32513J82407k8212R1793j49176j2625J37066q6763
$$ -15820 30627 -46963 -242700 -110187 72220 44008 135801 -13375 -26000 111066 24303
1820B4303j0083O0886n9214o4665r231R4537n2944o8748Q4234L4357k7264p682
$$ 24303 14220 75106 15892 -48773 -58004 36533 -16411 -85159 -925 33432 6168 -1514
1808a514R093j27075N9892P2514o0966Q2791O2448j95660J46277m1084j56633
$$ -1514 7579 -119496 -59604 12910 -48056 34735 97183 -98477 47800 6716 -149917
1797a49917Q0511J40437q1950K50435j34614j76444l5520J31475K6017o4064J59506
$$ -149917 -69406 71031 -10919 239516 104902 -71542 -107062 24413 50430 -13634 145872
1786A45872M420m7538j33836p0481Q0235M2451l6610p6786K5134O5829j3922K56658
$$ 145872 150292 102754 -31082 -101563 -21328 21123 -15487 -92273 -67139 -1310 -15232 241426
1774B41426k96637k07682K23822R5149N8182j30138J0577L3160L4420m8628O1155
$$ 241426 -55211 -262893 -39071 56078 114260 -15878 -5301 27859 62279 13651 74806
1763G4806j87420j3190Q4811o3080L0695l149N2641j5474J28805j31576k4986
$$ 74806 -112614 -125804 -40993 -104073 -73378 -76527 -23886 -39360 89445 -42131 -67117
1752f7117Q1960K13748M6141j69924j49397J16593j3270j29818J56007n1135j242
$$ -67117 14843 228591 274732 104808 -44589 72004 58734 -71084 84923 33788 32546
1741C2546K6024l8654O325n9535J8492j01381Q0556l1646n4985j6575Q2563J44528
$$ 32546 58570 19916 26241 -33294 -14802 -116183 -35627 -67273 -122258 -138833 -56270 88258
1729H8258p8804p1792l7840j7130J09361l2120r5287J21745J06338j86737r3327
$$ 88258 9454 -62338 -100178 -117308 -7947 -40067 -135354 -13609 92729 -94008 -187335
1718a87335J57398P0052o1434O9851K1797j60086J13954Q501j79958J00373P0773
$$ -187335 -29937 40115 -21319 48532 70329 -89757 24197 32698 -147260 -46887 23886
1707B3886j43858K909J47310Q5227l5751j9383j37982J41140n3366q6612O0872
$$ 23886 -119972 -117063 30247 115474 79723 60340 -77642 63498 10132 -76480 -15608
1696a5608R6751l3597l3832j0944p4883R2820j2387R6655r7463q9758n2481J39321
$$ -15608 81143 47546 13714 2770 -72113 20707 8320 104975 7512 -82246 -134727 4594
1684D594O0823m7245J16818l9601Q5941k1735k06541m1542j04075J16849o9092
$$ 4594 65417 18172 134990 95389 181330 159595 -46946 -88488 -192563 -75714 -144806
1673a44806K33990n5601r089R6256l6081K8024j29910K9660M8507j01216l9180
$$ -144806 89184 33583 24494 120750 84669 112693 -17217 12443 60950 -40266 -79446
1662g9446Q7406j55k359M5235N6240l3847j22302q0850O8677O4981R2166k3273
$$ -79446 7960 7805 5446 50681 106921 73074 -49228 -130078 -61401 3580 95746 72473
1650G2473j00959M863k7237o0797j8309P1852l0690j06121Q9898P1766k7684k6520
$$ 72473 -28486 -23623 -50860 -111657 -129966 -58114 -88804 -194925 -105027 -33261 -60945 -87465
1638h7465R4144N3666l938k9455O4882j44198Q0168o1045k0392m842O4369m7248
$$ -87465 6679 60345 56407 26952 91834 -52364 27804 -33241 -53633 -58475 5894 -41354
1626d1354J5724J3616j20505K23563o3585q6324k2177J8452q259O9222r7585j9503
$$ -41354 -25630 -12014 -132519 91044 27459 -58865 -81042 -62590 -70849 -1627 -99212 -118715
1614a18715J78726O463p6108K1935j05526l1779J06751O5973J6905j47342K6268
$$ -118715 60011 66474 -9634 12301 -93225 -125004 -18253 47720 64625 -82717 -56449
1603e6449N304N6069j35l5280K053m0552J588M8998L2093M9483J76619k08446
$$ -56449 -51145 4924 4789 -30491 -28438 -68990 -67402 -18404 13689 63172 239791 31345
1591C1345M0993K8570j24133K2117p2439q4770J2027K09723o4969m9390Q3332
$$ 31345 72338 100908 -23225 -1108 -73547 -158317 -146290 63433 -1536 -50926 32406
1580C2406o381p7827N6113J3816m7248J8600p513J8421q067J15934k6972m0230
$$ 32406 26025 -51802 4311 18127 -29121 -10521 -18034 387 -7680 108254 81282 41052
1568D1052L9982q8776J7045j80818J47504n6589J66491p0820k9921M4517k3870
$$ 41052 81034 -7742 9303 -171515 -24011 -80600 85891 15071 -14850 29667 5797
1557E797q7177J9421p8001O0530K38051o1851l8299j29559n6636M166P4013l6501
$$ 5797 -81380 -61959 -139960 -79430 158621 96770 58471 -71088 -127724 -123558 -49545 -86046
1545h6046J03941o2190j4332l1804J02706O813r879j36796r7194R5971q06P3882
$$ -86046 17895 -44295 -58627 -90431 12275 19088 9209 -127587 -224781 -128810 -129616 -55734
1533e5734O0252k2169N3818O9903n1880o1194j03610J23483J20503L230m6205
$$ -55734 4518 -17651 36167 106070 54190 -7004 -110614 12869 133372 136602 90397
1522I0397Q488K9736n972j01257j15419M4454N1693k2645N5407K00038r8903j6193
$$ 90397 98885 128621 122649 21392 -94027 -49573 2120 -20525 34882 234920 136017 119824
1510A19824j60599m4032L6846l3832L8934L5477O7040j48340j00905J09298k6678
$$ 119824 -40775 -84807 -47961 -81793 -42859 -7382 59658 -88682 -189587 -80289 -106967
1499a06967J37520K5581j52812J35575L1735P4593o3883o1074n6464q4729l1737
$$ -106967 30553 56134 -96678 38897 70632 145225 81342 20268 -36196 -120925 -152662
1488a52662Q8387Q1233q528o9970j15516K7148P9181N5117l7443j18553N3320
$$ -152662 -64275 16958 8430 -61540 -177056 -149908 -70727 -15610 -53053 -171606 -118286
1477a18286R7689j100m413n5888k2547M4713J08902l628J09695j78658J02854
$$ -118286 -20597 -21697 -26110 -81998 -104545 -59832 49070 45442 155137 -23521 79333
1466G9333R114j37635n2677J79497k6336n7746m0524P7647O1949P4069j31616
$$ 79333 88447 -49188 -101865 77632 51296 -6450 -46974 30673 92622 166691 35075
1455C5075k16724P8441J36256L9179n1766N3140j03461l007j22611K30968j14003
$$ 35075 -181649 -103208 33048 72227 20461 73601 -29860 -32867 -155478 75490 -38513
1444c8513m2943O7276p9221m5244k499J69406j0530j45912Q7265N2479j23662
$$ -38513 -81456 -14180 -93401 -138645 -141144 28262 17732 -128180 -40915 11564 -112098
1433a12098J010L6428L6293Q8236l3972j71174q6021J34915J23335K2785M4847
$$ -112098 -111088 -74660 -38367 49869 15897 -155277 -241298 -106383 16952 39737 84584
1422H4584j62142J08997j6846k83586K17380O365j6538N8651p0358m0775J13499
$$ 84584 -77558 31439 14593 -268993 -51613 -45248 -61786 -3135 -73493 -114268 -769
1411g69o8350N3909J04517r3767l0411R0757J180j80827J32348K5575L5690j01863
$$ -769 -69119 -15210 89307 -4460 -34871 55886 57066 -123761 8587 34162 69852 -32011
1399c2011J8281P1621Q9153j34767j11206k9081N9830M8015j12613j494J08031
$$ -32011 -13730 57891 147044 12277 -98929 -128010 -68180 -20165 -132778 -134272 -26241
1388b6241j53981Q1028J26121j31487k4732N5778J87160j37780o7635j9617l2558
$$ -26241 -180222 -99194 26927 -104560 -129292 -73514 113646 -24134 -91769 -111386 -143944
1377a43944J03218R3649k6063M4080L2210l2095R5088n3263r3954o0026j68278
$$ -143944 -40726 52923 26860 70940 103150 71055 166143 112880 18926 -41100 -209378
1366b09378N616J70448J8806n1211N4633j47383J32006p2601q7345J84305r0383
$$ -209378 -203762 -33314 -14508 -65719 -11086 -158469 -26463 -99064 -186409 -2104 -92487
1355i2487j07629R7556m481q1993K04548j31521j1971k6142m0270P7675N007J23667
$$ -92487 -200116 -102560 -107041 -189034 15514 -116007 -127978 -154120 -194390 -116715 -111708 11959
1343A1959k2946J05292K6999j01333J0639m5638m5120M5850J44060k5564j45243
$$ 11959 -10987 94305 121304 19971 30610 -15028 -60148 -14298 129762 104198 -41045
1332d1045Q0999j15485O6892o7325o5646K28419j67484J8173k8282L9606J32413
$$ -41045 39954 -75531 -8639 -75964 -141610 86809 -80675 -62502 -90784 -51178 81235
1321H1235j26447J11283j45075R1879J36081L5157j65528o6809m3970k1098j61966
$$ 81235 -45212 66071 -79004 12875 148956 184113 18585 -48224 -92194 -113292 -275258
1310b75258R8468J35040n3716M9007j1293O2174m2035l6185L506N1693Q2995p3133
$$ -275258 -176790 -41750 -95466 -46459 -57752 4422 -37613 -73798 -70292 -18599 64396 -8737
1298h737o1655N9555M0019o8793j4991l7493j08184R2310P9681l6694K1901J08698
$$ -8737 -70392 -10837 29182 -39611 -54602 -92095 -200279 -107969 -28288 -64982 -43081 65617
1286F5617p3644O8982j6021j30353R9977K3463K477K9503p9421j08236Q7804l0577
$$ 65617 -8027 60955 44934 -85419 14558 38021 40498 70001 -9420 -117656 -29852 -60429
1274f0429k5017j4291K880N6884K9942n035k2701O1833j08177K63421j42080k8287
$$ -60429 -85446 -99737 -96857 -39973 -10031 -15066 -37767 24066 -84111 179310 37230 8943
1262H943q5281M9598J40382K5228p180j47288Q6790L9946N3579l0255J2539l1074
$$ 8943 -76338 -26740 113642 138870 131690 -15598 71192 111138 164717 134462 147001 115927
1250A15927N0028k7499m6344m7445j16485J95923k9175n0953n3600M9974n8486
$$ 115927 165955 138456 92112 44667 -71818 124105 94930 43977 -9623 40351 -18135
1239a8135O2358J12745o3794k2731j41160Q5564J10396m076l4504K5179n0341
$$ -18135 44223 156968 93174 70443 -70717 14847 125243 121167 86663 111842 61501
1228F1501l6595N908j0986q0486o1394J73452q0904l538M7852l5869M9778O2052
$$ 61501 24906 30814 19828 -60658 -122052 51400 -29504 -33042 14810 -21059 28719 90771
1216I0771j4532N9668k4192j28913q2512P3006R5857r1240M015K2658P9223o4667
$$ 90771 76239 135907 111715 -17198 -99710 -26704 69153 -22087 -18072 4586 83809 19142
1204A9142q3690J2252K1296p1619L824N2575P8564p7339K8806k3272o3592P0396
$$ 19142 -64548 -52296 -31000 -102619 -98795 -46220 32344 -44995 -16189 -39461 -103053 -32657
1192c2657m758J66220j51524J1050M1991M6940j01932J3550P1795o3392P1905
$$ -32657 -37415 128805 -22719 -11669 30322 77262 -24670 -11120 60675 -2717 69188
1181F9188o6124q1971L6297k4157J145J80217m0684j33994j4969J44915r2181
$$ 69188 3064 -78907 -42610 -66767 -65622 114595 73911 -60083 -75052 69863 -22318
1170b2318M4617o2216k6048Q9318K0662p7181q2422P7173m9191p4122Q4808L6863
$$ -22318 22299 -39917 -65965 23353 44015 -33166 -115588 -38415 -87606 -161728 -76920 -40057
1158d0057J8721K1655p8778N4741l6110k4766M5320J2482k7773k1076Q1217l6316
$$ -40057 -21336 319 -78459 -23718 -59828 -84594 -39274 -26792 -54565 -75641 5576 -30740
1146c0740o9877M5827m9129L6836M9113j29729J19116M846N0274L4524n1800l6872
$$ -30740 -100617 -54790 -103919 -67083 -17970 -147699 -28583 -23737 26537 61061 9261 -27611
1134b7611m6963N0456J65008n6338k34576L1622R0186J03605j42715L0729K11623
$$ -27611 -74574 -24118 140890 84552 -150024 -118402 -28216 75389 -67326 -36597 175026
1123A75026j41683m7099j1230l8014K7002K43042j27086k3342M8036j74805N1444
$$ 175026 33343 -13756 -24986 -63000 -35998 207044 79958 56616 104652 -70153 -18709
1112a8709N3585r7079K7004M2312n6572P8401O4466j82531k2762P8954M749j00968
$$ -18709 34876 -62203 -35199 7113 -49459 28942 93408 -89123 -111885 -32931 -28182 -129150
1100a29150J27365j5815o2898L1704Q6975L1954j2965o9546r6160O4337O2484
$$ -129150 -1785 -17600 -80498 -48794 38181 70135 57170 -12376 -108536 -44199 18285
1089A8285N729p4467l1584r5940J57880j35169P6601J23905Q6699p7823j23465
$$ 18285 24014 -50453 -82037 -177977 -20097 -155266 -78665 45240 131939 54116 -69349
1078f9349j8519K6511O7069n2948j10533R5550M6825n9950K504Q5032O178R1746
$$ -69349 -87868 -61357 5712 -47236 -157769 -62219 -15394 -75344 -72840 12192 18370 110116
1066A10116j29375L8628l6513K3522j9561l4608L8036R7676m4519Q5931j3032
$$ 110116 -19259 19369 -17144 6378 -13183 -47791 -9755 87921 43402 129333 116301
1055A16301j94995j29687J00754J02073r1497J77206p022q7891j59143L898J19415
$$ 116301 -78694 -208381 -107627 -5554 -97051 80155 73133 -14758 -173901 -170003 -50588
1044e0588M1907J7152n0616K5959l0391J14181O9753k17658N1173M7067j71726
$$ -50588 -8681 8471 -42145 -16186 -46577 67604 137357 -80301 -29128 17939 -153787
1033a53787J57062j12233j23789R3207J24434j4133O9231R9730M3044k1748k97648
$$ -153787 3275 -108958 -232747 -139540 -15106 -29239 39992 139722 182766 161018 -136630
1022a36630J61018K0403j4773J56015J0357k33575R011J55107n626j66767J41828
$$ -136630 24388 44791 30018 186033 196390 -37185 -28174 126933 121307 -45460 96368
1011I6368N519K0421k0305J34546p8238j27496k9507M2720l3478J33666l4920
$$ 96368 101887 122308 102003 236549 158311 30815 1308 44028 10550 144216 109296
1000A09296k23979Q1596l4727M9582M0113k9547m442j33646J39398K203K1207
$$ 109296 -114683 -33087 -67814 -18232 21881 -7666 -12108 -145754 -6356 -4153 17054
$$ [...]
##END NTUPLES=NMR SPECTRUM
##END=
