##TITLE=1H_CG-1211_B3
 CDCl3
 8 sc, 
 9.9.2024
##JCAMPDX= 6.0         $$ Bruker NMR JCAMP-DX V2.0
##DATA TYPE= NMR SPECTRUM
##DATA CLASS= NTUPLES
##ORIGIN= UXNMR, Bruker Analytische Messtechnik GmbH
##OWNER= root
$$ XWIN-NMR		Version 3.5
$$ Mon Sep  9 14:10:53 2024 Russian Standard Time (UT+4h)  she@DPX200
##.OBSERVE FREQUENCY= 200.1318
##.OBSERVE NUCLEUS= ^1H
##.ACQUISITION MODE= SIMULTANEOUS
##.ACQUISITION SCHEME= undefined
##.AVERAGES= 8
##.DIGITISER RES= 18
##SPECTROMETER/DATA SYSTEM= spect
##.PULSE SEQUENCE= zg30
##.SOLVENT NAME= CDCl3
##.SHIFT REFERENCE= (INTERNAL, CDCl3, 0, 20.9547)
##AUDIT TRAIL= $$ (NUMBER, WHEN, WHO, WHERE, WHAT)
$$ ##TITLE= Audit trail, XWIN-NMR		Version 3.5
$$ ##JCAMPDX= 5.01
$$ ##ORIGIN= Bruker BioSpin GmbH
$$ ##OWNER= she
$$ F:/spectra/data/she/nmr/H-F/1/pdata/1/auditp.txt
$$ ##AUDIT TRAIL=  $$ (NUMBER, WHEN, WHO, WHERE, WHAT)
(   1,<2024-09-09 14:09:25.73 +0400>,<she>,<DPX200>,
      <created by zg, POWCHK disabled, PULCHK disabled
       configuration hash MD5:
       00 E9 B6 7A A2 85 ED C7 34 08 36 98 17 FE 4E 26
       data hash MD5: 16K
       CD 20 C2 89 4C 58 05 FA E6 32 F1 DA 0B 97 A0 37>)
(   2,<2024-09-09 14:09:28.26 +0400>,<she>,<DPX200>,
      <Start of raw data processing
       efp BC_mod = 2 LB = 0.24 FT_mod = 6 PKNL = 1 PHC0 = -25993.73 PHC1 = 13.18748 SI = 16K 
       data hash MD5: 16K
       EF F8 EB EE B8 96 17 CB 34 E3 05 1D 29 91 F4 F3>)
(   3,<2024-09-09 14:09:56.75 +0400>,<she>,<DPX200>,
      <pk PHC0 = 1.194261 PHC1 = -2.4 
       data hash MD5: 16K
       06 AE 82 43 4E 8C F8 63 A0 3E CC 41 21 C3 9E 10>)
(   4,<2024-09-09 14:09:59.93 +0400>,<she>,<DPX200>,
      <abs ABSG = 5 
       data hash MD5: 16K
       09 93 BC 8D 04 04 99 0C 54 98 0B 76 8A 3D BF 44>)
$$ ##END=
$$ 
$$ hash MD5
$$ 2F 7C 33 72 F1 62 96 51 8D 0E C6 80 09 BC 45 98
##$RELAX= 
##$RELAX= 
##$RELAX= 
##$RELAX= 
##$RELAX= 
##$RELAX= 
$$ Bruker specific parameters
$$ --------------------------
##$DU= <F:/spectra>
##$EXPNO= 1
##$NAME= <H-F>
##$PROCNO= 1
##$TYPE= <nmr>
##$USER= <she>
##$AMP= (0..31)
100 100 100 100 100 100 100 100 100 100 100 100 100 100 100 100 100 100 
100 100 100 100 100 100 100 100 100 100 100 100 100 100 
##$AQSEQ= 0
##$AQ_mod= 1
##$AUNM= <au_zg>
##$AUTOPOS= <>
##$BF1= 200.13
##$BF2= 200.13
##$BF3= 200.13
##$BF4= 200.13
##$BF5= 200.13
##$BF6= 200.13
##$BF7= 200.13
##$BF8= 200.13
##$BYTORDA= 1
##$CFDGTYP= 0
##$CFRGTYP= 5
##$CHEMSTR= <none>
##$CNST= (0..31)
1 1 145 1 1 1 1 1 1 1 1 1 1 1 1 1 1 1 1 1 1 1 1 1 1 1 1 1 1 1 1 1 
##$CPDPRG= <>
##$CPDPRG1= <>
##$CPDPRG2= <>
##$CPDPRG3= <>
##$CPDPRG4= <mlev>
##$CPDPRG5= <mlev>
##$CPDPRG6= <mlev>
##$CPDPRG7= <mlev>
##$CPDPRG8= <mlev>
##$CPDPRGB= <>
##$CPDPRGT= <>
##$D= (0..31)
0 1.2 0 0 0 0 0 0 0 0.06 0 0.03 0 0 0 0 0.0002 0 0 0 0 0 0 0 0 0 0 0 0 
0 0 0 
##$DATE= 1725876565
##$DBL= (0..7)
120 120 120 120 120 120 120 120 
##$DBP= (0..7)
150 150 150 150 150 150 150 150 
##$DBP07= 0
##$DBPNAM0= <>
##$DBPNAM1= <>
##$DBPNAM2= <>
##$DBPNAM3= <>
##$DBPNAM4= <>
$$ [...]
##$SUBNAM3= <"">
##$SUBNAM4= <"">
##$SUBNAM5= <"">
##$SUBNAM6= <"">
##$SUBNAM7= <"">
##$SUBNAM8= <"">
##$SUBNAM9= <"">
##$SW= 24.0689170037331
##$SWIBOX= (0..15)
0 0 2 0 0 0 0 0 0 0 0 0 0 0 0 0 
##$SW_h= 4816.95568400771
##$TD= 16384
##$TD0= 1
##$TE= 0
##$TE2= 300
##$TE3= 300
##$TEG= 300
##$TL= (0..7)
0 120 120 120 120 120 120 120 
##$TP= (0..7)
150 150 150 150 150 150 150 150 
##$TP07= 0
##$TPNAME0= <>
##$TPNAME1= <>
##$TPNAME2= <>
##$TPNAME3= <>
##$TPNAME4= <>
##$TPNAME5= <>
##$TPNAME6= <>
##$TPNAME7= <>
##$TPOAL= (0..7)
0.5 0.5 0.5 0.5 0.5 0.5 0.5 0.5 
##$TPOFFS= (0..7)
0 0 0 0 0 0 0 0 
##$TUNHIN= 0
##$TUNHOUT= 0
##$TUNXOUT= 0
##$USERA1= <user>
##$USERA2= <user>
##$USERA3= <user>
##$USERA4= <user>
##$USERA5= <user>
##$V9= 5
##$VALIST= <valist>
##$VCLIST= <CCCCCCCCCCCCCCC>
##$VD= 0
##$VDLIST= <DDDDDDDDDDDDDDD>
##$VPLIST= <PPPPPPPPPPPPPPP>
##$VTLIST= <TTTTTTTTTTTTTTT>
##$WBST= 1024
##$WBSW= 4
##$XGAIN= (0..3)
0 0 0 0 
##$XL= 0
##$YL= 0
##$YMAX_a= 766684
##$YMIN_a= -649686
##$ZGOPTNS= <>
##$ZL1= 120
##$ZL2= 120
##$ZL3= 120
##$ZL4= 120
##$ABSF1= 20.97381
##$ABSF2= -3.095322
##$ABSG= 5
##$ABSL= 3
##$ALPHA= 0
##$AQORDER= 0
##$ASSFAC= 0
##$ASSFACI= 0
##$ASSFACX= 0
##$ASSWID= 0
##$AUNMP= <proc_1d>
##$AZFE= 0.1
##$AZFW= 0.1
##$BCFW= 0
##$BC_mod= 2
##$BYTORDP= 0
##$COROFFS= 0
##$CY= -3
##$DATMOD= 1
##$DC= 0
##$DFILT= <>
##$DTYPP= 0
##$F1P= 0
##$F2P= 0
##$FCOR= 1
##$FTSIZE= 16384
##$FT_mod= 6
##$GAMMA= 0
##$GB= 0
##$INTBC= 1
##$INTSCL= 3.70164e-10
##$ISEN= 128
##$LB= 0.24
##$LEV0= 0
##$LPBIN= 0
##$MAXI= 10000
##$MC2= 0
##$MEAN= 0
##$ME_mod= 0
##$MI= 1.114404
##$NCOEF= 0
##$NC_proc= -6
##$NLEV= 6
##$NOISF1= 3.799351
##$NOISF2= 2.8
##$NSP= 0
##$NTH_PI= 0
##$NZP= 0
##$OFFSET= 20.95472
##$PC= 1
##$PHC0= -25992.54
##$PHC1= 10.78748
##$PH_mod= 1
##$PKNL= yes
##$PPARMOD= 0
##$PSCAL= 0
##$PSIGN= 0
##$REVERSE= no
##$SF= 200.130014809475
##$SI= 16384
##$SIGF1= 3
##$SIGF2= 2
##$SINO= 5.538805
##$SIOLD= 16384
##$SREGLST= <1H.CDCl3>
##$SSB= 0
##$STSI= 16384
##$STSR= 0
##$SW_p= 4816.95568400771
##$SYMM= 0
##$S_DEV= 0
##$TDeff= 16384
##$TDoff= 0
##$TI= <>
##$TILT= no
##$TM1= 0
##$TM2= 0
##$TOPLEV= 0
##$USERP1= <user>
##$USERP2= <user>
##$USERP3= <user>
##$USERP4= <user>
##$USERP5= <user>
##$WDW= 1
##$XDIM= 16384
##$YMAX_p= 532955945
##$YMIN_p= -552698
$$ End of Bruker specific parameters
$$ ---------------------------------
##NTUPLES= NMR SPECTRUM
##VAR_NAME=  FREQUENCY,     SPECTRUM/REAL,   SPECTRUM/IMAG
##SYMBOL=    X,             R,               I
##VAR_TYPE=  INDEPENDENT,   DEPENDENT,       DEPENDENT
##VAR_FORM=  AFFN,          ASDF,            ASDF
##VAR_DIM=   16384,         16384,           16384
##UNITS=     HZ,            ARBITRARY UNITS, ARBITRARY UNITS
##FACTOR=    0.29402158847633, 1,            1
##FIRST=     4193.66833256045, 0,            0
##LAST=      -623.287351447259, 0,           0
##MIN=       -623.287351447259, -552698,     0
##MAX=       4193.66833256045, 532955945,    0
$$ Real data points
##PAGE= N=1
##DATA TABLE= (X++(R..R)), XYDATA
$$ [...]
6962B33381299J061271N587632Q711519Q906637R782018J4187034K0999573K2652916
$$ 233381299 234442570 240030202 248741721 257648358 267430376 281617410 302616983 325269899
6954C25269899K1130470K1579016J5877491L190242j4822311k8585784l1330197
$$ 325269899 346400369 367979385 383856876 387047118 372224807 343639023 312308826
6947C12308826k5916775j7230202r918364n811232n153695o376820n004862k681425
$$ 312308826 286392051 269161849 259243485 253432253 248278558 241901738 236896876 234215451
6939B34215451o015037j2365078j4581312j2652941q801442q770559j1865869
$$ 234215451 228200414 215835336 201254024 188601083 179799641 171029082 159163213
6932A59163213j3226264j2315463j0021659p190128n627118m285313l389558k452503
$$ 159163213 145936949 133621486 123599827 116409699 110782581 106497268 103107710 100655207
6924A00655207j512590k53241Q37800J806592K426623K02559l450563n145507
$$ 100655207 99142617 98889376 99727176 101533768 103960391 104162950 100712387 95566880
6916I5566880m952891l313877k645777l395907n057665n066622m728572l978115
$$ 95566880 90613989 87300112 84654335 81258428 76200763 71134141 66405569 62427454
6908F2427454l153042k775139k267389j933674j618003j518090j344140j166508
$$ 62427454 59274412 56499273 54231884 52298210 50680207 49162117 47817977 46651469
6900D6651469j049262r25312r53372n50644m54536n96038l16671l05227j98996
$$ 46651469 45602207 44676895 43723523 43172879 42718343 42122305 41805634 41500407 41301411
6891D1301411k36842p1072J24749J76641N8898K14081M49475O39520Q08128N42489
$$ 41301411 41064569 40993497 41118246 41294887 41353785 41567866 42017341 42656861 43464989 44007478
6881D4007478L24367N42398L07252N32630P98762N63479M47813M74418L38864
$$ 44007478 44331845 44874243 45181495 45714125 46512887 47076366 47524179 47998597 48337461
6872D8337461N35565O36344P49767R78182R63127Q67165R30264J348876J542519
$$ 48337461 48873026 49509370 50259137 51237319 52200446 53067611 53997875 55346751 56889270
6863E6889270J697609J930960K176122K662074K501838K754478L043894L145443
$$ 56889270 58586879 60517839 62693961 65356035 67857873 70612351 73656245 76801688
6855G6801688L751979M674688N539808O922092P755444Q617436R897702J1294590
$$ 76801688 80553667 85228355 90768163 97690255 105445699 114063135 123960837 135255427
6847A35255427J0093025O115746L427659L257027J816987l509197p754735q816285
$$ 135255427 145348452 151464198 154891857 158148884 159965871 156456674 148701939 139885654
6839A39885654o968501m468818k345836l04851J317046K845385M456171N895120
$$ 139885654 132917153 128448335 126102499 125797648 127114694 129960079 134416250 140311370
6831A40311370O289115N908119N687734O279212P095830P220036P856986R379965
$$ 140311370 146600485 152508604 158196338 164475550 171571380 178791416 186648402 196028367
6823A96028367J1620740J1068748P794049K248396m298690p573685p062404m192949
$$ 196028367 207649107 218717855 226511904 228760300 224461610 216887925 209825521 205632572
6815B05632572l755211n448210o170266m864646k045830J055822L873076O756709
$$ 205632572 201877361 196429151 190258885 185394239 183348409 184404231 188277307 195034016
6807A95034016Q294106R897917J1881587J4182049J6774819J7751090J4260657
$$ 195034016 203328122 213226039 225107626 239289675 256064494 273815584 288076241
6800B88076241O419776p24840m600390o122573r300253j2699707j3207555j0952741
$$ 288076241 294496017 293771177 289170787 283048214 273747961 261048254 247840699 236887958
6792B36887958j0119610j2322885j3558225j2640249j0356834p558057m949018
$$ 236887958 226768348 214445463 200887238 188246989 177890155 170332098 165383080
6785A65383080k197852k05658J959031M306926O440261Q406966J0005066J1423674
$$ 165383080 163185228 162979570 164938601 169245527 175685788 184092754 194097820 205521494
6777B05521494J3326463J3452476J0515525O632566L008494l250240j1293497
$$ 205521494 218847957 232300433 242815958 249448524 252457018 249206778 237913281
6770B37913281j6294403j6088221j3952009j3035427j2459285j1803395j0862130
$$ 237913281 221618878 205530657 191578648 178543221 166083936 154280541 143418411
6763A43418411j0041193q724483p708235o378955m881930l650686k442238j549993
$$ 143418411 133377218 124652735 116944500 110565545 105683615 102032929 99590691 98040698
6755I8040698o74984J71576M35384Q91500J416400J981456K320187J608528q09872
$$ 98040698 97365714 97537290 97972674 98864174 100280574 102262030 104582217 106190745 105380873
6746A05380873l020439m203044m028971m282158n258699o231060o556083o075221
$$ 105380873 102360434 98157390 94128419 89846261 84587562 78356502 71800419 65725198
6738F5725198m959342m094656l279379k621317k419759k131217j621126j402960
$$ 65725198 60765856 56671200 53391821 50770504 48350745 46219528 44598402 43195442
6730D3195442j307760j216662j325544j267046j203155j156818j423468j257754
$$ 43195442 41887682 40671020 39345476 38078430 36875275 35718457 34294989 33037235
6722C3037235j277753j316714j347492j142932j243369j050589r04371r40404
$$ 33037235 31759482 30442768 29095276 27952344 26708975 25658386 24754015 23813611
6714B3813611p86614p20243n14611m91799n86346m30123m71860k95944k42904
$$ 23813611 23026997 22306754 21792143 21300344 20713998 20283875 19812015 19516071 19273167
6705A9273167k79158j76220k04807j91964m67094m70968n82323k89830m96821
$$ 19273167 18994009 18817789 18612982 18421018 17953924 17482956 16900633 16610803 16113982
6696A6113982n60420m18663l75895m05850n89063l81001j81752m55831l75931
$$ 16113982 15553562 15134899 14759004 14353154 13764091 13383090 13201338 12745507 12369576
6687A2369576k92565m774k39476k23152j42743n0170k10885m15569k07379l03109
$$ 12369576 12077011 12072237 11832761 11609609 11466866 11416696 11205811 10790242 10582863 10279754
6677A0279754l62671k41863k05770j87134k17476j69047r9387j60658j23081j8851
$$ 10279754 9917083 9675220 9469450 9282316 9064840 8895793 8796406 8635748 8512667 8493816
6667H493816l98067k70761k6250k55333q3640l25302o2411j50732j77221l23622
$$ 8493816 8095749 7824988 7798738 7543405 7459765 7134463 7072052 6921320 6744099 6420477
6657F420477j76182n7357q4238o1329j43277k45324j32855Q1345r7219o5648j09027
$$ 6420477 6244295 6186938 6102700 6041371 5898094 5652770 5519915 5601260 5504041 5438393 5329366
6646E329366j96118K2378p9369q5520r4459j58434n0820n8968K911j45835k80986
$$ 5329366 5133248 5155626 5076257 4990737 4896278 4737844 4687024 4628056 4630967 4485132 4204146
6635D204146p4964k7844P266j10029p8399q0657J9062r9967p0718J3379j37691
$$ 4204146 4129182 4101338 4108604 3998575 3920176 3839519 3858581 3758614 3687896 3701275 3563584
6624C563584O252K8366J08504p5403q3941J30963Q618j9121j37997O782l5660
$$ 3563584 3569836 3598202 3706706 3631303 3547362 3678325 3686943 3667822 3529825 3536607 3500947
6613C500947j86533N7180N1609r4632K0953j40753m198j19671l2694K07005M123
$$ 3500947 3314414 3371594 3423203 3328571 3349524 3208771 3204573 3084902 3052208 3259213 3263336
6602C263336j34936j17266m105J04430o308j3283p533j9703m6960J74186o0596
$$ 3263336 3128400 3011134 3007029 3111459 3105151 3091868 3084335 3064632 3017672 3191858 3131262
6591C131262M2673j04081J91449p9929K15444R0345K11197J59134R0945K97527
$$ 3131262 3173935 3069854 3261303 3181374 3396818 3487163 3698360 3857494 3948439 4245966
6581D245966j1578J21382k09095J77670j47006P7886K04459j31854J1846k60205
$$ 4245966 4234388 4355770 4146675 4324345 4177339 4255225 4459684 4327830 4339676 4079471
6571D079471l33055k3164K589j26073m0448j16913k52464Q0414M7587o9719J9760
$$ 4079471 3746416 3723252 3725841 3599768 3559320 3442407 3189943 3270357 3317944 3248225 3267985
6560C267985J26812J29186J72253M1028J9555R3955O5070m452R8827J64423l8594
$$ 3267985 3394797 3523983 3696236 3737264 3756819 3850774 3915844 3911392 4010219 4174642 4136048
6549D136048j72814j87772m7336J7861j47197j00812j46694n1438K9820M36j63223
$$ 4136048 3963234 3775462 3728126 3745987 3598790 3497978 3351284 3299846 3329666 3330102 3166879
6538C166879q5544j52139l8481l1470j00328K1557J67084L8226O2018J6230N040
$$ 3166879 3081335 2929196 2890715 2859245 2758917 2780474 2947558 2985784 3047802 3064032 3069072
6527C069072q9101j04133q0528j06851p9976q3320k598J32349m6593M0059j34856
$$ 3069072 2979971 2875838 2795310 2688459 2608483 2525163 2522565 2654914 2608321 2648380 2513524
6516B513524n1356j50199j01092O4506j46055j3516n3674k6487K3286K21529J24796
$$ 2513524 2462168 2311969 2210877 2275383 2129328 2115812 2062138 2035651 2058937 2280466 2405262
6505B405262J3027O4278k337n9348p5420N1314q0651j11944j31994K6739j49969
$$ 2405262 2418289 2482567 2480230 2420882 2345462 2396776 2316125 2204181 2072187 2098926 1948957
6494A948957k45838r0041j46838N4920J8924r966J5571j17470l3406J526m2001
$$ 1948957 1703119 1613078 1466240 1521160 1540084 1530118 1545689 1428219 1394813 1396339 1354338
6483A354338k804J11061m4798K2359j20643J24525L0821j91113P8792K1661l0094
$$ 1354338 1351534 1462595 1417797 1440156 1319513 1444038 1474859 1283746 1362538 1384199 1354105
6472A354105r896p6899K3339r1984K0738k1169N1946j95880j33002J71003j17725
$$ 1354105 1344209 1267310 1290649 1198665 1219403 1198234 1250180 1054300 921298 1092301 974576
6461I74576l5978R9115J28406q8531P7646j35433l831k5205N6307M3056O729K704
$$ 974576 938598 1037713 1166119 1077588 1155234 1019801 1015970 990765 1047072 1090128 1096857 1099561
6449A099561l9566m8832j1958K8133o2537j75776K3050J22971k2025j03249J07855
$$ 1099561 1059995 1011163 999205 1027338 964801 789025 812075 935046 913021 809772 917627
6438I17627L4236J33847j4300N5966j725J9384n4885N3808m146l6059M0098k03711
$$ 917627 951863 1085710 1071410 1127376 1125651 1145035 1090150 1143958 1139812 1103753 1143851 940140
6426I40140J49320K44038Q4782j34924L6824J59358n8163r1206Q1652K48020m5283
$$ 940140 1089460 1333498 1418280 1283356 1320180 1479538 1421375 1330169 1411821 1659841 1614558
6415A614558J15300l1679n6431M3077J17518J98360l3242p5238K13389J28624
$$ 1614558 1729858 1698179 1641748 1684825 1802343 2000703 1967461 1892223 2105612 2234236
6405B234236P2467P7184O7165K1661P5215J32463J93509O7319R2562K86542k0677
$$ 2234236 2306703 2383887 2451052 2472713 2547928 2680391 2873900 2941219 3033781 3320323 3299646
6394C299646P0947O4085R0820K95528J87603J92308L66820J59998O41162O53714
$$ 3299646 3370593 3434678 3525498 3821026 4008629 4200937 4567757 4727755 5368917 6022631
6384F022631N27931N28530N81794P08730N80601L49226J5377R1930J03334J0888
$$ 6022631 6550562 7079092 7660886 8369616 8950217 9299443 9314820 9406750 9510084 9520972
6374I520972N8574m07517l30403m64877n98198m45976l41254k91915j83949n6964
$$ 9520972 9579546 9172029 8841626 8376749 7778551 7332575 6991321 6699406 6515457 6458493
6364F458493O05j44329k9575p6595J74491J36480J49065L53477J45120J76319
$$ 6458493 6459098 6314769 6285194 6208599 6383090 6519570 6668635 7022112 7167232 7343551
6354G343551L44923L24031J30616L5732O9650n0224j03327l04464n26043o64799
$$ 7343551 7688474 8012505 8143121 8178853 8248503 8198279 8094952 7790488 7264445 6599646
6344F599646n53563m75383l71449l71763l70902l54620l36892j83826l40030j10631
$$ 6599646 6046083 5570700 5199251 4827488 4456586 4101966 3765074 3581248 3241218 3130587
6334C130587k27817j69060p8853k60777j67205j69673j42996p3552j47578k0433
$$ 3130587 2902770 2733710 2654857 2394080 2226875 2057202 1914206 1840654 1693076 1672643
6324A672643l8125L9816j01339j85307L2534q7375j33733O7553l9513j43400q1643
$$ 1672643 1634518 1674334 1572995 1387688 1420222 1332847 1199114 1266667 1227154 1083754 1002111
6313A002111r5396n2932L9824N7137L0023r1224K5884j56858r0327J21374M0789
$$ 1002111 906715 853783 893607 950744 980767 889543 915427 758569 668242 789616 830405
6302H30405j19678J14259q8942n6292Q057j3482P2343K2812J9961m8025j2970
$$ 830405 710727 824986 736044 679752 687809 674327 746670 769482 789443 741418 728448
6291G28448q805j85978J76P4270j460Q4094k19864O1859P2669o0393l0439k6468
$$ 728448 719643 533665 533841 608111 606651 690745 470881 532740 605409 545016 514577 488109
6279D88109M8734j65261j0010j0067l7255p5197J16447k0966j6541K4949K449
$$ 488109 536843 371582 361572 351505 314250 239053 355500 334534 317993 342942 345391
6268C45391L4356k28081j00278O5430k66J1100j2312K0089J97804k8206m7415
$$ 345391 379747 151666 51388 116818 116552 127652 115340 135429 333233 305027 257612
6257B57612L1467j18254N5067J4923O1144M4306j97812l8716P4353N2387n4385
$$ 257612 289079 170825 225892 240815 301959 346265 148453 109737 184090 236477 182092
6246A82092j29006L8342M2915j12425R9735J56935j69565p7702J46112J3119j04858
$$ 182092 53086 91428 134343 21918 121653 278588 109023 31321 177433 190552 85694
6235H5694J158K6101J4520p4251l0427m5208N0184j69085J79239J26121k18572
$$ 85694 86852 112953 127473 53222 22795 -22413 27771 -141314 37925 164046 -54526
6224e4526K6917J34173L5490k00949M5384L3380p5058J49821Q205l3708j06530
$$ -54526 -27609 106564 142054 -58895 -13511 19869 -55189 94632 102837 69129 -37401
6213c7401m6792O5709J5411K585j49973J43585p4974R4591l2647o3793j9829O1319
$$ -37401 -84193 -18484 -3073 -488 -150461 -6876 -81850 12741 -19906 -83699 -103528 -42209
6201d2209o8050J14864J6101J6116j25424J12876o1822L6242J30683j05373M0724
$$ -42209 -110259 4605 20706 36822 -88602 24274 -37548 -1306 129377 24004 64728
6190F4728Q9933k30769j14421J71592m7132J41473N5192n0327R3200p1894p6232
$$ 64728 154661 -76108 -190529 -18937 -66069 75404 130596 80269 173469 101575 25343
6179B5343q8499M6122J6381k9649J18898r5637l6347J76455n1193n4439n5368
$$ 25343 -63156 -17034 -653 -30302 88596 -7041 -43388 133067 81874 27435 -27933
6168b7933n736k2807J47020O185n9802J57622j05765j05852L7232o4972N1803
$$ -27933 -33669 -56476 90544 96729 36927 194549 88784 -17068 20164 -44808 6995
6157F995j41916n9534J42613J8966J37367j22762M7045l8220l281J62234r4369
$$ 6995 -134921 -194455 -51842 -32876 104491 -18271 28774 -9446 -12727 149507 55138
6146E5138J8044J34171j77005p2540J14030n6653o0625m4782J99912q2484j74735
$$ 55138 73182 207353 30348 -42192 71838 15185 -45440 -90222 109690 27206 -147529
6135a47529J67787n2752J04540j84835q555N3230P5948k5506J1964m0898p6264
$$ -147529 20258 -32494 72046 -112789 -121344 -68114 7834 -17672 -5708 -46606 -122870
6124a22870Q017R6730P1562j00617k2019J29040k7353L660q2632Q8949o0708o7851
$$ -122870 -114853 -18123 53439 -47178 -69197 59843 32490 36150 -46482 42467 -18241 -86092
6112h6092n6961J14051J84045o7316R924n1952k6056M8290m7008l5959k1678k5886
$$ -86092 -143053 -29002 155043 87727 97651 45699 19643 67933 20925 -15034 -36712 -62598
6100f2598m3816j6416J66258N1949N4418o026M7070j74710o9205J1124J04818
$$ -62598 -106414 -122830 43428 95377 149795 143769 190839 16129 -53076 -41952 62866
6089F2866J6468k54734O6705M0677j0260o491O2491J02782p9654N854j06732P1643
$$ 62866 79334 -175400 -108695 -68018 -78278 -84769 -22278 80504 850 6704 -100028 -28385
6077b8385J6339m4201J38098j61090m7754n1559K58422k8340k01208J63336O5113
$$ -28385 -12046 -56247 81851 -79239 -126993 -178552 79870 51530 -149678 13658 78771
6066G8771j79713q0233J42508r4118J3780J45181N1015j02862j01880M4995K466
$$ 78771 -100942 -181175 -38667 -132785 -119005 26176 77191 -25671 -127551 -82556 -80090
6055h0090J42511q7109j17785Q2152l3518j28296J19903J82506j36349L2093m941
$$ -80090 62421 -24688 -142473 -60321 -93839 -222135 -102232 80274 -56075 -23982 -28923
6044b8923j18159N1701j40203L6248M2949J90546R6457N2499j03991o8331j471
$$ -28923 -147082 -95381 -235584 -199336 -156387 34159 130616 183115 79124 10793 9322
6033I322l1737J782K6764m4925p6262M2536J58565o3281j45276N6065R7228K46833
$$ 9322 -22415 -20633 6131 -38794 -115056 -72520 86045 22764 -122512 -66447 30781 277614
6021B77614j80896j38636o2353K03554J16413j26731J6874J8291k28389j2819
$$ 277614 96718 -41918 -104271 99283 215696 88965 105839 124130 -104259 -117078
6011a17078J16958M6776k11916J56162Q2601r6853k1646Q8886q4754k9079q847
$$ -117078 -120 46656 -165260 -9098 73503 -23350 -44996 43890 -40864 -69943 -78790
6000g8790n61L5448K9915o2218p6656J37528p2720m4242J02990J00076L5359j83811
$$ -78790 -79351 -43903 -13988 -76206 -152862 -15334 -88054 -132296 -29306 70770 106129 -77682
5988g7682j37724R727L8148J2036J7443p3275N5732K1871J56284M6587n0736o0210
$$ -77682 -215406 -205679 -167531 -155495 -138052 -211327 -155595 -133724 22560 69147 18411 -41799
5976d1799l7085N6589n7674J00395o0932N2258k74973P0864K13100r6590k6900
$$ -41799 -78884 -22295 -79969 20426 -40506 11752 -263221 -192357 20743 -75847 -102747
5965a02747J03410k9418j9389m4123J00253j09960j96130J48333J008j9481J23378
$$ -102747 663 -28755 -48144 -92267 7986 -101974 -298104 -149771 -148763 -168244 -44866
5954d4866k2405M9382K6647k2226k3278j12687O0037m8483R6002O7486P373o6722
$$ -44866 -67271 -17889 8758 -13468 -36746 -149433 -89396 -137879 -41877 25609 32982 -33740
5942c3740P1038k64490J7886O9149J22916n4491j18962O3140P0638q1581J64251
$$ -33740 37298 -227192 -209306 -140157 -17241 -71732 -190694 -127554 -56916 -138497 25754
5931B5754j32118K4567K5433q7331k4025R4112J25887r4270p922j71975k9127
$$ 25754 -106364 -81797 -56364 -143695 -167720 -73608 52279 -41991 -49913 -221888 -251015
5920b51015K711J18850k3420J75425r0218L2194n9134l9656Q9554j55957J10515
$$ -251015 -248304 -129454 -152874 22551 -67667 -35473 -94607 -134263 -44709 -200666 -90151
5909i0151J5671o3597q417M6921Q2335L0621m579m4295Q8932m6764r2150k2389
$$ -90151 -74480 -138077 -146494 -99573 -17238 13383 8804 -35491 53441 6677 -85473 -107862
5897a07862J05894l2102m7849o9343P4304k1207Q4414R1666o0813j40183j51725
$$ -107862 -1968 -34070 -81919 -151262 -76958 -98165 -13751 77915 17102 -123081 -274806
5886b74806J74406Q0432j38295L3653q1471R0855j4149J36025M0981q8857K6326
$$ -274806 -100400 -19968 -158263 -124610 -206081 -115226 -129375 6650 47631 -41226 -14900
5875a4900m9839j35003J29776j08287P3431j0326J1660l5714J33061N2234j62094
$$ -14900 -64739 -199742 -69966 -178253 -104822 -115148 -103488 -139202 -6141 46093 -116001
5864a16001J72451j36605j1523K1988Q7844o6241l6728J06050p280j41823j18987
$$ -116001 56450 -80155 -91678 -69690 18154 -48087 -84815 21235 13955 -127868 -246855
5853b46855J40165p502J9249R4506J16059j35280k7089n541L842n354j42248K22082
$$ -246855 -106690 -114192 -94943 -437 115622 -19658 -46747 -52288 -48446 -53800 -196048 26034
5841B6034j40338N1892m6902k907O204m4450j2807l9719J28951j30319j5563J08373
$$ 26034 -114304 -62412 -109314 -112221 -106017 -150467 -163274 -202993 -74042 -204361 -219924 -111551
5829a11551O1052K8540K5264o5873j37026n3766R1166J44888j12569n7376J89659
$$ -111551 -50499 -21959 3305 -62568 -199594 -253360 -162194 -17306 -129875 -187251 2408
5818B408m1088o5945P3056j24184l29P8406O233j50410M7634p2181R9724J65148
$$ 2408 -38680 -104625 -31569 -155753 -156082 -77676 -71443 -221853 -174219 -246400 -146676 18472
5806A8472j5679j10028q3561P6962M1247j54331J32492N8705j17019j5848Q5882
$$ 18472 2793 -107235 -190796 -113834 -72587 -226918 -94426 -35721 -152740 -168588 -82706
5795h2706j46625L7916R9746L3548q6706J01969J0853n993j5267m9598j56537
$$ -82706 -229331 -191415 -91669 -58121 -144827 -42858 -32005 -37998 -53265 -102863 -259400
5784b59400K2838J80281K7264O6549j39438r841l8658P4090n5415J8168J90825
$$ -259400 -236562 -56281 -29017 37532 -101906 -111747 -150405 -76315 -131730 -113562 77263
5773G7263L1824k38287J28156R163n1875J25424j61750N7595m9266N8794n1064
$$ 77263 109087 -129200 -1044 8119 -43756 81668 -80082 -22487 -71753 -12959 -64023
5762f4023j64827R2613J90949K8018k00996m4654J7587J79977j05390J11136K0600
$$ -64023 -228850 -136237 54712 82730 -118266 -162920 -145333 34644 -70746 40390 60990
5751F0990p3068n0523J24176r7860r5962P7785K0340l6308p6067k1297P3911J37712
$$ 60990 -12078 -62601 61575 -36285 -132247 -54462 -34122 -70430 -146497 -167794 -93883 43829
5739D3829q7276j60305J16434L5199j3504J3536q3029J60978M7461r7417j1354
$$ 43829 -43447 -203752 -87318 -52119 -65623 -52087 -135116 25862 73323 -24094 -35448
5728c5448j11495K23268K1930j89611J42O3952N1962j12816k2085j2106k1842
$$ -35448 -146943 76325 98255 -91356 -91214 -27262 24700 -88116 -110201 -122307 -144149
5717a44149K5965J26247j14100J48858r402K4833k3305r8411J727L0856k6964
$$ -144149 -118184 8063 -106037 42821 33419 58252 34947 -63464 -61737 -30881 -57845
5706e7845K3983j34446J06687R7034Q682K09m4707r0215r6260n422l3566J80921
$$ -57845 -33862 -168308 -61621 35413 44095 44304 -403 -90618 -186878 -192300 -225866 -44945
5694d4945N084N7806J27556o8621j64621J07407p4441O6584m7983l8881M1808
$$ -44945 -39861 17945 145501 76880 -87741 19666 -54775 11809 -36174 -75055 -33247
5683c3247R1780n8742k58818P6986J96836O689K7606j36121Q6259N1990o9988
$$ -33247 58533 -209 -259027 -182041 14795 21484 49090 -87031 -772 51218 -18770
5672a8770m9663P0515K4357j30796O6278J2259M5717j34228J37872M4268j85221
$$ -18770 -68433 2082 26439 -104357 -38079 -25820 19897 -114331 23541 67809 -117412
5661a17412M0510q0344J44262J19828j9254N4647j12159j70079J4387K3369P1691
$$ -117412 -76902 -157246 -12984 106844 87590 142237 30078 -140001 -125614 -102245 -30554
5650c0554P1297J58945O1073m9886o0845m1902j76776k8427R9414R0044q499L5867
$$ -30554 40743 199688 260761 210875 150030 108128 -68648 -97075 2339 92383 83884 119751
5638A19751k5117n760j2318J2398o2571o163o2021p5109L10568j95931M1635N3290
$$ 119751 94634 88874 76556 88954 26383 20220 -41801 -116910 193658 -2273 39362 92652
5626I2652m0153J31922J28992j92300l1105K0203p9333M1452Q0032j74975J7217
$$ 92652 52499 184421 313413 121113 90008 110211 30878 72330 152362 -22613 -5396
5615e396K1082J32046k762m7927m654Q5050k9891Q7584k0135R3314J06324j27511
$$ -5396 15686 147732 144970 97043 92389 177439 147548 235132 214997 308311 414635 287124
5603B87124J39978j31553J5119Q4736p3526j18447m4634J9036q0269j00954P6048
$$ 287124 427102 295549 310668 395404 321878 203431 158797 177833 97564 -3390 72658
5592G2658j38814m7011J81945o2225n3671J41039m6131m6109J79552p7851q9522
$$ 72658 -66156 -113167 68778 6553 -47118 93921 47790 1681 181233 103382 13860
5581A3860m4770j9186K8951n4098N1044o8555J29404p4392n5504J98357j64612
$$ 13860 -30910 -50096 -21145 -75243 -24199 -92754 36650 -37742 -93246 105111 -59501
5570e9501O504L7548Q2785j4805K7979o7160L5863k05831j13543K38834J3655
$$ -59501 -52997 -15449 67336 52531 80510 13350 49213 -156618 -270161 -31327 -17672
5559a7672J40776q4481n7214L2090J145p9289J6648l2874P3239n4381j4845J13959
$$ -17672 123104 38623 -18591 13499 14644 -64645 -47997 -80871 -7632 -62013 -76858 37101
5547C7101L4907l00825J62405M8812p0207L5511j66208Q4942K74816K4212j19824
$$ 37101 72008 -228817 -66412 -17600 -87807 -52296 -218504 -133562 141254 165466 45642
5536D5642O8786n48j72949j60857J53927J34619P7800k2893j0110l3399j15684
$$ 45642 114428 113880 -59069 -219926 -65999 68620 146420 123527 113417 80018 -35666
5525c5666N5990N8340r8726P5437j9839P7027m5777l3059L110j15095r724J09362
$$ -35666 20324 78664 -20062 55375 35536 112563 66786 33727 36837 -78258 -87982 21380
5513B1380n6780P67O529R2097l1841k36790J37744k50m9139Q4087O9032n6565
$$ 21380 -35400 -34633 -28104 63993 32152 -204638 -66894 -67144 -116283 -32196 36836 -19729
5501a9729l80j26386R7122L3190j19174m1877J06384M539Q1678J0939j6513L1904
$$ -19729 -20109 -146495 -49373 -16183 -135357 -177234 -70850 -66311 15367 26306 9793 41697
5489D1697k3498q6698p9112M7683J66522N3895p4871J5440p7803K3117N8909o2567
$$ 41697 18199 -68499 -147611 -99928 66594 120489 45618 61058 -16745 6372 65281 2714
5477B714J31665J4893j61819J38035Q4779r6046m5688J79027q1482r7686K1985
$$ 2714 134379 149272 -12547 125488 210267 114221 68533 247560 166078 68392 90377
5466I0377J10421n9122r3644J5609p4674l396R3043l9235j7057O8542l4971K0537
$$ 90377 200798 141676 48032 63641 -11033 -14429 78614 39379 22322 90864 55893 76430
5454G6430K8585R5785j50613n8694Q424p9886N0862R2011N7379J7185m9997k8971
$$ 76430 105015 200800 50187 -8507 -83 -79969 -29107 62904 120283 137468 87471 58500
5442E8500J20335p7745q8149J18346J4198j21886r6427o7940N5052J38143k03931
$$ 58500 178835 101090 12941 131287 145485 23599 -72828 -140768 -85716 52427 -151504
5431a51504k596J64340l1362k1953J38187L6333n6045p2201o680l6582J11421
$$ -151504 -154100 10240 -21122 -43075 95112 131445 75400 3199 -3481 -40063 71358
5420G1358L7220o7126J37891l4042R4626R468j28686j2080j07730m2533J56561
$$ 71358 108578 41452 179343 145301 239927 249395 120709 108629 899 -41634 114927
5409A14927M5514N3158j16392J0296j04131M5622P3351K7914n0839p1341J08097
$$ 114927 160441 213599 97207 107503 3372 48994 122345 150259 99420 28079 136176
5398A36176r185J23338J4259r4837p4784p7740J4314J08015N376q4727Q8625m7027
$$ 136176 126991 250329 264588 169751 94967 17227 31541 139556 144932 60205 148830 101803
5386A01803m8891N9988K7289R132k24492R2919K61287k5048m2766p8489J1628
$$ 101803 52912 112900 140189 149321 -75171 17748 279035 253987 211221 132732 144360
5375A44360J27373m7925j11247R6240n5413n0894J45767j1106p543J32432n2617
$$ 144360 271733 223808 112561 208801 153388 102494 248261 237155 229612 362044 309427
5364C09427q0888n1756j19015L4116q0503O4304J16626j53834J5879j1048l5210
$$ 309427 228539 176783 57768 91884 11381 75685 192311 38477 54356 43308 8098
5353H098M5561J52413Q4588L2408j11903P2392K5298m0216M8080r5684K6470J51493
$$ 8098 53659 206072 290660 323068 211165 283557 308855 268639 316719 221035 247505 398998
5341C98998j12403k1739K7428q9583j4709R8769J75585L1889J9092j52852K7703
$$ 398998 286595 264856 292284 202701 187992 286761 462346 494235 513327 360475 388178
5330C88178J1436N2269N5159k9962j1826N3456n0841p4027K4848j20438l965J66418
$$ 388178 399614 451883 507042 477080 465254 518710 467869 393842 418690 298252 294287 460705
5318D60705o8174O0014Q0372J07439j25354j4399N4283p1719J52245K8854l2044
$$ 460705 392531 452545 532917 640356 515002 500603 554886 483167 635412 664266 632222
5307F32222K5740l1602P2174q498J22056P0816O3102O3674k11694P7848Q3298
$$ 632222 657962 626360 698534 690036 812092 882908 946010 1009684 797990 875838 959136
5296I59136J02128k1082N0698j01690L4001j2897J2087J01572O7628l5480O0828
$$ 959136 1061264 1040182 1090880 989190 1023191 1010294 1022381 1123953 1191581 1156101 1216929
5285A216929o3193J06498j04171j11183l7598J5599Q5909o7385J6796o6664J27975
$$ 1216929 1153736 1260234 1156063 1044880 1007282 1022881 1108790 1041405 1058201 991537 1119512
5274A119512p9265K5667K929M530k48057K5962l8413m3751J0076O4148j01648
$$ 1119512 1040247 1065914 1068843 1073373 825316 851278 812865 769114 779190 843338 741690
5263G41690j68267J52781j05620Q2492p9553r7480m215O4118J8489J40677M4973
$$ 741690 573423 726204 620584 703076 623523 526043 521828 585946 604435 745112 790085
5252G90085j15768m1627J06014O9741r2243N2508R273J11201n091j0146m4225
$$ 790085 674317 632690 738704 808445 716202 768710 777983 889184 884093 873947 829722
5241H29722M1783J14038k7249n9917j27558O0212J49395l7566R3700J7971k8233
$$ 829722 871505 985543 958294 898377 770819 831031 980426 942860 1036560 1054531 1026298
5230A026298R9135j17130O4519R574j51434R1133p6445J13280J11216m9166J7323
$$ 1026298 1125433 1008303 1072822 1082396 930962 1022095 945650 1058930 1170146 1120980 1138303
5219A138303M1361M4204k9932r7201q2008J00573J23816j9500R6429r7968k9041
$$ 1138303 1179664 1223868 1193936 1096735 1014727 1115300 1239116 1219616 1316045 1218077 1189036
5208A189036j57408M0312J09180Q6545P7232p3721J39784j2007J4427K6845o8859
$$ 1189036 1031628 1071940 1181120 1267665 1344897 1271176 1410960 1398953 1413380 1440225 1371366
5197A371366L6359L3685P6538n164k9403L2929J03491J12970k8748O2471O4146
$$ 1371366 1407725 1441410 1517948 1512784 1483381 1516310 1619801 1732771 1704023 1766494 1830640
5186A830640M3687O1329n2873Q6953n6428O6680J08856l717j51260J49752J13753
$$ 1830640 1874327 1935656 1882783 1969736 1913308 1979988 2088844 2085127 1933867 2083619 2197372
5175B197372o2521O1048N6239n8423R318O58k7600K86234O3609P2727r5962L1456
$$ 2197372 2134851 2195899 2252138 2193715 2203033 2203691 2176091 2462325 2525934 2598661 2502699 2534155
5163B534155J59821p4266J64735Q3514q2338K07135N5472P6304p8988k230Q8668
$$ 2534155 2693976 2619710 2784445 2867959 2785621 2992756 3048228 3124532 3045544 3043314 3131982
5152C131982j77486R6661j7975J64793J53820q0040J82417l3756J43679J87253
$$ 3131982 2954496 3051157 3033182 3197975 3351795 3271755 3454172 3420416 3564095 3751348
5142C751348K6060N0261K8436o2607J56129J56662L4808O3595j7971J06889K10851
$$ 3751348 3777408 3827669 3856105 3793498 3949627 4106289 4141097 4204692 4186721 4293610 4504461
5131D504461j540K66942N7347K9731K20182R3771J13444K68337J54906J08688
$$ 4504461 4502921 4769863 4827210 4856941 5077123 5170894 5284338 5552675 5707581 5816269
5121E816269J79148J36060J80236K42266P5930L10811L23905J5051J31988M952
$$ 5816269 5995417 6131477 6311713 6553979 6629909 6940720 7264625 7279676 7411664 7416616
5111G416616K54770L76302L74452K58955J33494M22086M03452M04537M88780N21999
$$ 7416616 7671386 8047688 8422140 8681095 8814589 9236675 9640127 10044664 10533444 11055443
5101A1055443K77511N18313P01012O30661R09986J063656J042683J068283J419648
$$ 11055443 11332954 11851267 12552279 13182940 14092926 15156582 16199265 17267548 18687196
5092A8687196J271753P78116K04090K11120L24968N45985O64654J096297J267758
$$ 18687196 19958949 20737065 20941155 21152275 21477243 22023228 22687882 23784179 25051937
5083B5051937J551654J437466J342929J503691J527072J576522J218197P61676
$$ 25051937 26603591 28041057 29383986 30887677 32414749 33991271 35209468 35971144
5075C5971144L74970N44592M98941R90158J376306J513390J048269J019946J230544
$$ 35971144 36346114 36890706 37389647 38379805 39756111 41269501 42317770 43337716 44568260
5066D4568260J325064J905083K397696K412299K847607K298018K159557K189548
$$ 44568260 45893324 47798407 50196103 52608402 55456009 57754027 59913584 62103132
5058F2103132K799030L564212M540496N878551P312237Q691714J0228382J0571726
$$ 62103132 64902162 68466374 73006870 78885421 86197658 94889372 105117754 115689480
5050A15689480O627414J206187k206228l763862l322122j382883J299565M250228
$$ 115689480 122316894 123523081 121316853 117552991 114230869 112847986 114147551 118397779
5042A18397779O073529M492198K373256J645265K107109L317765L277542R55272
$$ 118397779 124471308 128963506 131336762 132982027 135089136 138406901 141684443 142639715
5034A42639715k782797m748379m837719l456077p30139J13847k355076m151763
$$ 142639715 139856918 135108539 130270820 126814743 126084604 126198451 123843375 119691612
5026A19691612m413709l150321o97383J833847M177293M670520R5201o083262
$$ 119691612 115277903 112127582 111430199 113264046 117441339 122111859 122207060 116123798
5018A16123798j0340229j2016775j1656165r851810p950437o153271n268946m566170
$$ 116123798 105783569 93766794 82110629 72258819 64308382 58155111 52886165 48319995
5010D8319995l709910l102785k890583k523792k061090j832108j691254j416745
$$ 48319995 44610085 41507300 38616717 36092925 34031835 32199727 30508473 29091728
5002B9091728j186940j096616j067672q45260q49036p66112o65506n33428n64414
$$ 29091728 27904788 26808172 25740500 24895240 24046204 23280092 22614586 22081158 21516744
4993B1516744o15523n63121m56454l44664l82152l08835l21830n56151k63471
$$ 21516744 20901221 20338100 19881646 19536982 19154830 18845995 18524165 17968014 17704543
4984A7704543l86658k72636l21674j28904r3790k08914k29122l4328l4006q6533
$$ 17704543 17317885 17045249 16723575 16594671 16500881 16291967 16062845 16028517 15994511 15907978
4974A5907978k4493j42460p7647J30039j8096M9730k9151m7561J21863J14268
$$ 15907978 15883485 15741025 15663378 15793417 15775321 15825051 15795900 15748339 15870202 15984470
4964A5984470R0746M2530J29900Q9805K84803R6025L34340K44963K05461K54247
$$ 15984470 16075216 16117746 16247646 16337451 16622254 16718279 17052619 17297582 17503043 17757290
4954A7757290K83212L98247L29141M7822K24334L63698M38041K69760M69508M12863
$$ 17757290 18040502 18438749 18767890 18815712 19040046 19403744 19841785 20111545 20581053 20993916
4944B0993916M02799O64006P52331P31209N06873P46387Q15558P12265Q53335
$$ 20993916 21396715 22060721 22813052 23544261 24051134 24797521 25613079 26325344 27178679
4935B7178679P04121Q36119Q93523R12930J041010J119320J358000J343121J482206
$$ 27178679 27882800 28718919 29612442 30525372 31566382 32685702 34043702 35386823 36869029
4926C6869029J590819J742877J971815K218446K571803K854332L129660L503830
$$ 36869029 38459848 40202725 42174540 44392986 46964789 49819121 52948781 56452611
4918E6452611L925926M286617M870286N077564N425663N233381M183315L006183
$$ 56452611 60378537 64665154 69535440 74613004 80038667 85272048 89455363 92461546
4910I2461546J555707P4060q82291j078153p35809j82718O02266J445565K525167
$$ 92461546 94017253 94091313 93209022 92130869 91395060 91212342 91814608 93260173 95785340
4901I5785340L534941M679858N565318O624782P936442R092509J0080527J0097232
$$ 95785340 99320281 104000139 109565457 116190239 124126681 133219190 143299717 153396949
4893A53396949R494736P177647L807106m20358m544315p048493q043870p597847
$$ 153396949 162891685 170069332 173876438 173456080 168911765 161863272 153819402 146221555
4885A46221555o508567n290073m041211l100193j983615r51589l08981J198604
$$ 146221555 139712988 134422915 130381704 127281511 125297896 124346307 124037326 125235930
4877A25235930K160984L156106M064000M130349L621465J984131k85107k424522
$$ 125235930 127396914 130553020 134617020 138747369 142368834 144352965 144067858 141643336
4869A41643336l835195m440523m528151l993705l537392l346001l547053l731438
$$ 141643336 137808141 133367618 128839467 124845762 121308370 117962369 114415316 110683878
4861A10683878m679845n190912n466371n511708n089682m600407l902572l374391
$$ 110683878 106004033 100813121 95346750 89835042 84745360 80144953 76242381 72867990
4853G2867990k817241k182095j763211j276787o05553l93826j72528J65190J89825
$$ 72867990 70050749 67868654 66105443 64828656 64223103 63829277 63656749 63821939 64011764
4844F4011764o5650o29098j121987j768666k425948l019995l038449l048191k789508
$$ 64011764 63946114 63317016 62195029 60426363 58000415 54980420 51941971 48893780 46104272
4835D6104272k933851k638170k236444k002810j948928j716069j536856j353820
$$ 46104272 43170421 40532251 38295807 36292997 34344069 32628000 31091144 29737324
4827B9737324j173669j181536j067302r83220j043181p85886m64852p40432n61123
$$ 29737324 28563655 27382119 26314817 25331597 24288416 23502530 23037678 22297246 21736123
4818B1736123p62793l97837l43233k98766l90001l68136l00300l21164l45881
$$ 21736123 20973330 20575493 20232260 19933494 19543493 19175357 18875057 18553893 18208012
4809A8208012j04828l21514j37296j71064j63098j01862j91026o9329R4441j73532
$$ 18208012 18103184 17781670 17644374 17473310 17310212 17208350 17017324 16947995 17042436 16868904
4799A6868904j1545K20101o4858Q5627K27288K11012J64751N5930J91705M06130
$$ 16868904 16857359 17077460 17012602 17098229 17325517 17536529 17701280 17757210 17948915 18355045
4789A8355045K52144L13593L93171M33323L19125N75436N80134L91637L49532
$$ 18355045 18607189 18920782 19313953 19747276 20066401 20641837 21221971 21613608 21963140
4780B1963140L08801K32410K66934L00201J59994L08154M05825L37415M74136
$$ 21963140 22271941 22504351 22771285 23071486 23231480 23539634 23945459 24282874 24757010
4771B4757010N56944M18342O62622O73152R52155J000550J029168P89980P81466
$$ 24757010 25313954 25732296 26394918 27068070 28020225 29020775 30049943 30839923 31621389
4762C1621389P48284N91317M37854M91761N27935P41385O19396P81490J119277
$$ 31621389 32369673 32960990 33398844 33890605 34418540 35159925 35779321 36560811 37680088
4753C7680088J081972J227769J255713J339655J572517J561229J651048J954753
$$ 37680088 38762060 39989829 41245542 42585197 44157714 45718943 47369991 49324744
4745D9324744J761671J836319J988817K233215K590824K981592L561372M093379
$$ 49324744 51086415 52922734 54911551 57144766 59735590 62717182 66278554 70371933
4737G0371933M899908N858587O675372Q160719R265082J0623478J1017683J0053858
$$ 70371933 75271841 81130428 87805800 95966519 105231601 115855079 126872762 136926620
4729A36926620P185415L040847n85466l036726l548725k573853j066184Q59951
$$ 136926620 144112035 147152882 146567416 143530690 139981965 137408112 136341928 137201879
4721A37201879K392756K799357K929547K554527K546188L310451N051632P625489
$$ 137201879 139594635 142393992 145323539 147878066 150424254 153734705 158786337 166411826
4713A66411826J0317913J3132768J2994119P624219P45465n582489j0007835j1381519
$$ 166411826 176729739 189862507 202856626 210480845 211226310 205643821 195635986 184254467
4705A84254467j0274702p881910n084906k357853Q653J69292j455183l105382
$$ 184254467 173979765 166097855 161012949 158655096 158663749 158833041 157377858 154272476
4697A54272476m698265n322863m639105l730136k086731q39001p51766j685675
$$ 154272476 149574211 144251348 139612243 135882107 133795376 132956375 132204609 130518934
4689A30518934l157511n129681o612892o838780o160163m982597l721735k389192
$$ 130518934 127361423 122231742 115618850 108780070 102619907 97637310 93915575 91526383
4681I1526383j281426o64688n25555m68130r16910j474297k156282k391197k261605
$$ 91526383 90244957 89580269 89054714 88586584 87669674 86195377 84039095 81647898 79386293
4672G9386293k069969k454297k375842k063894j642929j265034n02432j29322
$$ 79386293 77316324 74862027 72486185 70422291 68779362 67514328 67011896 66882574
4664F6882574L02886N65787P24709J127284J150293J020793J403194J134019M35323
$$ 66882574 67185460 67751247 68475956 69603240 70753533 71774326 73177520 74311539 74746862
4655G4746862o0472k49982m3371m9047L45718K92749O70302J010835J841860K368033
$$ 74746862 74686390 74436408 74393037 74343990 74689708 74982457 75652759 76663594 78505454 80873487
4645H0873487L087075L748167M677541N568760O469505P376367Q323410R572384
$$ 80873487 83960562 87708729 92386270 97955030 104424535 111800902 120124312 129696696
4637A29696696J0512527Q041831K495182k023631m223121m802476m188077j661099
$$ 129696696 140209223 148251054 150746236 148722605 144499484 139697008 135508931 133847832
4629A33847832J285199L467676K509036Q47441K85286J226303K339173L594759
$$ 133847832 135133031 138600707 141109743 141957184 142242470 143468773 145807946 149402705
4621A49402705L543802R06645k091193l864666m488364l393028l140613m448546
$$ 149402705 152946507 153853152 151761959 147897293 143408929 140015901 136875288 132426742
4613A32426742n533433n334341m319822l000169p17667J399932K940916J848448
$$ 132426742 126893309 121558968 117239146 114238977 113521310 114921242 117862158 119710606
4605A19710606k399560o348533q727689r741427r416334q119352o599797n272034
$$ 119710606 117311046 110962513 102234824 92493397 83077063 74957711 68357914 63085880
4597F3085880m277680l248164k712292k179755j610425r65035r23182j117907
$$ 63085880 58808200 55560036 52847744 50667989 49057564 48092529 47169347 46051440
4589D6051440r69781j018315j525975j964653j708597j478334j188050r01822
$$ 46051440 45081659 44063344 42537369 40572716 38864119 37385785 36197735 35295913
4581C5295913n02152k81639J09790K47782K50768Q39492R32148J049940J044456
$$ 35295913 34793761 34512122 34621912 34869694 35120462 35959954 36892102 37942042 38986498
4572C8986498J225983J242953M22573o30878j699932k191617k742895k737134
$$ 38986498 40212481 41455434 41878007 41247129 39547197 37355580 34612685 31875551
4564C1875551k405091j981166j664480r90117q68957o41901m67345k01467j92016
$$ 31875551 29470460 27489294 25824814 24834697 23965740 23323839 22856494 22655027 22463011
4555B2463011k51271j70437l21922o57856o69039p10716r37169j024756r85832
$$ 22463011 22211740 22041303 21719381 21061525 20392486 19681770 18744601 17719845 16734013
4546A6734013j026474o87900p31090o05032k79068m00722m35815k96177j04634
$$ 16734013 15707539 15019639 14288549 13683517 13404449 13003727 12567912 12271735 12167101
4537A2167101r7166k28731k37309m67462k65170k1428l13129l92703l93769k82351
$$ 12167101 12069935 11841204 11603895 11136433 10871263 10849835 10536706 10144003 9750234 9467883
4527I467883l29406j92187l10224j17937k59246k14188j62217o2145j82808k50768
$$ 9467883 9138477 8946290 8636066 8518129 8258883 8044695 7882478 7820333 7637525 7386757
4517G386757K0294n4271j3231j15958l04689j9623m505j13602j30189j19032j12716
$$ 7386757 7407051 7352780 7339549 7223591 6918902 6899279 6894774 6781172 6650983 6531951 6419235
4506F419235k57137j73077K8321j00371j03624j20779n4751j69432j59277J0262
$$ 6419235 6162098 5989021 6017342 5916971 5813347 5692568 5637817 5468385 5309108 5319370
4496E319370K7395l0578j25546n3618N221J16624q5022p4268J23118j44605j07212
$$ 5319370 5346765 5316187 5190641 5137023 5142244 5258868 5173846 5099578 5222696 5078091 4970879
4485D970879K2415p6928p4846q2479n5058o1712p871J11340r3155j86333J06326
$$ 4970879 4993294 4916366 4841520 4759041 4703983 4642271 4634400 4745740 4652585 4466252 4572578
4474D572578p1788o9056o7841r0852j33469M4719J08277O7943N1040M9503j7622
$$ 4572578 4500790 4431734 4363893 4273041 4139572 4184291 4292568 4360511 4411551 4461054 4443432
4463D443432p3467j9768N4229n9185l8511K9372j07640j21843j32418j32926j17785
$$ 4443432 4369965 4350197 4404426 4345241 4306730 4336102 4228462 4106619 3974201 3841275 3723490
4452C723490j29781j0754n2161m9866q9854J22159o2723r5393o9067J1872O3473
$$ 3723490 3593709 3582955 3530794 3480928 3391074 3513233 3450510 3355117 3286050 3297922 3361395
4441C361395j23246K8883k7440l5118P4325k05024k0814K8012j71415j99732R0386
$$ 3361395 3238149 3267032 3239592 3204474 3278799 3073775 3052961 3080973 2909558 2709826 2800212
4430B800212n1235r725K7541r7220J09744P8310j57550j03886Q6798L346N51o7385
$$ 2800212 2748977 2739252 2766793 2669573 2779317 2857627 2700077 2596191 2682989 2686335 2686886 2619501
4418B619501P0517L5239j13534K4919Q6085J16120j7629k39917k9469K681L487
$$ 2619501 2690018 2725257 2611723 2636642 2722727 2838847 2821218 2581301 2551832 2554513 2558000
4407B558000O6470K77428j25857k3066l0338p8388L129J03945O8791m6167L6163
$$ 2558000 2624470 2901898 2776041 2752975 2722637 2644249 2647378 2751323 2820114 2773947 2810110
4396B810110k0577m1363O0685K17579l4693n6185M3369R8322l7262N471O7638
$$ 2810110 2789533 2748170 2808855 3026434 2991741 2935556 2978925 3077247 3039985 3045456 3113094
4385C113094K4815R4925l1720K03758l6695P0641Q8300Q3056J20284J30142j27333
$$ 3113094 3137909 3232834 3201114 3404872 3368177 3438818 3527118 3610174 3730458 3860600 3733267
4374C733267R4454J59978O4077K80129J43752L04952J59668L21257M61679M37069
$$ 3733267 3827721 3987699 4051776 4331905 4475657 4780609 4940277 5261534 5723213 6160282
4364F160282O51512P41464M74792m7860j80799l29209n35865j93105l43925k69331
$$ 6160282 6811794 7553258 8028050 7980190 7799391 7470182 6934317 6741212 6397287 6127956
4354F127956P632K3415j7808J39471K61425J86523L78106M73179M54468O50749
$$ 6127956 6135588 6159003 6141195 6280666 6542091 6728614 7106720 7579899 8034367 8685116
4344H685116P34896J144427J190647J628245J798516J989228J615474K81462j171155
$$ 8685116 9420012 10564439 11755086 13383331 15181847 17171075 18786549 19068011 17896856
4335A7896856j898859k083142j770735j070189q11465q09254m95393m68972j92817
$$ 17896856 15997997 13914855 12144120 11073931 10262466 9453212 8957819 8488847 8296030
4326H296030n2106r4433k4020n9753K44176J51871N80608Q04271R91033J213151
$$ 8296030 8243924 8149491 8125471 8065718 8309894 8461765 9042373 9846644 10837677 12050828
4316A2050828J280832J380379J775900O88010n67522j470182j722555j720391
$$ 12050828 13331660 14712039 16487939 17175949 16608427 15138245 13415690 11695299
4308A1695299j357994q39914o30929o34221m65339m18128m02741k90982l4383
$$ 11695299 10337305 9497391 8866462 8232241 7766902 7348774 6946033 6655051 6620668
4299F620668p489p2198K2003J39819n386K06504M36646N08547N26317M30138L10486
$$ 6620668 6613179 6540981 6562984 6702803 6697417 6903921 7340567 7849114 8375431 8805569 9116055
4288I116055o0500l79807m56909m61327m87499l41258j87491j18476k87978m56414
$$ 9116055 9055555 8675748 8218839 7757512 7270013 6928755 6741264 6622788 6334810 5878396
4278E878396j24556k52217j75155k28916l150J3007k5326p1218J04515q627q5847
$$ 5878396 5753840 5501623 5326468 5097552 5094402 5107409 5082083 5010865 5115380 5106753 5020906
4267E020906R9150j7805p2312J15507J54239J94782J78991j5407K25340J19288
$$ 5020906 5120056 5102251 5029939 5145446 5299685 5494467 5673458 5658051 5883391 6002679
4257F002679J31295j6355k38458m2081o8282k65313o2202n772M0321j49735j15213
$$ 6002679 6133974 6117619 5879161 5837080 5768798 5503485 5441283 5435511 5475832 5326097 5210884
4246E210884n7955n439J11966L0466p8205J32927J58051J02196Q6018M5472n742
$$ 5210884 5152929 5147490 5259456 5289922 5211717 5344644 5502695 5604891 5690909 5736381 5730639
4235E730639K63318J56919J7336J54709N9218j7737K6084j0886j69103l4677P7134
$$ 5730639 5993957 6150876 6168212 6322921 6382139 6364402 6390486 6379600 6210497 6175820 6252954
4224F252954J09903l7051P8404K8859j5860J27447N5727Q0075K61206L04168R6673
$$ 6252954 6362857 6325806 6404210 6433069 6417209 6544656 6600383 6680458 6941664 7245832 7342505
4213G342505L58700M45357L46268L07510M17621M14351M84878M28243M99729M26238
$$ 7342505 7701205 8146562 8492830 8800340 9217961 9632312 10117190 10545433 11045162 11471400
4203A1471400N89095P97000P36342Q06029J375644J336931J811122J895838K838750
$$ 11471400 12060495 12857495 13593837 14399866 15775510 17112441 18923563 20819401 23658151
4194B3658151L318178L895719M559801O381585O091668j67194m368622n858064
$$ 23658151 26976329 30872048 35431849 41813434 47905102 47737908 43369286 37511222
4186C7511222o029374m428025k953312k089663j619760j161207r34176n53094
$$ 37511222 31481848 27053823 24100511 22010848 20391088 19229881 18295705 17742611
4178A7742611l23072l11467n04547m25898k86259R3667K56309M16182M82221M05388
$$ 17742611 17419539 17108072 16603525 16177627 15891368 15985035 16241344 16657526 17139747 17545135
4168A7545135k9858j33480l22171k3786J30146M03843L51102N27039L95616N19079
$$ 17545135 17515277 17381797 17059626 17035840 17165986 17569829 17920931 18447970 18843586 19362665
4158A9362665M42045N58593N92197P77572R40098P57673J293948J480414J064538
$$ 19362665 19804710 20363303 20955500 21733072 22673170 23430843 24724791 26205205 27269743
4149B7269743J027201Q32820J174381J151498J550615J767355K333995K401718
$$ 27269743 28296944 29129764 30304145 31455643 33006258 34773613 37107608 39509326
4141C9509326K515479K811934M028671M473004M795205N477905O584201M108693
$$ 39509326 42024805 44836739 48865410 53338414 58133619 63611524 70195725 74304418
4133G4304418n7060k176513k906836k281449p65391L42810J374172J927560K380354
$$ 74304418 74247358 72070845 69164009 66882560 66117169 66459979 67834151 69761711 72142065
4124G2142065K782300L178802L442541L438384K929662L097237L662952M808320
$$ 72142065 74924365 78103167 81545708 84984092 87913754 91010991 94673943 99482263
4116I9482263O408903Q471806J0475934J2366197J4870407J8193105K2894664
$$ 99482263 105891166 114362972 124838906 137205103 152075510 170268615 193163279
4109A93163279L0051008L9321770M7519733N6737343P6686553Q0153802R322457
$$ 193163279 223214287 262536057 310055790 366793133 443479686 523633488 532955945
4102E32955945n0357480p7085387p9210908o0140395m2812711l0322028k4047768
$$ 532955945 482598465 405513078 326302170 266161775 223349064 193027036 168979268
4095A68979268k0004018j7249900j3420460j1447774r529097q736669p473201
$$ 168979268 148975250 131725350 118304890 106857116 97328019 88591350 81118149
4088H1118149o391125n015980m259943l600949l129099k327609k038381j373474
$$ 81118149 74727024 69711044 65451101 61850152 58721053 56393444 54355063 52981589
4080E2981589j072950p13379m06549K08202L36776R35585J266436J576845j395140
$$ 52981589 51908639 51195260 50788711 50996913 51333689 52269274 53535710 55112555 53717415
4071E3717415l869925m760793m340871l402430k606873j985568j599865j587426
$$ 53717415 49847490 45086697 40745826 37343396 34736523 32750955 31151090 29563664
4063B9563664j498376j322778j314190j204951j201294j030752r19793q99219
$$ 29563664 28065288 26742510 25428320 24223369 23022075 21991323 21071530 20172311
4055B0172311n80009n07146n11935n04022l63398n63107j73263l81443k76352
$$ 20172311 19592302 19085156 18573221 18069199 17705801 17142694 16969431 16587988 16311636
4046A6311636k56212j98286j66468L6189o2462L2235j20832l1804j00196K6272
$$ 16311636 16055424 15857138 15690670 15726859 15664397 15696632 15575800 15543996 15443800 15470072
4036A5470072L7367J7511j07790K18021K34645L02413P21747P33915N16057O32981
$$ 15470072 15507439 15524950 15417160 15635181 15869826 16172239 16893986 17627901 18143958 18776939
4026A8776939P54847R71489J592691K395033K714823L621025M712425M859916
$$ 18776939 19531786 20503275 22095966 24490999 27205822 30826847 35539272 40399188
4018D0399188l79076l760963n454057n141367l791155k861213k068343j549190
$$ 40399188 40020112 36259149 30805092 25663725 21872570 19011357 16943014 15393824
4010A5393824j532575j195474q42194p85502o87772m90822n53316m77286l74172
$$ 15393824 13861249 12665775 11823581 11038079 10350307 9859485 9306169 8828883 8454711
4001H454711l57560l52028l03161k31619j93231k54123k10333o4188l52460j85207
$$ 8454711 8097151 7745123 7441962 7210343 7017112 6762989 6552656 6488468 6136008 5950801
3991E950801j50977j49494o6042k6263k98824j86718j11667j96511j77314k45329
$$ 5950801 5799824 5650330 5584288 5558025 5259201 5072483 4960816 4764305 4586991 4341662
3981D341662O2108j36621r5079j68693k56362j29445k4067O009k11949j07503
$$ 4341662 4403770 4267149 4172070 4003377 3747015 3617570 3593503 3599512 3387563 3280060
3971C280060j49948r0174p7959j41798j10083P084j73959j57523j91507J5043
$$ 3280060 3130112 3039938 2961979 2820181 2710098 2717182 2543223 2385700 2194193 2209236
3961B209236J05832k6915q1471q7341J19597J28267k09866M8831L8509l21q9156
$$ 2209236 2315068 2288153 2206682 2119341 2238938 2367205 2157339 2206170 2244679 2244358 2155202
3950B155202N6573j10312M8050j45568J32495R1323k64967r5473k4240M1584j4115
$$ 2155202 2211775 2101463 2149513 2003945 2136440 2227763 1962796 1867323 1843083 1884667 1870552
3939A870552j10087j62205o8992j1567j8135o7094l8105J04900l5219l0939j68484
$$ 1870552 1760465 1598260 1529268 1517701 1499566 1432472 1394367 1499267 1464048 1433109 1264625
3928A264625J1957J38759k7062j8820j15965k9249J62586j18396o7846l2603Q693
$$ 1264625 1276582 1415341 1388279 1369459 1253494 1224245 1386831 1268435 1200589 1167986 1176679
3917A176679K3450K0802p2785J37897R6649j29240j64834J13507j2006J43K1303
$$ 1176679 1200129 1220931 1148146 1286043 1382692 1253452 1088618 1202125 1190119 1190262 1211565
3906A211565k886l319O4667j50310J31832M4038M8776j16850M6390J00968N7002
$$ 1211565 1208679 1205360 1270027 1119717 1251549 1295587 1344363 1227513 1273903 1374871 1431873
3895A431873q4352n2094j39553R7835j4407n8758J04507r2877k36263j5938J80273
$$ 1431873 1347521 1295427 1155874 1253709 1239302 1180544 1285051 1192174 955911 939973 1120246
3884A120246J10877l9956j2505j16828Q939l0675K1483J14514J25914l1549J40787
$$ 1120246 1231123 1191167 1178662 1061834 1070773 1040098 1061581 1176095 1302009 1270460 1411247
3873A411247L44184R0487J15911Q7312L14525L37129K33848L80359J4725l68524
$$ 1411247 1755431 1845918 1961829 2049141 2363666 2700795 2934643 3315002 3329727 2961203
3863B961203l92080m29431l57105k70842j33065j53260j84529j8884n9732j15216
$$ 2961203 2569123 2139692 1782587 1511745 1378680 1225420 1040891 1022007 962275 847059
3853H47059J8148j5621J26582k09423j70472L5859J12000j13180n322M7858l2421
$$ 847059 865207 849586 976168 766745 596273 632132 744132 630952 625630 673488 641067
3842F41067Q7317M3518j7969o7563M6167N4472J0663K0944n8624p8940n8636p1912
$$ 641067 728384 771902 753933 686370 732537 787009 797672 818616 759992 681052 622416 550504
3830E50504r1820r995J27476N1561O1128m8552q6086r048j22651q393m8567J47495
$$ 550504 458684 448689 576165 627726 688854 640302 554216 545168 422517 414124 365557 513052
3818E13052k4948p4795r1735J2016J50286K7650k09022J09950o0764j19374J9108
$$ 513052 488104 413309 321574 333590 483876 511526 302504 412454 351690 232316 251424
3807B51424J25292J10966j12175o7106m43M7591n0186N363J47794p0975K2667
$$ 251424 376716 487682 375507 308401 307958 355549 305363 310726 458520 387545 410212
3796D10212J7596M2689k1114p6694J18683j8013P8984O3073k03354j02010J0595
$$ 410212 427808 470497 449383 372689 491372 473359 552343 615416 412062 310052 320647
3785C20647R3057L3489j56523J41552j6992k2927J60876j64690m3693m7028R8424
$$ 320647 413704 447193 290670 432222 415230 392303 553179 388489 344796 297768 396192
3774C96192j2709Q6816r4548n3454j39208J45814j6011m529J5653j2989j28445
$$ 396192 383483 470299 375751 322297 183089 328903 312892 308363 324016 311027 182582
3763A82582J05669J02979p8384J2315J01801j65003K7780P065P9524j88619N8208
$$ 182582 288251 391230 312846 325161 426962 261959 289739 296804 376328 187709 245917
3752B45917J80836j98933J4968P6087j1863j75613q0551j0473J45483r477m6109
$$ 245917 426753 227820 242788 318875 307012 131399 50848 40375 185858 176381 130272
3741A30272Q7850J08069p3863l8344j5748n3m4637k7683j9078q4599J18716J17533
$$ 130272 218122 326191 252328 213984 198236 198183 153546 125863 106785 22186 140902 258435
3729B58435m6261r3421J6479K03971j72515J18760Q8065P3790r8221k0470j11755
$$ 258435 212174 118753 135232 339203 166688 285448 373513 447303 349082 328612 216857
3718B16857o8238Q7514J30042L0841K1569L0924o8149o3089j15775j86026O3593
$$ 216857 148619 236133 366175 397016 418585 449509 381360 318271 202496 16470 80063
3707H0063K67567N2656p7887M6790r3206j57170J07571J08645Q1521L9349l2561
$$ 80063 347630 400286 322399 369189 275983 118813 226384 335029 416550 455899 423338
3696D23338l4693m2545k5417k3029O3289j47659J2494P4415K78908m8716j88733
$$ 423338 388645 346100 320683 297654 360943 213284 225778 300193 579101 530385 341652
3685C41652K3095Q6352K5629j51043K4621N1831J5973K0642m1834p957j78096
$$ 341652 364747 451099 476728 325685 350306 402137 418110 438752 396918 388961 210865
3674B10865P6344j5541R2134J18044n5133N9025m9505m0784J03242m2771n3473
$$ 210865 287209 271668 363802 481846 426713 485738 436233 395449 498691 455920 402447
3663D02447J62576N6330j17305J9205Q7535m6195o9727L5737Q5944J319O5466
$$ 402447 565023 621353 504048 523253 610788 564593 494866 530603 616547 617866 683332
3652F83332J9224K10803j19695j0576J57823o4852k20526p3678K06562k1736r4807
$$ 683332 702556 913359 793664 783088 940911 876059 655533 581855 788417 766681 671874
3641F71874l1533m3630r4965J6067J48964o3828j2180j79188J4437n085K3238
$$ 671874 640341 596711 501746 517813 666777 602949 590769 411581 426018 420933 444171
3630D44171J17303q1476l3515j37945k3316K8109J42669n7908Q19l115j8372N5155
$$ 444171 561474 479998 446483 308538 285222 313331 456000 398092 398911 395796 377424 432579
3618D32579k0884n1716J9384j8182J02113l7165q4406P6083N6127k1210J91623
$$ 432579 411695 359979 379363 361181 463294 426129 341723 417806 473933 452723 644346
3607F44346j6792j21524N7956O5406l2807l3557k6902o2668M3139N2108L2505
$$ 644346 627554 506030 563986 629392 596585 563028 536126 473458 516597 568705 601210
3596F01210l1419J00270J9822M2169o4454Q3965k7219j85988P2573J44947k8281
$$ 601210 569791 670061 689883 732052 667598 751563 724344 538356 610929 755876 727595
3585G27595J58950K8728o8724J56108n7138l2830n4008J83111k5525l6852O196
$$ 727595 886545 915273 846549 1002657 945519 912689 858681 1041792 1016267 979415 985611
3574I85611J05232p9336k1467k11562l9734O5491j19888K47634J05057j2625r8275
$$ 985611 1090843 1011507 990040 778478 738744 804235 684347 931981 1037038 1024413 926138
3563I26138j181Q4266J09756l2447L586J3044Q613j13804K9572j49011P323J30958
$$ 926138 924957 1009223 1118979 1086532 1090118 1103162 1111775 997971 1027543 878532 885855 1016813
3551A016813j6439Q6162n420N2361p1023o660Q6379N9125J70692j43665L6238
$$ 1016813 1000374 1086536 1081116 1133477 1062454 1055794 1142173 1201298 1371990 1228325 1264563
3540A264563j08175r1453K8998L4210l6174M6659J53528R3152K7117q5907J05031
$$ 1264563 1156388 1064935 1093933 1128143 1091969 1138628 1292156 1385308 1412425 1326518 1431549
3529A431549N0738j4803J08691j6241n1710J76954J5349j95198J85745o6193M6561
$$ 1431549 1482287 1467484 1576175 1559934 1508224 1685178 1700527 1505329 1691074 1624881 1671442
3518A671442Q194j5034M0213P7538m2835J60876J51014k2180k0881K2185J8313
$$ 1671442 1679636 1664602 1704815 1782353 1739518 1900394 2051408 2029228 2008347 2030532 2048845
3507B048845J05525k748n5130J73569j4212K6723J56053J31850k8969o6992N8328
$$ 2048845 2154370 2151622 2096492 2270061 2255849 2282572 2438625 2570475 2541506 2474514 2532842
3496B532842R9920j98227R4785K11018m3878j86984O8575J30048M0556N6223M1217
$$ 2532842 2632762 2434535 2529320 2740338 2696460 2509476 2578051 2708099 2748655 2804878 2846095
3485B846095q526J06695O0579K0463N3014o4530O1247o2632J78095Q0103n930
$$ 2846095 2837569 2944264 3004843 3025306 3078320 3013790 3075037 3012405 3190500 3270603 3264673
3474C264673R0879J4471M6233J05473l7261p0355K25260P105q9931n6411J97891
$$ 3264673 3355552 3370023 3416256 3521729 3484468 3414113 3639373 3646478 3556547 3500136 3698027
3463C698027J05757n7063J89185l1996r0146M3377P6480P7918J79379r5989P6497
$$ 3698027 3803784 3746721 3935906 3903910 3813764 3857141 3933621 4011539 4190918 4094929 4171426
3452D171426P2897j21101J82133J02924j25660M1253K4656K0338Q8547j40616
$$ 4171426 4244323 4123222 4305355 4408279 4282619 4323872 4348528 4368866 4457413 4316797
3442D316797j3568P0625k8624n7466O4889R5096R7277l5764K31977m1167j15797
$$ 4316797 4303229 4373854 4345230 4287764 4352653 4447749 4545026 4509262 4741239 4700072 4584275
3431D584275m5136J72707n1355m2509M6922r9170n4948M0069p3495J32329j1827
$$ 4584275 4539139 4711846 4660491 4617982 4664904 4565734 4510786 4550855 4477360 4609689 4597862
3420D597862k552o7139L8003m5393j42695J36982p0670l1333m8088N3362k085
$$ 4597862 4595310 4528171 4566174 4520781 4378086 4515068 4444398 4413065 4364977 4418339 4416254
3409D416254N524j21238p1579P3951P7118m3241j61347k120N6097j10858J34974
$$ 4416254 4421778 4300540 4228961 4302912 4380030 4336789 4175442 4173322 4229419 4118561 4253535
3398D253535o5379P8927r9019J47787n2732j24029N5222l6127j19068o4521R1106
$$ 4253535 4188156 4267083 4168064 4315851 4263119 4139090 4194312 4158185 4039117 3974596 4065702
3387D065702J3518o777j44697J80774o7477q693k25254M3168R2233j66058M1888
$$ 4065702 4079220 4072443 3927746 4108520 4041043 4032350 3807096 3850264 3942497 3776439 3818327
3376C818327J31307n576R603O7521k11393r2505L1246j20351L8546L0461J30710
$$ 3818327 3949634 3944058 3953661 4021182 3809789 3717284 3748530 3628179 3666725 3697186 3827896
3365C827896J9524M7126j84957J4134l5980m4986P2369m5346n0690o85J07206
$$ 3827896 3847420 3894546 3709589 3723723 3687743 3642757 3715126 3669780 3619090 3618405 3725611
3354C725611k389l7521j32618k7804L4487L8443o6364P939J6919Q9837m6949l7166
$$ 3725611 3723222 3685701 3553083 3525279 3559766 3598209 3531845 3539784 3556703 3646540 3599591 3562425
3342C562425L1125L5670O9162L1323m7025m3757K8414K7690K7450K958Q9610j06823
$$ 3562425 3593550 3629220 3698382 3729705 3682680 3638923 3667337 3695027 3722477 3725435 3815045 3708222
3330C708222M687R0527Q9583n0032k2335K3991O2030l8837l0557Q5657m3083J05681
$$ 3708222 3712909 3803436 3893019 3842987 3820652 3844643 3906673 3867836 3837279 3922936 3879853 3985534
3318C985534J23987Q937q2472J13185q039j33674J17975J44449J64734q5337M487
$$ 3985534 4109521 4118458 4035986 4149171 4141132 4007458 4125433 4269882 4434616 4349279 4353766
3307D353766J38100m9544l3215J45037J14065Q380M8447L0729J16833p6643R6435
$$ 4353766 4491866 4442322 4409107 4554144 4668209 4676589 4725036 4755765 4872598 4795955 4892390
3296D892390J23089R7604J4315L7906q3558j5072N9500R7708Q6214M1869n4168
$$ 4892390 5015479 5113083 5127398 5165304 5081746 5066674 5126174 5223882 5310096 5351965 5297797
3285E297797N4402j32112o226N8866R9056R676N9624J32969O9251m0474j85069
$$ 5297797 5352199 5220087 5213861 5272727 5371783 5381459 5441083 5574052 5643303 5602829 5417760
3274E417760K4146J52379P2941p6518l3367K647N678p4242L9494P4061M8207L1314
$$ 5417760 5441906 5594285 5667226 5590708 5557341 5559988 5565666 5491424 5530918 5604979 5653186 5684500
3262E684500m4095j06773M8520J83758p1834o2162J1504n4157J38046L8185K9539
$$ 5684500 5640405 5533632 5582152 5765910 5694076 5631914 5643418 5589261 5727307 5765492 5795031
3251E795031K25769q1703l648O239J29027j50576O3689R5295n7873r2331L7543
$$ 5795031 6020800 5939097 5935449 5941688 6070715 5920139 5983828 6079123 6021250 5928919 5966462
3240E966462j2990l0532Q2978l7502j1998j12032J60938M9832p1273L386J39202
$$ 5966462 5953472 5922940 6005918 5968416 5956418 5844386 6005324 6055156 5983883 5987269 6126471
3229F126471J35462J70127j74789n9607P9932p286j6633J0781K23776N3058n9728
$$ 6126471 6261933 6432060 6257271 6197664 6277596 6270310 6253677 6264458 6488234 6541292 6481564
3218F481564r7426J7629M9057j5020J38133n0006M9428L4059J4968N1290j6366
$$ 6481564 6384138 6401767 6450824 6435804 6573937 6523931 6573359 6607418 6622386 6673676 6657310
3207F657310o324L5767J41439N2813M8678Q9020O4014L6193l3672J98151J75995
$$ 6657310 6650986 6686753 6828192 6881005 6929683 7018703 7082717 7118910 7085238 7283389 7459384
3196G459384j40540R6761N3346l0530k2952m4178J1986J39354l1657M1236R6611
$$ 7459384 7318844 7415605 7468951 7438421 7415469 7371291 7383277 7522631 7490974 7532210 7628821
3185G628821k3549J31165K09371Q3986p7192J36793Q555J65652K2118k1241n3424
$$ 7628821 7605272 7736437 7945808 8029794 7952602 8089395 8097950 8263602 8285720 8264479 8211055
3174H211055M1149K0356J03053m1273o2028j5348m8044J19512l7801L0998N062
$$ 8211055 8252204 8272560 8375613 8334340 8272312 8256964 8208920 8328432 8290631 8321629 8326691
3163H326691n0536N2497J36183K23537j30881Q9737Q1472k3822J368M8823L2506
$$ 8326691 8276155 8328652 8464835 8688372 8557491 8647228 8728700 8704878 8706246 8755069 8787575
3152H787575j38180J00274P9753o1080l7611j21101J90716m8222j5922k5981j90869
$$ 8787575 8649395 8749669 8829422 8768342 8730731 8609630 8800346 8752124 8736202 8710221 8519352
3141H519352Q4428N2199J17478R3959j19556N9984R763k2751O1267R2776J4290
$$ 8519352 8603780 8655979 8773457 8867416 8747860 8807844 8817607 8794856 8856123 8948899 8963189
3130H963189J18583M8731m0419p811j89475K11735N6791k40712M4745P2029K1075
$$ 8963189 9081772 9130503 9090084 9082273 8892798 9104533 9161324 8920612 8965357 9037386 9058461
3119I058461J43556l1249j3511J07521n1620N5505j6040J56508J64173q3291J15220
$$ 9058461 9202017 9170768 9157257 9264778 9213158 9268663 9252623 9409131 9573304 9490013 9605233
3108I605233J12673J83263k5954k6435R4051L2593J24667M8412K6920K1137O4137
$$ 9605233 9717906 9901169 9875215 9848780 9942831 9975424 10100091 10148503 10175423 10196560 10260697
3097A0260697K14174j0144J20756R4928J20680M3557K62968K78376K53033R4465
$$ 10260697 10474871 10464727 10585483 10680411 10801091 10844648 11107616 11385992 11639025 11733490
3087A1733490L00273K11123J40805K28646J04557J5536K294J06658R0157R8461
$$ 11733490 12033763 12244886 12385691 12614337 12718894 12734430 12736724 12843382 12933539 13032000
3077A3032000K10092L1423K34987K24278K77706K43130K7275K83019M10105K50031
$$ 13032000 13242092 13273515 13508502 13732780 14010486 14253616 14280891 14563910 14974015 15224046
3067A5224046K61274M85167N25771L59573K29097K89791J68592K56287K37267
$$ 15224046 15485320 15970487 16496258 16855831 17084928 17374719 17543311 17799598 18036865
3058A8036865K37451J45271j33754K04699O3583K62275L65698J25668M48726L36994
$$ 18036865 18274316 18419587 18285833 18490532 18554115 18816390 19182088 19307756 19756482 20093476
3048B0093476K99072L49299M54207M28777N61000M72646N63773N91357P43058
$$ 20093476 20392548 20741847 21196054 21624831 22185831 22658477 23222250 23813607 24556665
3039B4556665N58714N38727O75188N50751N79507M60440N05253P23492P70214
$$ 24556665 25115379 25654106 26329294 26880045 27459552 27919992 28425245 29148737 29918951
3030B9918951L02384N93292P18969M90242O88761Q22775P77968R47346Q70858
$$ 29918951 30221335 30814627 31533596 32023838 32712599 33535374 34313342 35260688 36131546
3021C6131546J034475J057947Q90194J149213J332561J366144J400364J169511
$$ 36131546 37166021 38223968 39114162 40263375 41595936 42962080 44362444 45531955
3013D5531955J388248J477109J251342J399956J474035J565956J324175J475661
$$ 45531955 46920203 48397312 49648654 51048610 52522645 54088601 55412776 56888437
3005E6888437J466135J441600J605948J916954J771548J959696K191367K090550
$$ 56888437 58354572 59796172 61402120 63319074 65090622 67050318 69241685 71332235
2997G1332235K333618K408984K608079K968291K880413L361402L498373L756901
$$ 71332235 73665853 76074837 78682916 81651207 84531620 87893022 91391395 95148296
2989I5148296M333495M939547N463245N946313O736329P404605Q098392Q383247
$$ 95148296 99481791 104421338 109884583 115830896 122567225 129971830 138070222 146453469
2981A46453469Q657534Q566846Q482755P756821O206921L990358P08647l363613
$$ 146453469 155111003 163677849 172160604 179917425 186124346 190114704 190823351 187459738
2973A87459738o682626q513189q892745q490791p670192o738300o021019n287959
$$ 187459738 180777112 172263923 163371178 154880387 147210195 140471895 134450876 129162917
2965A29162917n141518m316011l835483l627173l120699k741276k605068k372854
$$ 129162917 124021399 119705388 115869905 112242732 109122033 106380757 103775689 101402835
2957A01402835k249618j938842j645390j274065r40112p08399l74624q1307l78149
$$ 101402835 99153217 97214375 95568985 94294920 93354808 92646409 92271785 92190478 91812329
2948I1812329j582440l042937l776860l594906l121765k859990k614938k268666
$$ 91812329 90229889 87186952 83410092 79815186 76693421 73833431 71218493 68949827
2940F8949827k177466j905685j472525j184159j002193r44882o53853k96750k46935
$$ 68949827 66772361 64866676 63394151 62209992 61207799 60262917 59609064 59312314 59065379
2931E9065379Q3565N79097R53191J439075J896735K795159K702553L37505k698542
$$ 59065379 59148944 59728041 60681232 62120307 64017042 66812201 69514754 69852259 67153717
2922F7153717m378213m441884l912541l159523k515296j947472j603921j593125
$$ 67153717 62775504 58333620 54421079 51261556 48746260 46798788 45194867 43601742
2914D3601742j290803q50900q14525p59098n88894k60803l38945l8555P6915J33877
$$ 43601742 42310939 41460039 40645514 39886416 39297522 39036719 38697774 38659219 38736134 38870011
2904C8870011M23013R26680J000494J146539J35480j136988k027623k401709k232520
$$ 38870011 39293024 40219704 41220198 42366737 42502217 41365229 39337606 36935897 34703377
2895C4703377j711009j313384j129094r74550p23697q08652o75910m77768o26565
$$ 34703377 32992368 31678984 30549890 29575340 28851643 28042991 27367081 26889313 26262748
2886B6262748o58863n29693l11485k96832l71288k91828l82713k77365j55804
$$ 26262748 25603885 25074192 24762707 24465875 24094587 23802759 23420046 23142681 22986877
2877B2986877k45436l13017l48432j99203k81367k45098j47709k34521k24346
$$ 22986877 22741441 22428424 22079992 21880789 21599422 21354324 21206615 20972094 20747748
2868B0747748j64335m01196r348j81828j18675l24481r7136n4731q5822r9299
$$ 20747748 20583413 20182217 20172869 19991041 19872366 19547885 19450749 19396018 19310196 19210897
2858A9210897k20292o0321k38424n4631j66638j56010m02809j58932n5327p9533
$$ 19210897 18990605 18930284 18691860 18637229 18470591 18314581 17911772 17752840 17697513 17617980
2848A7617980j75266k77333j13893k92983j63595k43083j24132j81985k31934
$$ 17617980 17442714 17165381 17051488 16758505 16594910 16351827 16227695 16045710 15813776
2839A5813776r4445j13097q7637l25728o7219o6233k73184K7800k59652r2186
$$ 15813776 15719331 15606234 15518597 15192869 15125650 15059417 14786233 14814033 14554381 14462195
2829A4462195q0901j28915r6557j32214k09621q0573j77282n9071k61932n1454
$$ 14462195 14381294 14252379 14155822 14023608 13813987 13733414 13556132 13497061 13235129 13183675
2819A3183675k3964j40722n1062k58891r9320j41475p2070p4099j40507n1752
$$ 13183675 13159711 13018989 12967927 12709036 12609716 12468241 12396171 12322072 12181565 12129813
2809A2129813J46380k4011j0132l2664J6558J23190K11840n8667j40023K7803
$$ 12129813 12276193 12252182 12242050 12209386 12225944 12349134 12560974 12502307 12362284 12390087
2799A2390087l9200N640J79805M752K9395J15198o1164K87583J51370J09005J12849
$$ 12390087 12350887 12356527 12536332 12541084 12570479 12685677 12624513 12912096 13063466 13172471 13285320
2788A3285320K64306K36653K25546L53243J85989K66245J72843K81832N32391
$$ 13285320 13549626 13786279 14011825 14365068 14551057 14817302 14990145 15271977 15804368
2779A5804368L79133N15478N71933L56080L15579J01562k8303J13235M5521L25596
$$ 15804368 16183501 16698979 17270912 17626992 17942571 18044133 18015830 18129065 18174586 18500182
2769A8500182M31282L5706L78844Q13212N12523K39567L05041M10242K85159N51991
$$ 18500182 18931464 18967170 19346014 20159226 20671749 20911316 21216357 21626599 21911758 22463749
2759B2463749O88574N65482Q70982Q36055R31822J019646J244553J156844J296482
$$ 22463749 23152323 23717805 24588787 25424842 26356664 27376310 28620863 29777707 31074189
2750C1074189J016118P06049R34840Q71361J173367J163151J526072J704463J662588
$$ 31074189 32090307 32796356 33731196 34602557 35775924 36939075 38465147 40169610 41832198
2741D1832198J412062J148571R19945M72558N94567L23039M89572P38959Q43246
$$ 41832198 43244260 44392831 45312776 45785334 46379901 46702940 47192512 47931471 48774717
2732D8774717R33543J178832J255292J518279J732714J934859K044383K118650
$$ 48774717 49708260 50887092 52142384 53660663 55393377 57328236 59372619 61491269
2724F1491269K344170K700528K941968L019496L054058K474305J052510j185780
$$ 61491269 63835439 66535967 69477935 72497431 75551489 78025794 79078304 77892524
2716G7892524k405026k827561k762272k109146j610460j026116k94809J65325
$$ 77892524 75487498 72659937 69897665 67788519 66178059 65151943 64857134 65022459
2708F5022459L86211Q14607Q70862J099238J115266J082704J079109J037811N80789
$$ 65022459 65408670 66223277 67094139 68193377 69308643 70391347 71470456 72508267 73089056
2699G3089056L23631k42217j136529j256983j757716k126213k542346k798333
$$ 73089056 73412687 73170470 72033941 70776958 69019242 66893029 64350683 61552350
2691F1552350k434950k017591j583369j214077j037981o60553m97946n66971m98849
$$ 61552350 59117400 57099809 55516440 54302363 53264382 52603829 52105883 51538912 51040063
2682E1040063p39723r97205j202222j344125j633967j945700k053299k247840
$$ 51040063 50300340 49303135 48100913 46756788 45122821 43177121 41123822 38875982
2674C8875982k070373j873255j872951j591576j314458j163338j230660j099183
$$ 38875982 36805609 34932354 33059403 31467827 30153369 28990031 27759371 26660188
2666B6660188j030565r44979o50964q17588p17252o96464o93916o78591o71243
$$ 26660188 25629623 24684644 24033680 23216092 22498840 21802376 21108460 20429869 19758626
2657A9758626o52285o70484n73389o98689o54538n10381n47539n44440m36493
$$ 19758626 19106341 18435857 17862468 17163779 16509241 15998860 15451321 14906881 14470388
2648A4470388n45394l83523n09154m79258k80264k15017l56686l52621k51904
$$ 14470388 13924994 13541471 13032317 12553059 12272795 12057778 11701092 11348471 11096567
2639A1096567k86778r3504k44565k43683k93955j11193q5897k82885k34397k25660
$$ 11096567 10809789 10716285 10471720 10228037 9934082 9822889 9736992 9454107 9219710 8994050
2629H994050j21192j94306k12335k64001k15901k94489k59507k02358j61010j68668
$$ 8994050 8872858 8678552 8466217 8202216 7986315 7691826 7432319 7229961 7068951 6900283
2619F900283k24185m670j71605j76278j32305k6354k44033J5811k24815n1617
$$ 6900283 6676098 6671428 6499823 6323545 6191240 6164886 5920853 5936664 5711849 5660232
2609E660232l3488j89687k96503j91936m8772O3559j99454k04283j10562K2986
$$ 5660232 5626744 5437057 5140554 4948618 4899846 4963405 4763951 4559668 4449106 4472092
2599D472092j08891k20418q2637n0180k2677k36716J0789q2305j05092q929p3057
$$ 4472092 4363201 4142783 4060146 4009966 3987289 3750573 3761362 3679057 3573965 3565036 3491979
2588C491979j97622n4494J7286j24973O2863j82462l4572q8413p9010J22705j07096
$$ 3491979 3294357 3239863 3257149 3132176 3195039 3012577 2978005 2889592 2810582 2933287 2826191
2577B826191j46572j3540m669j2788j80325j21093O6103m9520K6180L9156N8930
$$ 2826191 2679619 2666079 2661410 2648622 2468297 2347204 2413307 2363787 2389967 2429123 2488053
2566B488053j45084K3726j70768j14469O4301k7688L8827P9653k3847k17324m5402
$$ 2488053 2342969 2366695 2195927 2081458 2145759 2118071 2156898 2236551 2212704 1995380 1949978
2555A949978k497J29985P7521j82748L1512j41270Q2145r472O125O398k2062j06953
$$ 1949978 1947481 2077466 2154987 1972239 2003751 1862481 1944626 1935154 1941279 1947677 1925615 1818662
2543A818662l1165J07350j16348o973k4847N2839R7497j82616m9137m631o9919
$$ 1818662 1787497 1894847 1778499 1771526 1746679 1799518 1897015 1714399 1665262 1660631 1590712
2532A590712J27948n1777j35432R4844M6815p4110l3822j08033L6417N7696o9337
$$ 1590712 1718660 1666883 1531451 1626295 1673110 1599000 1565178 1457145 1493562 1551258 1481921
2521A481921M7272O278L3263j66101J27334n5269k3556K4807O4290J46227L3496
$$ 1481921 1529193 1535471 1568734 1402633 1529967 1474698 1451142 1475949 1540239 1686466 1719962
2510A719962j30940p2520o2035l8375M6956o574K3000O5105k00737j58489j18825
$$ 1719962 1589022 1516502 1454467 1416092 1463048 1456474 1479474 1544579 1343842 1185353 1066528
2499A066528J92588M5549J9421j5142k3041K3643N8760j26910k7505K6880J0121
$$ 1066528 1259116 1304665 1324086 1308944 1285903 1309546 1368306 1241396 1213891 1240771 1250892
2488A250892L4262m2049k7075j62986L9896L1206J14377l2005L7422j76345l7867
$$ 1250892 1285154 1243105 1216030 1053044 1092940 1124146 1238523 1206518 1243940 1067595 1029728
2477A029728Q9984p2150k3511R7102j05919n7482K9601r3610l7981Q1397j6463
$$ 1029728 1119712 1047562 1024051 1121153 1015234 957752 987353 893743 855762 937159 920696
2466I20696J5941k05488R1885k1795Q8098n7056J8136p3855o1944k7508M7981
$$ 920696 936637 731149 823034 801239 889337 832281 850417 776562 714618 687110 735091
2455G35091R140j38824P420q7015J10975J38389m8708j18854k8822J28557j2896
$$ 735091 744231 605407 612827 525812 636787 775176 726468 607614 578792 707349 694453
2444F94453p2948L8358R9824j44751k6696k0461m6121Q9115j28405M0420p186
$$ 694453 621505 659863 759687 614936 588240 567779 521658 610773 482368 522788 515602
2433E15602j00716k3208L3598M7849L7878N0739p536q3060l000n7450L6865j1725
$$ 515602 414886 391678 425276 473125 511003 561742 554206 471146 468146 410696 447561 435836
2421D35836j51978Q6414L0318l8847M8014J1637M4451j26073J4632Q9412k46688
$$ 435836 283858 370272 400590 361743 409757 421394 465845 339772 354404 443816 197128
2410A97128L5048L3972N0589Q2759n0280N5128N6801k4466m7929r4178q53J44667
$$ 197128 232176 266148 316737 399496 349216 404344 461145 436679 388750 294572 293719 438386
2398D38386j46695j03038O2873o6282Q1475Q5094j20449j6942J02113k20688m3363
$$ 438386 291691 188653 251526 185244 266719 351813 231364 214422 316535 95847 52484
2387E2484K15637k9879p9064k7593q6398L2702N0695J09165J44716K3408j01650
$$ 52484 268121 238242 159178 131585 45187 77889 128584 237749 382465 405873 304223
2376C04223r6415Q8211L6140j46697Q2946j3814k04114m2274K34975P740l0958
$$ 304223 207808 296019 332159 185462 268408 254594 50480 8206 243181 250921 219963
2365B19963j3313q2745K0965m3445j6816m8531R7110m8944P8199j84566r280K30079
$$ 219963 206650 123905 144870 101425 84609 36078 133188 84244 162443 -22123 -31403 198676
2353A98676j74385q5498Q9841P1701j9653q7666P7646p5974J34172l7606o2377
$$ 198676 24291 -61207 28634 100335 80682 -6984 70662 -5312 128860 91254 28877
2342B8877M2498j57267o6177J58373r493J05033p4938l6342R8410M6323j20558
$$ 28877 71375 -85892 -152069 6304 -3189 101844 26906 -9436 88974 135297 14739
2331A4739O8355p057k9012J384o9327j57543J02993J52416M6295j21808J49047
$$ 14739 83094 76037 47025 48409 -20918 -178461 -75468 76948 123243 1435 150482
2320A50482m9116P8939L1574k22078j15399N777N3444j20379J31706l855J9163
$$ 150482 101366 180305 211879 -10199 -125598 -119821 -66377 -186756 -55050 -58905 -39742
2309c9742j21446J14835K9514m6970k6863j39890R3283J88113j56154J75159n3275
$$ -39742 -161188 -46353 -16839 -63809 -90672 -230562 -137279 50834 -105320 69839 16564
2298A6564j49663R2326Q9917j08147L2466j45035J14137N6377p6392P9262K3614
$$ 16564 -133099 -40773 49144 -59003 -26537 -171572 -57435 -1058 -77450 1812 25426
2287B5426N8560q7198j3686M2972N9338j33749L6195K5928L2641j10602R9800
$$ 25426 83986 -3212 -16898 26074 85412 -48337 -12142 13786 46427 -64175 35625
2276C5625L8013r5472N067P6763j35116j35781J55612l5671n906j66753J86961
$$ 35625 73638 -21834 -16767 59996 -75120 -210901 -55289 -90960 -96866 -263619 -76658
2265g6658P2345n0643o6984O1071n1191p1136J70334L4263K4647r5346j38209
$$ -76658 -4313 -54956 -121940 -60869 -112060 -183196 -12862 21401 46048 -49298 -187507
2254a87507J38024L9743J6316p274k3403P170m5479L1823j2979r6809K9155j47995
$$ -187507 -49483 -9740 6576 -698 -24101 -16931 -62410 -30587 -43566 -140375 -111220 -259215
2242b59215J06989J11745R893l7198m8168Q0021m0834K6751j03206J04375m1889
$$ -259215 -152226 -40481 -30588 -67786 -115954 -35933 -76767 -50016 -153222 -48847 -90736
2231i0736j48830J29205N8769M5582n2803J7914J4176m3512J10990n851r4343
$$ -90736 -239566 -110361 -51592 -6010 -58813 -40899 -26723 -70235 40755 34904 -59439
2220e9439R8559p0618K5065m062p1989K9466n8399R0570N2452R510j14595p1894
$$ -59439 39120 -31498 -6433 -10495 -82484 -53018 -111417 -20847 31605 41115 -73480 -145374
2208a45374J00075l6692m4642K05000K8817j6015Q3512J03303J7024r0630r8468
$$ -145374 -45299 -81991 -126633 78367 107184 91169 174681 277984 295008 204378 105910
2197A05910r1462m3812Q0611n4419l0529J1059K7224Q6774J01544p2096J48815
$$ 105910 14448 -29364 51247 -3172 -33701 -22642 4582 91356 192900 120804 269619
2186B69619K4752j13223l0011J55894P1257p4068J16671o037q5177K473k726P2130
$$ 269619 294371 181148 151137 307031 378288 304220 420891 414854 329677 332150 329424 401554
2174D01554O9044L2064N6732K8914J37699k3508j13112R7196J51578J10560j74988
$$ 401554 470598 502662 559394 588308 726007 702499 589387 686583 838161 948721 773733
2163G73733Q1023K39777R1725M1992J9394P6982J39078j09190R0759J15717J22611
$$ 773733 854756 1094533 1186258 1228250 1247644 1324626 1463704 1354514 1445273 1560990 1683601
2152A683601J1329J52000J31358P9441J71772R0822K24432R0063J43200K26345
$$ 1683601 1694930 1846930 1978288 2057729 2229501 2320323 2544755 2634818 2778018 3004363
2142C004363L08486L04681K24815K10958L31631K26570L69957L75251K99454N74610
$$ 3004363 3312849 3617530 3842345 4053303 4384934 4611504 4981461 5356712 5656166 6230776
2132F230776O18095R15664O51957O99849R52028J329159J772875K387757K979335
$$ 6230776 6848871 7764535 8416492 9116341 10068369 11397528 13170403 15558160 18537495
2123A8537495L428420M368671O090993M801826m763130p942899n502329l676863
$$ 18537495 21965915 26334586 32425579 37227405 32464275 24521376 19019047 15342184
2115A5342184k237375j825049j261851q37657p91009p82001o31403m20289o75873
$$ 15342184 13104809 11279760 10017909 9180252 8389243 7607242 6975839 6555550 5879677
2106E879677n60456n72498o03322m29861k18538l33213k76704j06503k58347o7798
$$ 5879677 5319221 4746723 4143401 3713540 3495002 3161789 2885085 2778582 2520235 2452437
2096B452437k80623J08178r9960k23633j25541n0896j51397o2307j12593p7257
$$ 2452437 2171814 2279992 2180032 1956399 1830858 1779962 1628565 1566258 1453665 1376408
2086A376408M4995k42252L4901J13662k95899o3287o539o1597K4039l6477j25821
$$ 1376408 1421403 1179151 1214052 1327714 1031815 968528 961989 900392 924431 887954 762133
2075G62133O7952n1993j4553q115J8078j57710J49332j22472j24445r2226p8240
$$ 762133 830085 778092 763539 755424 773502 615792 765124 642652 518207 425981 347741
2064C47741R0519J11435j14914j14243J47411n4668j6455j02553n4955k9596l3778
$$ 347741 438260 549695 434781 320538 467949 413281 396826 294273 239318 209722 175944
2053A75944M7146Q3520J0472j93278M3460P6558N0468j64427p085O6494j08571
$$ 175944 223090 306610 317082 123804 167264 243822 294290 129863 122778 189272 80701
2042H0701o179O530K9060j11236m5909J68028o1275J4314o5708Q6807P5278j60268
$$ 80701 74522 81052 110112 -1124 -47033 120995 59720 74034 8326 95133 170411 10143
2030A0143l6390k7891J05551J4367j01310j13476J28973P4708p2508n9016J2273
$$ 10143 -26247 -54138 51413 65780 -35530 -149006 -20033 54675 -17833 -76849 -64576
2019f4576N5567J6665M8339o1986l8534J36920m9255m5943j6428k3414N8901j9453
$$ -64576 -9009 7656 55995 -5991 -44525 92395 43140 -2803 -19231 -42645 16256 -3197
2007c197q4041m7455J7584R3103L181p4721j9075q4363R2156o6734Q6219O893
$$ -3197 -87238 -134693 -117109 -24006 -20825 -95546 -114621 -198984 -106828 -173562 -87343 -80450
1995h0450K6515L6229j07880m8684L9832J6107q1618k9009J05350N0977N3790
$$ -80450 -53935 -17706 -125586 -174270 -134438 -118331 -199949 -228958 -123608 -72631 -18841
1984a8841p3515j4544M1012j27435M5618n2108J49244j75469O5806p1393r6341
$$ -18841 -92356 -106900 -65888 -193323 -147705 -199813 -50569 -226038 -160232 -231625 -327966
1973c27966J01809J37849J55663o5746l13093l8817J09461J79686l3702j25348
$$ -327966 -226157 -88308 67355 1609 -311484 -350301 -240840 -61154 -94856 -220204
1963b20204N7144j6642J0188L629k7912P5634j12463J19717q9957O2074l1181
$$ -220204 -163060 -179702 -169514 -165885 -193797 -118163 -230626 -110909 -200866 -138792 -169973
1952a69973P7076J35912k5955q2584j75936O8273n0473M5749R6545n6457K8062
$$ -169973 -92897 43015 17060 -65524 -241460 -173187 -223660 -177911 -81366 -137823 -109761
1941a09761P465q9535J382K3712N036Q4678k048m7170L9431J0989K3388N4421
$$ -109761 -102296 -191831 -190449 -166737 -161701 -77023 -79071 -126241 -86810 -75821 -52433 1988
1929A988j55333O2315l4139l290J34848k4857J7649J3382p5826J9565N3505N7211
$$ 1988 -153345 -91030 -125169 -128459 6389 -18468 -819 12563 -63263 -43698 9807 67018
1917F7018q159j91575m6603J15085k5428K7481M0340j39840o5870J62803j37638
$$ 67018 58859 -132716 -179319 -64234 -89662 -62181 -21841 -161681 -227551 -64748 -202386
1906b02386O9868J05758j58179O2963m8677q9784o1043J23976j32042J25697J6726
$$ -202386 -132518 -26760 -184939 -121976 -170653 -260437 -321480 -197504 -329546 -203849 -187123
1895a87123R5510r0963j34356j6568J90982j30643N3087o1005K0777o3468K4044
$$ -187123 -91613 -182576 -316932 -333500 -142518 -273161 -220074 -281079 -260302 -323770 -299726
1884b99726R7013p7062l8838J4781Q4487j8510q5539Q9769Q4762j00533r6875
$$ -299726 -202713 -279775 -318613 -303832 -219345 -237855 -323394 -233625 -148863 -249396 -346271
1873c46271J23523K15178n0081k23282M9912J05417o9107L816J54787k3804K4670
$$ -346271 -222748 -7570 -57651 -280933 -231021 -125604 -194711 -190895 -36108 -59912 -35242
1862c5242j51815k3437k4942P6182j8334J8526P4640j30031o6888M8623o2823
$$ -35242 -187057 -210494 -235436 -159254 -177588 -159062 -84422 -214453 -281341 -232718 -295541
1851b95541k955J8900P1513r3332k4196J46730K2386j0175n5149L4825j04560
$$ -295541 -298496 -279596 -208083 -301415 -325611 -178881 -156495 -166670 -221819 -186994 -291554
1840b91554K7088N9417J18195K3874N0052j14943j0609j63548O7399J36601N344
$$ -291554 -264466 -205049 -86854 -62980 -12928 -127871 -138480 -302028 -234629 -98028 -92684
1829i2684j06426m9433L6197R5134r7453N3199l383j77496R2385R8930o7756N041
$$ -92684 -199110 -248543 -212346 -117212 -214665 -161466 -164849 -342345 -249960 -151030 -218786 -213745
1817b13745j19754J33368p3011N8495M143J08040k57720k1061K01539q3238p5608
$$ -213745 -333499 -200131 -273142 -214647 -210504 -102464 -360184 -381245 -179706 -262944 -338552
1806c38552j0284j15728L10450l1677m0752J21895M7411M8965j18183l7899j42334
$$ -338552 -348836 -464564 -154114 -185791 -226543 -104648 -57237 -8272 -126455 -164354 -306688
1795c06688J9246k0213J8922k6259J05588l9803R4627K1937k01787l2148n010
$$ -306688 -287442 -307655 -288733 -314992 -209404 -249207 -154580 -132643 -334430 -366578 -371588
1784c71588k6138K33818m0440N718k0873Q0586p2782k9409Q2931n8174r3861k714
$$ -371588 -397726 -163908 -204348 -198630 -219503 -138917 -211699 -241108 -158177 -216351 -310212 -312926
1772c12926k7830L6148J71798L4441n8210j02254L2981J2456O5189J09201j23185
$$ -312926 -340756 -304608 -132810 -98369 -156579 -258833 -225852 -213396 -148207 -39006 -162191
1761a62191M1417L4807o1232j04825R133J7166o8931m0861N8678n1615L0431R912
$$ -162191 -120774 -85967 -147199 -252024 -242891 -225725 -294656 -335517 -276839 -328454 -298023 -288111
1749b88111M6294J33178Q9812q6085k40972O075J80449N5838j721j34809J52334
$$ -288111 -241817 -108639 -18827 -104912 -345884 -339809 -159360 -103522 -105243 -240052 -87718
1738h7718P8119O0867j86112m9332J58003j2286L0498j05953L7998n1965n9288
$$ -87718 -9599 51268 -134844 -184176 -26173 -38459 -7961 -113914 -75916 -127881 -187169
1727a87169O4499q6350j28912R6010Q4011J28635L8906m9059k39813J03453L1787
$$ -187169 -122670 -209020 -337932 -241922 -157911 -29276 9630 -39429 -279242 -175789 -144002
1716a44002k8859r1124j9371j8137L0005P8025o2523Q7338j63903L8537O4597
$$ -144002 -172861 -263985 -283356 -301493 -271488 -193463 -255986 -168648 -332551 -294014 -229417
1705b29417J01461r1356j42252O0541J72097O6781j36841J66438j3883m1950L2765
$$ -229417 -127956 -219312 -361564 -301023 -128926 -62145 -198986 -32548 -46431 -88381 -55616
1694e5616o8431n25J73118M9216r7865k07777J3475M9463q896l8973q1579p6656
$$ -55616 -124047 -124572 48546 97762 -103 -207880 -194405 -144942 -153838 -192811 -274390 -351046
1682c51046n2272L1235k2437J55063J65078j44670J25036m9417j31527N2153j8340
$$ -351046 -403318 -372083 -394520 -239457 -74379 -219049 -94013 -143430 -274957 -222804 -241144
1671b41144J21792J7470M934m5846j22930M3677j35326J49814J36722j5665j4870
$$ -241144 -119352 -101882 -96948 -142794 -265724 -222047 -357373 -207559 -70837 -86502 -101372
1660a01372j24130l108o0776P5246J19596j08897o794N089l7657K09834j17373
$$ -101372 -225502 -228610 -289386 -214140 -94544 -203441 -210235 -205146 -242803 -32969 -150342
1649a50342m7163Q7185n3827q3249J31790q3552Q4861O5681q4722J9005j09312
$$ -150342 -197505 -110320 -164147 -247396 -115606 -199158 -114297 -48616 -133338 -114333 -223645
1638b23645L0575K2727J8530K2807O4788j35972n2731K5763M8994K5458j30644
$$ -223645 -193070 -170343 -151813 -129006 -64218 -200190 -252921 -227158 -178164 -152706 -283350
1627b83350O4766M7762O576m0962J04485n3851J52693j09215r8176J86834j2991
$$ -283350 -218584 -170822 -164246 -205208 -100723 -154574 -1881 -111096 -209272 -22438 -35429
1616c5429L75M868o4700m4013J3025p4205Q0205N0255K551j1587k13792n9853
$$ -35429 -35054 -30186 -94886 -138899 -125874 -200079 -119874 -69619 -67068 -78655 -292447 -352300
1604c52300K81936k3429o4399j12691K17318J3932k31110n2159J32037J45501
$$ -352300 -70364 -93793 -158192 -270883 -53565 -39633 -270743 -322902 -190865 -45364
1594d5364m7014q9123J7511O1630j03825O3905L3746n2104m0391Q7377j15187
$$ -45364 -92378 -181501 -163990 -102360 -206185 -142280 -108534 -160638 -201029 -113652 -228839
1583b28839O5139l665j64394O1504k3335O6166J8141K3544j01196R5070P6660
$$ -228839 -163700 -167365 -331759 -270255 -293590 -227424 -209283 -185739 -286935 -191865 -115205
1572a15205L3452p7849j07632R7509L9582n216p2720r9407r8484J42798J54555
$$ -115205 -81753 -159602 -267234 -169725 -130143 -135359 -208079 -307486 -405970 -263172 -108617
1561a08617N9112O88j36442j10680R7562N7523o3689j03432J22115N406r2909
$$ -108617 -49505 -48817 -185259 -295939 -198377 -140854 -204543 -307975 -185860 -180454 -273363
1550b73363L2056J20517q9875K4203Q5859o1189m468l5212r908M5442q801K581
$$ -273363 -241307 -120790 -210665 -186462 -100603 -161792 -166260 -201472 -211380 -165938 -174739 -172158
1538a72158q7829q2826N6091P8405Q9027K8995m2230K71022j35223j52713P3026
$$ -172158 -259987 -342813 -286722 -208317 -119290 -90295 -132525 138497 3274 -149439 -76413
1527g6413k2891q7074M0614j01837J19343M2540k3210L3502k08799R4514p0698
$$ -76413 -99304 -186378 -145764 -247601 -128258 -85718 -108928 -75426 -284225 -189711 -260409
1516b60409l7694J10897J4138k1229M6542o9725n259J02591J01487o7491k5473
$$ -260409 -298103 -187206 -173068 -194297 -147755 -217480 -222739 -120148 -18661 -86152 -111625
1505a11625r8295r677N1766m3890j947J23320o1271O4758J18611k22816o7188
$$ -111625 -209920 -219597 -167831 -211721 -213668 -90348 -151619 -86861 31750 -191066 -258254
1494b58254J56243n0235N7209l4259Q380j13173J3987J9623N1385L3867l1578
$$ -258254 -102011 -152246 -95037 -129296 -120916 -234089 -220102 -200479 -149094 -115227 -146805
1483a46805O1679r8421J7969L6856q4473Q439o5291J57335J47043j38269j55103
$$ -146805 -85126 -183547 -165578 -128722 -213195 -204756 -270047 -112712 34331 -103938 -259041
1472b59041N8690m8765Q3J0996p3380K32730j10610p2086J06304l5678l79Q2988
$$ -259041 -200351 -249116 -249033 -238037 -311417 -78687 -189297 -261383 -155079 -190757 -191136 -108148
1460a08148j46637p6189J05231J3200m970M3197j9454j086J7787J49485j85734
$$ -108148 -254785 -330974 -225743 -212543 -217513 -174316 -193770 -194856 -177069 -27584 -213318
1449b13318m0479L7953J8810Q0279j64816K25080J3709k4497K7218k56335O0648
$$ -213318 -253797 -215844 -197034 -116755 -281571 -56491 -42782 -67279 -40061 -296396 -235748
1438b35748L2914J36009p8040P774J33039P3448P710j47027P0830p6272q8193
$$ -235748 -202834 -66825 -144865 -137091 -4052 69396 77106 -69921 909 -75363 -163556
1427a63556K6960r4637O9451O6019k9616O1486j06004q7272R9197o450n2558j9056
$$ -163556 -136596 -231233 -161782 -95763 -125379 -63893 -169897 -257169 -157972 -164422 -216980 -236036
1415b36036J731J03751o0714N8632j33355K10810r9459L034K9607j1071J6700
$$ -236036 -234305 -130554 -191268 -132636 -265991 -55181 -154640 -151606 -121999 -133070 -116370
1404a16370o7778L0788J95K3598J19476o7685o1331L4952o8377N87o5446K23394
$$ -116370 -184148 -153360 -153165 -129567 -10091 -77776 -139107 -104155 -172532 -171945 -237391 -13997
1392a3997K5591j9717q0463r2220n6704K09554j5677n5618n7733N1519J07866
$$ -13997 11594 -8123 -88586 -180806 -237510 -27956 -43633 -99251 -156984 -105465 2401
1381B401k2680j2932n6760j2349n1197R3402l8441O9377o4053J25878j10439m1310
$$ 2401 -20279 -33211 -89971 -102320 -153517 -60115 -98556 -29179 -93232 32646 -77793 -119103
1369a19103L2706j05971Q5470o3473Q5096j16437L889J27458J7486n1390L6614
$$ -119103 -86397 -192368 -106898 -170371 -85275 -201712 -197823 -70365 -52879 -104269 -67655
1358f7655K9846r4044p2630J37903o6977J29638p308K3502K6869j53381P7329
$$ -67655 -37809 -131853 -204483 -66580 -133557 -3919 -11227 12275 39144 -114237 -36908
1347c6908n6734J24564k8000k5464l5752k2744J56611j57118j0923P2855r3877
$$ -36908 -93642 30922 2922 -22542 -58294 -81038 75573 -81545 -92468 -19613 -113490
1336a13490j47695P4629R338J5065p159N259J17912J18613j32173J37309r5240
$$ -113490 -261185 -186556 -177218 -162153 -169312 -164053 -46141 72472 -59701 77608 -17632
1325a7632q0112Q650n3967J2471J07178j42966K9336R8591O9787j84729j02007
$$ -17632 -97744 -89094 -143061 -130590 -23412 -166378 -137042 -38451 31336 -153393 -255400
1314b55400J95398j69854J06316J08812j36508r973J33981m1618m5633K5656M6777
$$ -255400 -60002 -229856 -123540 -14728 -151236 -161209 -27228 -68846 -114479 -88823 -42046
1303d2046p8187n9396M7839J92109o4659R0812l6198R0367L4444n2697j18978
$$ -42046 -120233 -179629 -131790 60319 -4340 86472 50274 140641 175085 122388 3410
1292C410M97j8201k561j0098j01462K0503r0124r0241N1802J16473P6456j22245
$$ 3410 3907 -14294 -16855 -26953 -128415 -107912 -198036 -288277 -236475 -120002 -43546 -165791
1280a65791O7985o2949M8347L2892j26928L5422n89m6395K21356J42227j15170
$$ -165791 -97806 -160755 -112408 -79516 -206444 -171022 -171611 -218006 3350 145577 30407
1269C0407l5785O248Q3058j00926j14864j29039O1660J6654K6080J25908k2826
$$ 30407 -5378 870 83928 -16998 -131862 -260901 -199241 -182587 -156507 -30599 -53425
1258e3425p2226L1177p9356O9805P3310p650J19287p8067M1943q6859n051k3593
$$ -53425 -125651 -94474 -173830 -104025 -30715 -38365 80922 2855 44798 -42061 -47112 -70705
1246g0705m7222J01314m0245j23014k2395j3760R0502n6910J818K29307m8915
$$ -70705 -117927 -16613 -56858 -179872 -202267 -216027 -125525 -182435 -180617 48690 -225
1235b25j0209j11975L649P5618j42978K58190J30761k21099m2807M7529J1905
$$ -225 -10434 -122409 -118760 -43142 -186120 72070 202831 -18268 -61075 -13546 -1641
1224a641J2673j70466N4253p4653K3613j1751J93005k2761o4708l3587p6118p737
$$ -1641 11032 -159434 -105181 -179834 -156221 -167972 25033 2272 -62436 -96023 -172141 -179878
1212a79878N1968N7024j01634N5971j4032J08921m7127R290p6767O9660N2720
$$ -179878 -127910 -70886 -172520 -116549 -130581 -21660 -68787 -59497 -136264 -66604 -13884
1201a3884m1277k47376J81257K7312k6129Q0497J00342r9342M763j9490K5109
$$ -13884 -55161 -302537 -121280 -93968 -120097 -39600 60742 -38600 -33837 -53327 -28218
1190b8218K6834n8836o7006j1648J6277J9091J77020j21103j83625Q5966M5493
$$ -28218 -1384 -60220 -127226 -138874 -122597 -103506 73514 -47589 -231214 -145248 -99755
1179i9755O348J92043m8614j20147j01347J20653M2280N8479N308o9456J0821
$$ -99755 -93407 98636 50022 -70125 -171472 -50819 -8539 49940 55248 -14208 -3387
1168c387J16586q7033r9998p6737l2479J7880m6570J34800p6089P2125O995J76241
$$ -3387 113199 26166 -73832 -150569 -183048 -165168 -211738 -76938 -153027 -80902 -73907 102334
1156A02334k34506J18895J09941j54430R8380m4631L9944j38739K0277j10794
$$ 102334 -132172 -13277 96664 -57766 40614 -4017 35927 -102812 -82535 -193329
1146a93329j149L8208N409J116J0109J46445J6506j61234j47378k439J09025J55165
$$ -193329 -194478 -156270 -150861 -149745 -139636 6809 23315 -137919 -285297 -287736 -178711 -23546
1134b3546j34502M6095Q2587k0343L8037q4030J29980o9416M7320n2547k22062
$$ -23546 -158048 -111953 -29366 -49709 -11672 -95702 34278 -35138 12182 -40365 -262427
1123b62427J68394L7636r740Q0673o6655J0453l9370j3609J11656J0182K2921
$$ -262427 -94033 -56397 -66137 14536 -52119 -41666 -81036 -94645 17011 27193 50114
1112E0114j0478R2313j35213o5881k1394k7927j9413j6963J59623J00249o4811
$$ 50114 39636 131949 -3264 -69145 -90539 -118466 -137879 -154842 4781 105030 40219
1101D0219l9855j25157M7173J9115m0384J36903r1349J0869R5640l4278M964j7011
$$ 40219 364 -124793 -77620 -58505 -98889 38014 -53335 -42466 53174 18896 23860 6849
1089F849o0681J48847m6263P1098j19441o4267o995Q3951M9166q4465j7476O0695
$$ 6849 -53832 95015 48752 119850 409 -63858 -70853 13098 62264 -22201 -39677 21018
1077B1018r0257N836K3002n2967k8665R0347j62730R4927N1471j41269m0845J28067
$$ 21018 -69239 -63403 -40401 -93368 -122033 -31686 -194416 -99489 -48018 -189287 -230132 -102065
1065a02065P6830Q5533o3676L1222r4171L3387K5918q3392L4578k4412Q9688M2402
$$ -102065 -25235 60298 -3378 27844 -66327 -32940 -7022 -90414 -55836 -80248 9440 51842
$$ [...]
##END NTUPLES=NMR SPECTRUM
##END=
