##TITLE=1H_CG-1211-B-21
 CDCl3
 8 sc, 
 10.9.2024
##JCAMPDX= 6.0         $$ Bruker NMR JCAMP-DX V2.0
##DATA TYPE= NMR SPECTRUM
##DATA CLASS= NTUPLES
##ORIGIN= UXNMR, Bruker Analytische Messtechnik GmbH
##OWNER= root
$$ XWIN-NMR		Version 3.5
$$ Tue Sep 10 14:21:04 2024 Russian Standard Time (UT+4h)  she@DPX200
##.OBSERVE FREQUENCY= 200.1318
##.OBSERVE NUCLEUS= ^1H
##.ACQUISITION MODE= SIMULTANEOUS
##.ACQUISITION SCHEME= undefined
##.AVERAGES= 8
##.DIGITISER RES= 18
##SPECTROMETER/DATA SYSTEM= spect
##.PULSE SEQUENCE= zg30
##.SOLVENT NAME= CDCl3
##.SHIFT REFERENCE= (INTERNAL, CDCl3, 0, 20.9386)
##AUDIT TRAIL= $$ (NUMBER, WHEN, WHO, WHERE, WHAT)
$$ ##TITLE= Audit trail, XWIN-NMR		Version 3.5
$$ ##JCAMPDX= 5.01
$$ ##ORIGIN= Bruker BioSpin GmbH
$$ ##OWNER= she
$$ F:/spectra/data/she/nmr/H-F/1/pdata/1/auditp.txt
$$ ##AUDIT TRAIL=  $$ (NUMBER, WHEN, WHO, WHERE, WHAT)
(   1,<2024-09-10 14:19:37.15 +0400>,<she>,<DPX200>,
      <created by zg, POWCHK disabled, PULCHK disabled
       configuration hash MD5:
       00 E9 B6 7A A2 85 ED C7 34 08 36 98 17 FE 4E 26
       data hash MD5: 16K
       6A 86 42 A0 A6 BD 4F B4 F8 91 14 F6 A7 8B 9A 96>)
(   2,<2024-09-10 14:19:39.68 +0400>,<she>,<DPX200>,
      <Start of raw data processing
       efp BC_mod = 2 LB = 0.24 FT_mod = 6 PKNL = 1 PHC0 = -25996.77 PHC1 = 15.98748 SI = 16K 
       data hash MD5: 16K
       16 6A 05 C9 36 09 4E A9 71 90 66 4E CD AE 74 81>)
(   3,<2024-09-10 14:20:02.26 +0400>,<she>,<DPX200>,
      <pk PHC0 = 2.035185 PHC1 = -2.6 
       data hash MD5: 16K
       5C E5 9B FB B4 B1 6E D4 81 8A 19 D9 E5 AB 3A 5F>)
(   4,<2024-09-10 14:20:06.07 +0400>,<she>,<DPX200>,
      <abs ABSG = 5 
       data hash MD5: 16K
       38 18 03 FF 15 91 16 51 99 8D 4C 65 46 B7 D9 5A>)
$$ ##END=
$$ 
$$ hash MD5
$$ C4 75 DA 9D 18 25 FF BB 4B E1 B0 1A 91 85 51 87
##$RELAX= 
##$RELAX= 
##$RELAX= 
##$RELAX= 
##$RELAX= 
##$RELAX= 
$$ Bruker specific parameters
$$ --------------------------
##$DU= <F:/spectra>
##$EXPNO= 1
##$NAME= <H-F>
##$PROCNO= 1
##$TYPE= <nmr>
##$USER= <she>
##$AMP= (0..31)
100 100 100 100 100 100 100 100 100 100 100 100 100 100 100 100 100 100 
100 100 100 100 100 100 100 100 100 100 100 100 100 100 
##$AQSEQ= 0
##$AQ_mod= 1
##$AUNM= <au_zg>
##$AUTOPOS= <>
##$BF1= 200.13
##$BF2= 200.13
##$BF3= 200.13
##$BF4= 200.13
##$BF5= 200.13
##$BF6= 200.13
##$BF7= 200.13
##$BF8= 200.13
##$BYTORDA= 1
##$CFDGTYP= 0
##$CFRGTYP= 5
##$CHEMSTR= <none>
##$CNST= (0..31)
1 1 145 1 1 1 1 1 1 1 1 1 1 1 1 1 1 1 1 1 1 1 1 1 1 1 1 1 1 1 1 1 
##$CPDPRG= <>
##$CPDPRG1= <>
##$CPDPRG2= <>
##$CPDPRG3= <>
##$CPDPRG4= <mlev>
##$CPDPRG5= <mlev>
##$CPDPRG6= <mlev>
##$CPDPRG7= <mlev>
##$CPDPRG8= <mlev>
##$CPDPRGB= <>
##$CPDPRGT= <>
##$D= (0..31)
0 1.2 0 0 0 0 0 0 0 0.06 0 0.03 0 0 0 0 0.0002 0 0 0 0 0 0 0 0 0 0 0 0 
0 0 0 
##$DATE= 1725963576
##$DBL= (0..7)
120 120 120 120 120 120 120 120 
##$DBP= (0..7)
150 150 150 150 150 150 150 150 
##$DBP07= 0
##$DBPNAM0= <>
##$DBPNAM1= <>
##$DBPNAM2= <>
##$DBPNAM3= <>
##$DBPNAM4= <>
$$ [...]
##$SUBNAM3= <"">
##$SUBNAM4= <"">
##$SUBNAM5= <"">
##$SUBNAM6= <"">
##$SUBNAM7= <"">
##$SUBNAM8= <"">
##$SUBNAM9= <"">
##$SW= 24.0689170037331
##$SWIBOX= (0..15)
0 0 2 0 0 0 0 0 0 0 0 0 0 0 0 0 
##$SW_h= 4816.95568400771
##$TD= 16384
##$TD0= 1
##$TE= 0
##$TE2= 300
##$TE3= 300
##$TEG= 300
##$TL= (0..7)
0 120 120 120 120 120 120 120 
##$TP= (0..7)
150 150 150 150 150 150 150 150 
##$TP07= 0
##$TPNAME0= <>
##$TPNAME1= <>
##$TPNAME2= <>
##$TPNAME3= <>
##$TPNAME4= <>
##$TPNAME5= <>
##$TPNAME6= <>
##$TPNAME7= <>
##$TPOAL= (0..7)
0.5 0.5 0.5 0.5 0.5 0.5 0.5 0.5 
##$TPOFFS= (0..7)
0 0 0 0 0 0 0 0 
##$TUNHIN= 0
##$TUNHOUT= 0
##$TUNXOUT= 0
##$USERA1= <user>
##$USERA2= <user>
##$USERA3= <user>
##$USERA4= <user>
##$USERA5= <user>
##$V9= 5
##$VALIST= <valist>
##$VCLIST= <CCCCCCCCCCCCCCC>
##$VD= 0
##$VDLIST= <DDDDDDDDDDDDDDD>
##$VPLIST= <PPPPPPPPPPPPPPP>
##$VTLIST= <TTTTTTTTTTTTTTT>
##$WBST= 1024
##$WBSW= 4
##$XGAIN= (0..3)
0 0 0 0 
##$XL= 0
##$YL= 0
##$YMAX_a= 754140
##$YMIN_a= -662722
##$ZGOPTNS= <>
##$ZL1= 120
##$ZL2= 120
##$ZL3= 120
##$ZL4= 120
##$ABSF1= 20.96794
##$ABSF2= -3.101192
##$ABSG= 5
##$ABSL= 3
##$ALPHA= 0
##$AQORDER= 0
##$ASSFAC= 0
##$ASSFACI= 0
##$ASSFACX= 0
##$ASSWID= 0
##$AUNMP= <proc_1d>
##$AZFE= 0.1
##$AZFW= 0.1
##$BCFW= 0
##$BC_mod= 2
##$BYTORDP= 0
##$COROFFS= 0
##$CY= -3
##$DATMOD= 1
##$DC= 0
##$DFILT= <>
##$DTYPP= 0
##$F1P= 0
##$F2P= 0
##$FCOR= 1
##$FTSIZE= 16384
##$FT_mod= 6
##$GAMMA= 0
##$GB= 0
##$INTBC= 1
##$INTSCL= 3.70164e-10
##$ISEN= 128
##$LB= 0.24
##$LEV0= 0
##$LPBIN= 0
##$MAXI= 10000
##$MC2= 0
##$MEAN= 0
##$ME_mod= 0
##$MI= 1.114404
##$NCOEF= 0
##$NC_proc= -6
##$NLEV= 6
##$NOISF1= 3.799351
##$NOISF2= 2.8
##$NSP= 0
##$NTH_PI= 0
##$NZP= 0
##$OFFSET= 20.93856
##$PC= 1
##$PHC0= -25994.73
##$PHC1= 13.38748
##$PH_mod= 1
##$PKNL= yes
##$PPARMOD= 0
##$PSCAL= 0
##$PSIGN= 0
##$REVERSE= no
##$SF= 200.130018044249
##$SI= 16384
##$SIGF1= 3
##$SIGF2= 2
##$SINO= 5.538805
##$SIOLD= 16384
##$SREGLST= <1H.CDCl3>
##$SSB= 0
##$STSI= 16384
##$STSR= 0
##$SW_p= 4816.95568400771
##$SYMM= 0
##$S_DEV= 0
##$TDeff= 16384
##$TDoff= 0
##$TI= <>
##$TILT= no
##$TM1= 0
##$TM2= 0
##$TOPLEV= 0
##$USERP1= <user>
##$USERP2= <user>
##$USERP3= <user>
##$USERP4= <user>
##$USERP5= <user>
##$WDW= 1
##$XDIM= 16384
##$YMAX_p= 462947467
##$YMIN_p= -660475
$$ End of Bruker specific parameters
$$ ---------------------------------
##NTUPLES= NMR SPECTRUM
##VAR_NAME=  FREQUENCY,     SPECTRUM/REAL,   SPECTRUM/IMAG
##SYMBOL=    X,             R,               I
##VAR_TYPE=  INDEPENDENT,   DEPENDENT,       DEPENDENT
##VAR_FORM=  AFFN,          ASDF,            ASDF
##VAR_DIM=   16384,         16384,           16384
##UNITS=     HZ,            ARBITRARY UNITS, ARBITRARY UNITS
##FACTOR=    0.29402158847633, 1,            1
##FIRST=     4190.43448785173, 0,            0
##LAST=      -626.521196155983, 0,           0
##MIN=       -626.521196155983, -660475,     0
##MAX=       4190.43448785173, 462947467,    0
$$ Real data points
##PAGE= N=1
##DATA TABLE= (X++(R..R)), XYDATA
$$ [...]
10130H992K654k4576k673m9848J01312n710k6833J6392j8164L4648j22609M7111
$$ 8992 11646 -12930 -15603 -65451 35861 30151 3318 19710 1546 36194 -86415 -39304
10118c9304j44893k2224K45434j2528N8372k49117J15635J27423j32508N0396
$$ -39304 -184197 -206421 39013 26485 84857 -164260 -48625 78798 -53710 -3314
10108c314n3079P4598r9252r338J49739m3879k66322K5692J04465q2348J51380
$$ -3314 -56393 18205 -81047 -90385 59354 15475 -250847 -225155 -120690 -203038 -51658
10097e1658L8334K3443l8923n0471J06493m1996j0412r4751k0367J1115J76321
$$ -51658 -13324 10119 -28804 -79275 27218 -14778 -25190 -119941 -140308 -129193 47128
10086D7128n0159K992L3266o8548K5452j46685K2370O6476K791j09972m5977K09586
$$ 47128 -3031 -39 33227 -35321 -9869 -156554 -134184 -67708 -64917 -174889 -220866 -11280
10074a1280l2639M3515M8630M9178l9134Q237O5813j3520J3649j90429k8686r880
$$ -11280 -43919 -404 48226 97404 58270 66507 132320 118800 132449 -57980 -86666 -96546
10062i6546m0693M5962K1629N3272M9920j58095j7575J28726K4654N4381p1936
$$ -96546 -137239 -91277 -69648 -16376 33544 -124551 -142126 -13400 11254 65635 -6301
10051f301J0820P731K9379q7532O765o9461Q9198N0784P0787l8702N5071j02885
$$ -6301 4519 12250 41629 -45903 -39138 -108599 -19401 31383 102170 63468 118539 15654
10039A5654J7716N5550r6831j26297m5540M7920q744J0083K8732n4978M6178m3180
$$ 15654 33370 88920 -7911 -134208 -179748 -131828 -140572 -130489 -101757 -156735 -110557 -153737
10027a53737L1524K6613K1300J40403j31872J09939r6176m091N2102j33141K22131
$$ -153737 -122213 -95600 -74300 66103 -65769 44170 -52006 -56097 -3995 -137136 84995
10016H4995k1877R227j17379n8264n0634n9877M7960n2967N4322J26099N6708
$$ 84995 63118 72345 -45034 -103298 -153932 -213809 -165849 -218816 -164494 -38395 18313
10005A8313j35893R5652j8046Q9038R8394k1582j44391L390r6171R3430j30076
$$ 18313 -117580 -21928 -39974 49064 147458 125876 -18515 -15125 -111296 -17866 -147942
9994a47942p6579J42675j00371O1939J24397J01924j37843p105J8765j5328K791
$$ -147942 -224521 -81846 -182217 -120278 4119 106043 -31800 -38905 -20140 -35468 -32677
9983c2677J52123j64954j70480J56610J21005l3280j08584N6752J9657P8491J0448
$$ -32677 119446 -45508 -215988 -59378 61627 28347 -80237 -23485 -3828 74663 85111
9972H5111Q8669r0757j59857R1056n5237n8134M7104L661j7022k7519o8533l2996
$$ 85111 173780 83023 -76834 14222 -41015 -99149 -52045 -48384 -65406 -92925 -161458 -194454
9960a94454J00453M6442J49436j61335q6695J35485R4203l5301j98117J79468
$$ -194454 -94001 -47559 101877 -59458 -146153 -10668 83535 48234 -149883 29585
9950B9585j0222l8168J32096j01592l5479K0136J09900j20835q574k1152J28648
$$ 29585 19363 -18805 113291 11699 -23780 -3644 106256 -14579 -23153 -44305 84343
9939H4343p5310L5297j00702J1701O1141m0224J24416j40310M9473J01810m8710
$$ 84343 9033 44330 -56372 -44671 16470 -23754 100662 -39648 9825 111635 62925
9928F2925n8814n846m2818n4429J55511J58856j32254q7270N2012k571M5090p669
$$ 62925 4111 -1735 -44553 -98982 56529 215385 83131 -4139 47873 45302 90392 82723
9916H2723n9777l4274j7426m1638L7586n2498R5937Q6363J1150l0631j37040Q670
$$ 82723 22946 -11328 -28754 -70392 -32806 -85304 10633 96996 108146 77515 -59525 -50855
9904e0855j1375J0191L4969L3561o3283o5221m0117J62284M922k1644M4362j61829
$$ -50855 -62230 -52039 -17070 16491 -46792 -112013 -152130 10154 15076 -6568 37794 -124035
9892a24035N7230j37337J31703N4537j590R4815q4087m5198j1020L7084Q3210
$$ -124035 -66805 -204142 -72439 -17902 -19492 75323 -8764 -53962 -64982 -27898 55312
9881E5312l9036j84941P8267k7464N2029j5372J17375J7223m9771j7167L6644
$$ 55312 16276 -168665 -90398 -117862 -65833 -81205 36170 53393 3622 -13545 23099
9870B3099O279j12191k8719o5418J33436j44876O9228k2484K630k4950R3805P1319
$$ 23099 29378 -82813 -111532 -176950 -43514 -188390 -119162 -141646 -139016 -163966 -70161 1158
9858A158j3530k2402n6722P4767O7256j12393r046K5680J23964n194j53970J1423
$$ 1158 -12372 -34774 -91496 -16729 50527 -61866 -70912 -45232 78732 73538 -80432 -69009
9846f9009M9510J10139j67407j5396q0129J58666j2986n4462k9687O8752p2543
$$ -69009 -19499 90640 -76767 -92163 -172292 -13626 -26612 -81074 -110761 -42009 -114552
9835a14552j7686N4003O5966K5901j5343j12164O9178m6131J09665j80399K4456
$$ -114552 -132238 -78235 -12269 13632 -1711 -113875 -44697 -90828 18837 -161562 -137106
9824a37106n977n5074n9894L7742m4384J25369j4053L6195j07543J40593J05035
$$ -137106 -143083 -198157 -258051 -220309 -264693 -139324 -153377 -117182 -224725 -84132 20903
9813B0903k3710j05804k9012K07478N5284j08619j16119j38809M9536M6610q8627
$$ 20903 -2807 -108611 -137623 69855 125139 16520 -99599 -238408 -188872 -142262 -230889
9802b30889J80300Q8362n9753o263N2704m8604N5403J0423L0093j06929K8253
$$ -230889 -50589 37773 -21980 -28243 24461 -24143 31260 41683 71776 -35153 -6900
9791f900L0815L800N0278j01734L7989J07729j31212q8794K6102J60756q9095
$$ -6900 23915 27715 77993 -23741 14248 121977 -9235 -98029 -71927 88829 -266
9780b66k8206k8644Q4303Q44O0538j17438l7442m114j1234k6352k3660p4756J60465
$$ -266 -28472 -57116 27187 28031 88569 -28869 -66311 -70425 -81659 -108011 -131671 -206427 -45962
9767d5962J36837j21483r8703J20495q4247P297N8964r534k1279J22753j09122
$$ -45962 90875 -30608 -129311 -8816 -93063 -85766 -26802 -36336 -57615 65138 -43984
9756d3984o0861M6967o7451L5307o6184n5280J60198m9092J65115R0793p4114
$$ -43984 -104845 -57878 -125329 -90022 -156206 -211486 -51288 -100380 64735 155528 81414
9745H1414q1141J1283j00176j1730R8364n0088O3385j48063R651M5488P6637m4346
$$ 81414 273 11556 -88620 -100350 -1986 -52074 11311 -136752 -127101 -81613 -4976 -49322
9733d9322L3831o8253K47352K0638o1105j51609K78Q9346j20891p8012N0061J65073
$$ -49322 -15491 -83744 163608 184246 123141 -28468 -28190 61156 -59735 -137747 -87686 77387
9721G7387l3772J26829o7282q7991j20997J45287J3385p6325j03969J69597J4557
$$ 77387 43615 170444 103162 15171 -105826 39461 52846 -23479 -127448 42149 56706
9710E6706n4666K6420p9715j35129J7067K577K717K01092j42142L4673J32422
$$ 56706 2040 28460 -51255 -186384 -169317 -166740 -164023 37069 -105073 -70400 62022
9699F2022j13057L6429k1135o7751o7710K5813J44746L9182k5731m9754j05093
$$ 62022 -51035 -14606 -35741 -103492 -171202 -145389 -643 38539 12808 -36946 -142039
9688a42039l9488J25566r3962J44761n0669m0917Q9575n5573J78947J3544n0565
$$ -142039 -181527 -55961 -149923 -5162 -55831 -96748 -7173 -62746 116201 129745 79180
9677G9180k47963m0581J70450K8283k432l6867m6264j00593l7638J40396J4495
$$ 79180 -168783 -209364 -38914 -10631 -13063 -49930 -96194 -196787 -234425 -94029 -79534
9666g9534K4369M3390Q9347J6100j07639J04140n1236k7259J4383J13002j95719
$$ -79534 -55165 -11775 77572 93672 -13967 90173 38937 11678 26061 139063 -56656
9655e6656p4331K31001k08982r544P652J39222O375n4206n1245K0612j35365J8869
$$ -56656 -130987 100014 -108968 -118512 -110860 28362 34737 -19469 -70714 -50102 -185467 -166598
9643a66598J05672r455J01330m7518K6495j31952P4078l0517j5577K3454K28P5515
$$ -166598 -60926 -70381 30949 -16569 9926 -122026 -47948 -78465 -94042 -70588 -70360 5155
9631E155M804o9054J42344O9155r9855N762O46j81940R6950O9036m2204j32482
$$ 5155 9959 -59095 83249 152404 52549 58311 58957 -122983 -26033 43003 799 -131683
9619a31683J33520j43488Q741J23825P0141p0633j04596J9710m8461K3005R0932
$$ -131683 1837 -141651 -132910 -9085 61056 -9577 -114173 -94463 -142924 -119919 -28987
9608b8987J2492L1569L3282j07528L9104J51307k10551J45J07959K674l1031o1644
$$ -28987 -16495 15074 48356 -59172 -20068 131239 -79312 -79167 28792 31466 435 -61209
9596f1209o1552K39860J361N293j19719p0087o885M4701o5941K8010j8940j5341
$$ -61209 -122761 117099 118460 123753 4034 -66053 -72938 -28237 -94178 -66168 -85108 -100449
9584a00449l9841p175J02495n9670M8933L0197O488o4579j03869L5196K09486
$$ -100449 -140290 -147465 -44970 -104640 -55707 -25510 -19022 -83601 -187470 -152274 57212
9573E7212j36616J20763p2216J08927j59528n3189M5690o6066J01224P5516q2023
$$ 57212 -79404 41359 -30857 78070 -81458 -134647 -88957 -155023 -53799 21717 -60306
9562f0306j33613J49087N0655m633P8493j69018J5637J2411Q7484K8483q8130
$$ -60306 -193919 -44832 5823 1190 79683 -89335 -73698 -61287 26197 54680 -33450
9551c3450O1564k7347r8959o4806O9400O7802J8219K2459k9150o1657p4195J4186
$$ -33450 28114 767 -98192 -162998 -93598 -25796 -7577 14882 -14268 -75925 -150120 -135934
9539a35934K1807K4522R2128k4712o4497K8415j10321J38424P7656j27247k2081
$$ -135934 -114127 -89605 2523 -22189 -86686 -58271 -168592 -30168 47488 -79759 -101840
9528a01840M5404l5071L4669j7742q859J30783M9579k41921M1373P8969j28976
$$ -101840 -56436 -91507 -56838 -74580 -83439 47344 96923 -144998 -103625 -24656 -153632
9517a53632M5649L14l1283k0489P4609p1125j27568R5787j4209J05891J32820
$$ -153632 -107983 -107669 -138952 -159441 -84832 -155957 -283525 -187738 -201947 -96056 36764
9506C6764r9307L3144P3359n0997o2626P214p1939j04887n5632J24574J1514N3039
$$ 36764 -62543 -29399 43960 -7037 -69663 -62449 -134388 -239275 -294907 -170333 -158819 -105780
9494a05780N3291l2275K9015M3508J04354p0445M7189R250K8185Q945k08132O4932
$$ -105780 -52489 -84764 -55749 -12241 92113 21668 68857 78107 106292 115237 -92895 -27963
9482b7963N6727K0901j48937J8000J38914l3021p7450k47969K67418N4498j24775
$$ -27963 28764 49665 -99272 -81272 57642 24621 -52829 -300798 -33380 21118 -103657
9471a03657l2096R255M3921K0430j0990K3046j31389J82198n0197Q1143j23022
$$ -103657 -135753 -126498 -82577 -62147 -73137 -50091 -181480 718 -49479 31664 -91358
9460i1358o1822l5343m6438O5992L5953J99021l9095j65862J34337J36279k05600
$$ -91358 -153180 -188523 -234961 -168969 -133016 66005 26910 -138952 -4615 131664 -73936
9449g3936K1938n4106L5945q0127L760p186M1316r7750J43736Q9506r1914l732
$$ -73936 -51998 -106104 -70159 -150286 -146526 -153712 -112396 -210146 -66410 23096 -68818 -72550
9437g2550O8881l4106q5522o8190L0261J3978K1319K5015L9809J6329j27377O777
$$ -72550 -3669 -37775 -123297 -191487 -161226 -147248 -125929 -100914 -61105 -44776 -172153 -165376
9425a65376M3452j1071L6431J49450j06368j23010J95552J97306j30582j00559
$$ -165376 -121924 -132995 -96564 52886 -53482 -176492 19060 216366 85784 -14775
9415a4775j4803j33282J21729j8647J32532m1093j03628l774j7114L1741O8200
$$ -14775 -29578 -162860 -41131 -59778 72754 31661 -71967 -75741 -92855 -61114 7086
9404G086j32935k449P1520M8689q3817M4322Q7024l8458o9145o6711M5297M7273
$$ 7086 -125849 -128298 -56778 -8089 -91906 -47584 39440 982 -68163 -134874 -89577 -42304
9392d2304N1407P0269j81867n9099K04364m990N0636O944j51164n1023P2264k9200
$$ -42304 9103 79372 -102495 -161594 42770 37780 88416 95360 -55804 -106827 -34563 -63763
9380f3763j27102Q0139R6967r9835R3912j82428J5226J33857J60903r9322j33880
$$ -63763 -190865 -110726 -13759 -113594 -19682 -202110 -186884 -53027 107876 8554 -125326
9369a25326J36298N1611O1635r4573k58168J44421J84371Q2049o0505j53061q0801
$$ -125326 10972 62583 124218 29645 -228523 -84102 100269 182318 121813 -31248 -112049
9358a12049q9518N9484M3460n5164R9521N5979J0359P6417k7363K9138k10780
$$ -112049 -201567 -142083 -98623 -153787 -54266 1713 12072 88489 61126 90264 -120516
9347a20516J16569q052j11034m9900l174J25511J45935j5594p3664K855j27957
$$ -120516 -3947 -11999 -123033 -172933 -176107 -50596 95339 79745 6081 8936 -119021
9336a19021R2936O8935J5727J071j26170q0352K4155J71461o6128j8867j8863
$$ -119021 -26085 42850 58577 59648 -66522 -146874 -122719 48742 -17386 -36253 -55116
9325e5116m5642J11792J6677j33963L8780j00669J01059R3314l9460j11838Q1510
$$ -55116 -100758 11034 27711 -106252 -67472 -168141 -67082 26232 -13228 -125066 -43556
9314d3556J15467n1222P5661k00335j77136J50852J61588J6123K5830j77138J75200
$$ -43556 71911 20689 96350 -103985 -281121 -130269 31319 47442 73272 -103866 71334
9303G1334k4285j4654n0262l3709K7907q648l733j05224j27411J12947K2827K8840
$$ 71334 47049 32395 -17867 -51576 -23669 -32317 -36050 -141274 -268685 -155738 -132911 -104071
9291a04071J69066o2813j3574o5576N4719J11045p2419j59751k0868J04417j01275
$$ -104071 64995 2182 -11392 -76968 -22249 88796 16377 -143374 -164242 -59825 -161100
9280a61100J06774K8453Q0594N5097k01651p7935K43771J9202k18731J24242J06971
$$ -161100 -54326 -25873 54721 109818 -91833 -169768 74003 93205 -125526 -1284 105687
9269A05687l8784q4667o699O2479R1343R199p8010n5980R6089M5160K317n4539
$$ 105687 66903 -17764 -24463 38016 129359 138558 60548 4568 100657 145817 148134 93595
9257I3595j6683j28425Q694o7422J17233j27102J9036L2735o2480k9840P2202
$$ 93595 76912 -51513 -42819 -110241 6992 -120110 -101074 -68339 -130819 -160659 -88457
9246h8457L6577j78637J01064j376L1985q3184J32814o7999k6593M1258N294k728
$$ -88457 -51880 -230517 -129453 -130829 -98844 -182028 -49214 -117213 -143806 -102548 -97254 -99982
9234i9982J44336j23515m6634J21033j29522M4816p0708L4152R2502J1235P5156
$$ -99982 44354 -79161 -125795 -4762 -134284 -89468 -160176 -126024 -33522 -22287 52869
9223E2869l7750n9343Q8585j8691n4938j39070M0794J32919p902L7660o7385N0617
$$ 52869 15119 -44224 44361 25670 -29268 -168338 -127544 5375 -2527 35133 -32252 18365
9211A8365K5743r7579l8925N7349J02177r4840n9724O3634p4079J16129q0770
$$ 18365 44108 -53471 -92396 -35047 67130 -27710 -87434 -23800 -97879 18250 -62520
9200f2520o6412Q4184Q6159j3690j0066l2342N0639l7556o6104L8011o9163Q1417
$$ -62520 -128932 -44748 41411 27721 17655 -14687 35952 -1604 -67708 -29697 -98860 -17443
9188a7443j43411k3944J41517J9958o8229m147k6169L6105N1996j87334O3265
$$ -17443 -160854 -184798 -43281 -23323 -91552 -95699 -121868 -85763 -33767 -221101 -157836
9177a57836J37616M8923j42098O7405n713J2306L6990j2440o9673L1719k8383
$$ -157836 -20220 28703 -113395 -45990 -51703 -39397 -2407 -14847 -84520 -52801 -81184
9166h1184l6009Q2822p9397r1334q7284J69658L4405n3483j1702k9692J03021
$$ -81184 -117193 -34371 -113768 -205102 -292386 -122728 -88323 -141806 -153508 -183200 -80179
9155h0179N9016l9322m1724J40816K0715R6515o0369p5953J3302j15016n3221
$$ -80179 -21163 -60485 -102209 38607 59322 155837 95468 19515 32817 -82199 -135420
9144a35420J34509j05307j45519R8210K2507P4762O6553p3882q382N2622M4343
$$ -135420 -911 -106218 -251737 -153527 -131020 -56258 10295 -63587 -71969 -19347 24996
9133B4996p4593j64183J13356J90121M4677j53636L3530N4899j63544j42805L0702
$$ 24996 -49597 -213780 -100424 89697 134374 -19262 14268 69167 -94377 -237182 -206480
9122b06480Q2200Q2668j1365M9968j4203O7709n3269J35098k71180j61831L31658
$$ -206480 -124280 -41612 -52977 -3009 -17212 50497 -2772 132326 -138854 -300685 30973
9111C0973N0884n7719p6628j02976J57469j36421R665N3367R026o5396J2333Q4507
$$ 30973 81857 24138 -52490 -155466 2003 -134418 -124753 -71386 -62360 -127756 -115423 -30916
9099c0916R1183l5569m985l1350l6490J30323l7082J11751q0483j30795L5906
$$ -30916 60267 24698 19713 -11637 -48127 82196 45114 156865 76382 -54413 -18507
9088a8507J03016j7028N13m2735l3633n3914k335L4770q1623R5524l7395M06l6638
$$ -18507 84509 67481 67994 25259 -8374 -62288 -64623 -29853 -111476 -15952 -53347 -52941 -89579
9075h9579K1503J9385P0081o5798R1293J1227q5947l9781J39572M7744M4425k0970
$$ -89579 -68076 -48691 21390 -44408 46885 58112 -27835 -67616 71956 119700 164125 143155
9063A43155j27191j64954J32746K1871l2594J01934q0024l2918j7101o0430J08724
$$ 143155 15964 -148990 -16244 5627 -26967 74967 -5057 -37975 -55076 -115506 -6782
9052f782P4126j35035o1871K3305N2804o5414p1356J82200r747Q1929j00187L2828
$$ -6782 67344 -67691 -129562 -106257 -53453 -118867 -190223 -8023 -17770 64159 -36028 -3200
9040c200J21778j83892o8007R3101O0745m9436J35947q7601J23781j42387P5235
$$ -3200 118578 -65314 -133321 -40220 20525 -28911 107036 19435 143216 829 76064
9029G6064k0202p4494j43443J85396M7295q3538J01081j17069j8370l4184N9892
$$ 76064 55862 -18632 -162075 23321 70616 -12922 88159 -28910 -47280 -81464 -21572
9018b1572J19852j88367Q505j8564j2926n5132O0323J10629J19808j42381o7717
$$ -21572 98280 -90087 -81582 -100146 -113072 -168204 -107881 2748 122556 -19825 -87542
9007h7542m5814k6960N5131P9552k851j32561Q7750l4477N9824L9406j06277O6181
$$ -87542 -133356 -160316 -105185 -25633 -28484 -161045 -73295 -107772 -47948 -8542 -114819 -48638
8995d8638m4988J7075j7090J00885o643k704m2724Q5838o6954N9166J08834J2275
$$ -48638 -93626 -76551 -93641 7244 601 -2103 -44827 41011 -25943 33223 142057 154332
8983A54332j3799o971n7929K8593q3235R1915j52017k9934L2626m4016N4424k18602
$$ 154332 140533 133562 75633 104226 20991 112906 -39111 -69045 -36419 -80435 -26011 -244613
8971b44613K56141O683l6328J9032j2519o3477M1709o8095O162N9475q2771P9555
$$ -244613 11528 18211 -18117 915 -11604 -75081 -33372 -101467 -95305 -35830 -118601 -39046
8959c9046K3914M4206j78196k9235n1566P9909J22807l2454K1842J5707M0893
$$ -39046 -15132 29074 -149122 -178357 -229923 -150014 -27207 -59661 -37819 -22112 18781
8948A8781N4658j23104r6275m7971K13568K20520m0041j80905L5193o5132j89807
$$ 18781 73439 -49665 -145940 -193911 19657 240177 200136 19231 54424 -10708 -200515
8937b00515R9044r2391P2416K5451j36316j26372K21827L1528Q1689n6587J1434
$$ -200515 -101471 -193862 -121446 -95995 -232311 -358683 -136856 -105328 -23639 -80226 -68792
8926f8792k7936J83868J6843o0255p5355l9184j08316J34798K3139m3882J944
$$ -68792 -96728 87140 103983 43728 -31627 -70811 -179127 -44329 -21190 -65072 -63128
8915f3128L0706Q2025K0952j05938j9281o2472N0833M4803O7846n0233j1099Q9257
$$ -63128 -32422 49603 70555 -35383 -54664 -117136 -66303 -21500 46346 -3887 -14986 74271
8903G4271o9111r1713j20646J69192k516N0638q8662k709O7685K7980M1351j22168
$$ 74271 5160 -86553 -207199 -38007 -40523 10115 -78547 -81256 -13571 14409 55760 -66408
8891f6408r1838L0222J29173K6538L4844N2183O8689m5294j40151P9373J73776
$$ -66408 -158246 -128024 1149 27687 62531 114714 183403 138109 -2042 77331 251107
8880B51107j06236j22498o785j8373j15225J17301J9458n3444r7334K6200J51489
$$ 251107 144871 22373 15588 -2785 -118010 -709 18749 -34695 -132029 -105829 45660
8869D5660j70754K1689J92298N717k45487j5106J10917J08439J43146p1691j778
$$ 45660 -125094 -103405 88893 94610 -150877 -165983 -55066 53373 196519 124828 123050
8858A23050n0567r408N3704j06260J32917j05361k0644J5903j8414J18565j63847
$$ 123050 72483 63075 116779 10519 143436 38075 17431 33334 14920 133485 -30362
8847c0362m6664j03531L5424J02581M0285L804j91396m0838N2958J85138j21742
$$ -30362 -77026 -180557 -145133 -42552 -2267 1537 -189859 -230697 -177739 7399 -114343
8836a14343k4357J17500l0664O5898q8436j4710o0347Q1214O9511j29927R0684
$$ -114343 -138700 -21200 -51864 14034 -74402 -89112 -149459 -68245 1266 -128661 -37977
8825c7977q4927P0145o2523o7190R1409j934M9677Q1057J484k13753R2126N7339
$$ -37977 -122904 -52759 -115282 -182472 -91063 -92997 -43320 37737 39221 -174532 -82406 -25067
8813b5067O1891m1740p0516J17920n2841r0477n6693J63090K01913j40653k08080
$$ -25067 36824 -4916 -75432 42488 -10353 -100830 -157523 5567 207480 66827 -141253
8802a41253P569J232k9843J74306m7137j03410L7321Q1929J89265o6446q3873
$$ -141253 -133684 -132452 -162295 12011 -35126 -138536 -101215 -19286 169979 103533 19660
8791A9660J48584j6096l3763j55296J6781j6523j01741K3318J24245j04946L9027
$$ 19660 168244 152148 118385 -36911 -20130 -36653 -138394 -115076 9169 -95777 -56750
8780e6750J61077l5570l1969M0840n1769j40403J92602q5949L2522l1337K4388
$$ -56750 104327 68757 36788 77628 25859 -114544 78058 -7891 24631 -6706 17682
8769A7682j78k2220q821q3551j23845J47764J04835P5084j67551j3401L5902o746
$$ 17682 17504 -4716 -13537 -97088 -220933 -73169 31666 106750 -60801 -74202 -38300 -45046
8757d5046J8293M2831k7359J19295R4304J2618o9329P452n8855o4758o6552N8670
$$ -45046 -26753 16078 -11281 108014 202318 214936 145607 153059 94204 29446 -37106 21564
8745B1564K4830j37132j05454J13966J97411j58572j11435J00262J05935M254
$$ 21564 46394 -90738 -196192 -82226 115185 -43387 -154822 -54560 51375 55629
8735E5629j25179J08492q6694j04065Q4449J954m1645k9112J06948Q553o8271
$$ 55629 -69550 38942 -47752 -151817 -67368 -65414 -107059 -136171 -29223 -20670 -88941
8724h8941n989J27954m6815p4881N7370j1748L1917R7673P2969k0722n7128M1937
$$ -88941 -94930 33024 -13791 -88672 -31302 -43050 -11133 86540 159509 138787 81659 123596
8712A23596l19844J42212K2813N8417J12185j27569r398k7487L0940j34806R189
$$ 123596 -196248 -54036 -31223 27194 139379 11810 2412 -25075 5865 -128941 -119752
8701a19752J69333j21373J37130l7786n1702p2275k5908R1940J7891N8991r7443
$$ -119752 49581 -71792 65338 27552 -24150 -96425 -122333 -30393 -12502 46489 -50954
8690e0954k863J15639j13508J5076R4292j04777k21370K94354J05898j67445Q2013
$$ -50954 -53817 61822 -51686 -36610 57682 -47095 -268465 25889 131787 -35658 46355
8679D6355L3016j12740J16413j13564R3581Q0806k48130N5137K32994j90306k8230
$$ 46355 79371 -33369 83044 -30520 63061 143867 -104263 -49126 183868 -6438 -34668
8668c4668J02526m5768J39648j05306J1940j00136j15054K7226R7615j12762L0813
$$ -34668 67858 22090 161738 56432 68372 -31764 -146818 -119592 -21977 -134739 -103926
8657a03926r560M7201Q5499j9599o3076N0911Q1680R6003j11776j08410j17716
$$ -103926 -113486 -66285 19214 -385 -63461 -12550 69130 165133 53357 -55053 -172769
8646a72769M3185J55315j20267R3407J0890m2562j16297P0650m993L7687j8766
$$ -172769 -129584 25731 -94536 -1129 9761 -32801 -149098 -78448 -83441 -45754 -64520
8635f4520p4436J84198J7428Q1920k2310k41965J8811R2059n3335L5995j8152
$$ -64520 -138956 45242 62670 144590 122280 -119685 -100874 -8815 -62150 -26155 -44307
8624d4307l2181J6822o2105n7518J78088P552o0013m4814O4246L7641j274K1185
$$ -44307 -76488 -59666 -121771 -179289 -1201 6351 -53662 -98476 -34230 3411 2137 23322
8612B3322j28957r1298m791K0233J76697j00485M3104J9860m653L6708k6467N3241
$$ 23322 -105635 -196933 -201724 -181491 -4794 -105279 -62175 -42315 -46968 -10260 -36727 16514
8600A6514j2834j46898K7414j5839J974l7535J22994O4191q1182j2539L0399p9437
$$ 16514 3680 -143218 -115804 -131643 -129669 -167204 -44210 19981 -61201 -73740 -43341 -122778
8588a22778j38705j4751O7377J43393j1290K1894m7917o9382n8548Q8299L1170
$$ -122778 -261483 -276234 -208857 -65464 -76754 -54860 -102777 -172159 -230707 -142408 -111238
8577a11238J8706Q147j0029L8309J09241l20037K30930j6754N0570m1554r0211
$$ -111238 -92532 -84385 -94414 -56105 53136 -266901 -35971 -52725 -2155 -43709 -133920
8566a33920M0800q1039P2551J3777J52524Q3259L1058L457k03338j14756P4181
$$ -133920 -93120 -174159 -101608 -87831 64693 147952 179010 182467 -20871 -135627 -61446
8555f1446j39946J02129P3178K8950L4465m3857j07718K2452J3395j7428l473
$$ -61446 -201392 -99263 -26085 2865 37330 -6527 -114245 -91793 -78398 -95826 -99299
8544i9299J43092O6128j83955j11162j18817K68101J74395k11016o1382L93K1381
$$ -99299 43793 109921 -74034 -185196 -304013 -35912 138483 -72533 -133915 -133522 -112141
8533a12141R3618J9404J02022j31244q7766q2089P4669P758o5269N3165l9200
$$ -112141 -18523 881 102903 -28341 -116107 -198196 -123527 -115769 -181038 -127873 -167073
8522a67073p2528K67850j5465r1778P6545o7256K948j03409k3489k8900M827R7443
$$ -167073 -239601 28249 12784 -78994 -2449 -69705 -66757 -170166 -193655 -222555 -217728 -120285
8510a20285N4724p6543L1583L0316L9804J96N937J40617j38254K3527j33149J18685
$$ -120285 -65561 -142104 -110521 -80205 -40401 -40205 -34268 106349 -31905 -8378 -141527 -22842
8498b2842O0166r9291J25433j72790K51774J3336j67573q1952l5021L7853K27743
$$ -22842 37324 -61967 63466 -109324 142450 155786 -11787 -93739 -128760 -90907 136836
8487A36836J7501q2122N1760k10186j8819J03349p6441K6786m1885Q2840k8996
$$ 136836 154337 72215 123975 -86211 -105030 -1681 -78122 -51336 -93221 -10381 -39377
8476c9377p5724r1603J64735J7754j00414L0914P7205N1173p0704K05m8902Q8201
$$ -39377 -115101 -206704 -41969 -24215 -124629 -93715 -16510 34663 -36041 -35836 -84738 3463
8464C463P1590j7885k1581O730J7124r237K9102m9557m4074k8510P603J7561P4394
$$ 3463 75053 57168 35587 42317 59441 50204 79306 29749 -14325 -42835 -35232 -17671 56723
8451E6723J18485n3795r4073M2003j7729J34268J3015n334q809M5607j36620n5862
$$ 56723 175208 121413 27340 69343 51614 185882 198897 193563 184754 230361 93741 37879
8439C7879R7117l1947l6260n4203j3435l0285p0898M2113O2301q0940j2678K08056
$$ 37879 134996 103049 66789 12586 -849 -31134 -102032 -59919 2382 -78558 -91236 116820
8427A16820p907k3075j40504J6591J48334Q3541l7918k21597k0896o4062O1836
$$ 116820 108913 85838 -54666 -38075 110259 193800 155882 -65715 -86611 -150673 -88837
8416h8837J50948l6800o1584n80J35662r1471j27497j01884J58009j22592M9271
$$ -88837 62111 25311 -36273 -36853 98809 7338 -120159 -222043 -64034 -186626 -137355
8405a37355N0182Q860P355Q6185J18737N2079k7341j34471P9819j48088N2658
$$ -137355 -87173 -78313 -70958 15227 133964 186043 158702 24231 104050 -44038 8620
8394H620Q0826K0417j22392j743J0544L62n3535j6906Q6948l8803j03723J85861
$$ 8620 89446 109863 -12529 -14272 -3728 -3366 -56901 -73807 13141 -25662 -129385 56476
8382E6476o0382k1153l6881J47891r8742O9874O4025q8791P5159K3294l3606m496
$$ 56476 -3906 -25059 -61940 85951 -12791 57083 121108 32317 107476 130770 97164 92668
8370I2668j49319K0171L380n5250k3484r347R3732q37J7907M7292q3734J5564
$$ 92668 -56651 -36480 -33100 -88350 -111834 -121181 -27449 -28286 -10379 36913 -46821 -31257
8358c1257p2320N4928l0281J39211J30823j37512o0719K4841N1323J9045j64482
$$ -31257 -103577 -48649 -78930 60281 191104 53592 -7127 17714 69037 88082 -76400
8347g6400O2660m5562N0156q8736J97956N1480J7382J8803q5923N9777j27061
$$ -76400 -13740 -59302 -9146 -97882 100074 151554 168936 187739 101816 161593 34532
8336C4532r0323J31674r294j20882L1913l9105O6268r706P2980p7249p1961K1040
$$ 34532 -55791 75883 66589 -54293 -22380 -61485 4783 -4923 68057 -9192 -81153 -60113
8324f0113J05366j8753J340m576o421N9142l4645k2329n0428N0800n3580p3884
$$ -60113 45253 26500 27840 23264 16843 75985 41340 19011 -31417 19383 -34197 -108081
8312a08081M2396l9524K01992k1118r1765l3367K13406n5804J6467j84956J59325
$$ -108081 -65685 -105209 96783 75665 -16100 -49467 163939 108135 124602 -60354 98971
8301I8971J01185j61303J55319p9354Q0768q7450q4163l086l8307q9247j547J42693
$$ 98971 200156 38853 194172 114818 195586 108136 23973 20887 -17420 -106667 -108214 34479
8289C4479j41259K1145J15036j8177J4738j1462n7967l2952p1233O6865J05957
$$ 34479 -106780 -85635 29401 11224 25962 14500 -43467 -76419 -147652 -80787 25170
8278B5170p6958J6929L5005K1297K8905r7115J75168j00947n2312k6347M7591
$$ 25170 -51788 -34859 146 21443 50348 -46767 128401 27454 -24858 -51205 -3614
8267c614l2873m2434N6909J2153m7519K2068R9515q2543J6284k0394o1201l2831
$$ -3614 -36487 -78921 -22012 -9859 -57378 -35310 64205 -18338 -2054 -22448 -83649 -116480
8255a16480P0751R8000r6251O262P0364r0331N9162j0975P69l5900L3376l4034
$$ -116480 -45729 52271 -43980 -37718 32646 -57685 1477 -9498 -8729 -44629 -11253 -45287
8243d5287j723R8960r0225J0022l5714k1396k9632K8655l5859J27217O865k5631
$$ -45287 -47010 51950 -38275 -28253 -63967 -85363 -114995 -86340 -122199 5018 11883 -13748
8231a3748j4941n3993J02558L327Q2178j65358L1125M0352n216J02624m4733j15284
$$ -13748 -28689 -82682 19876 23203 105381 -59977 -28852 11500 6284 108908 64175 -51109
8219e1109Q4147R624j00820J74925j08004r2541J937J5947L7J23712m9388j29564
$$ -51109 33038 42662 -58158 116767 8763 -83778 -81841 -65894 -65857 57855 8467 -121097
8207a21097R3784J73416R924j04168r3016L5257P0511m2848r2371J1053L5097
$$ -121097 -27313 146103 156027 51859 -41157 -5900 64611 21763 -70608 -59555 -24458
8196b4458O3607O4891o2689L761j24820Q2498j02336M7080L4945Q8857J8612k7412
$$ -24458 39149 104040 41351 45112 -79708 2790 -99546 -52466 -17521 71336 89948 62536
8184F2536P29Q354J658p6843l2008p031k2821q9355M3032J62465M5489j63972
$$ 62536 63265 71619 73277 -3566 -35574 -42605 -65426 -154781 -111749 50716 96205 -67767
8172f7767J22556J6951j05887k8709M1082q9185K7127K2532j52465J6771J4558
$$ -67767 54789 71740 -34147 -62856 -21774 -110959 -83832 -61300 -213765 -196994 -182436
8161a82436J06096O3271o6954L748Q6408j1067j14871P1257N0511r0256k7832
$$ -182436 -76340 -13069 -80023 -76275 10133 -934 -115805 -44548 5963 -84293 -112125
8150a12125Q1285N2587O2278n6112n8109J09214j2237o4856J6321r6053M5203
$$ -112125 -30840 21747 84025 27913 -30196 79018 66781 1925 18246 -77807 -32604
8139c2604K1487j1168l0299j8607L9449p2209J12617j5998j7699J4357j8131m3892
$$ -32604 -11117 -22285 -52584 -71191 -31742 -103951 8666 -7332 -25031 -10674 -28805 -72697
8127g2697P0998N7589r999j81403o5640j0163N6256J38928L108j21079O9751M6196
$$ -72697 -1699 55890 45891 -135512 -201152 -211315 -155059 -16131 -13023 -134102 -64351 -18155
8115a8155p2778J47757r2875o7229l7160J18656M692O0421J2453l0582o6466J6621
$$ -18155 -90933 56824 -36051 -103280 -140440 -21784 -17092 43329 55782 25200 -41266 -24645
8103b4645J3100r8738J16712o6082R9796n3496l2030J1490J11987p8667j60677
$$ -24645 -11545 -110283 6429 -59653 40143 -13353 -45383 -33893 78094 -573 -161250
8092a61250J04321J5029p725p4342Q0156M6896k8119K1452l1909J22019j41024
$$ -161250 -56929 -41900 -49625 -123967 -43811 3085 -25034 -3582 -35491 86528 -54496
8081e4496j9179m2806j59116P1331K02268j3230K1670j0361M7831m9792j6537
$$ -54496 -73675 -116481 -275597 -204266 -1998 -15228 6442 -3919 43912 -5880 -22417
8070b2417l5296j8o0098j19786L1235K41622j00931j25042L4168L2681R5484q7869
$$ -22417 -57713 -57731 -117829 -237615 -206380 35242 -65689 -190731 -156563 -123882 -28398 -116267
8058a16267M1371J75440J7883n7634P0723k1695j35145o9721J70786O3687k08745
$$ -116267 -74896 100544 118427 60793 131516 109821 -25324 -95045 75741 139428 -69317
8047f9317J0905N4925o7264R0296K292k7597O6240K0710q6607J37161j38350Q2919
$$ -69317 -58412 -3487 -70751 19545 21837 -5760 60480 81190 -5417 131744 -6606 76313
8035G6313r0661O8535k5760j53961Q6979J09300K5743l9875J5185r4997m8241
$$ 76313 -14348 54187 28427 -125534 -38555 70745 96488 56613 71798 -23199 -71440
8024g1440o9141Q5403m6068L2735Q5412j09785L1626J0738L8281N8047j6001j36576
$$ -71440 -140581 -55178 -101246 -68511 16901 -92884 -61258 -50520 -12239 45808 29807 -106769
8012a06769J59013n2524L5421k1363J6732L411j5017O9909j06280J99345k0604
$$ -106769 52244 -280 35141 13778 30510 33921 18904 88813 -17467 181878 161274
8001A61274n7971K25528r7163j36811J90070m5760r0682M2818j16292j80449Q7256
$$ 161274 103303 328831 231668 94857 284927 239167 148485 191303 75011 -105438 -18182
7990a8182P7668J7899J2327J1507q2393j39469Q1495M8480K7041R2207m215o5477
$$ -18182 59486 77385 89712 101219 18826 -120643 -39148 9332 36373 128580 124365 58888
7978E8888j17631k7040J88376m4760j04752N4057R940L6617j01023J02739K5829
$$ 58888 -58743 -85783 102593 57833 -46919 7138 17078 53695 -47328 55411 81240
7967H1240j1362q6289N2293R1021n767N5127K782n2656j34507j27338J19748n2204
$$ 81240 69878 -16411 35882 126903 121136 176263 179045 126389 -8118 -135456 -15708 -67912
7955f7912j20021J43679k4568l5102m6829J32037l8404K09293j11428p5171o5456
$$ -67912 -187933 -44254 -68822 -103924 -150753 -18716 -57120 152173 40745 -34426 -99882
7944i9882J29673k6779n654J42061p9422j82364P3782M4365k2694R4551q931q545
$$ -99882 29791 3012 -2642 139419 59997 -122367 -48585 -4220 -26914 67637 58706 50161
7932E0161m8993J18234q9953m2930N4629M9395J1221r2999l0884O7594R0708j98417
$$ 50161 1168 119402 29449 -13481 41148 90543 101764 8765 -22119 45475 136183 -62234
7920f2234J13190J07249r0728Q13Q4584J4589k4065j15271J80727O5730k20550
$$ -62234 50956 158205 67477 68290 152874 167463 143398 28127 208854 274584 54034
7909E4034P5364j21890J39897l4813m1018R0993p2256j05673N6399m6433L34066
$$ 54034 129398 7508 147405 112592 71574 162567 90311 -15362 41037 -5396 328670
7898C28670j42097j16932L3186J88610j92657J6873r7835p831P073Q7752L4176
$$ 328670 186573 69641 102827 291437 98780 115653 17818 9987 17060 104812 138988
7887A38988j68146M0108n6567J68332o8419l4832J20654K2978j14225J4424l4102
$$ 138988 -29158 10950 -45617 122715 54296 19464 140118 163096 48871 63295 29193
7876B9193L1715p4683M3099J82117k19547Q2706L9686k9360j46163J21430J33936
$$ 29193 60908 -13775 29324 211441 -8106 74600 114286 84926 -61237 60193 194129
7865A94129n1777l1686j40664P3126M059Q1775n7985o8553p5874M9111p490L0837
$$ 194129 142352 110666 -29998 43128 47187 128962 70977 2424 -73450 -24339 -31829 -992
7853i92j15291M8501J08897l4027o6908k6261M132J14356l9190r2847J9376M4016
$$ -992 -116283 -67782 41115 7088 -59820 -86081 -81949 32407 -6783 -99630 -80254 -36238
7841c6238J12144o809N4275J1911M5736r9663q0485N2104P6809K296r4063R9209
$$ -36238 75906 69097 123372 135283 181019 81356 871 52975 129784 132080 38017 137226
7829A37226m7294N9507p2829j09966j06733J94088m6611r3426M6721J66155J8158
$$ 137226 89932 149439 76610 -33356 -140089 53999 7388 -86038 -39317 126838 144996
7818A44996m7328N3392J04979p3559m0111j23468j58824R4803J14891M7060n388
$$ 144996 97668 151060 256039 182480 142369 18901 -139923 -45120 69771 116831 111443
7807A11443R5247n9167K83q3805N1225j20289R2198Q7143K0762J345l10227j26989
$$ 111443 206690 147523 147806 64001 115226 -5063 87135 174278 195040 196385 -113842 -240831
7795b40831J56092O1777N2021M3519M5074q1994o0290k234J47580L6127J8764
$$ -240831 -84739 -22962 29059 72578 117652 35658 -24632 -26866 120714 156841 175605
7784A75605j86838J5052m1514R5717P3222j54092o2644J14983L0695P0267j9489
$$ 175605 -11233 3819 -37695 58022 131244 -22848 -85492 29491 60186 130453 110964
7773A10964j70297r0641J01617M7048J09608r721j86238P3235Q689o9619J772
$$ 110964 -59333 -149974 -48357 -1309 108299 98578 -87660 -14425 -5736 -75355 -73583
7762g3583J16459m6474J08741j45216k290K04739M6032j38105q4359J8776M6099
$$ -73583 42876 -3598 105143 -40073 -42363 162376 208408 70303 -14056 4720 50819
7751E0819r4578K9288j14811L5736l0507R680O5145O5097o5979K2354Q7634j14368
$$ 50819 -43759 -14471 -129282 -93546 -124053 -114373 -49228 15869 -50110 -27756 59878 -54490
7739e4490n4114J16720P8139L043o043r5521j17049J06563j4687Q0811K0623k5123
$$ -54490 -108604 8116 86255 89298 83255 -12266 -129315 -22752 -37439 43372 63995 38872
7727C8872p9407O7609j2519o4057R7342L4334j30971p038J96639P1308q9280L9362
$$ 38872 -40535 27074 14555 -49502 47840 82174 -48797 -55835 140804 212112 122832 162194
7715A62194J24770k10828O7216N7786K5707k91459N3905k3969O0202M6120m635
$$ 162194 286964 76136 143352 201138 226845 -64614 -10709 -34678 25524 71644 67009
7704F7009o5553k8703O3526j02930J34379N0586o1399l4011L4711J2007l0641
$$ 67009 1456 -27247 36279 -66651 67728 118314 56915 22904 57615 69622 38981
7693C8981J28104n9526q8987O583n4578j3328J51513R355J076J3814n5821N8726
$$ 38981 167085 107559 18572 25155 -29423 -42751 108762 118117 119193 133007 77186 135912
7681A35912K9987J7594p2536J6901Q4449J21466N7361K918j30947j11367M169
$$ 135912 165899 183493 110957 127858 212307 333773 391134 394052 263105 151738 155907
7670A55907l3932K1858m1184k2417J29777k8459k7659K3046p6655L7725P0804
$$ 155907 121975 143833 102649 80232 210009 181550 153891 176937 100282 138007 208811
7659B08811L1939L0554j08122p7755J95396j51047j18179L4647K31336N7239q6895
$$ 208811 240750 271304 163182 85427 280823 129776 11597 46244 277580 334819 247924
7648B47924K8868J1334o8122j22956K63365o7263j2245j23666J29017j06917M5966
$$ 247924 276792 288126 220004 97048 360413 293150 280905 157239 286256 179339 225305
7637B25305Q2632j06990p9148M8995J37108k0102M8519p9570j41802J16959N7526
$$ 225305 307937 200947 121799 170794 307902 287800 336319 256749 114947 231906 289432
7626B89432p1246J92822n850l4381k6109J65617j38571l7845P7714N7796J96733
$$ 289432 218186 411008 405158 370777 344668 510285 371714 333869 411583 469379 666112
7615F66112j62633j19336p385J74694p80l2613l0788M6043j40681N3154j2445
$$ 666112 503479 384143 376758 551452 550672 518059 487271 533314 392633 445787 433342
7604D33342p9140M605P3489m8611j45265J63429r9847Q6189P384O5385N5713r2417
$$ 433342 354202 358807 432296 383685 238420 401849 302002 388191 395575 460960 516673 424256
7592D24256q6494J42557j7046o1514n5248k3892J41966q2455j3629J0102r8471
$$ 424256 337762 480319 463273 401759 346511 322619 464585 382130 368501 378603 280132
7581B80132N7875j54212m155J96690p4904j8445K0331J231l0907l5447M8889j37859
$$ 280132 338007 183795 179640 376330 301426 282981 303312 304543 273636 238189 287078 149219
7569A49219J19319j7166m604J32252j04398R3721O603q4514p5686n0765K1717
$$ 149219 268538 251372 246768 379020 274622 368343 374946 290432 214746 163981 185698
7558A85698q516J21158L3248p700p1561K1562j0605J32194k1467O5946L0456j93064
$$ 185698 177182 298340 331588 323888 252327 273889 263284 395478 374011 439957 470413 277349
7546B77349Q5707n8826N1355O328L4158P7192n8374L0876j81365K8304J43582
$$ 277349 363056 304230 355585 361913 396071 473263 414889 445765 264400 292704 436286
7535D36286l6728j28923P8933j9018K0196l4420J22006j7679j0082o9890Q5935
$$ 436286 399558 270635 349568 330550 350746 316326 438332 420653 410571 340681 426616
7524D26616J43711j22465J35987L0918j41420n1204J30094p3739j75794j948J37171
$$ 426616 570327 447862 583849 614767 473347 422143 552237 478498 302704 300756 437927
7513D37927r8912J70824p5638P4424J28650m7050q7437q461J7648j24376K4164
$$ 437927 339015 509839 434201 508625 637275 590225 502788 494327 511975 387599 411763
7502D11763J14706k6780o0513J80963n2908j25377J38048M5533j21204N8247K9803
$$ 411763 526469 499689 439176 620139 567231 441854 579902 625435 504231 562478 592281
7491E92281k9315K8489N6324j7995m1248J4421K1584P0887p2611J53599q8196
$$ 592281 562966 591455 647779 629784 588536 602957 624541 695428 622817 776416 688220
7480F88220N9876K0350j25327j45912O8865J40737O3261j00324o829Q0722R7583
$$ 688220 748096 768446 643119 497207 566072 706809 770070 669746 662917 743639 841222
7469H41222j1512q8063k3672m636L1164j1756Q0186n2126j12740P8648O0361Q9365
$$ 841222 829710 741647 717975 713339 744503 732747 812933 760807 648067 726715 787076 876441
7457H76441j44061L4766Q3812K15360j6521j6771q036J5717K45927k9730N287
$$ 876441 732380 767146 850958 1066318 1049797 1033026 1024990 1040707 1286634 1256904 1262191
7446A262191j783O8306k01857J832n2093l591Q2935J11122L953L478p4753J22744
$$ 1262191 1260408 1328714 1126857 1128689 1076596 1073005 1155940 1267062 1271015 1274493 1199740 1322484
7434A322484n7882J09470M3566o8496R8657J16778O3096Q3589Q1644J14875l5025
$$ 1322484 1264602 1374072 1417638 1349142 1447799 1564577 1627673 1711262 1792906 1907781 1872756
7423A872756L855J05758j59618n0321J26287J55619J79503k982J27571K3781N6829
$$ 1872756 1876611 1982369 1822751 1772430 1898717 2054336 2233839 2230857 2358428 2382209 2439038
7412B439038J46831O2769K05724M3242L09100J35232K77867R1332J70606K64781
$$ 2439038 2585869 2648638 2854362 2897604 3206704 3341936 3619803 3711135 3881741 4146522
7402D146522M14808J92397K25411M82489N02035O56045R54558N91017M25172J78889
$$ 4146522 4561330 4753727 4979138 5461627 5963662 6619707 7574265 8165282 8590454 8769343
7392H769343k93303m78795n60461k68402j05912j0094k28444J0662k22084k86883
$$ 8769343 8476040 7997245 7436784 7168382 7062470 7052376 6823932 6834594 6612510 6325627
7382F325627J5716j3415j07082R517N2932K83805J75213K44572K77575L81784
$$ 6325627 6341343 6327928 6220846 6230363 6283295 6567100 6742313 6986885 7264460 7646244
7372G646244N02218M36808O57404L27339M26976P30115N19785Q14540J176821
$$ 7646244 8148462 8585270 9242674 9570013 9996989 10727104 11246889 12061429 13238250
7363A3238250J323780R10383M17663k1561m81554p05135p00710o93967m76046
$$ 13238250 14562030 15472413 15890076 15868515 15386961 14681826 13981116 13287149 12811103
7354A2811103k77083l18080m34977j09195Q4490K00413K32699L68806N82681M42845
$$ 12811103 12534020 12215940 11780963 11671768 11756258 11956671 12189370 12558176 13140857 13583702
7344A3583702N81841O67764P86260J254682J671603J850477K282073K757360K340691
$$ 13583702 14165543 14833307 15619567 16874249 18545852 20396329 22678402 25435762 27776453
7335B7776453J616442N11278l58787p55815m09556L82160N30368l8624j078801
$$ 27776453 29392895 29904173 29545386 28789571 28380015 28762175 29292543 29253919 28175118
7326B8175118j873113k456845k298427j829832j434981q08191n78684k46880o1005
$$ 28175118 26302005 23845160 21546733 19716901 18281920 17473729 16895045 16648165 16587160
7317A6587160K22156P87085J240592J526023K000497K296737J508922J453271
$$ 16587160 16809316 17596401 18836993 20363016 22363513 24660250 26169172 27622443
7309B7622443J435738Q60477L17248l80554j027205r71241j422597j999319k508005
$$ 27622443 29058181 29918658 30235906 29855352 28828147 27856906 26434309 24434990 21926985
7300B1926985k824342k543520j967361j480569j026761j023165n89450r00303
$$ 21926985 19102643 16559123 14591762 13111193 12084432 11061267 10471817 9571514
7292I571514p96306m56332n43140l21496m48844m53131j50605j84290j69361k81881
$$ 9571514 8775208 8318876 7775736 7454240 7005396 6552265 6401660 6217370 6048009 5766128
7282E766128K2741k05812j31866o4144k26151j93064j19809k24476k01278k25374
$$ 5766128 5788869 5583057 5451191 5387047 5160896 4967832 4848023 4623547 4422269 4196895
7272D196895Q4655l9569o1361J7072j1955j24603k3530J01713r1919K80192j16026
$$ 4196895 4281550 4241981 4180620 4197692 4185737 4061134 4037604 4139317 4047398 4327590 4211564
7261D211564O5504l0847M5457j3530N6492o9675j1373m9553K3780K08258J05043
$$ 4211564 4277068 4246221 4291678 4278148 4334640 4264965 4253592 4204039 4227819 4436077 4541120
7250D541120p662L24569N8849J65239J1645o255l630l33O7382m2641j45430k4871
$$ 4541120 4533458 4858027 4916876 5082115 5093760 5087505 5083875 5083542 5150924 5108283 4962853 4937982
7238D937982j35397p3242j39913l1820J21124N4622j86003J25645N9996j0148
$$ 4937982 4802585 4729343 4589430 4557610 4678734 4733356 4547353 4672998 4732994 4722846
7228D722846R9467R0601J83727J61249P1900J31549K16059J62678j7872L1629
$$ 4722846 4822313 4912914 5096641 5257890 5329790 5461339 5677398 5840076 5822204 5853833
7218E853833O6158p237j70876l8940k68391j03844k5584j11911j08600r6640P915
$$ 5853833 5919991 5912754 5741878 5702938 5434547 5330703 5305119 5193208 5084608 4987968 4995883
7207D995883r1435L1562L6436J34090O489J50119N4363j76469J69733J58297J5685
$$ 4995883 4904448 4936010 4972446 5106536 5113025 5263144 5317507 5141038 5310771 5469068 5484753
7196E484753l6521q27J30251K8115J24078J4417K11996P4211j3395P6903J75045
$$ 5484753 5448232 5447405 5577656 5605771 5729849 5744266 5956262 6030473 6017078 6093981 6269026
7185F269026L5729J73687P9838J10620J60096J90313P5214J75880M7505O8863
$$ 6269026 6304755 6478442 6558280 6668900 6828996 7019309 7094523 7270403 7317908 7386771
7175G386771N611J85731L56798K48718K6690M01146N9339K78016K18656J90267
$$ 7386771 7392382 7578113 7934911 8183629 8210319 8611465 8670804 8948820 9167476 9357743
7165I357743L77842J26651M38321L51168M71887L98646M26554N16969M13829M78696
$$ 9357743 9735585 9862236 10300557 10651725 11123612 11522258 11948812 12465781 12879610 13358306
7155A3358306O15984O92323P32288M22388N31329N76699N12910P69176P65513
$$ 13358306 13974290 14666613 15398901 15821289 16352618 16929317 17442227 18211403 18976916
7146A8976916J062315J047478J455844J539381J565754K092223J893933J601232
$$ 18976916 20039231 21086709 22542553 24081934 25647688 27739911 29633844 31235076
7138C1235076J016587O03033M99602O86880J313024J611538J546624J604949J374808
$$ 31235076 32251663 32854696 33354298 34041178 35354202 36965740 38512364 40117313 41492121
7129D1492121N74518J8797L0865L99561R84324J379144O80538L98483l8316Q6403
$$ 41492121 42066639 42085436 42116301 42515862 43500186 44879330 45559868 45958351 45920035 46006438
7119D6006438Q06307J712635K141344K396759K077725K009561K290863L222987
$$ 46006438 46812745 48525380 50666724 53063483 55141208 57150769 59441632 62664619
7111F2664619M801621N441302M275110L687265K850318J804003P57720k097519
$$ 62664619 67466240 72907542 77182652 80869917 83720235 85524238 86281958 84184439
7103H4184439m093381m814091m788641l408233k558106j750106j618539j703137
$$ 84184439 80091058 75276967 70488326 67080093 64521987 62771881 61153342 59450205
7095E9450205j795594j566383j198895k47058M19569O00170R14497R60544J723556
$$ 59450205 57654611 56088228 54889333 54642275 55061844 55662014 56576511 57537055 59260611
7086E9260611K641536M073014N013459N853478M253860J292598q13171j844114
$$ 59260611 61902147 65975161 70988620 76842098 81095958 82388556 81575385 79731271
7078G9731271q15322J307574K930655K415365N90802j561403m010339m812443
$$ 79731271 78915949 80223523 83154178 85569543 86160345 84598942 80588603 75776160
7070G5776160m366900l461474k663527k278997k138189k144257j855794j011467
$$ 75776160 71409260 67947786 65284259 63005262 60867073 58722816 56867022 55855555
7062E5855555m28803K17543Q14860O29108O41200J018062J051269J473900J823002
$$ 55855555 55426752 55644295 56459155 57088263 57729463 58747525 59798794 61272694 63095696
7053F3095696K596023K196089K735799K577381K571592K563982L382896M481002
$$ 63095696 65691719 67887808 70623607 73200988 75772580 78336562 81719458 86200460
7045H6200460P057668J0120515J5749590J8209492K5382066J1238774o167984
$$ 86200460 93258128 103378643 119128233 137337725 162719791 173958565 167790581
7038A67790581j4334594k2589266k0155668j5047764r628222q155278o079381
$$ 167790581 153455987 130866721 110711053 95663289 86035067 77879789 71800408
7031G1800408m977927l797702l217916j729630j526435r81165j012784o44225
$$ 71800408 66822481 63024779 59806863 58077233 56550798 55569633 54556849 53912624
7023E3912624m93275q6211k17880M51855O31559R14692Q26890J217219J698863
$$ 53912624 53419349 53333138 53115258 53567113 54198672 55113364 55940254 57157473 58856336
7014E8856336J696107J478676J613425J642226J763885K056393J807667J122419
$$ 58856336 60552443 62031119 63644544 65286770 67050655 69107048 70914715 72037134
7006G2037134R45040J254809J131966J346788K047382K164944K660694K668363
$$ 72037134 72982174 74236983 75368949 76715737 78763119 80928063 83588757 86257120
6998H6257120L274727L526976M754493N246279O006935O450346P112077P674959
$$ 86257120 89531847 93058823 97813316 103059595 109066530 115516876 122628953 130303912
6990A30303912P559800P885344Q380323R141663J0286587R576363Q246249P362765
$$ 130303912 137863712 145749056 154129379 163271042 173557629 183133992 191380241 198743006
6982A98743006O837763P594935R656910J1980775J6415101K1059596K5879783
$$ 198743006 205580769 213175704 222832614 234813389 251228490 272288086 298167869
6975B98167869K5235766J2409312O0573q105263j1198903p577214o282040r373628
$$ 298167869 323403635 335812947 335873520 327768257 316569354 308992140 302710100 293336472
6967B93336472j1395829j2178274j0220232o451777j882290K104249M119878N581877
$$ 293336472 281940643 269762369 259542137 253090360 251208070 253312319 257432197 263014074
6959B63014074O362802N794778O562294Q822570J3014750J9202966K6490540L2593152
$$ 263014074 269376876 275171654 281733948 290556518 303571268 322774234 349264774 381857926
6951C81857926L3784411K7169514J7754332K381284j1834253k0779156k5925159
$$ 381857926 415642337 442811851 460566183 462947467 451113214 430334058 404408899
6944D04408899k6048673k9281532l1933097l2918961l1061560k6938524k1260780
$$ 404408899 378360226 349078694 317145597 284226636 253165076 226226552 204965772
6937B04965772j6064408j1991321q873295o126482l969256j754269P39535L603926
$$ 204965772 188901364 176910043 168036748 161910266 157941010 156186741 156926276 160530202
6929A60530202O773798R374750J1032377N750645j818558o428977r484041q750327
$$ 160530202 167304000 176678750 187711127 193461772 191643214 185214237 175730196 166979869
6921A66979869o866517q372277j0724853j2141558j2586870j1271540r315548
$$ 166979869 160113352 151741075 141016222 128874664 116287794 105016254 95700706
6914I5700706p637210o129500n047160m181416l396680l113309k495156k288598
$$ 95700706 88063496 81933996 76886836 72705420 69308740 66195431 63700275 61411677
6906F1411677j983366j781341j589836j492502j156678r51295p89401q44258j036995
$$ 61411677 59428311 57646970 56057134 54564632 53407954 52456659 51667258 50823000 49786005
6897D9786005p09526o15824m33489k04751j32443O3893Q6239J63506M58910K20589
$$ 49786005 49076479 48460655 48027166 47822415 47689972 47753865 47840104 48003610 48462520 48683109
6887D8683109L19567J94986P12085Q38676R32245Q82323N27106P609k6289j6993
$$ 48683109 49002676 49197662 49909747 50748423 51680668 52562991 53090097 53097706 53071417 53054424
6877E3054424N00096N06573M93074M26765J463j4738M24001N83648Q59388J286755
$$ 53054424 53554520 54061093 54554167 54980932 54982395 54967657 55391658 55975306 56834694 58121449
6867E8121449J374551J489623J463825J810546J846129K344807K840911L593403
$$ 58121449 59496000 60985623 62449448 64259994 66106123 68450930 71291841 74885244
6859G4885244M187348M623398M705152M183154L446302K634975K575297K667766
$$ 74885244 79072592 83695990 88401142 92584296 96030598 98665573 101240870 103908636
6851A03908636L175909L118374K316679J121369Q57236J251371J968316L578123
$$ 103908636 107084545 110202919 112519598 113640967 114498203 115749574 117717890 121296013
6843A21296013N588913Q115030J1116664J3383792J5802773J3954003J0652135
$$ 121296013 126884926 134999956 146116620 159500412 175303185 189257188 199909323
6836A99909323Q042765O231357K926000l024372o637479r317388j0181639q387746
$$ 199909323 207952088 214183445 217109445 214085073 207447594 198130206 187948567 179560821
6828A79560821o034266m583641l022184k114555j601668j329163l27656R12576
$$ 179560821 173526555 168942914 165920730 163806175 162204507 160875344 160547688 161460264
6820A61460264K587536M298264P236034R358079J2159543J3269941J1969752J1514536
$$ 161460264 164047800 168346064 175582098 184940177 197099720 210369661 222339413 233853949
6812B33853949J2256193J2176581J1419013P755611k331469r996914j5038330
$$ 233853949 246110142 258286723 269705736 277461347 275129878 265132964 250094634
6805B50094634j6541813j5106345j2640193j0116405q309682o894666n736410
$$ 250094634 233552821 218446476 205806283 195689878 187380196 180485530 174749120
6798A74749120m611177l542963k146964j170528k5529J319079L134559N320034
$$ 174749120 170137943 166594980 164448016 163277488 163251959 164571038 167705597 173025631
6790A73025631P739589J0633116J2956856J2977278J3299467J4615174J6868321
$$ 173025631 180765220 191398336 204355192 217332470 230631937 245247111 262115432
6783B62115432J8012337J7274034J3343246O167101o77858o861913j3121891j8308695
$$ 262115432 280127769 297401803 310745049 316912150 316234292 309372379 296250488 277941793
6775B77941793k1167376k1485672j9536365j6193688j2885593j0981611j0250101
$$ 277941793 256774417 235288745 215752380 199558692 186673099 175691488 165441387
6768A65441387r739051q848008p809591n918100m093771k410673o49920J083270
$$ 165441387 155702336 146854328 139044737 133126637 129032866 126622193 125972273 127055543
6760A27055543K766424M522711O514709Q401905J0543325J1664937J1535722Q437997
$$ 127055543 129821967 134344678 140859387 149261292 159804617 171469554 183005276 191443273
6752A91443273K831381k524153n878801p370912q380989j0387981j2950964j4385265
$$ 191443273 194274654 191750501 185871700 178500788 170119799 159731818 146780854 132395589
6744A32395589j4426915j3433890j1445893r455047p753951o434908n364032m237990
$$ 132395589 117968674 104534784 93088891 83633844 75879893 69444985 64080953 59842963
6736E9842963l807727l080945k710279k519192k233370k228309j800124j662911
$$ 59842963 56035236 52954291 50244012 47724820 45491450 43263141 41463017 39800106
6728C9800106j751387j615541j517721j601855j526676j326263j244092j166522
$$ 39800106 38048719 36433178 34915457 33313602 31786926 30460663 29216571 28050049
6720B8050049j189194j041326r85935r69100o14013p78325p10823n98256n04359
$$ 28050049 26860855 25819529 24833594 23864494 23250481 22472156 21761333 21163077 20658718
6711B0658718m70954m94794l21407n20033m62863n49508l66161l22469j91092
$$ 20658718 20187764 19692970 19371563 18851530 18388667 17839159 17472998 17150529 16959437
6702A6959437l46328m10438j74634j42226l21419l12319k91812j44965n00920
$$ 16959437 16613109 16202671 16028037 15885811 15564392 15252073 14960261 14815296 14314376
6693A4314376k56509l27123n47628m05973l06682l29222m00601r0809k43615k98320
$$ 14314376 14057867 13730744 13183116 12777143 12470461 12141239 11740638 11649829 11406214 11107894
6683A1107894m6280l6481k62687k40951k94170l49417k37412M0878j74498p7440
$$ 11107894 11061614 11025133 10762446 10521495 10227325 9877908 9640496 9681374 9506876 9429436
6673I429436k755j81870r572J4237l79777k00263l42707k20691j72087j93258
$$ 9429436 9426681 9244811 9235239 9249476 8869699 8669436 8326729 8106038 7933951 7740693
6663G740693j31691j95996l04258k72103k2640r1215j82074j40756k06281Q330
$$ 7740693 7609002 7413006 7108748 6836645 6814005 6722790 6540716 6399960 6193679 6202009
6653F202009j5193j11126j75045j75772N9864n1258j08447O733r9645p1489K0478
$$ 6202009 6186816 6075690 5900645 5724873 5784737 5733479 5625032 5631765 5532120 5460631 5481109
6642E481109o8533j32870j6190p3724j31439r4623r8047J08897j5879k8559k6200
$$ 5481109 5412576 5279706 5263516 5189792 5058353 4963730 4865683 4974580 4958701 4930142 4903942
6631D903942K4760q3064P3165k6570j9651J69773M7106K6558j10216R1929n9365
$$ 4903942 4928702 4845638 4918803 4892233 4872582 5042355 5089461 5116019 5005803 5097732 5038367
6620E038367m8997J59834R547O4870j1852J39492N8193j28662K0050m1836J67316
$$ 5038367 4989370 5149204 5158751 5223621 5211769 5351261 5409454 5280792 5300842 5259006 5426322
6609E426322k2463l1010K50901j5009R4466J87182Q4108K14674J41491K10404
$$ 5426322 5403859 5372849 5623750 5608741 5703207 5890389 5974497 6189171 6330662 6541066
6599F541066K11273L04639M26424M89518N88766O28569J076405J332154J221927
$$ 6541066 6752339 7056978 7483402 7972920 8561686 9190255 10266660 11598814 12820741
6590A2820741R76576P17937L08599n1007j56599J46298K51910n55243p23538j002014
$$ 12820741 13797317 14515254 14823853 14772846 14616247 14762545 15014455 14459212 13735674 12733660
6580A2733660j368050q90328q20290m98140m58049l92794j66040j09872j60109
$$ 12733660 11365610 10475282 9654992 9156852 8698803 8306009 8139969 8030097 7869988
6571G869988Q8095K94362M96015L39463Q02507P21148P34652O06425N13785L04066
$$ 7869988 7958083 8252445 8748460 9087923 9890430 10611578 11346230 11952655 12466440 12770506
6561A2770506J8729n4681M5775n5359l59774q24275j250190j128746r85768o02567
$$ 12770506 12789235 12734554 12780329 12724970 12365196 11540921 10290731 9161985 8176217 7573650
6551G573650p90474n91386m86873l59619j99699j81430l64997k10402j73892K4252
$$ 7573650 6783176 6191790 5704917 5345298 5145599 4964169 4599172 4388770 4214878 4239130
6541D239130j47313J80069m2856q6194j10880J0545K83994M886j84152j78416
$$ 4239130 4091817 4271886 4229030 4142836 4031956 4042501 4326495 4331381 4147229 3968813
6531C968813j88479k05746j119j09062j68022j15047j10193o2725Q7750r4943
$$ 3968813 3780334 3574588 3573469 3464407 3296385 3181338 3071145 3008420 3096170 3001227
6521C001227j59176p5595J72366j75367N5362J13256N049O843J51816J07170J17038
$$ 3001227 2842051 2766456 2938822 2763455 2818817 2932073 2937122 2943965 3095781 3202951 3319989
6510C319989m0795p4413Q8641j45408q1633o2596r6168n7066k94546m6197k24928
$$ 3319989 3279194 3204781 3293422 3148014 3066381 3003785 2907617 2850551 2556005 2509808 2284880
6499B284880k67387J40759q3167j19913M3442j09395P885R4542L1073j26373J10289
$$ 2284880 2017493 2158252 2075085 1955172 1998614 1889219 1897104 1991646 2022719 1896346 2006635
6488B006635R177j64788J22385N9928Q5880o8262K23069r6257j88899j3149r1594
$$ 2006635 2015812 1851024 1973409 2033337 2119217 2050955 2274024 2177767 1988868 1975719 1884125
6477A884125o6354O6337k21338M5849j23128j04856j33740Q0784p9315n4689O8759
$$ 1884125 1817771 1884108 1662770 1708619 1585491 1480635 1346895 1427679 1348364 1293675 1362434
6466A362434J7046j8769j86596L1058j06750j36864J08901N1044L1100J19899
$$ 1362434 1379480 1360711 1174115 1205173 1098423 961559 1070460 1121504 1152604 1272503
6456A272503j98715q362O1282j29660J29780n3196j53191K9833P2572R7635r1363
$$ 1272503 1073788 1065426 1126708 997048 1126828 1073632 920441 950274 1022846 1120481 1029118
6445A029118j78219J69727K0277j16657K1274J04861n6055q7281J16662k1616
$$ 1029118 850899 1020626 1040903 924246 945520 1050381 994326 907045 1023707 1002091
6435A002091n8944k0600K03951P9495j18168m4661q0925J9193L7381K6803L9884
$$ 1002091 943147 922547 1126498 1205993 1087825 1043164 962239 981432 1018813 1045616 1085500
6424A085500j19422L3829j1518J41192M3825J07574M0130j15060J8753J69712
$$ 1085500 966078 999907 988389 1129581 1173406 1280980 1321110 1206050 1224803 1394515
6414A394515J709P8589M9400n2471K8590N6709J07668q8487J7707o2576Q5800
$$ 1394515 1396224 1474813 1524213 1471742 1500332 1557041 1664709 1576222 1593929 1531353 1617153
6403A617153J06688J18245M6390k2228J13281k5147K42357J00074N0725J0224
$$ 1617153 1723841 1842086 1888476 1866248 1979529 1954382 2196739 2296813 2347538 2357762
6393B357762N9813K02501K30154J21314J65872J80171K34950K81124K23226K33743
$$ 2357762 2417575 2620076 2850230 2971544 3137416 3317587 3552537 3833661 4056887 4290630
6383D290630K97551L37519L15876K91494N6601k28396j77946k21802O8244O6578
$$ 4290630 4588181 4925700 5241576 5533070 5589671 5361275 5183329 4961527 5029771 5096349
6373E096349j71391k81847k17517l36624j56886j90171k63509q5007O5997J38590
$$ 5096349 4924958 4643111 4425594 4088970 3932084 3741913 3478404 3393397 3459394 3597984
6363C597984p8787m8254J35194J09763M3119K48141K12701J51232J18850J00660
$$ 3597984 3519197 3470943 3606137 3715900 3759019 4007160 4219861 4371093 4489943 4590603
6353D590603k09575l0256k5576j6689j39714j21123k51896k95456m03465l41646
$$ 4590603 4381028 4350772 4325196 4308507 4168793 4047670 3795774 3500318 3096853 2755207
6343B755207k25152k41330k10304k35091r0912n7475r5023j44037r1561m1407
$$ 2755207 2530055 2288725 2078421 1843330 1752418 1694943 1599920 1455883 1364322 1322915
6333A322915r0683o1883o9626n5165o2902J09996J6484o7774J4792r2010L4026
$$ 1322915 1232232 1170349 1100723 1045558 982656 1092652 1109136 1041362 1056154 964144 998170
6322I98170j5182n0109j08969O881r3293J92553o4799p2989L2596k2544R299j87161
$$ 998170 982988 932879 823910 830791 737498 930051 865252 792263 824859 802315 811614 624453
6310F24453J57162j20707q9987L5177J4265K7834K2823n1913K5802q5995p0852
$$ 624453 781615 660908 570921 606098 620363 648197 671020 619107 644909 558914 488062
6299D88062L9002k29412R9202O1938P7211r7227j00572K11249j12766O0045K7086
$$ 488062 527064 297652 396854 458792 536003 438776 338204 549453 436687 496732 523818
6288E23818K8450J9949l8119r0513l8514l1829n1068m2428r1O1l8017j3187J8759
$$ 523818 552268 572217 534098 443585 405071 373242 322174 279746 279655 279716 241699 228512 247271
6275B47271K4298l19n6005Q2348j43790j30290J85010J03664k3324o9889P5930
$$ 247271 271569 271250 215245 297593 153803 23513 208523 312187 288863 218974 294904
6264B94904j44612Q503m6748N8604M478k6797K1789L8517r7360l0477M8342l1444
$$ 294904 150292 158795 112047 170651 175129 148332 170121 208638 111278 80801 129143 97699
6252I7699L0201K6192J2532j07418j8694R3005K0204J17204m6477m8258l7344
$$ 97699 127900 154092 166624 59206 40512 133517 153721 270925 224448 176190 138846
6241A38846L5198q4385n6309J22806m1113n2703Q0313M8852j40851N2286k0341
$$ 138846 174044 89659 33350 156156 115043 62340 142653 191505 50654 102940 82599
6230H2599n7385L0685p0268m7115R8119l0877J8740O6088j0348l7591L8226M0113
$$ 82599 25214 55899 -14369 -61484 36635 5758 24498 90586 80238 42647 80873 120986
6218A20986j81859J8113M3849j80620J24602J20613J2380q9434O7824J3003K8875
$$ 120986 -60873 -42760 1089 -179531 -54929 65684 78064 -11370 56454 69457 98332
6207I8332j28556R8572N8909m0690k3854j6537m8788p026L4483r6650M5501J54940
$$ 98332 -30224 68348 127257 86567 62713 46176 -2612 -9638 24845 -71805 -26304 128636
6195A28636n0184R3801l5939k3616K7603j24140J12628K9012m4572J01990R4283
$$ 128636 78452 172253 136314 112698 140301 16161 128789 157801 113229 215219 309502
6184C09502n2203m5085r9848q6710l7268J89117r6106k5207j42603P3628n447
$$ 309502 257299 212214 112366 25656 -11612 177505 81399 56192 -86411 -12783 -18230
6173a8230M9802P385J22036j47435l9541N8175j8890P1517l3336j02607O3046
$$ -18230 31572 38957 160993 13558 -25983 32192 13302 84819 51483 -51124 11922
6162A1922J66499k53849K4423O3886P9623k5040n2176n8921q561K32144j84773
$$ 11922 178421 -75428 -51005 12881 92504 67464 15288 -43633 -52194 179950 -4823
6151d823J21316J2405k26356J19291L9093R5897j28036j16504J09006Q6175j73054
$$ -4823 116493 128898 -97458 21833 60926 156823 28787 -87717 21289 107464 -65590
6140f5590J00999R8904l0937l9908O2217p420j12917J10594k5224o1512M0322
$$ -65590 35409 134313 103376 63468 125685 118265 5348 115942 90718 29206 69528
6129F9528j82275J65003N5496J4633J7400p7659N9669N784J8341k0493j195j09620
$$ 69528 -112747 52256 107752 122385 139785 62126 121795 127579 145920 125427 124232 14612
6117A4612k3419J08970K18694o5307j62736l0333Q4020M0616K6661p6694m0595
$$ 14612 -8807 100163 318857 253550 90814 60481 144501 185117 211778 135084 94489
6106I4489n3589j1495r1984L7867J25347O0156p7886j09797K7788j66542P3887
$$ 94489 40900 29405 -62579 -24712 100635 160791 82905 -26892 896 -165646 -91759
6095i1759J72475m0672k0562J33145o467j70051O9877O3573j06345r4090J14066
$$ -91759 80716 40044 19482 152627 146160 -23891 45986 109559 3214 -90876 23190
6084B3190J34479j65431J36884J17920j59717J750n7722o768O4903J46667j04198
$$ 23190 157669 -7762 129122 247042 87325 89075 31353 24585 89488 236155 131957
6073A31957J1839q3053m6423J55066m984J8993j90012p6963J07999N2477o9726
$$ 131957 143796 60743 14320 169386 164402 183395 -6617 -83580 24419 76896 7170
6062G170N0336N4074j70136M9487L1833N9345l710j72286J30276j06015N6109
$$ 7170 57506 111580 -58556 -9069 22764 82109 78399 -93887 36389 -69626 -13517
6051a3517j23840l3426P4011N1493O4935J83207j20138L7086M09p9971K9534p8681
$$ -13517 -137357 -170783 -96772 -45279 19656 202863 82725 119811 120220 40249 69783 -8898
6039h898N0835O7935R762o4256m391J1303o9515n0431M952J36975j27078O4391
$$ -8898 41937 109872 119634 55378 50987 62290 -7225 -57656 -52704 84271 -42807 21584
6027B1584K9471m7745N296j15550J47542l9500K5064j5789K6056M0251J19468
$$ 21584 51055 3310 8606 -106944 40598 1098 26162 10373 36429 76680 196148
6016A96148k05243j10745K37640p3224J2331N336N7926l0360o0040M4502j6678
$$ 196148 -9095 -119840 117800 44576 56907 62243 120169 89809 29769 74271 57593
6005E7593n1057L1382q5140l364J22910j72359n3167Q8718J03996n4822j06496
$$ 57593 6536 37918 -47222 -50586 72324 -100035 -153202 -64484 39512 -15310 -121806
5994a21806J09633K45582o7619l1975q4490n5053j05220r7719J1011Q0504J14056
$$ -121806 -12173 233409 165790 133815 49325 -5728 -110948 -208667 -197656 -117152 -3096
5983c096N3100o1092j17777J1709Q1460p3309L5518J3621J37528j09755J6115
$$ -3096 50004 -11088 -128865 -117156 -35696 -109005 -73487 -59866 77662 -32093 -15978
5972a5978o1823P6260J20011p1078l8839j09468Q8918k241p2991j00893J53306
$$ -15978 -77801 -1541 118470 47392 8553 -100915 -11997 -14238 -87229 -188122 -34816
5961c4816Q977r3080J34251M0545j6910J5551N9448j6088K1029j9348o1728n5068
$$ -34816 -25839 -118919 15332 55877 38967 54518 113966 97878 118907 99559 37831 -17237
5949a7237j25594J47209l5552n5953R07J80960m3218j4362o8877m9572p6780n9056
$$ -17237 -142831 4378 -31174 -87127 -86220 94740 51522 37160 -31717 -81289 -158069 -217125
5937b17125K19133J25455j40950n7646L2157k46944O4362K15570j4208q0920L6380
$$ -217125 2008 127463 -13487 -71133 -38976 -285920 -221558 -5988 -20196 -101116 -64736
5926f4736J54511p9844q1599n7536q9865L3446L0755l4900P3652J13004m9134
$$ -64736 89775 9931 -71668 -129204 -219069 -185623 -154868 -189768 -116116 -3112 -52246
5915e2246o6210N3511j7341M3432j466m6252P9895r5427m222j8131O4715j23630
$$ -52246 -118456 -64945 -82286 -38854 -40320 -86572 -6677 -102104 -106326 -124457 -59742 -183372
5903a83372L4070J70671m3776n569j62553k0410l0073l9988M8202m2734l5698
$$ -183372 -149302 21369 -22407 -27976 -190529 -210939 -241012 -281000 -232798 -275532 -311230
5892c11230n7397R6756P0166J94512o3962n5660M9537R3343j99098O079P4071
$$ -311230 -368627 -271871 -201705 -7193 -71155 -126815 -77278 16065 -183033 -176954 -102883
5881a02883L2488j6249L1195o0902P2914j50628M6528O9830J16852j27735q9068
$$ -102883 -70395 -86644 -55449 -116351 -43437 -194065 -147537 -77707 39145 -88590 -177658
5870a77658J6447J439Q5160p4493M3566O9647J36348j53256J00743j62690J65098
$$ -177658 -161211 -159772 -74612 -149105 -105539 -35892 100456 -52800 47943 -114747 50351
5859E0351r571l5633J59777m2794j26896n554O1575j04350r364p1892K1409J06613
$$ 50351 40780 5147 164924 122130 -4766 -10320 51255 -53095 -62459 -134351 -112942 -6329
5847f329k34587m4995L8964J74638Q3401J5209k15005L2669L7184P620k456M4276
$$ -6329 -240916 -285911 -246947 -72309 11092 26301 -188704 -156035 -118851 -111231 -113687 -69411
5835f9411m9511m1155O3419L2122N4527P2552r3429j22317o6549J74865j9021
$$ -69411 -118922 -160077 -96658 -64536 -10009 62543 -30886 -153203 -219752 -44887 -63908
5824f3908o9343m7594L0249l04m9939M2156k1646R807J80342j480j2956j30138
$$ -63908 -133251 -180845 -150596 -150900 -200839 -158683 -180329 -170522 9820 8340 -4616 -134754
5812a34754j06429J75504P6016j91705q6052K08448O6261l8224q8892p3308M6532
$$ -134754 -241183 -65679 10337 -181368 -267420 -58972 7289 -30935 -119827 -193135 -146603
5801a46603n8157Q5787J820P0261p7830M1250J22992j74660R5901L6084J28579
$$ -146603 -204760 -118973 -117153 -46892 -124722 -83472 39520 -135140 -39239 -3155 125424
5790A25424j84820m1469R1530l0819q2653O8739q5188M8680Q4931N0151j30670
$$ 125424 -59396 -100865 -9335 -40154 -122807 -54068 -139256 -90576 -5645 44506 -86164
5779h6164L1917j92661J39361Q4345k00442P9882L9326j4738Q8468o8100j25275
$$ -86164 -54247 -246908 -107547 -23202 -223644 -143762 -104436 -119174 -30706 -98806 -224081
5768b24081l4494J04179L3537j2202O1519J3177n870j04315J33358p3104j92400
$$ -224081 -258575 -154396 -120859 -133061 -71542 -58365 -64235 -168550 -35192 -108296 -300696
5757c00696J35359R913J9802Q8329l2946Q2855o0412J0975j04209J97728j60667
$$ -300696 -165337 -155424 -135622 -47293 -80239 2616 -57796 -46821 -151030 46698 -113969
5746a13969j28406J77155M5501n5560L7555k0765l0711j0462J05287N80k30488
$$ -113969 -242375 -65220 -19719 -75279 -37724 -58489 -89200 -99662 5625 6205 -224283
5735b24283N7705R5084J3580p2844J27484q8171n8081N9169K0405l6931p201k8457
$$ -224283 -166578 -71494 -57914 -130758 -3274 -91445 -149526 -90357 -69952 -106883 -114084 -142541
5723a42541p0062M3864R099m2950J06720R6735M3030N094k11840R396N8581J08288
$$ -142541 -212603 -168739 -159640 -202590 -95870 865 43895 48989 -162851 -153455 -94874 13414
5711A3414m7135p7210J27818j1906P6226q0269L3752o0947R4660q2988M0039O3262
$$ 13414 -33721 -110931 16887 4981 81207 938 34690 -26257 68403 -14585 25454 88716
5699H8716o500J60943J8128O8495j19606p3342R5502J09743J12431j70049P5528
$$ 88716 82216 243159 261287 329782 210176 136834 232336 342079 454510 284461 359989
5688C59989j15948n1507K5931k8513J14203N8220r1442k4436J1577j35320j6689
$$ 359989 244041 192534 218465 189952 304155 362375 270933 246497 258074 122754 106065
5677A06065j5884M2400o7566l1344Q7578j3708j06621M0201k6246j34857J6199
$$ 106065 90181 132581 65015 33671 121249 107541 920 41121 14875 -119982 -103783
5666a03783J19368r8760N244K40036j72515O8056L2928J0349m9782K6005n2631
$$ -103783 15585 -83175 -77931 162105 -10410 57646 90574 100923 51141 77146 24515
5655B4515o6134J8492k8040J96941J2217J40569P8556k10897j5341N508p5679
$$ 24515 -41619 -23127 -51167 145774 157991 298560 377116 166219 150878 156386 80707
5644H0707J45264o7890l057l0259m3250Q6665l6101L9820J5264J06884o5554o1131
$$ 80707 225971 158081 155024 124765 81515 168180 132079 171899 187163 294047 228493 167362
5632A67362Q5107j38980n9186k2225Q5575j14891q5957J29126J8597j48367J11440
$$ 167362 252469 113489 54303 32078 117653 2762 -83195 45931 64528 -83839 27601
5621B7601L848m1572K8551J4409Q1186N8222l8738j4255j8647r0557J3439Q7207
$$ 27601 31449 -10123 18428 32837 114023 172245 133507 119252 100605 10048 23487 110694
5609A10694j08345J18996L8761L6229J7175J30387j58239j45272N4836L5809p9037
$$ 110694 2349 121345 160106 196335 213510 343897 185658 40386 95222 131031 51994
5598E1994r4419P4900m1875k7304K6210Q137Q8633j63173N8754j01556P431P1128
$$ 51994 -42425 32475 -9400 -36704 -10494 -2357 86276 -76897 -18143 -119699 -112268 -41140
5586d1140R3409j29987n4778Q3510J1139Q438L9878M6372k05884j3459J09757
$$ -41140 52269 -77718 -132496 -48986 -37847 -29409 10469 56841 -149043 -162502 -52745
5575e2745j2240j04332K8329Q3139L9995J8999l9635j7586j8337L0379m6027k2204
$$ -52745 -64985 -169317 -140988 -57849 -17854 1145 -38490 -56076 -74413 -44034 -90061 -112265
5563a12265J36072l4389j67571J06850N4432j66137J90987j5116r9743l612R9130
$$ -112265 23807 -10582 -178153 -71303 -16871 -183008 7979 -7137 -106880 -110492 -11362
5552a1362J6305r81r118O162k1513j11704N9024J23208r5091L6576l027o4062
$$ -11362 4943 3962 -5156 1006 -20507 -132211 -73187 50021 -45070 -8494 -11521 -75583
5540g5583n4680N2677r0896R5099K5293J02557k9556j0054r2540o5866L9091J3912
$$ -75583 -130263 -77586 -168482 -73383 -48090 54467 24911 14857 -77683 -143549 -104458 -90546
5528i0546M8110N5641o0949n0064M5059L0247J2230j24348M1322r813N8431n2447
$$ -90546 -42436 13205 -47744 -97808 -52749 -22502 -10272 -134620 -93298 -103111 -44680 -97127
5516i7127j785Q3817l374p5878j94241J62642J14030j17703m1649N3766R7328
$$ -97127 -98912 -15095 -18469 -94347 -288588 -125946 -11916 -129619 -171268 -117502 -20174
5505b0174N4188j4838L1422K0348k11539N6886J6473n1207k8883n17P7115J1908
$$ -20174 34014 19176 50598 70946 -140593 -83707 -67234 -118441 -147324 -147841 -70726 -58818
5493e8818j7781j56452J86217j4776r0225j44596O3935R1566l8932p6059N9508
$$ -58818 -76599 -233051 -46834 -61610 -151835 -296431 -232496 -140930 -179862 -255921 -196413
5482a96413K1037O4435R5989j41645J7057j129o619P2214m7694P6097q3011L1680
$$ -196413 -175376 -110941 -14952 -156597 -139540 -140669 -147288 -75074 -122768 -46671 -129682 -98002
5470i8002R805j7673N7858k652j1942p9090k3653K6725P1229K4216K03388k29098
$$ -98002 -88197 -105870 -48012 -50664 -62606 -141696 -165349 -138624 -67395 -43179 160209 -68889
5458f8889j01289M8599L0977p2386j9381l627P8467P5865q786k2361n2793n9930
$$ -68889 -170178 -121579 -90602 -162988 -182369 -185996 -107529 -31664 -40450 -62811 -115604 -175534
5446a75534Q426P9766m2633n9696k3404J02835j52255K53022q1129r029K0219
$$ -175534 -167108 -87342 -129975 -189671 -213075 -110240 -262495 -9473 -90602 -99631 -79412
5435g9412L0534O2576q6856M7449j8155j9411j15171R3917N3469O727j39266k2341
$$ -79412 -48878 13698 -73158 -25709 -43864 -63275 -178446 -84529 -31060 -24333 -163599 -185940
5423a85940Q0282r005M3163k3883j23047J52315k5337M852m4560R8328o9943K3686
$$ -185940 -105658 -114663 -71500 -95383 -218430 -66115 -91452 -86600 -131160 -32832 -102775 -79089
5411g9089j44639K0546P8680P410m6885m099L1183r899N3036m9245J06197j037
$$ -79089 -223728 -203182 -124502 -117092 -163977 -168076 -136893 -146792 -93756 -143001 -36804 -37841
5399c7841N1669j44633L8576R1505P9830o3837R3962q4577q8743P5506k02898
$$ -37841 13828 -130805 -92229 -724 79106 15269 109231 24654 -64089 11417 -191481
5388a91481o2159r4304K69117N1097j23476J33342J27114r965o4429r7126p1964
$$ -191481 -253640 -347944 -78827 -27730 -151206 -17864 109250 99285 34856 -62270 -134234
5377a34234R8317l6348j5145P7124n8844J7032P3504r2904j89075N8048Q8699
$$ -134234 -35917 -72265 -87410 -10286 -69130 -52098 21406 -71498 -260573 -202525 -113826
5366a13826R7790k16953J71651P3331j11345K7108J05799j9278m3045K2671j23372
$$ -113826 -16036 -232989 -61338 11993 -99352 -72244 33555 14277 -28768 -6097 -129469
5355a29469J3380n3851J46480M8810j21479k2597j6617R9245k014n741P0905J2832
$$ -129469 -116089 -169940 -23460 25350 -96129 -118726 -135343 -36098 -38112 -43853 27052 39884
5343C9884p0031j9619k8726J8367j03722R1374L0192J9479K8810o6309N9362k6960
$$ 39884 -30147 -49766 -78492 -60125 -163847 -72473 -42281 -22802 6008 -60301 -939 -27899
5331b7899K1974j83984L4289n3778J04428j18356R0084m5058J38263Q5449p2986
$$ -27899 -5925 -189909 -155620 -209398 -104970 -223326 -133242 -178300 -40037 45412 -27574
5320b7574m6573R139K0198J1907R4503J17235q600o6259L5865p4493o0538J33430
$$ -27574 -74147 -65008 -44810 -32903 61600 178835 170235 103976 139841 65348 4810 138240
5308A38240j52618P9292J95804j34914q7758N0749K8233K4821J03405j95877J3811
$$ 138240 -14378 64914 260718 125804 38046 88795 117028 141849 245254 49377 63188
5297F3188K09536q3546p7681L6570P6599r0840J9141K4563k4122r014P5843O4360
$$ 63188 272724 189178 111497 148067 224666 133826 152967 177530 153408 144394 220237 284597
5285B84597j23121R1286j357r8683k9692N1153j02350J50672k4222m9657M6366
$$ 284597 161476 252762 251405 152722 123030 174183 71833 222505 198283 148626 194992
5274A94992l7025J14853q3965j0888L0736l3497P3198K3470j71909j22606K15618
$$ 194992 157967 272820 188855 177967 208703 175206 248404 271874 99965 -22641 192977
5263A92977p1520j21322P9072j00267q264J40103J294N5091k0414m5238J02289
$$ 192977 121457 135 79207 -21060 -29324 110779 112073 167164 146750 101512 203801
5252B03801Q9118r5540O804n8782k1860K9061M3855M297J4988o0210N6390j12628
$$ 203801 292919 197379 204183 145401 123541 152602 196457 200754 215742 155532 211922 99294
5240I9294j17784O4168M8658J55257j9285l5842L8409n233O6749J41678n7160
$$ 99294 -18490 45678 94336 249593 230308 194466 232875 227642 294391 436069 378909
5229C78909L5504n486R303o7370m4830R6816l2060K5295J8098j14099L7110Q2028
$$ 378909 414413 408927 418230 350860 306030 402846 370786 396081 414179 300080 337190 419218
5217D19218j02095l0248J70692j43674j12608J52193j7294L8823L1321m712P7431
$$ 419218 317123 286875 457567 313893 201285 353478 336184 375007 406328 401616 479047
5206D79047J44471p6551j10182J55276l1834j13218L8358O2456M1686K2139P1403
$$ 479047 623518 546967 436785 592061 560227 447009 485367 547823 589509 611648 683051
5195F83051j0580j17350l706K17185J6084r8967R4210N7516J64860q354N1649
$$ 683051 672471 555121 551415 768600 784684 685717 779927 837443 1002303 993949 1045598
5184A045598J20226J10011K4392q6422M3833j25487o6783J12511J47076M7171
$$ 1045598 1165824 1275835 1300227 1213805 1257638 1132151 1065368 1177879 1324955 1372126
5174A372126Q0860m3174j7389J02893L6755K7893J01790J90620L5678O1789m737
$$ 1372126 1452986 1409812 1392423 1495316 1532071 1559964 1661754 1852374 1888052 1949841 1945104
5163A945104J51630q5311j73524o9525m4751m0966j97233j6666J57835k02086
$$ 1945104 2096734 2011423 1837899 1768374 1723623 1682657 1485424 1468758 1626593 1424507
5153A424507J1201R5344K6889N3747J35357J00845Q0613J3434r0842m8164J8305
$$ 1424507 1435708 1531052 1557941 1611688 1747045 1847890 1928503 1941937 1851095 1802931 1821236
5142A821236o0163m8486J5257L9901P4964j07946j711n9770j13298J42429P2720
$$ 1821236 1761073 1712587 1727844 1767745 1842709 1734763 1733052 1673282 1559984 1702413 1775133
5131A775133l3895k8122l151K25993p6941O9796J8660J15909K1521J74666q7708
$$ 1775133 1741238 1713116 1709965 1935958 1859017 1928813 1947473 2063382 2084903 2259569 2171861
5120B171861r48O9058r6280M2872J50661J0330K5334J4054J1839J57923j7134
$$ 2171861 2170913 2239971 2143691 2186563 2337224 2347554 2372888 2386942 2398781 2556704 2539570
5109B539570J56890J17615l5614J29455K06499o112J30967R7260J73286J48737
$$ 2539570 2696460 2814075 2778461 2907916 3114415 3108303 3239270 3336530 3509816 3658553
5099C658553N1624Q767j01585J30804P7313Q3972j4167O624K94256j7110Q2102
$$ 3658553 3710177 3718944 3617359 3748163 3825476 3909448 3895281 3901905 4196161 4179051 4261153
5088D261153K34031J99962J45625J37207J27557K07374L00443K50470K28909J83567
$$ 4261153 4495184 4695146 4840771 4977978 5105535 5312909 5613352 5863822 6092731 6276298
5078F276298J12258J89087L14219L43001K18592L69094J93351M00972M39754N14186
$$ 6276298 6388556 6577643 6891862 7234863 7453455 7822549 8015900 8416872 8856626 9370812
5068I370812K94265L76235M60193N20172O88130Q81703J038151J530116J686500
$$ 9370812 9665077 10041312 10501505 11021677 11709807 12591510 13629661 15159777 16846277
5059A6846277J919999K106775J522915P75735r8926n19175o45018l57706J72703
$$ 16846277 18766276 20873051 22395966 23171701 23072775 22553600 21908582 21550876 21723579
5050B1723579O81499J282938J211517N07251P82765N75518N81649O99765K74520
$$ 21723579 22405078 23688016 24899533 25406784 26189549 26765067 27346716 28046481 28321001
5041B8321001l90387q77065j071786q44379m69486K56876l01996p44316r81533
$$ 28321001 27930614 27053549 25981763 25137384 24667898 24924774 24622778 23878462 22896929
5032B2896929p90902k39978M94796P69551J064426M76773n81849j332359k087009
$$ 22896929 22106027 21866049 22360845 23130396 24194822 24671595 24089746 22757387 20670378
5023B0670378k075711j658221j617758j179962j089652j028690q46564o08609
$$ 20670378 18594667 16936446 15318688 14138726 13049074 12020384 11173820 10565211
5015A0565211o20945m39181l74519k30413j03706l23535k36304k10945j03409
$$ 10565211 9944266 9505085 9130566 8900153 8796447 8472912 8236608 8025663 7922254
5006G922254j66722M8016j84889j48299j98529k0964m6019m1681K09361K4511
$$ 7922254 7755532 7803548 7618659 7470360 7271831 7250867 7204848 7163167 7372528 7397039
4996G397039r204J28606O5073m0148j94064p6126Q775r3699j72059k3987m3992
$$ 7397039 7387835 7516441 7581514 7541366 7347302 7271176 7279951 7186252 7014193 6990206 6946214
4985F946214N9528r427m7828l5888L7873J2951J56373P4626J30951m3403J99354
$$ 6946214 7005742 6996315 6948487 6912599 6950472 6963423 7119796 7194422 7325373 7281970 7481324
4974G481324K42191M482J06970J01019J41989J73186J28924J82856J13004J84213
$$ 7481324 7723515 7727997 7834967 7935986 8077975 8251161 8380085 8562941 8675945 8860158
4964H860158J17221K62510K29432l2539K86025K67341M5312M15321K86339K29772
$$ 8860158 8977379 9239889 9469321 9436782 9722807 9990148 10035460 10450781 10737120 10966892
4954A0966892K25665K82670K74262L81949M74283M22452M17701L73525M69067
$$ 10966892 11192557 11475227 11749489 12131438 12605721 13028173 13445874 13819399 14288466
4945A4288466M93908M11107M08236N01907N82084M64190N76142O37377P46306
$$ 14288466 14782374 15193481 15601717 16103624 16685708 17149898 17726040 18363417 19109723
4936A9109723O83192O52778P90893J167393J001493J240821J093143J167612J289151
$$ 19109723 19792915 20445693 21236586 22403979 23405472 24646293 25739436 26907048 28196199
4927B8196199J113555J275317J283835J356902J382578J538235J856484K186592
$$ 28196199 29309754 30585071 31868906 33225808 34608386 36146621 38003105 40189697
4919D0189697J899609J936240J478916J430376R82694Q95601R80820J053452J342425
$$ 40189697 42089306 44025546 45504462 46934838 47917532 48813133 49793953 50847405 52189830
4910E2189830J699769K031347K479226K573990K797431K854705L173977L655165
$$ 52189830 53889599 55920946 58400172 60974162 63771593 66626298 69800275 73455440
4902G3455440M183758M768766N129353N798289O159966N640025N136930M827649
$$ 73455440 77639198 82407964 87537317 93335606 99495572 105135597 110272527 115100176
4894A15100176M510816M428535L940178L099528J697918Q1965j246501k381198
$$ 115100176 119610992 124039527 127979705 131079233 132777151 132859116 131612615 129231417
4886A29231417k576934k296002j773352o65513N94429K048870L507149M658058
$$ 129231417 126654483 124358481 122585129 121919616 122514045 124562915 128070064 132728122
4878A32728122N735067O498644P583492Q663892R946911J1273418J1526151J0287113
$$ 132728122 138463189 144961833 152545325 161209217 171156128 182429546 193955697 204242810
4870B04242810P471215K650088l684703r599240j3548308j5164178j4657006j2815805
$$ 204242810 211714025 214364113 210679410 201080170 187531862 172367684 157710678 144894873
4862A44894873j0780405q395191o084985m264959k456457p07143Q84585K713357
$$ 144894873 134114468 125719277 119634292 115369333 112912876 112205733 113090318 115803675
4854A15803675M016476N385073O336855N885413M240143J105084k660673o602338
$$ 115803675 119820151 125205224 131542079 137427492 141667635 142772719 140112046 133509708
4846A33509708r446726j1041646j0793046j0386827r373216q100757o927716o077341
$$ 133509708 124062982 113021336 102228290 91841463 82468247 74367490 67439774 61362433
4838F1362433n312741m490919l703718l139152k893218k411607k244090j941230
$$ 61362433 56049692 51558773 47855055 44715903 41822685 39411078 37166988 35225758
4830C5225758j766168j530134j454371j277923j096866j073089j056847q33941
$$ 35225758 33459590 31929456 30475085 29197162 28100296 27027207 25970360 25136419
4822B5136419o65025o55832q19316o34119o35442n04124n25482m89066n97642
$$ 25136419 24471394 23815562 22996246 22362127 21726685 21222561 20697079 20208013 19610371
4813A9610371m18226m10979n58892k62032k00346l43501l43732j35111q6434k34585
$$ 19610371 19192145 18781166 18222274 17960242 17759896 17416395 17072663 16937552 16851118 16616533
4803A6616533k5276j77624j2564q1905j90928J31249j10256p0048o8132P680q8668
$$ 16616533 16591257 16413633 16401069 16319164 16128236 16259485 16149229 16079181 16011049 16018729 15930061
4792A5930061J82974O0886K10609M35753m0016J58646J20440L70965L79746K36274
$$ 15930061 16113035 16173921 16384530 16820283 16780267 16938913 17059353 17430318 17810064 18046338
4782A8046338K73632K07093L43920M01606L10157L97980M15345M25507O02940
$$ 18046338 18319970 18527063 18870983 19272589 19582746 19980726 20396071 20821578 21424518
4773B1424518O90307M98901N94715O86653O83851O35564P10895P33087P11849
$$ 21424518 22114825 22613726 23208441 23895094 24578945 25214509 25925404 26658491 27370340
4764B7370340P55764Q89929R55472J145143J116054J468984J597776J639988J437813
$$ 27370340 28126104 29016033 29971505 31116648 32232702 33701686 35299462 36939450 38377263
4755C8377263J535040J594906J714179J573002J514504J355492R83479J050146
$$ 38377263 39912303 41507209 43221388 44794390 46308894 47664386 48647865 49698011
4747D9698011J088748J408534J493154J884050K217599K445124L086347L922620
$$ 49698011 50786759 52195293 53688447 55572497 57790096 60235220 63321567 67244187
4739F7244187M362819M937400N763795O318431O451218O732504O436017O623680
$$ 67244187 71607006 76544406 82308201 88626632 95077850 101810354 108246371 114870051
4731A14870051O789253P528605Q976871J0089289J0529841R580285O627288K322323
$$ 114870051 121659304 129187909 138164780 148254069 158783910 168364195 174991483 177313806
4723A77313806k361426n955974p488492p264285n455663l307853j006275R49422
$$ 177313806 174952380 168996406 161507914 154243629 148787966 145480113 144473838 145423260
4715A45423260J774566K020698K244928L021897M430813P009389R869327J3165894
$$ 145423260 147197826 149218524 151463452 154485349 158916162 165925551 175794878 188960772
4707A88960772J5514101J4912906R339409J688418n931325j2508794j6085931
$$ 188960772 204474873 219387779 228727188 230415606 224484281 211975487 195889556
4700A95889556j6639010j5813953j4069425j1549586r533375p793641o236970
$$ 195889556 179250546 163436593 149367168 137817582 128284207 120490566 114253596
4693A14253596m882167m221852k911561j719480l15819R41233K145005K388870
$$ 114253596 109371429 105149577 102238016 100518536 100202717 101143950 103288955 105677825
4685A05677825K228110J111556j144696l432987o010960p245685p940263p700495
$$ 105677825 107905935 109017491 107872795 104439808 98428848 91183163 83242900 75542405
4677G5542405o905842n964273n196696m205212l555416l139423k594559k160548
$$ 75542405 68636563 62672290 57475594 53270382 49714966 46575543 43980984 41820436
4669D1820436j886492j532149j425179j160587j023373r65143q82181r31792o12151
$$ 41820436 39933944 38401795 36976616 35816029 34792656 33827513 32945332 32013540 31401389
4660C1401389o26421p07992o23555l65504k65273k84081m6726K73057K62805N52358
$$ 31401389 30774968 30066976 29443421 29077917 28812644 28528563 28481837 28754894 29017699 29570057
4650B9570057M90489N56916P79767O76970R26927J106452J076654J310247J519317
$$ 29570057 30060546 30617462 31397229 32074199 33001126 34107578 35184232 36494479 38013796
4641C8013796J675825J020048J837r03911j607334j243029p84878r6224L58532
$$ 38013796 39689621 40709669 40711506 39807595 38200261 36957232 36172354 36076130 36434662
4632C6434662Q45141N70267L71003N16372K94207P84476Q24713O58987k83234
$$ 36434662 37279803 37850070 38221073 38737445 39031652 39816128 40640841 41299828 41016594
4623D1016594j161308j557274j630453j064969r03599j341156j500339j491463
$$ 41016594 39855286 38298012 36667559 35602590 34698991 33357835 31857496 30366033
4615C0366033j132480p51035j08628M52246P79391L61243o23760j421452j802725
$$ 30366033 29233553 28482518 28373890 28826136 29605527 29966770 29343010 27921558 26118833
4606B6118833k107077j739229j444420j014655q52610o52136n21170n29526k41363
$$ 26118833 24011756 22272527 20828107 19813452 18960842 18308706 17787536 17258010 17016647
4597A7016647l17281j55984o1634j76734m25614l32208k16484k28047j33197Q7929
$$ 17016647 16699366 16543382 16481748 16305014 15879400 15547192 15330708 15102661 14969464 15057393
4587A5057393J60582K71519M26268M20740N87916J022297J177477J405043J606007
$$ 15057393 15217975 15489494 15915762 16336502 16924418 17946715 19124192 20529235 22135242
4578B2135242J399247P84671K16780n77033j051791j313516j297964j449509j491599
$$ 22135242 23534489 24319160 24535940 23958907 22907116 21593600 20295636 18846127 17354528
4569A7354528j051982j065133o82439m02184p3100M6441p9457J16288P3080j51374
$$ 17354528 16302546 15237413 14554974 14152790 14079690 14126131 14046674 14162962 14236042 14084668
4559A4084668K7596r4942j42784l53148l96487n93415n53861q13024o88525m49477
$$ 14084668 14112264 14017322 13874538 13521390 13124903 12531488 11977627 11164603 10476078 10026601
4549A0026601n38116l46668l69121k84306j68708L0498l2899J38814n3541j08194
$$ 10026601 9488485 9141817 8772696 8488390 8319682 8350180 8317281 8456095 8402554 8294360
4539H294360j50023k68633j81358k50100k32507j91916k24006k82600m59296m3972
$$ 8294360 8144337 7875704 7694346 7444246 7211739 7019823 6795817 6513217 6053921 6009949
4529F009949j48087K6520j40383j41746n2949k92698l5183N8167m7486l75221
$$ 6009949 5861862 5888382 5747999 5606253 5553304 5260606 5225423 5283590 5236104 4860883
4519D860883k19775k8820j7996q0353j57126j6423j19740m6493l5762p0376l3763
$$ 4860883 4641108 4612288 4594292 4513939 4356813 4340390 4220650 4174157 4138395 4068019 4034256
4508D034256K4263Q8317p9861J1945O1749P1068m7218l4374N2130m7752k02003
$$ 4034256 4058519 4146836 4066975 4078920 4140669 4211737 4164519 4130145 4182275 4134523 3932520
4497C932520l27526n334m8351Q3006p195K9195Q9109m0586Q4271l5928J37288
$$ 3932520 3604994 3599660 3551309 3634315 3627120 3656315 3745424 3704838 3789109 3753181 3890469
4486C890469J99911K2094p1226q1103l8580j77524o9147N0015J4448N8629m6530
$$ 3890469 4090380 4112474 4041248 3960145 3921565 3744041 3674894 3724909 3739357 3797986 3751456
4475C751456J04029j07429o0115k6446q7094N6389J82524N3726p6611l7323j05356
$$ 3751456 3855485 3748056 3687941 3661495 3574401 3630790 3813314 3867040 3790429 3753106 3647750
4464C647750J04888J84453J3483j5392N3919r713j36846l24872n7467j98824j5308
$$ 3647750 3752638 3937091 3950574 3935182 3989101 3979388 3842542 3517670 3460203 3261379 3246071
4453C246071o0973N4725j48224P4985n4552m8235J06127N669l9141R6616j0389
$$ 3246071 3185098 3239823 3091599 3166584 3112032 3063797 3169924 3175593 3136452 3233068 3222679
4442C222679l9949J71807q0668Q3546l1349k9353j32009L1956L8091j3390L248
$$ 3222679 3182730 3354537 3273869 3357415 3326066 3296713 3164704 3196660 3234751 3221361 3224609
4431C224609j16560j40428O7427N6268r2273N7133R7230J756M9076N4219N3747
$$ 3224609 3108049 2967621 3035048 3091316 2999043 3056176 3153406 3155162 3204238 3258457 3312204
4420C312204K01965O7390J04033J67723n4185K6401J60725K0371j56824J03368
$$ 3312204 3514169 3581559 3685592 3853315 3799130 3825531 3986256 4006627 3849803 3953171
4410C953171M5497J2340r1874J19423K20755n6311j07580N9724K34448J16775
$$ 3953171 3998668 4011008 3919134 4038557 4259312 4203001 4095421 4155145 4389593 4506368
4400D506368J19287K04165K02394J76654J14073J26181K69768J51348J65399K83443
$$ 4506368 4625655 4829820 5032214 5208868 5322941 5449122 5718890 5870238 6035637 6319080
4390F319080K0597K77842K66362K17237L97224K21111L78178M11518O10875M47575
$$ 6319080 6339677 6617519 6883881 7101118 7498342 7719453 8097631 8509149 9120024 9567599
4380I567599N62740Q35252P91361R80430J123626J327062J724370K164942K318465
$$ 9567599 10130339 10965591 11756952 12737382 13861008 15188070 16912440 19077382 21395847
4371B1395847K292147J514327M25541q75712j474305j786867j415502j045549
$$ 21395847 23687994 25202321 25627862 24752150 23277845 21490978 20075476 19029927
4363A9029927m12026k76605k35294J33746L46624O27401Q05584R73547J614988
$$ 19029927 18617901 18341296 18106002 18239748 18586372 19213773 20019357 20992904 22607892
4354B2607892J709063K100005K407873L267740M304643N461183O407544P003786
$$ 22607892 24316955 26416960 28824833 32092573 36397216 41858399 48265943 55269729
4346E5269729N673963J422943k704355n605430o788690o007643m580624l572905
$$ 55269729 60943692 62366635 59662280 54056850 47268160 41260517 36679893 33106988
4338C3106988k780794k069695j489076j070082o32006r7448L83898P33574J214917
$$ 33106988 30326194 28256499 26767423 25697341 25065335 24967887 25351785 26085359 27300276
4329B7300276J633645J972505K689944L561698M780695N936625P091044O154096
$$ 27300276 28933921 30906426 33596370 37158068 41938763 47875388 54966432 61120528
4321F1120528K180770k072619n120515o944945o747751n444460m223939l314757
$$ 61120528 63301298 61228679 56108164 49163219 42415468 36971008 32747069 29432312
4313B9432312k671723k324310j777428j462979j116798o14490l34245j65058M2422
$$ 29432312 26760589 24436279 22658851 21195872 20079074 19464584 19130339 18965281 19007703
4304A9007703K00604M52311J217653J425628J891953K289818J981152J135385
$$ 19007703 19208307 19660618 20878271 22303899 24195852 26485670 28466822 29602207
4296B9602207P1893j143417j657022j767308j465091j321667j277618j587403
$$ 29602207 29674100 28530683 26873661 25106353 23641262 22319595 21041977 19454574
4288A9454574j462661j312981j201145j105693n45687o79704m07664l42428l70126
$$ 19454574 17991913 16678932 15477787 14372094 13826407 13146703 12739039 12396611 12026485
4279A2026485m43527J37480l5426J23446K42207L27763M87705O25494O35236Q28401
$$ 12026485 11582958 11720438 11685012 11808458 12050665 12378428 12866133 13491627 14126863 14955264
4269A4955264R11497Q77159O04458L63967k55468p47963q05775q00106q63591
$$ 14955264 15866761 16743920 17348378 17712345 17456877 16708914 15903139 15103033 14239442
4260A4239442o60417p31372n93736l28251o21777o15582l76918k37971k56899
$$ 14239442 13579025 12847653 12253917 11925666 11303889 10688307 10311389 10073418 9816519
4251I816519j11787j82507J77926J30954K96925O17049N91443N42019O40318O79082
$$ 9816519 9704732 9522225 9700151 9831105 10128030 10745079 11336522 11878541 12518859 13197941
4241A3197941M55688N6459l43667p41676r05942r97060o47116o80217p41340o04730
$$ 13197941 13653629 13710088 13366421 12624745 11718803 10721743 10074627 9394410 8653070 8048340
4231H048340l60757m79658l68676l38058l45325j73374o8603j22779k52695j43970
$$ 8048340 7687583 7207925 6839249 6501191 6155866 5982492 5913889 5791110 5538415 5394445
4221E394445R3780K19040J14016J90001K25153K41444J27788k31224o1120j10326
$$ 5394445 5488225 5707265 5821281 6011282 6236435 6477879 6605667 6374443 6313323 6202997
4211F202997m87867k08335j38177j84990l75116j04338l05417O4988l3764k11273
$$ 6202997 5715130 5506795 5368618 5183628 4808512 4704174 4398757 4463745 4429981 4218708
4201D218708J12736p1313N5812l4872q1495j13079N9P4934J07507P4873M5175
$$ 4218708 4331444 4260131 4315943 4281071 4199576 4086497 4086556 4161490 4268997 4343870 4389045
4190D389045l3533P0210J7272K3189K60720J77403J7550J19252J14500P5007J24659
$$ 4389045 4355512 4425722 4442994 4466183 4726903 4904306 4921856 5041108 5155608 5230615 5355274
4179E355274K62850J90575n6492R8825K34038L4204M55604P8508J31895K10355
$$ 5355274 5618124 5808699 5752207 5851032 6085070 6119274 6574878 6653386 6785281 6995636
4169F995636J66147J40748M03120K10956K69645K07247M53472K77805L30529L67552
$$ 6995636 7161783 7302531 7705651 7916607 8186252 8393499 8846971 9124776 9455305 9822857
4159I822857L57287L43536M01345O60357M43759M27693Q49294N41463O02864R61795
$$ 9822857 10180144 10523680 10925025 11585382 12029141 12456834 13306128 13847591 14450455 15412250
4149A5412250R00554J036214J160355J445960J782329J929604J961390J083205
$$ 15412250 16312804 17349018 18509373 19955333 21737662 23667266 25628656 26711861
4141B6711861N09072K19406o5077K03753N81858O83976J002138J677082K230933
$$ 26711861 27220933 27440339 27375262 27579015 28160873 28844849 29846987 31524069 33755002
4132C3755002K685047L629559M485438N288009N319716L295219L61368j930269
$$ 33755002 36440049 40069608 44555046 49843055 55162771 58457990 58819358 56889089
4124E6889089l609718l708147k828641j528092p38918M71657R70015J908005K767752
$$ 56889089 53279371 49571224 46742583 45214491 44475573 44947230 45917245 47825250 50593002
4115E0593002M198394N756929Q861243J0948780J4030737J3759797K396680n381067
$$ 50593002 54791396 60548325 69409568 80358348 94389085 108148882 110545562 105164495
4107A05164495j1329916j4097484j1983455q630317o435789n010635l934476k972106
$$ 105164495 93834579 79737095 67753640 59123323 52687534 47676899 43742423 40770317
4099D0770317k376701j724514r96722p04375k55246J87969L77742N65709J084406
$$ 40770317 38393616 36669102 35672380 34968005 34712759 34900728 35278470 35844179 36928585
4090C6928585J635251K311822K944517L525136M219248N462176P140387R954225
$$ 36928585 38563836 40875658 43820175 47345311 51564559 57026735 64167122 74121347
4082G4121347J2199680J4392688J3561861L111889n463818j1808259j4907067
$$ 74121347 86321027 100713715 114275576 117387465 111923647 100115388 85208321
4075H5208321j3722853j0427182p784250o367053m930011m042291l313471k663033
$$ 85208321 71485468 61058286 53274036 46906983 41976972 37934681 34621210 31958177
4067C1958177k006476j669785j159591j109832m08446o17117m43364l01867k58504
$$ 31958177 29951701 28281916 27122325 26012493 25604047 24986930 24543566 24241699 23983195
4058B3983195l6233J4801K65K64894J53212M75574P25633O48040O10573P38305
$$ 23983195 23946962 23961763 23962028 24226922 24380134 24855708 25581341 26229381 26839954 27578259
4048B7578259Q69134P65456Q32871P37109N64870P42933P53700J076731J741259
$$ 27578259 28447393 29212849 30045720 30782829 31347699 32090632 32844332 33921063 35662322
4039C5662322K086552K920847L652688K918490L094748K993143L877339M533392
$$ 35662322 37748874 40669721 44322409 47240899 50335647 53328790 57206129 61739521
4031F1739521O612682Q873413J3365543J6610585K1201961J7319768L94842j0098822
$$ 61739521 68352203 77225616 90591159 107201744 128403705 145723473 146118315 136019493
$$ [...]
##END NTUPLES=NMR SPECTRUM
##END=
