##TITLE=1H_CG-1211-B2
 CDCl3
 8 sc, 
 6.9.2024
##JCAMPDX= 6.0         $$ Bruker NMR JCAMP-DX V2.0
##DATA TYPE= NMR SPECTRUM
##DATA CLASS= NTUPLES
##ORIGIN= UXNMR, Bruker Analytische Messtechnik GmbH
##OWNER= root
$$ XWIN-NMR		Version 3.5
$$ Fri Sep  6 14:47:01 2024 Russian Standard Time (UT+4h)  she@DPX200
##.OBSERVE FREQUENCY= 200.1318
##.OBSERVE NUCLEUS= ^1H
##.ACQUISITION MODE= SIMULTANEOUS
##.ACQUISITION SCHEME= undefined
##.AVERAGES= 8
##.DIGITISER RES= 18
##SPECTROMETER/DATA SYSTEM= spect
##.PULSE SEQUENCE= zg30
##.SOLVENT NAME= CDCl3
##.SHIFT REFERENCE= (INTERNAL, CDCl3, 0, 20.9488)
##AUDIT TRAIL= $$ (NUMBER, WHEN, WHO, WHERE, WHAT)
$$ ##TITLE= Audit trail, XWIN-NMR		Version 3.5
$$ ##JCAMPDX= 5.01
$$ ##ORIGIN= Bruker BioSpin GmbH
$$ ##OWNER= she
$$ F:/spectra/data/she/nmr/H-F/1/pdata/1/auditp.txt
$$ ##AUDIT TRAIL=  $$ (NUMBER, WHEN, WHO, WHERE, WHAT)
(   1,<2024-09-06 14:45:39.76 +0400>,<she>,<DPX200>,
      <created by zg, POWCHK disabled, PULCHK disabled
       configuration hash MD5:
       00 E9 B6 7A A2 85 ED C7 34 08 36 98 17 FE 4E 26
       data hash MD5: 16K
       14 1A C6 EA 6F 37 C9 71 3F 65 27 F1 38 A6 74 C0>)
(   2,<2024-09-06 14:45:42.06 +0400>,<she>,<DPX200>,
      <Start of raw data processing
       efp BC_mod = 2 LB = 0.24 FT_mod = 6 PKNL = 1 PHC0 = -26152.46 PHC1 = 13.98748 SI = 16K 
       data hash MD5: 16K
       71 CE 69 92 59 3C B8 00 45 84 E4 18 E9 66 10 23>)
(   3,<2024-09-06 14:46:06.95 +0400>,<she>,<DPX200>,
      <pk PHC0 = 4.324616 PHC1 = -7 
       data hash MD5: 16K
       64 E5 60 5D 6E 0A 8F F7 96 03 AC 90 F4 8A F2 46>)
(   4,<2024-09-06 14:46:10.81 +0400>,<she>,<DPX200>,
      <abs ABSG = 5 
       data hash MD5: 16K
       64 D1 CA 8F F7 80 A5 B6 28 D2 20 0D 7B B2 64 E5>)
$$ ##END=
$$ 
$$ hash MD5
$$ 12 B4 AB C8 D3 4D 84 F9 28 9F 81 0A BA 53 BC 58
##$RELAX= 
##$RELAX= 
##$RELAX= 
##$RELAX= 
##$RELAX= 
##$RELAX= 
$$ Bruker specific parameters
$$ --------------------------
##$DU= <F:/spectra>
##$EXPNO= 1
##$NAME= <H-F>
##$PROCNO= 1
##$TYPE= <nmr>
##$USER= <she>
##$AMP= (0..31)
100 100 100 100 100 100 100 100 100 100 100 100 100 100 100 100 100 100 
100 100 100 100 100 100 100 100 100 100 100 100 100 100 
##$AQSEQ= 0
##$AQ_mod= 1
##$AUNM= <au_zg>
##$AUTOPOS= <>
##$BF1= 200.13
##$BF2= 200.13
##$BF3= 200.13
##$BF4= 200.13
##$BF5= 200.13
##$BF6= 200.13
##$BF7= 200.13
##$BF8= 200.13
##$BYTORDA= 1
##$CFDGTYP= 0
##$CFRGTYP= 5
##$CHEMSTR= <none>
##$CNST= (0..31)
1 1 145 1 1 1 1 1 1 1 1 1 1 1 1 1 1 1 1 1 1 1 1 1 1 1 1 1 1 1 1 1 
##$CPDPRG= <>
##$CPDPRG1= <>
##$CPDPRG2= <>
##$CPDPRG3= <>
##$CPDPRG4= <mlev>
##$CPDPRG5= <mlev>
##$CPDPRG6= <mlev>
##$CPDPRG7= <mlev>
##$CPDPRG8= <mlev>
##$CPDPRGB= <>
##$CPDPRGT= <>
##$D= (0..31)
0 1.2 0 0 0 0 0 0 0 0.06 0 0.03 0 0 0 0 0.0002 0 0 0 0 0 0 0 0 0 0 0 0 
0 0 0 
##$DATE= 1725619539
##$DBL= (0..7)
120 120 120 120 120 120 120 120 
##$DBP= (0..7)
150 150 150 150 150 150 150 150 
##$DBP07= 0
##$DBPNAM0= <>
##$DBPNAM1= <>
##$DBPNAM2= <>
##$DBPNAM3= <>
##$DBPNAM4= <>
##$DBPNAM5= <>
$$ [...]
##$SUBNAM3= <"">
##$SUBNAM4= <"">
##$SUBNAM5= <"">
##$SUBNAM6= <"">
##$SUBNAM7= <"">
##$SUBNAM8= <"">
##$SUBNAM9= <"">
##$SW= 24.0689170037331
##$SWIBOX= (0..15)
0 0 2 0 0 0 0 0 0 0 0 0 0 0 0 0 
##$SW_h= 4816.95568400771
##$TD= 16384
##$TD0= 1
##$TE= 0
##$TE2= 300
##$TE3= 300
##$TEG= 300
##$TL= (0..7)
0 120 120 120 120 120 120 120 
##$TP= (0..7)
150 150 150 150 150 150 150 150 
##$TP07= 0
##$TPNAME0= <>
##$TPNAME1= <>
##$TPNAME2= <>
##$TPNAME3= <>
##$TPNAME4= <>
##$TPNAME5= <>
##$TPNAME6= <>
##$TPNAME7= <>
##$TPOAL= (0..7)
0.5 0.5 0.5 0.5 0.5 0.5 0.5 0.5 
##$TPOFFS= (0..7)
0 0 0 0 0 0 0 0 
##$TUNHIN= 0
##$TUNHOUT= 0
##$TUNXOUT= 0
##$USERA1= <user>
##$USERA2= <user>
##$USERA3= <user>
##$USERA4= <user>
##$USERA5= <user>
##$V9= 5
##$VALIST= <valist>
##$VCLIST= <CCCCCCCCCCCCCCC>
##$VD= 0
##$VDLIST= <DDDDDDDDDDDDDDD>
##$VPLIST= <PPPPPPPPPPPPPPP>
##$VTLIST= <TTTTTTTTTTTTTTT>
##$WBST= 1024
##$WBSW= 4
##$XGAIN= (0..3)
0 0 0 0 
##$XL= 0
##$YL= 0
##$YMAX_a= 214591
##$YMIN_a= -265273
##$ZGOPTNS= <>
##$ZL1= 120
##$ZL2= 120
##$ZL3= 120
##$ZL4= 120
##$ABSF1= 21.00173
##$ABSF2= -3.067404
##$ABSG= 5
##$ABSL= 3
##$ALPHA= 0
##$AQORDER= 0
##$ASSFAC= 0
##$ASSFACI= 0
##$ASSFACX= 0
##$ASSWID= 0
##$AUNMP= <proc_1d>
##$AZFE= 0.1
##$AZFW= 0.1
##$BCFW= 0
##$BC_mod= 2
##$BYTORDP= 0
##$COROFFS= 0
##$CY= -3
##$DATMOD= 1
##$DC= 0
##$DFILT= <>
##$DTYPP= 0
##$F1P= 0
##$F2P= 0
##$FCOR= 1
##$FTSIZE= 16384
##$FT_mod= 6
##$GAMMA= 0
##$GB= 0
##$INTBC= 1
##$INTSCL= 3.70164e-10
##$ISEN= 128
##$LB= 0.24
##$LEV0= 0
##$LPBIN= 0
##$MAXI= 10000
##$MC2= 0
##$MEAN= 0
##$ME_mod= 0
##$MI= 1.114404
##$NCOEF= 0
##$NC_proc= -7
##$NLEV= 6
##$NOISF1= 3.799351
##$NOISF2= 2.8
##$NSP= 0
##$NTH_PI= 0
##$NZP= 0
##$OFFSET= 20.94884
##$PC= 1
##$PHC0= -26148.14
##$PHC1= 6.98748
##$PH_mod= 1
##$PKNL= yes
##$PPARMOD= 0
##$PSCAL= 0
##$PSIGN= 0
##$REVERSE= no
##$SF= 200.130015985225
##$SI= 16384
##$SIGF1= 3
##$SIGF2= 2
##$SINO= 5.538805
##$SIOLD= 16384
##$SREGLST= <1H.CDCl3>
##$SSB= 0
##$STSI= 16384
##$STSR= 0
##$SW_p= 4816.95568400771
##$SYMM= 0
##$S_DEV= 0
##$TDeff= 16384
##$TDoff= 0
##$TI= <>
##$TILT= no
##$TM1= 0
##$TM2= 0
##$TOPLEV= 0
##$USERP1= <user>
##$USERP2= <user>
##$USERP3= <user>
##$USERP4= <user>
##$USERP5= <user>
##$WDW= 1
##$XDIM= 16384
##$YMAX_p= 303034562
##$YMIN_p= -298717
$$ End of Bruker specific parameters
$$ ---------------------------------
##NTUPLES= NMR SPECTRUM
##VAR_NAME=  FREQUENCY,     SPECTRUM/REAL,   SPECTRUM/IMAG
##SYMBOL=    X,             R,               I
##VAR_TYPE=  INDEPENDENT,   DEPENDENT,       DEPENDENT
##VAR_FORM=  AFFN,          ASDF,            ASDF
##VAR_DIM=   16384,         16384,           16384
##UNITS=     HZ,            ARBITRARY UNITS, ARBITRARY UNITS
##FACTOR=    0.29402158847633, 1,            1
##FIRST=     4192.49152149071, 0,            0
##LAST=      -624.464162516998, 0,           0
##MIN=       -624.464162516998, -298717,     0
##MAX=       4192.49152149071, 303034562,    0
$$ Real data points
##PAGE= N=1
##DATA TABLE= (X++(R..R)), XYDATA
$$ [...]
10291b3485K8872L0116p7682P2433o55n2939J07629r5489P5804O943j06720P1820
10279C6647K5826m9571m335m2650k9725M6608l966K6855m4133J0339L0545m4513
10267d2073k5615N9291K7190J1596p3574j07531K5756Q66Q9023R4884m4450k5331
10255i968L5621o530J6982M0170r6381J42871j24888k3366l6562J39067k6651
10244E0365k5090k6533q5938O9024n2238q4346N6393j9459Q4455o899J60804q5220
10232C5318o1737J4001M1173K3650j13897N24L2839M414l4718k2141N4005l1991
10220e8560L6350k1116m2224O8119j9830j03275n8857J04962l8714P5833K0787
10209c6525k2990J0751J5906J10068m1750r928Q853j6703n9340m5768J18445O3583
$$ y = [-23485, 5387, 35503, -42179, 30254, 29599, -23340, 84289, -11200, 64604, 71547, -35173, 36647, 62473, 12902, 8567, -34083, -63808, -17200, -21166, 5689, -38444, -28105, 2440, -42073, -67688, -8397, 18793, 30389, -43185, -150716, -124960, -124094, -35071, 59813, 15363, -9968, 25653, 19123, 36105, 76275, -20106, 122765, -2123, -25489, -62051, 77016, 50365, 25275, -1258, -87196, -18172, -70410, -154756, -98363, -117822, -33367, -40266, 120538, 35318, -26419, -12418, 28755, 52405, -61492, -60968, -28129, -23715, -58433, -80574, -26569, -58560, -22210, -43326, -85550, -17431, -37261, -140536, -199393, -94431, -133145, -57312, -36525, -59515, -48764, -32858, 77210, 35460, 25532, 34385, 17682, -41658, -87426, 31019, 94602]
10197I4602l4981p8226k9392K2352O8705k9932l3863J08461q3535q685L509J8179
10185A7194m8703l1461l7037J30400k830n9099J57853n8237L5845k6267Q5987
10174A63645o2857j29096J7965m8479K9246j0015j32128J24028K3281O5083m3101
10163b428J3657K3254l3196m2773N844O0686n7606l7800O8802K9660K2586j5547
10151C5139o5001P2220m9229j42587K9914P4012J3859p7453O1364K4976O4401
10140D1615n1265N5200l4018r2146q528Q6361J3005L2511l3606p0349R47R3836
10128C3563p7004p6020J13890m5349N2497k0166J40997n9728q0497n3401p039
10117g8257L211k7574P1098Q282l2397L6838J04044j30282L5295k2985Q133l3118
$$ y = [94602, 59621, -18605, -47997, -25645, 43060, 13128, -20735, 87726, 4191, -4494, -985, 17194, -31509, -62970, -100007, 30393, 27563, -31536, 126317, 68080, 103925, 77658, 163645, 100788, -28308, -10343, -58822, -29576, -39591, -171719, -47691, -24410, 40673, -2428, 11229, 34483, 1287, -41486, -35642, 25044, -32562, -70362, -1560, 28100, 50686, 35139, -29862, 42358, -6871, -149458, -119544, -45532, -31673, -109126, -47762, -22786, 41615, -9650, 45550, 11532, -80614, -89142, -2781, 10224, 42735, 9129, -61220, -60273, 33563, -43441, -119461, -5571, -50920, 1577, -18589, 122408, 62680, -17817, -71218, -78257, -75046, -102620, -31522, -23240, -55637, -18799, 85245, -45037, -9742, -32727, -24594, -57712]
10105e7712j1402K9658L4654n0311P2199l0356N3018r4743r575M6076K8479M0450
10093E0435j28728o2437J48494J46767j28715l8430J6498q605l6061j5130l2563
10082h8475O7619N597R2441p3540j6172m2386n060J37792L7753l7965K3636l0786
10070G0454j11178K6284O9104p728m2827p6290P4597P891n7866J2749J27245p5713
10058A6722o1837Q9257r8961n6994N4281M0994J05003r2952m6598N3047J0135
10047A2097j7094l2888N1899o0451Q5443k858J0428Q3746j8517R543p6373N875
10035E0850r6649M0363l0000K385M8425j0667p350n108p322q4973O6493J02073
10023F8520n6730j7348O4295l5826K3000M5673J9055o0200r147q6856P5624J3959
$$ y = [-57712, -69114, -39456, -4802, -55113, 17086, -13270, 39748, -54995, -64570, -18494, 9985, 50435, -78293, -140730, 7764, 154531, 25816, -12614, 3884, -4721, -40782, -55912, -88475, -20856, -15259, 77182, 3642, -12530, -54916, -59976, 77816, 115569, 77604, 101240, 70454, -40724, -14440, 54664, 46936, 4109, -72181, 2416, 10307, -47559, -34810, 92435, 16722, -45115, 44142, -54819, -111813, -57532, -16538, 88465, -4487, -51085, 1962, 12097, -4997, -37885, 14014, -46437, 39006, 36148, 46576, 130322, 111805, 121348, 44975, 50850, -45799, -5436, -35436, -33051, 15374, 4707, -2643, -7751, -15073, -100046, -33553, 68520, 11790, -5558, 58737, 22911, 45911, 91584, 110639, 50439, 41292, -45564, 30060, 44019]
10011D4019k9301L4311J2830m9018p1323J40487n4081j9361J6465q8092M4138
10000a8926P653j00403j9853N5400L6642p8212O4279n7312M9386L575n2629l8577
9988a48977K8126L4269M0527k8203R3346N3971r327o4919K9821P6270k4432q7775
9976g303l5376j59759P7571P7124k1307N1202L7204j2299l3883L408K1780o4970
9964f6608m0426O7885p4469O7360j6636k7442K6471M4437r2029O7994j717l2519
9952g7699M8835N0422p4831R1639K8367j24660M7606N7919m2967n5244K0622l1746
9940f1737r528J27845L7565j42197K8005J00035k3989n1181o2167O1712o5061
9929f0698M0258L2134P788M0919l2014M4946M6031r8780j502m5243L5249O704
$$ y = [44019, 14718, 49029, 61859, 12841, -58482, 82005, 27924, 8563, 25028, -63064, -18926, -11273, -111676, -131529, -76129, -39487, -117699, -53420, -110732, -61346, -57771, -110400, -148977, -120851, -86582, -46055, -74258, 19088, 73059, 63732, -1187, 28634, 104904, 80472, -7303, -42679, -202438, -124867, -47743, -69050, -17848, 19356, 7057, -26826, -23418, -1638, -66608, -107034, -39149, -113618, -46258, -62894, -90336, -63865, -19428, -111457, -43463, -45180, -77699, -28864, 21558, -53273, 38366, 66733, -57927, -10321, 47598, 4631, -50613, -29991, -61737, -71265, 56580, 94145, -48052, -20047, 79988, 55999, 4818, -57349, 4363, -60698, -20440, 11694, 19482, 60401, 28387, 73333, 119364, 20584, 19082, -26161, 9088, 15792]
9917A5792m7980K9008l7805j30354O1789N9856l7925J25967P1739j07658L8371
9906D0800k8509k6220J4848J1845K2737q6342N3257J6078l0150K2869N8761N9511
9894A29485o4604K3473k7827m8920k5144R1454m770p8568J7566k5346L4221P5100
9882I6120o5364o6050j5391J9664P1854r0310l8433K0272J9057M4973N0445m7654
9870h17l4464j2845L7053J3j9960k418p8573P0041N0985J8829q1429n9554J8114
9857i5025K9123P3345K4462K077j9658j7583O997m34K5661l0600L2616q2038P4533
9844B3476k7142j5697j01215j7330R4749R0279J2582j10415q0869K3276N6957
9833e1349j5086J32783m4623k9831N7587K4405n9995M8372j3682P8780p7243l6838
$$ y = [15792, -32188, -3180, -40985, -171339, -109550, -49694, -87619, 38348, 110087, 2429, 40800, 12291, -13929, 919, 12764, 35501, -50841, 2416, 18494, -11656, 11213, 69974, 129485, 64881, 88354, 60527, 11607, -13537, 77917, 73147, -5421, 12145, -13201, 21020, 96120, 30756, -35294, -50685, -31021, 40833, -49477, -87910, -67638, -48581, -3608, 46837, -817, -35281, -48126, -11073, -11060, -31020, -33438, -112011, -41970, 9015, 27844, -53585, -113139, -95025, -65902, 7443, 31905, 33982, 14324, -3259, 3738, 3304, 28965, -1635, 30981, -51057, 23476, -3666, -19363, -120578, -137908, -43159, 47120, 59702, -50713, -131582, -108306, -51349, -66435, 66348, 21725, -8106, 49481, 73886, 13891, 62263, 48581, 127361, 50118, 13280]
9821A3280K3420m912k9369j6313n2256R472k2441M4881j10106M4812L4042J5755
9809d9735L1529L4160N3969j24148k9267Q0004n2512N2174M9794m4466M0016J8736
9797F0254j31037J07489J879n2472j2163j43j4249J27724r1435l6953M6273P1487
9785G6654m4556r2842M0202q5366L3785K6173K4124o1848l6815o7101J08282J13156
9773C3848l98j09307j2266Q97Q0172L133l8509N7725L0447L9244o3552l1890Q3051
9760G2595M1858Q530j48862p6696J20633n6002k8835P5384k4067L8350j02525
9749g9637L507O0892k2869M4917k6554j9497N5597k0608l7152r5991O0150j2158
9737h9403M808R633l8964M8321l8882J90388M4789n3155k2672m132M810j3681
$$ y = [13280, 36700, 31788, 2419, -13894, -66150, -56678, -79119, -34238, -144344, -99532, -65490, -49735, -18206, 15954, 69923, -54225, -83492, -3488, -56000, -3826, 45968, 1502, 41518, 60254, -70783, 36706, 38585, -13887, -26050, -26193, -40442, 87282, -4153, -41106, 5167, 76654, 32098, -60744, -20542, -105908, -72123, -45950, -21826, -83674, -120489, -187590, -79308, 33848, 33450, -75857, -88123, -87226, -7054, -3921, -42430, 15295, 45742, 84986, 21434, -10456, 72595, 114453, 122983, -25879, -102575, 18058, -37944, -66779, 8605, -15462, 22888, -79637, -76130, -15238, -38107, 6810, -19744, -39241, 16356, -4252, -41404, -137395, -77245, -89403, -84595, -74962, -113926, -65605, -104487, 85901, 130690, 77535, 54863, 50731, 55541, 41860]
9725D1860j3081n2208j7848o0460r632k3148K22172K503n8408L0809l457j8955
9713D0147p5200J5365j1610q282l8339J4520m8993k1961J19719J08475K7910l1339
9701I0412k9109o0555K2270l9021l2571P0293l9184J0507n0818M3103J70273r9632
9689E5968q0801l020Q7192N5769m2508O8511j32604o9738k7268M9841J14180L991
9677G9513Q984M096k4371j9182j869j592l4622q0361j5867k7340M0400j1724l1313
9664a15248j05905J09399O8443J21067k9869m0268k1975O891K7833K3439P043
9653E0850k8593P4565j1555m2499o734K2821j1161j2558q305L3037L774L5399
9641I9041n2930L1982K6684p8888r75p175P495J5433k0697j25241k2223N8376
$$ y = [41860, 28779, -23429, -41277, -101737, -111369, -134517, 87655, 90158, 31750, 62559, 59102, 40147, -35053, -19688, -31298, -39580, -77919, -63399, -112392, -134353, -14634, 93841, 121751, 90412, 61303, 748, 23018, -16003, -48574, 21719, -17465, -6958, -57776, -14673, 155600, 55968, -24833, -27853, 59339, 115108, 72600, 141111, 8507, -61231, -88499, -38658, 75522, 79513, 88497, 92593, 68222, 49040, 47171, 45579, 10957, -69404, -85271, -112611, -72211, -83935, -115248, -221153, -111754, -43311, 77756, 47887, 7619, -14356, -7465, 20368, 43807, 50850, 22257, 96822, 85267, 42768, 36034, 58855, 47694, 35136, 26831, 59868, 63642, 99041, 46111, 78093, 104777, 25889, 24914, 17739, 25234, 40667, 19970, -105271, -127494, -69118]
9629f9118K8235M2449o7144J7073K9862L0833j7933M949N5945m7452Q365k6754
9617a0690P2171j6854l3072O0063q3940O66o8306L317k859n442Q2476m3690k1651
9604f7811R4123n7491M1498O9429p8890k8502j7079j0221j8980P4295n7514k474
9592e9617m1341K6647Q0272k6132k1233p4396l726J25803K1565j3618J07609j03748
9580A8085o2067q9487Q9300Q7883o8010j14329O1933j3929l1482L0184K6597M4915
9568b0407o2521m5004L5643O1060r753q6046k6643O0711M5038n0406K3992J2872
9556f1464k9042K6646K77J1347K46J26288J7216o3980q73J578j0872q763m8633
9543d0029J8873l6276J501J36575j59862K4403J07399j661n5370O856n851O0121
$$ y = [-69118, -40883, 1566, -65578, -48505, -18643, 12190, -5743, -794, 55151, 7699, 16064, -10690, 61481, 44627, 11555, 71618, -12322, -11656, -79962, -76645, -79504, -84946, -2470, -46160, -67811, 26312, -31179, 10319, 79748, 858, -27644, -44723, -54944, -73924, 371, -57143, -59617, -100958, -74311, 5961, -20171, -41404, -115800, -119526, 6277, 27842, 14224, 121833, 18085, -43982, -133469, -44169, 43714, -24296, -138625, -76692, -90621, -122103, -91919, -65322, -20407, -82928, -127932, -92289, -31229, -40982, -127028, -153671, -92960, -47922, -98328, -74336, -61464, -90506, -63860, -63583, -52236, -51990, 74298, 91514, 27534, 26661, 28239, 17367, 8604, -40029, -21156, -57432, -55931, 80644, -79218, -54815, 52584, 50923, -4447, 2409, -3442, 56679]
9531E6679q6303k3144P1136K17n7508R683P190p1828P4618j7415o4309l0368P0855
9518f0497O545n3322Q5689n6164J2453M9095P9807j50027R716L3608m7859O6757
9506b4199k8448m2127P3565j9562Q0327n9683j13825J07356q2079J06119l2740
9495c5296n3285k7824N7870o1828O5996N1680l8184N1266K7338r0143J1109m2878
9483h4179P1399k6141j5506N4322o9523n7682Q2497m9643O0468M4714j0724j8482
9471a8480k2962p8852O2757l2023N6731J0465L630J21144k5121o165n2213o8759
9459d9848J5115M2204Q3257k937j56548j2222o4186L9323j4698M9358J4363J4694
9447d2125P9651l219j09511P4564J8549j12770j5030Q2581J26498o0557r1783
$$ y = [56679, -29624, -52768, 18368, 18585, -38923, -29240, -22050, -93878, -19260, -36675, -100984, -131352, -60497, -53952, -107274, -21585, -77749, -65296, -16201, 63606, -86421, -76705, -43097, -90956, -24199, -52647, -94774, -21209, -40771, 39556, -20127, -133952, -26596, -108675, -2556, -35296, -88581, -116405, -58535, -120363, -54367, -2687, -40871, 10395, 37733, -52410, -41301, -84179, -12780, -38921, -54427, -105, -69628, -127310, -44813, -94456, -33988, 10726, 2, -18480, -41442, -120294, -57537, -89560, -32829, -22364, -18734, 102410, 77289, 71124, 18911, -49848, -34733, 7471, 90728, 87791, -68757, -80979, -145165, -105842, -120540, -71182, -56819, -42125, 37526, 34307, -75204, -640, 17909, -94861, -109891, -27310, 99188, 38631, -53152]
9436e3152N9965j0312p081Q3192m5252o1062n7919J271K4193o2814J8865o0912
9424a71018M9055J09894j112K3652m2600O755M8898k4896r0763J51189p000o0507
9412h453R4842O519q2307p8710P1727K0844k4786j4444j3134M5063P2461K0747
9400A10369q2598j01326R122P747K2355J6492K698n7333Q9002O5092o6915K5797
9388D0502N17K6646j85920M171J11165o5877l8620P3942K8619j846K8408M8074
9376F9781m1862p2043J5165k3428P0088j50883M6239J22576n0655k8011M0343
9365b690m0348N0399P568m2628m5500k7459O8136K3122K3839j21074R092N266
9353i2277L9885K6887O3974o8003j19421J33319N2168R138o8651o6368J4909R4438
$$ y = [-53152, 6813, -3499, -10580, 72612, 27360, -33702, -91621, -90350, -66157, -128971, -110106, -171018, -121963, -12069, -13181, 10471, -32129, -25374, 23524, -1372, -92135, 59054, 52054, -8453, 86389, 92908, 10601, -68109, 3618, 24462, -324, -14768, -27902, 17161, 89622, 110369, 27771, -73555, -64433, -56686, -34331, -17839, -15141, -72474, 16528, 81620, 14705, 40502, 41019, 67665, -118255, -114084, -2919, -68796, -107416, -33474, -4855, -6701, 21707, 69781, 27919, -44124, -28959, -52387, 17701, -133182, -86943, 35633, -15022, -43033, -2690, -43038, 7361, 14929, -27699, -73199, -100658, -32522, -9400, 14439, -106635, -97543, -92277, -52392, -25505, 38469, -29534, -148955, -15636, 36532, 45670, -22981, -89349, -74440, 19998]
9341A9998n0048n8383L8364n2187R2503l3663p3870N2562J8248J10764p5491l6366
9329d7569k453K4179j2871o775o7501J01160k2106J5097L5601q2032O242r726
9317f8754L3392o0181K8866m3638R5766J1740q9242J05090M7703N0326r9451l358
9305H259O5759r1517M694M3119n9052K8556j5714L4554K4273l8660n4034j1330
9293f1093R7866L698K0080o5906j7029j42Q4470k54j52643n4760Q9870O5774j12562
9280a02631Q1383n8820j4085Q9224j00757N3849M341K625K0774k439O4078m6992
9268i450j23521P6370L2304r880J06106j19046P0917l5105r2638P9870N8135j2361
9256B1701K241j7327p1071j1030l3768R2330o8872m8758J3512L1567j1979N1265
$$ y = [19998, -30050, -88433, -50069, -102256, -9753, -43416, -117286, -64724, -46476, 64288, -11203, -47569, -50022, -25843, -38714, -45489, -112990, -11830, -33936, -18839, 16762, -65270, -59028, -68754, -35362, -95543, -66677, -110315, -14549, -2809, -92051, 13039, 60742, 111068, 11617, 8259, 74018, -17499, -12805, 30314, -28738, -182, -15896, 18658, 42931, 4271, -49763, -61093, 36773, 40471, 60551, -5355, -22384, -22526, 61944, 61690, -90953, -145713, -55843, 9931, -102631, -21248, -80068, -94153, -4929, -105686, -51837, -47496, -44871, -24097, -26536, 37542, -9450, -132971, -56601, -24297, -34177, 71929, -47117, 23800, -11305, -103943, -24073, 34062, 21701, 23942, 6615, -64456, -75486, -109254, -16924, -85796, -134554, -121042, -89475, -101454, -50189]
9244e0189o7579J3343k1504N4829K8136n8620R5006O6432j49432o5332n1787J15808
9232i0889L6900l2497j618M8920R5340Q498q1255j2928M8873m0185l7250j2029
9220g0120O0811l7802M7639l0785L4942K0777r9645l3356J4296p50Q4871N2344
9208D3222p673j49724j5619Q6014J4836P153j5189j4740M9345j2359o6039L8650
9196d2123l0181m5053M3784O4811J7980j32889k9173k582P2212P9007o266N9967
9184D9494k170m344j45044R0040K4174q8379L618K6281L2727N5236o6879p1025
9172i6271M8086Q4822m0210p5518K7483Q6217l224j52630L6562l2064J09808j0053
9160a6992n9176N8639N729k50p5944k8190l6000J10388J22979k8756n8147N9859
$$ y = [-50189, -117768, -104425, -125929, -71100, -42964, -101584, -6578, 59854, -89578, -154910, -206697, -90889, -53989, -86486, -88104, -39184, 56156, 64654, -16601, -29529, 19344, -20841, -58091, -70120, -9309, -47111, 528, -30257, 4685, 25462, -74183, -107539, -93243, -93993, -9122, 43222, 35549, -114175, -129794, -43780, -28944, -21791, -36980, -51720, -2375, -14734, -80773, -42123, -72304, -117357, -73573, -8762, 9218, -123671, -152844, -155426, -83214, -4207, -10473, 49494, 47324, 42980, -102064, -12024, 12150, -76229, -72611, -46330, -13603, 41633, -25246, -96271, -48185, 36637, -3573, -79091, -51608, 34609, 31385, -121245, -84683, -116747, -6939, -16992, -76168, -17529, -11800, -12050, -87994, -116184, -152184, -41796, 81183, 52427, -5720, 54139]
9148E4139O3379j38590r610p3328J05560K5419k2025j4841k7409l9155m6845J17867
9136e439O174J4607q5537O148N3821M5770o234q5230n867J3948m7269O3159M678
9123b7271P536P0586j14463j2143Q1278p3568p671K7051Q247R641P9684J8943
9111F7850j75150m7167o2269P1261J73008p0030j3560P4350j6908o863k0244N9147
9099C3425j233j3765L1964l9131j6887o4865M0901N7117n2340m8191k6653J21525
9087B1867o277p0559O3100N8121m2095j3420M4271l1323M2564r9487n2785R9791
9075A3768R7537j39429n976K3756o4408J9716M0396J4705j01048j0040L9188L2633
9063c9202L5450N0158n0262l1155k5386l3722J09959p8913q448M2314m6197M9546
$$ y = [54139, 117518, -21072, -30682, -104010, 1550, 26969, 4944, -9897, -37306, -76461, -123306, -5439, 735, 15342, -70195, -64047, -10226, 35544, 29310, -55920, -61787, -47839, -95108, -31949, -27271, -19735, 50851, -63612, -75755, 5523, -68045, -75716, -48665, -40418, -30777, 48907, 67850, -107300, -154467, -216736, -145475, 27533, -42497, -56057, 18293, 1385, -5478, -25722, 33425, 32192, 18427, 50391, 11260, -5627, -70492, -29591, 27526, -24814, -73005, -99658, 21867, 15590, -54969, 8131, 66252, 24157, 10737, 55008, 23685, 66249, -33238, -86023, 13768, 111305, -28124, -34100, -10344, -74752, -55036, -14640, 65, -100983, -111023, -71835, -39202, -3752, 46406, -3856, -35011, -60397, -94119, 15840, -63073, -71521, -29207, -75404, -25858]
9051b5858k0765m6535M1679j7375k9685J19962m2120K9103P212k9848J05013j12090
9039b1307q1575R6242M3446Q7706j20843j48732Q7782J64166m0660k8467j8508
9028A9250o297M1412n8986n2996P0510n6846j5073K7414P8300K1022K7997O0454
9016A56161o0324p3505n1P0957j23157j6975J13510o618q1470K8230j10366J19185
9004A5577j5425n4793J12514j00580L654P9867J799j01286n334p6774J22222m4865
8992f3424k2494R329k7983M1125j7575O5292j13625j6130J33793k7732K131j52649
8980a89942J52880M4891r2112Q347k1664n8155J16987P9081o6405l4490o3149
8969a23731J40761n1749R8130q1379j8442j3405n677q9955k9254J16313K7442
$$ y = [-25858, -46623, -93158, -51479, -68854, -98539, 21423, -20697, 8406, 15618, -14230, 90783, -21307, -102882, -6640, 36806, 124512, 3669, -145063, -57281, 106885, 66225, 37758, 19250, 12953, 54365, -4621, -57617, 12893, -43953, -59026, -31612, 46688, 67710, 95707, 156161, 95837, 22332, 22281, 93238, -29919, -46894, 66616, 59998, -21472, 6758, -103608, 15577, 152, -54641, 57873, -42707, -39053, 40814, 42613, -58673, -64007, -140781, -18559, -63424, -85918, -76589, -104572, -63447, -81022, -15730, -129355, -145485, -11692, -39424, -37293, -189942, -37062, 7829, -84283, -75936, -97600, -155755, -38768, 40313, -26092, -60582, -123731, 17030, -34719, 63411, -17968, -36410, -49815, -55492, -145447, -174701, -58388, -30946]
8958c0946K2752N0493p654k4357j27430j1710N8896Q5941l9134r0292J0011j03512
8946b06942J07325P6656Q5405j18590n43N3361l102m024q6047K5822j081P9106
8934G346q5636J0227K2588j3040l6184P4179m6717k6268Q87o5477M2812N3233
8922f2050P7942l8486j38579L8559J59698p8430M2764J3723q4217L2829j08769
8911a45016M61L781J26501L1983j67757J19586J05001k024m7263n6078o5280l0228
8899a26333P9782Q0473m6088k4512n8625N197J13315j5159l3279K8828k0229M437
8887a2193J9300m1073J6882L87M6929j9125N6367n3903N1970j31648k0158O1009
8875b5256N5055j9137j6954J4945R2859k5043m7751j0688j2825j8921j7746K0922
$$ y = [-30946, -8194, 42299, 34645, 10288, -117142, -128852, -69956, 15985, -23149, -113441, -103430, -206942, -99617, -22961, 62444, -56146, -56689, -3328, -6430, -10454, -96501, -70679, -71760, 7346, -78290, -68063, -45475, -58515, -94699, -20520, -67237, -93505, -92618, -158095, -115283, -62050, 15892, -22594, -161173, -122614, 37084, -41346, 1418, 15141, -69076, -36247, -145016, -144555, -140774, -14273, 17710, -150047, -30461, 74540, 72516, 25253, -30825, -96105, -126333, -46551, 33922, -12166, -36678, -95303, -90106, 23209, 8050, -25229, 3599, -16630, -12193, 7107, -33966, -17084, -16697, 30232, 11107, 67474, 13571, 65541, -66107, -86265, -25256, 29799, 10662, -6292, 8653, 101512, 76469, 28718, 18030, 5205, -13716, -31462, -10540]
8863a0540o7784K7276N2594j7082o9694N2547n9914M0208P8510j4883K4757P0531
8851A06526j93765k7070J51715l9464p8582o8561O4214P1476j9069n3011R563
8840g6028J66555j18430j6726M6470k601j35334o452J75358o288j19741Q1556
8829a1661n7400P4122l6941k2303L0226K4236k3258K8857n0517l6202K8128P9302
8817B6589K5098l0212k0982J7111m9217k7812o319J2546Q004p936p1155J9744
8805a04541N8287L3584J0855o463K0823q6615L6557q517J04827K9908j80283p201
8793i8779n1206J03675M3711j50915J05755j7113j6078N1125k918j1465M8204
8782C996q158j9310K0388J6355m9563p26K765K4419R336q2982R0386J83250j30208
$$ y = [-10540, -78324, -51048, 1546, -15536, -85230, -32683, -92597, -52389, 26121, 11238, 35995, 106526, -87239, -114309, 37406, -2058, -80640, -149201, -84987, -13511, -32580, -85591, -76028, 90527, -27903, -44629, 1841, -760, -136094, -142546, 32812, 26524, -93217, -11661, -69061, 5061, -31880, -54183, -23957, 279, -22979, 5878, -44639, -80841, -52713, 26589, 51687, 21475, 493, 17604, -31613, -59425, -65744, -53198, -45194, -53130, -124285, -104541, -46254, -12670, -1815, -8278, 12545, -74070, -37513, -46030, 58797, 88705, -91578, -98779, -149985, -46310, -2599, -153514, -47759, -64872, -80950, -29825, -32743, -44208, 3996, -4162, -23472, -3084, 13271, -36292, -37018, -34253, -9834, -498, -83480, 6906, 190156, 59948]
8769E9948n8388N360j4329r3097O654J529o1227L0341L9655K7001M7540j4951
8757b3964J3389K5206l1791M508m9231P6596k0050l2068N9550j06116L9411P2328
8745B7768k2595K673q1101J2524j1833M9034J8196p5968N8872p5594L8578J37259
8733G7813n6782n6735P496K9321p0734k7982J24856j4840j18601k0977J2851N0664
8721f3650J768j2742R7643l5787J1079o7229K1570N3216O2135p7825O6372L2122
8709H8672j63355R6441q8310J8819R6307j10545N6348J8124J7138k442o6582o0565
8697i9950J17959M4468j21022M6705Q228M6647Q0738j46840l1628M2653l2543
8686d4585j0683J46924m5428m7433N3118P2583j08701j14436Q7251m914N3330
$$ y = [59948, 1560, 6920, -7409, -100506, -93852, -92323, -153550, -123209, -83554, -56553, -9013, -23964, -10575, 14631, -17160, -12652, -61883, 14713, -5337, -37405, 22145, -83971, -44560, 27768, 5173, 7846, -73255, -60731, -72564, -23530, -5334, -81302, -22430, -98024, -59446, 77813, 21031, -35704, -28208, 1113, -69621, -97603, 27253, 12413, -106188, -127165, -114314, -63650, -61882, -74624, 23019, -12768, -1689, -68918, -47348, 5868, 68003, -9822, 56550, 88672, -74683, 21758, -66552, -47733, 48574, -61971, -5623, 12501, 29639, 27197, -39385, -99950, 18009, 62477, -58545, -11840, -3612, 43035, 123773, -23067, -54695, -12042, -44585, -55268, 91656, 46228, -1205, 51913, 124496, 15795, -98641, -11390, -16304, 37026]
8675C7026l519q4615q989J0032p9089M7439Q3866k5259q153J3487l6340Q910j5667
8662f0871R0119P7605k4628r4255j8176L3547j8511O292j285K7106n9550R239
8650c3368j8512n8711M4328K9933k9749p0999L6172L35K5834Q1422q3781M1052
8638c6044P8913p0293l311J7943j45582K7965J06374J2197L4835J3766l9915p8359
8626h1511R2026o5518o5081K5849J44873R6470l6284j21625P686n0588n630O646
8614e2687L0286l6038l3702K1933O1493p2256M4243k2849J4901N5956q2240k4329
8602i5289K3050P7304N6613Q875m6408r2741M2853N4349J5243k502o2135L5067
8590A4279R6074k1817j09237J6604k268l9228m7573M8454l593N70M5899o8595
$$ y = [37026, 33507, -51108, -60097, -50065, -129154, -81715, 2151, -23108, -31261, -17774, -54114, -45204, -60871, 29248, 106853, 82225, -12030, -30206, 3341, -15170, -8878, -10163, 16943, -42607, -33368, -51880, -110591, -66263, -36330, -66079, -137078, -100906, -100571, -74737, 6685, -77096, -36044, 42869, -27424, -30735, -12792, -158374, -130409, -24035, -11838, 22997, 36763, -3152, -81511, 10515, -55003, -120084, -94235, 50638, 147108, 110824, -10801, -3115, -53703, -59333, -52687, -22401, -58439, -92141, -70208, -8715, -80971, -36728, -59577, -44676, 11280, -70960, -95289, -72239, 5065, 61678, 70553, 24145, -68596, -25743, 28606, 43849, 41347, -20788, 14279, 110353, 88536, -20701, -4097, -6365, -45593, -93166, -44712, -48305, -47735, -1836, -70431]
8578g0431r0672J07401M7887P7096j15713J3676q2178R4712n1246J7987K0068
8567c1413K5534O2431j0446q9261l2206m1034Q0537N166K9941n6714k0138K0923
8555e6680j7068J55562l2047k9838j1018N920k6386p8802J04283Q0869q9203M484
8543A0076r1963k1629j3547R9537p4803P5152J9046O863n6419K3148l5515L2219
8531b7835j082N9442o5795N755K637J1925j1213N2531m6225O964q3337m14P1425
8518b5222N2547j11716J7051n504P709k3355k7338N7211L8735p511K8840j1309
8506i862N461O1450K925r8664o3923R0607q281L9688N4909l1143q2573j995r164
8493e0565J6151L031J975M1106q8225J20370M1474j85469J12841L0358J22716
$$ y = [-70431, -161103, -53702, -5815, 71281, -44432, -30756, -112934, -18222, -69468, -51481, -31413, -5879, 56552, 46106, -43155, -75361, -116395, -35858, -30692, -751, -57465, -77603, -56680, -73748, 81814, 49767, 19929, 8911, 14831, -11555, -90357, 13926, 94795, 5592, 10076, -81887, -103516, -117063, -17526, -92329, -17177, 1869, 8732, -47687, -24539, -60054, -27835, -28917, 30525, -35270, -29515, -26878, -14953, -26166, 26365, -19860, -12896, -96233, -96647, -25222, 27325, -84391, -67340, -72844, -65135, -88490, -115828, -58617, -19882, -27393, 1447, -9862, -4401, 57049, 59974, -38690, -102613, -12006, -20287, 19401, 74310, 43167, -39406, -41401, -50565, -34414, -31383, -29408, 11698, -76527, 43843, 85317, -100152, 12689, 43047, 165763]
8482A65763J40413K39747o06469j72161J12439J814K6226M210l0708n862K2781
8471a01807L6886K8501l2194j9959p028R3200o9946O3292O0538m4481J5543n3584
8459c1039J23865p9266k2717m1211K8383M158k9646j12730J03116J4900p1287
8448a13474R7992n1008J2489n2778J15825R5394o8898m5060p7158m0495J05685
8437b1486K7825r2843n6971R0674M3048n9121N3747q1059q377R6164K8752l6457
8425a6104k4690J01560j022r3402l0813L4390P429m455q2875P4497J84105p1888
8413G6732n2008n5822k3008Q6052j5843M697j05376K2029j2924O9883k1752j2910
8401d0250j316m6593L8535n346L6853n0336M7708K9526p7094K5786m2699O201
$$ y = [165763, 306176, 545923, -60546, -232707, -120268, -118454, -92228, -88018, -118726, -124588, -101807, -64921, -36420, -68614, -88573, -95601, -2401, -72347, -9055, 51483, 7002, 22545, -31039, 92826, 13560, -9157, -50368, -21985, -17827, -47473, -160203, -57087, -42187, -113474, -15482, -66490, -54001, -106779, 9046, 104440, 35542, -9518, -86676, -127171, -21486, 6339, -86504, -143475, -52801, -9753, -68874, -15127, -96186, -104563, -8399, 20353, -16104, -40794, 60766, 59744, -33658, -64471, -30081, -22652, -27107, -109982, -35485, 148620, 76732, 24724, -31098, -54106, 31946, 16103, 20800, -84576, -62547, -75471, -5588, -27340, -40250, -41566, -88159, -49624, -54970, -18117, -68453, -20745, 8781, -68313, -42527, -85226, -79025]
8389g9025L2567O5399q2148m6941j8334L2762Q3295o2566Q5298j8856l8776r9754
8377a47079R0695o333j1950J8528l6093J23987n9705m9333l6017P3638K0917j2662
8365c1407o0463K744J29805M9169q0438m452p1110L2462N8582n4951M0580K9996
8353D0517O80o2048n771r8229L5794M3424R8131l8111j5424k2441M0113J8134
8341C4769q273K9479m4195l3772L7175n4745p0971L4605j9289L4716o6023Q7452
8329c9072k0605J06930N72k7826n5013R9917O228q6445o5943J8715M8082J5998
8317A538j9779k0916M0673J4174r3069N7469P6935k4670m0841K0980l3055M5401
8305B4840n0859l2504k9807l175N1763k9388j0588J26331j6672j11656J33719
$$ y = [-79025, -46458, 18941, -63207, -110148, -128482, -95720, -12425, -74991, 10307, -8549, -47325, -147079, -56384, -62717, -74667, -56139, -92232, 31755, -27950, -77283, -113300, -39662, -18745, -31407, -91870, -89126, 40679, 89848, 9410, 4958, -66152, -33690, 24892, -30059, 10521, 40517, 41197, -20851, -26622, -124851, -89057, -45633, 52498, 14387, -1037, -23478, 16635, 34769, 26496, 55975, 11780, -21992, 15183, -39562, -110533, -75928, -95217, -60501, -126524, -39072, -59677, 47253, 47825, 19999, -35014, 64903, 71131, -15314, -81257, -62542, -14460, 1538, -18241, -39157, 1516, 15690, -77379, -19910, 57025, 32355, -8486, 12494, -20561, 24840, -26019, -58523, -88330, -91505, -39742, -69130, -79718, 46613, 29941, -81715, 52004]
8294E2004O978j75982k2260M6270K6728M027m1982N9244N4219R542j03443k6131
8282a10786J8713M2756J4734M6183K4317K3139N9113j46033o253K9855m5347k3394
8270g3003K0329L8843J3710q8969K3899O716j3673N8961j6509M2923n2481l299
8258d2553m9414l6230P0240R6265j45637N0227l1314J21955Q87k5543M3676l1234
8246B1325q7286P3609L7547m8901L2844K7882n331p3511k2941J06491J1097r9902
8234b7077m425M1646k6610J3860P2639m1520j29145M0628k3504N8859p1677L4854
8222f1472K5668q6966M2598J19983j9915r644P2901j21977J9114l9691k9817J8865
8210g0353k6864n2732R3891N3372k3700J39732j14569p109j44442J30463o7725
$$ y = [52004, 58982, -117000, -139260, -92990, -66262, -62235, -104217, -44973, 9246, 18788, -84655, -110786, -92073, -49317, -34583, 11600, 35917, 59056, 118169, -27864, -34117, -4262, -49609, -73003, -52674, -13831, -121, -89090, -65191, -58475, -72148, -13187, -29696, 13227, -39254, -42553, -91967, -128197, -57957, 38308, -107329, -57102, -88416, 33539, 34426, 8883, 52559, 21325, -65961, 7648, 45195, -3706, 29138, 57020, 51689, -21822, -44763, 61728, 72825, -27077, -31502, 10144, -16466, -2606, 70033, 28513, -100632, -60004, -83508, -24649, -96326, -61472, -35804, -122770, -80172, 39811, 19896, 10252, 83153, -38824, -19710, -59401, -89218, -70353, -97217, -149949, -56058, -2686, -26386, 113346, -1223, -8332, -152774, -22311, -90036]
8199i0036N4082j0663r3079n0687P9855K2214J86813J226351o19290n83346j20187
8188B027J00353J2121j46048k0266N5973O3803M8540n1435l1350n3827r3987j1410
8176a25506O3686L2640k4214K6912P8064j2225k6719R58n69Q7739r343J26675
8164B18098j46075k9273o8409k1390K8330J28k2439L0052N3636r851N414m1101
8152b880o0313J31356j23110j06603R4786Q9601j29413Q5499k1519K7685M8977
8141C4066k0335J186m9280k9421Q2369K374n4181j7671m7852J06632j195p6036
8129f9344K9924N2764k2327O8965q7433L8269K1013q8134q8660k8128Q8701L9628
8117d4762R8830N4147r0771j007l4947J3930l7455K5674L0621p5949J16107j44871
$$ y = [-90036, -35954, -46617, -139696, -190383, -110528, -88314, 98499, 1324850, 705560, 122214, 2027, 102380, 114501, -31547, -51813, 4160, 67963, 116503, 65068, 33718, -20109, -114096, -125506, -61820, -29180, -53394, -26482, 51582, 39357, 12638, 13596, 13027, 100766, 91423, 218098, 72023, 42750, -25659, -47049, -18719, -18591, -41030, -10978, 42658, 32807, 38221, -2880, -63193, 68163, -54947, -161550, -66764, 22837, -106576, -21077, -42596, -14911, 34066, 13731, 14917, -34363, -63784, 18585, 20959, -33222, -50893, -98745, 7887, 6692, -69344, -39420, 13344, -8983, 59982, -27451, 10818, 31831, -56303, -144963, -173091, -84390, -44762, 54068, 108215, 17444, 16437, -18510, -4580, -42035, -16361, 14260, -61689, 54418, -90453]
8105i0453K6696J07876m1066j36341N5493K0449N610r4986K5458J74356n1192
8094A900p3536p6163n0230J05823J03846J0272J6683j00039N1968q2900Q1557
8083a0819o433J3092K9516n1874l9144O599Q2004L6714q4554N4250r1917m69J66894
8070A03859q4822j0457K6234k1650R267m8926K0605p7174K3717N548J17019k3349
8058C9871p2855k184L8122M8210j14244n0443O1778P7779Q2965j01954k3968k4339
8046d1262J2473O4359J7654o8954o5324P8901k4040o6699n6161L6447P3899J06801
8034F8094J8265j1374r7802M2226J190o6606K4289J8429j2606L5081j37391m6013
8022a64218Q2628P2178J6374J2331l3663N6259n8123L7264J07271j13534n9264
$$ y = [-90453, -63757, 44119, 3053, -133288, -77795, -57346, -51736, -146722, -121264, 53092, 1900, -71636, -147799, -198029, -92206, 11640, 21912, 38595, -61444, -9476, -92376, -10819, -17252, -4160, 25356, -26518, -65662, -59063, 22941, 59655, -24899, 29351, -62566, -63035, 103859, 19037, 8580, 34814, 13164, 22431, -26495, -5890, -83064, -59347, -53799, 63220, 39871, -32984, -35168, 2954, 51164, -63080, -113523, -51745, 26034, 108999, 7045, -16923, -41262, -28789, 35570, 53224, -15730, -81054, -2153, -26193, -92892, -149053, -112606, -38707, 68094, 86359, 74985, -22817, 19409, 20599, -46007, -21718, -3289, -15895, 19186, -118205, -164218, -81590, -9412, 6962, 19293, -14370, 41889, -16234, 21030, 128301, 14767, -44497]
8011d4497L5251j13164J17556M3864r0077L475q4944N016K1686m917O3717Q6498
7999C9464j03088J4525N3725j9520p903L7035K3007j09149j7792J20813k9038
7988B079k488o6099k3135P437J66991n1648k6330Q0472K8572K0674m5673m9282
7976D1570n5393M2650K859p3313J23743J7119j06210L9564K7367r0973j31764
7965a62781J50624n0847j9726O1123L7167l9893k5957K5426n4127n0577M5716
7954h3852P7668m5731j2103L0965j1266l0221L9948P4128j05782k5161O6111l3475
7942e8771K76L8008k0146P9442J9655m6887k5584p0965p0159P5961j8348L0415
7930f7103N1973N4511J0098m2304J8636j8325L9957j1267J14632m5809m9451k3769
$$ y = [-44497, -9246, -122410, -4854, 39010, -51067, -47592, -132536, -127520, -105834, -110751, -47034, 39464, -63624, -49099, 4626, -14894, -22797, 14238, 37245, -71904, -89696, 31117, 2079, -409, -66508, -89643, -82206, 84785, 33137, 6807, 87279, 115851, 136525, 90852, 41570, -13823, 28827, 31686, -41627, 82116, 99235, -6975, 32589, 59956, -31017, -162781, -12157, -63004, -82730, -21607, 15560, -24333, -50290, -24864, -78991, -129568, -83852, -6184, -51915, -64018, -33053, -44319, -74540, -34592, 39536, -66246, -91407, -25296, -58771, -58495, -20487, -40633, 38809, 58464, 11577, -14007, -84972, -155131, -79170, -97518, -67103, -15130, 39381, 49479, 7175, 25811, 7486, 47443, 36176, 150808, 104999, 55548, 31779]
7918C1779n5624P547M7661J0508J06869j71285M4228Q3493P8330m9118j9129P602
7906A22861L1353r4505K44634k64501l38559L34186j88726J23243J560O9092k9134
7895A1504M2561j06113L5447l3604j8905K4761O0672j01338q970O3066R2425J6259
7883G7765n6445K2335L5160l7340r1011K0601K5593k3207o315q095R7886n9498
7871b571K8332n6242k2594J34390O0851p5228l2446r101l9795L1701o8920K8216
7859b3407l8869k796Q2456j4404J8486m2136n9884j0140q8004R3319M1861J12188
7847F8670q3470N261p63l8372J21825r1842k8417J8459l3442J9108O8288O6655
7835I1960o3905P0236l655j2447p7199K2182J5077J8129q4823l6340M6879J04716
$$ y = [31779, -23845, -16298, 31363, 41871, 148740, -22545, 21683, 105176, 183506, 134388, 115259, 122861, 154214, 59709, 304343, 39842, -298717, 35469, -153257, -30014, -28454, 40638, 11504, 54065, -52048, -16601, -50205, -69110, -44349, 16323, -85015, -93985, -30919, 61506, 77765, 21320, 43655, 78815, 41475, -49536, -28935, -3342, -26549, -32864, -40959, 56927, -2571, 25761, -30481, -53075, 81315, 142166, 66938, 34492, 25391, -14404, 17297, -51623, -23407, -62276, -65072, 17384, 2980, 21466, -20670, -80554, -90694, -178698, -85379, -43518, 68670, -14800, -9539, -10302, -48674, 73151, -18691, -47108, -28649, -62091, -42983, 25305, 91960, 28055, 98291, 94636, 82189, 4990, 27172, 42249, 60378, -24445, -60785, -13906, 90810]
7823I0810k5310j36077P7364M8076j8030P1646o7375P5045j4128p2351m2235N5763
7811D3198j8158p3181J2763m5253M7653K9470j2832M7114j5575K9548R6397p3498
7799F7646q9491M1382m5250j5621J48073k4147j51607M1748Q571p2396L2918O7195
7787I021L1599o6197l0901r130Q6354L7298k6873p1768P7854M7894j7416j9041
7775D8694J8973m2608J2990l6573j4308K5698M5240N9578r5094N4175j45204K6492
7763d1947M2048p0764L0578N6669q8119M9717l104J13859r0919O1950M1892n9853
7751D2007k1419j5814P793L2774L2177M9758L8925p9458k5681K5062m5365q601
7739C2158K9934L0694N2677j5968j16208J2483O5610p7565o940r8856J63500m6346
$$ y = [90810, 65500, -70577, 6787, 54863, 36833, 108479, 41104, 116149, 102021, 29670, -12565, 43198, 25040, -48141, -35378, -80631, -32978, -3508, -16340, 30774, 15199, 44747, 141144, 67646, -21845, 19537, -25713, -41334, 106739, 82592, -69015, -27267, -18696, -91092, -58174, 9021, 40620, -25577, -56478, -65608, 20746, 58044, 31171, -40597, 37257, 85151, 67735, 48694, 67667, 25059, 38049, 1476, -12832, 12866, 58106, 117684, 22590, 76765, -68439, -41947, 101, -70663, -40085, 16584, -71535, -21818, -24922, 88937, -1982, 59968, 101860, 42007, 20588, 4774, 12567, 45341, 77518, 127276, 166201, 86743, 61062, 86124, 40759, 32158, 62092, 92786, 145463, 129495, 13287, 25770, 91380, 13815, 6875, -91981, 71519, 25173]
7727B5173J3207M9061j8616M2257l5369l9662J276K3695J794n6033J37580L13
7715A44676p8826M2869j27284l7749O4639J4726j02756P499J52697N3284p0337
7704F3438L4921n9837j16563J54598m7905p2047P7379l0618J3789q1247N5118
7693h974M8921p5386L8231n2616R3099k5222O6269J5971J1076j28661j7732k10180
7681b45204J55199J26007p635M6227K8024n814j60097R037J16219N8802O3422
7670A84187p6068p1190j8641L7477N9622K6234k6293K0090j14377R4829J980P4151
7658A92001k1875K5864k0516o4676K104n5860O2856P4757q8758K5419l123l1422
7646I6771O9242o8504n0563k5835K3551O219O7681N2070O8811p2464O8916l8926
$$ y = [25173, 38380, 87441, 68825, 111082, 75713, 36051, 37327, 61022, 62816, 6783, 144363, 144676, 65850, 108719, -18565, -56314, 8325, 23051, -79705, -72206, 80491, 133775, 63438, 98359, 38522, -78041, 76557, 28652, -43395, 33984, 3366, 17155, -64092, -8974, 39947, -35439, 2792, -49824, 43275, 18053, 84322, 100293, 111369, -17292, -35024, -245204, -90005, 36002, 28367, 74594, 102618, 96804, -63293, -54256, 61963, 120765, 184187, 108119, 36929, 18288, 55765, 115387, 141621, 115328, 135418, 21041, 115870, 117850, 192001, 170126, 195990, 175474, 110798, 112902, 57042, 119898, 194655, 105897, 131316, 128193, 96771, 166013, 97509, 46946, 21111, 44662, 50881, 118562, 170632, 239443, 166979, 235895, 196969]
7634A96969Q0817j85433p148K2472M395J9900N92k2139J33719m6774j23090m432
7622F9848K6270J6907j4645L1068n5489j3110Q2992O9726P3124j06896j6695p806
7610A55294o4844K6289K5932o1501N8341J11002j17009M6088n5870k0251N4247
7599A57718j8425o294n0983L4890l410L2431L077M7623L2379p1150m6261P6194
7587A87789n5713j3710q352Q2271O0280N8960q0802k7926m3062j5704K4847j936
7575A66942L4607o2147M3993j3953M4346j2988k4463L9969j4901o9577o2141N6346
7563A26033n0169M857k1340N1753J3282J09350M8736m2857n4460q668j017n4375
7551A21125l9125K2321R7970n1182n9752M7271J19593j30675n9019M2927L3982
$$ y = [196969, 277786, 92353, 85205, 107677, 112072, 131972, 132564, 110425, 244144, 197370, 74280, 69848, 96118, 113025, 98380, 129448, 73959, 60849, 143841, 213567, 286691, 179795, 163100, 155294, 90450, 116739, 142671, 81170, 139511, 250513, 133504, 179592, 123722, 103471, 157718, 139293, 132999, 82016, 116906, 113496, 145927, 149004, 196627, 229006, 157856, 111595, 187789, 132076, 118366, 110014, 192285, 252565, 311525, 230723, 202797, 159735, 144031, 168878, 166942, 201549, 139402, 183395, 169442, 213788, 200800, 176337, 216306, 201405, 131828, 69687, 126033, 75864, 80721, 59381, 111134, 124416, 233766, 282502, 239645, 185185, 176517, 175500, 121125, 82000, 104321, 202291, 151109, 91357, 138628, 258221, 127546, 68527, 111454, 145436]
7540A45436l9668L9275m1817L3130J12111q2998n1985q1352L0414N9592n2353
7529F9785J08118M3012J055n8989R87J11426j10276J02111l0988p0682K450R144
7517A77153P2926o1186N9942l8308k66l8925m8254j5400O177P5288R1788R091
7505B90026o5801m6785l4489O210J20450q550o3045j1712j4842j6712K5581q8638
7493I1693R3197P153Q9638j7588o8220J7484r1334J62762n0183j341m3889Q1053
7481B70425j7541k1687L2853j35475Q4561L2594N692o4130k169k7358O2996N8149
7469B78910M661m0722r038L6166J28580m0159p3218R5253j4087j18605K8770O786
7457B83297K7078l0486m186j12563K3249J31059k6321O528j19242j0467Q3585
$$ y = [145436, 105768, 145043, 103226, 136356, 248467, 165469, 113484, 32132, 62546, 122138, 69785, 177903, 220915, 221970, 162981, 163968, 275394, 165118, 267229, 236241, 165559, 168009, 177153, 250079, 188893, 248835, 210527, 210261, 171336, 123082, 107682, 113859, 189147, 280935, 290026, 224225, 177440, 142951, 149161, 269611, 261061, 198016, 186304, 171462, 154750, 180331, 91693, 184890, 192043, 281681, 264093, 195873, 213357, 122023, 284785, 234602, 233261, 189372, 270425, 252884, 231197, 264050, 128575, 213136, 245730, 251422, 187292, 185123, 157765, 220761, 278910, 283571, 242849, 233811, 269977, 398557, 358398, 285180, 380433, 366346, 247741, 276511, 283297, 310375, 279889, 275703, 163140, 186389, 317448, 291127, 297655, 178413, 167946, 251531]
7446B51531M5618M3379k50l7621l8637m014L5131m6533J14815r425O4194n0044
7434C68144L1040m9051K3898J11524j31556k5952N3687k977L3870L7544O9051
7423E19222p9581p4734P8130P0387o2317J10638j8638J0009J8896m9943N1162
7412E73231m875n0645Q7540j061n540P988q3523J75338L5241O8710n7774L8331
7400G82961J47775m5040P1572J70782J34765K03904m8120j19406j03811J111Q148
7389A204641Q9135Q9493M2460J0798Q3816m8189j62559l1621O0399o0300o7989
7378A210084M0825N923K1213J6281k1776j07210o9706K0997J23911K4200m1085
7367A223657R2961R3671k148Q0577O0252J53740N1157O0133K6396J44511J58435
$$ y = [251531, 297149, 340528, 340278, 302657, 264020, 260006, 295137, 248604, 363419, 353994, 418188, 368144, 399184, 350133, 374031, 485555, 353999, 328047, 381734, 378757, 412627, 450171, 519222, 439641, 364907, 443037, 513424, 451107, 561745, 543107, 553116, 572012, 522069, 573231, 568356, 517711, 605251, 604190, 598650, 606638, 523115, 698453, 733694, 802404, 744630, 782961, 930736, 885696, 957268, 1128050, 1262815, 1466719, 1418599, 1299193, 1195382, 1196493, 1204641, 1293776, 1383269, 1425729, 1436527, 1520343, 1472154, 1309595, 1277974, 1338373, 1278073, 1210084, 1250909, 1256832, 1278045, 1294326, 1272550, 1165340, 1095634, 1116631, 1240542, 1264742, 1223657, 1316618, 1410289, 1408141, 1488718, 1548970, 1702710, 1753867, 1814000, 1840396, 1984907, 2143342]
7356B143342K24449K47619N5259O3988j60951j31354r4459j3277j526o6028m4997
7345B222065n348M5085P9494j10732K19429j601J18546J64478J11542L7346J81767
7334C062071K13745J95632K05871L69913N47701N06265O11941J97639j0771k88363
7324E611644k51395Q1521J27323K74866Q8438k79429n34000n35694l14753k40992
7314D027529k49106k0909q393p3527J45076J6844J94777K94464K96590M42373
7304E065718N65284K34506J20294K32268K81716q2500j9747j53848k80873l44838
7294E617980l27669n98042o49396m22307k38546j58483k76167j66562n2315J9494
7284B747987n4084j36612j18221r2943K2318q62n3980R5364k5245j74320n82M5869
$$ y = [2143342, 2367791, 2615410, 2670669, 2734657, 2573706, 2442352, 2347893, 2334616, 2333090, 2267062, 2222065, 2216717, 2261802, 2341296, 2230564, 2449993, 2448392, 2566938, 2731416, 2842958, 2880304, 3062071, 3275816, 3471448, 3677319, 4047232, 4594933, 5101198, 5713139, 5910778, 5900007, 5611644, 5360249, 5441770, 5569093, 5843959, 5932397, 5652968, 5118968, 4583274, 4268521, 4027529, 3778423, 3757514, 3749121, 3675594, 3820670, 3837514, 4032291, 4326755, 4623345, 5065718, 5631002, 5865508, 5985802, 6218070, 6499786, 6417286, 6397539, 6243691, 5962818, 5617980, 5290311, 4692269, 4042873, 3620566, 3382020, 3223537, 2947370, 2780808, 2728493, 2747987, 2693903, 2557291, 2439070, 2346127, 2368445, 2367583, 2313603, 2408967, 2383722, 2209402, 2208820, 2254689]
7272B254689r6895r5943L9114j01663J1988j14335j328j4138M2346J2539p4255
7261A862119O0262L532R3532R6608J8505M9087o581j17111J61294M1703L0562
7250B293512o8467m5755k1953Q2813O1779k24508l842J42191J417j4784K2772
7239B225175l4909l2375J0852n1679O3016O9890l8209J5507l4377M6114j4196
7228B224809l0286J02816Q0307k982j6987j61350M8131o9951N3581N8641J07689
7217B394418p2897o8565k6068L4976K7597j31954j55127M8810J1709q7892M7438
7206B022445r0655q8652J8600o435l9463N1554p2918J36658j04133n985J39566
7195A960582N2575o9786L1377k3838k8719p842L3409K0727o8997k2183M5867L2348
$$ y = [2254689, 2157794, 2061851, 2100965, 1999302, 2011290, 1896955, 1895627, 1881489, 1923835, 1936374, 1862119, 1922381, 1925913, 2019445, 2116053, 2134558, 2183645, 2177064, 2059953, 2221247, 2262950, 2293512, 2225045, 2179290, 2157337, 2240150, 2301929, 2077421, 2073579, 2215770, 2217187, 2202403, 2225175, 2190266, 2157891, 2168743, 2117064, 2180080, 2249970, 2211761, 2227268, 2192891, 2239005, 2224809, 2194523, 2297339, 2377646, 2374664, 2357677, 2196327, 2244458, 2174507, 2228088, 2286729, 2394418, 2321521, 2252956, 2226888, 2261864, 2289461, 2157507, 2002380, 2051190, 2062899, 1975007, 2022445, 1931790, 1843138, 1861738, 1855303, 1815840, 1867394, 1794476, 1931134, 1827001, 1821016, 1960582, 2013157, 1943371, 1974748, 1950910, 1922191, 1914349, 1947758, 1968485, 1899488, 1877305, 1923172, 1955520]
7183A955520Q4341m5994J37799j1053k818Q2446M2981L9285l2004P4572N1676
7172B376751K3201J9870P3029J0807J69449R7364l6502l1675M8966J75478L4347
7161B961085R8871K1329J4153N3922J20244K11076M4113N6528Q4808J52317K14199
7150D032645J82816J06799J72913J11601Q5007K14698J78017K89930J71054L95130
7140E940610K87414L71010M54593L82329K67452P7306O475l5501K35758L25898
7130H313344N17049M37622K72488L09571K3067r5472r6452J15041K45204M57721
7120A0499183L96054J90932l7882Q8053L37353N52557N16850M89086J94410K70080
7110A3496676M96356Q61292J168810J191741O42547K82032L96484L48465J28943
$$ y = [1955520, 2039861, 1993867, 2131666, 2120613, 2117795, 2200241, 2243222, 2282507, 2250503, 2325075, 2376751, 2399952, 2419822, 2492851, 2503658, 2673107, 2770471, 2733969, 2702294, 2751260, 2926738, 2961085, 3059956, 3081285, 3095438, 3149360, 3269604, 3480680, 3524793, 3581321, 3666129, 3818446, 4032645, 4215461, 4322260, 4495173, 4606774, 4691781, 4906479, 5084496, 5374426, 5545480, 5940610, 6228024, 6599034, 7053627, 7435956, 7703408, 7780714, 7787189, 7751688, 7987446, 8313344, 8830393, 9268015, 9540503, 9850074, 9873141, 9777669, 9681217, 9796258, 10041462, 10499183, 10895237, 11086169, 11048287, 11136340, 11473693, 12026250, 12543100, 13032186, 13226596, 13496676, 13993032, 14854324, 16023134, 17214875, 17857422, 18139454, 18535938, 18884403, 19013346]
7101A9013346k19102r35892j057091q18184l23373k10764p3539o4190j93630k34827
7091A4882754k12856M7095J84328L43174M13555M09524M81185M99525Q60039J030742
7081A8939065J212655J111874P55406K29158k66775l71168M399N27907O56145
7072B2798666L91323J96366k3580J51803R1970l54968m50488j59709Q157K12425
7062B2861965M63436M35345N89445N46821Q98189R66279Q63111Q68965J103356
7053B9596912J171443J578331K082789K662856K654240L159937L463287M043096
7045E0412891M794652P272756R218936J2667159J6017136K1019649M977885j6996176
7037A09384888k1855286j5877073j0031517p149933m514727l505454k499090k169480
$$ y = [19013346, 18794244, 17858352, 16801261, 15983077, 15659704, 15448940, 15375401, 15311211, 15117581, 14882754, 14669898, 14716993, 14901321, 15244495, 15658050, 16067574, 16548759, 17048284, 17908323, 18939065, 20151720, 21263594, 22019000, 22248158, 21981383, 21610215, 21614614, 22142521, 22798666, 23189989, 23386355, 23362775, 23514578, 23606548, 23251580, 22801092, 22641383, 22649540, 22861965, 23325401, 23760746, 24350191, 24897012, 25795201, 26761480, 27624591, 28493556, 29596912, 30768355, 32346686, 34429475, 37092331, 39746571, 42906508, 46369795, 50412891, 55207543, 62480299, 71699235, 84366394, 100383530, 121403179, 126381064, 109384888, 87529602, 71652529, 61621012, 54471079, 49956352, 46450898, 43951808, 41782328]
7029D1782328j279784j304182r84118p87735m06701l39855N1972N1919M06100
7020C7189944N43864Q82450J077199J231148J307727J527028J666619K359457
7012D7785436K919211L521483L891244K935440J062382R06134J881509K906590
7004F7809429K906552O06636j486220j392731n82815K18508J069817J661805K332457
6995G3143438K856843L287609L670423M214305M907249N953905P359964Q861918
6987A14255654J0724517J2804041J3866314J0902225Q400463J0702858J2544786
6980A94200858J0530705M710113p909885j5070917j2714036q063566m908672j335972
6972A59438628K564925N878482Q261648N075669k937959o350286m112100j58844
$$ y = [41782328, 40502544, 39198362, 38214244, 37426509, 37019808, 36679953, 36731925, 36783844, 37189944, 37733808, 38616258, 39693457, 40924605, 42232332, 43759360, 45425979, 47785436, 50704647, 54226130, 58117374, 61052814, 62115196, 63021330, 64902839, 67809429, 70715981, 71322617, 69836397, 68443666, 67860851, 68079359, 69149176, 70810981, 73143438, 76000281, 79287890, 82958313, 87172618, 92079867, 98033772, 105393736, 114255654, 124980171, 137784212, 151650526, 162552751, 170953214, 181656072, 194200858, 204731563, 209441676, 201531791, 186460874, 173746838, 165683272, 160774600, 159438628, 162003553, 167882035, 176143683, 181219352, 178281393, 171931107, 167819007, 167660163]
6964A67660163L609412M341398J961215J961378N815234R808345R872447R488727
6956B14518319J2205572J0943436L591211p181171j5925965j5884034j0678418
6949A91588950m560590O59550L717767L304035O42427o32337k85001n255201j2662108
6940A76517492j4089168j0312312p337620q926986j2241619j2273471j0108070
6933A01228246p588898n540153m231366l064246k372866j550702p64916L90666
6925G6505765J588660K780991L888138K976932j511084n496711n552120l795044
6917G1385527k373932k337734m419556n336451m811366l834574l222960k498587
6909D2550367k238659j802869j454700j409162j192781r75650j025044q23818
$$ y = [167660163, 171269575, 175610973, 177572188, 179533566, 185348800, 195157145, 205029592, 214518319, 226723891, 237667327, 241258538, 234077367, 218151402, 202267368, 191588950, 187028360, 187687910, 191405677, 194709712, 195352139, 194719802, 194434801, 189179600, 176517492, 162428324, 152116012, 144778392, 135851406, 123609787, 111336316, 101228246, 93639348, 88099195, 83867829, 80803583, 78430717, 76880015, 76115099, 76505765, 78094425, 80875416, 84763554, 87740486, 86229402, 80732691, 75180571, 71385527, 69011595, 66673861, 62254305, 56917854, 52106488, 48271914, 45048954, 42550367, 40311708, 38508839, 37054139, 35644977, 34452196, 33476546, 32451502, 31627684]
6901C1627684n75066o19992n35300m17202l51331k43695l31536k41877n7727l7721
6891B8216237J02645J82137J51144J93042L18366L37727J41531J01779q530J89108
6881B9925186L02259M01790L96989J59329J07904J5203M0676J84462L70532N18373
6871C2422703N52711M01788P02189Q53687Q90803J158252J398889J510249J727329
6862D1618600J876667J503482J509062J757981K249149K740791L191516L863748
6854F0310996M391511M791166N621964O606688O567012L894947J804292J987049
6846I5975625K692495o68021n078977n526211l864677k003911o70581P18357K043554
6837H3617653L423979M814107O123334O864520N140800L365637L555739M825128
$$ y = [31627684, 31052618, 30432626, 29897326, 29480124, 29128793, 28885098, 28553562, 28311685, 28253958, 28216237, 28318882, 28501019, 28652163, 28845205, 29163571, 29501298, 29642829, 29744608, 29736078, 29925186, 30227445, 30629235, 31026224, 31185553, 31293457, 31308660, 31349336, 31533798, 31904330, 32422703, 32975414, 33377202, 34079391, 34933078, 35823881, 36982133, 38381022, 39891271, 41618600, 43495267, 44998749, 46507811, 48265792, 50514941, 53255732, 56447248, 60310996, 64702507, 69493673, 75115637, 81722325, 88289337, 92184284, 93988576, 95975625, 98668120, 98000099, 92921122, 87394911, 83530234, 81526323, 80855742, 81574099, 83617653, 87041632, 91855739, 97979073, 104843593, 109984393, 113350030, 116905769, 121730897]
6829A21730897L888170J471382J759412M314082N338642L554199J052788k272782
6821A40836790m956391m862253k622389j634954l021611l481892k401945p43337
6813A17112018J195694L197742N343361O238103N416449N553406P214200Q557390
6805A59828363R034922Q479168N290459K824965P90536j539149l512840n950600
6797A75245824p854261q297893p639682p828349p724888o938437o227733n437782
6789A17296799l945885k310703n37975J118970K890736M467469N530855N288470
6781A29798736N213569P156058R580604J0109976Q333249N115211K208782Q1354
6773A77597539l753609r586404j2955194j2265852r848575q161953p465766p164730
$$ y = [121730897, 125619067, 127090449, 128849861, 133163943, 138502585, 142056784, 143109572, 140836790, 135880399, 131018146, 128395757, 126760803, 123739192, 120257300, 117855355, 117112018, 118307712, 121505454, 126848815, 133086918, 138503367, 144056773, 151270973, 159828363, 168863285, 177342453, 182632912, 185457877, 186248413, 184709264, 181196424, 175245824, 167391563, 159093670, 151453988, 143625639, 135900751, 128962314, 122734581, 117296799, 113350914, 111040211, 110502236, 111621206, 114511942, 118979411, 124510266, 129798736, 135012305, 142168363, 151748967, 161858943, 170192192, 175307403, 177516185, 177597539, 173843930, 164257526, 151302332, 139036480, 129187905, 121025952, 113560186, 106395456]
6765A06395456o919954o789534n875717n022554l820040k567280j782649r62192
6757G2655536l88207j9114L34393J225477K168938K934928L397803L336432J778813
6748H7424999j192089l767067m011209l248640l149592m367750n894008o120853
6740E5673791n509120m355381l520439k923346k385418j941237j589741j205667
6732C2243442j391093j451059j228246j134324r39365j126788j052899j113169
6724B2806499j128944r23950j008903r64798p71268p47858n82284o14586n28252
6715A5535656m80112m68035k99489m22606k21668j99142k99066o6740j64751l90837
6705A2523210l07273k62804k28168k33585l60527m22558k80559l50932m23294
$$ y = [106395456, 99475502, 92685968, 86810251, 81787697, 77967657, 75400377, 73617728, 72655536, 72267329, 72248215, 72582608, 73808085, 75977023, 78911951, 82309754, 85646186, 87424999, 86232910, 82465843, 78454634, 75205994, 72056402, 67688652, 61794644, 55673791, 50164671, 45809290, 42288851, 39365505, 36980087, 35038850, 33449109, 32243442, 30852349, 29401290, 28173044, 27038720, 26099355, 24972567, 23919668, 22806499, 21677555, 20753605, 19744702, 18779904, 18008636, 17260778, 16678494, 16063908, 15535656, 15055544, 14587509, 14288020, 13865414, 13643746, 13444604, 13145538, 13078798, 12914047, 12523210, 12215937, 11953133, 11724965, 11491380, 11130853, 10708295, 10427736, 10076804, 9653510]
6696I653510k45046j69006k74838k21813j76108o7710j93960j86768l11372o2751
6686G744138j41165j60654j77229p2988M1785j50496k21393j72806k77888j52408
6676F258896p9998j96426q4778k33717k05538j71270o9853r7677j52643l164j28165
6665D835667q5932r7035j24425p0865l2747k12388j36274j2467q4417j81585j27219
6654C670313r8244j3966k0906r0656j31731m7655j01198J5880l5366j40209j5929
6643B990333j55471R0073l0638j32065o6719K3711j05788L6612q3667l3867K9597
6632B562111q9074k0645k4102k9110J8789r6364n3307K9880p22J5730k1143q3324
6620B208719L6276p1122l5610p3212k3715k1652J2368m0665N4315k3222M6704
$$ y = [9653510, 9408464, 9239458, 8964620, 8742807, 8566699, 8498989, 8305029, 8118261, 7806889, 7744138, 7602973, 7442319, 7265090, 7192102, 7233887, 7083391, 6861998, 6689192, 6411304, 6258896, 6178898, 5982472, 5897694, 5663977, 5458439, 5287169, 5217316, 5119639, 4966996, 4963832, 4835667, 4749735, 4652700, 4528275, 4457410, 4424663, 4212275, 4076001, 4063534, 3979117, 3797532, 3670313, 3572069, 3558103, 3537197, 3446541, 3314810, 3267155, 3165957, 3181837, 3146471, 3006262, 2990333, 2834862, 2924935, 2894297, 2762232, 2695513, 2719224, 2613436, 2650048, 2566381, 2532514, 2562111, 2473037, 2452392, 2428290, 2399180, 2417969, 2321605, 2268298, 2298178, 2297456, 2313186, 2292043, 2208719, 2244995, 2173873, 2138263, 2065051, 2041336, 2019684, 2032052, 1991387, 2045702, 2022480, 2069184]
6609B069184n4691p2026k4106o8529Q2948Q800m2267J0637j6715M3057o8912M9411
6597A916791O3457o1716K3717L9424J15083L5311k7406J47110R5849N1373J10339
6586B509332K35884Q8269Q2835J06820K0876p4327J7768J40197O0135j42554k63632
6575B781603j44425j26524o1702p180j01466N375j15499R0293o3365o7843L7927
6564B227194R863k902k2825J81661J51864J33001P4242L6190M0164M3261p3717
6553B797996J3048m8046q8660j38095r3638N453j20153r9618k0559k14548m1167
6542A952013k2571j22172l0563p8618l1181J1863O8609N9382j4456J07763j7909
6531A882160L082N8988j1270r7514n7477o5510p1253l9668k7391n8048m8793j06497
$$ y = [2069184, 2014493, 1942467, 1918361, 1849832, 1932780, 1941580, 1899313, 1909950, 1893235, 1936292, 1867380, 1916791, 1980248, 1918532, 1942249, 1981673, 2096756, 2132067, 2104661, 2251771, 2347620, 2398993, 2509332, 2745216, 2833485, 2916320, 3023140, 3044016, 2969689, 2987457, 3127654, 3187789, 3045235, 2781603, 2637178, 2510654, 2448952, 2441772, 2340306, 2345681, 2230182, 2320475, 2257110, 2189267, 2227194, 2237057, 2234155, 2211330, 2392991, 2544855, 2677856, 2752098, 2788288, 2828452, 2871713, 2797996, 2811044, 2762998, 2674338, 2536243, 2442605, 2448058, 2327905, 2228287, 2207728, 1993180, 1952013, 1929442, 1807270, 1776707, 1698089, 1666908, 1678771, 1747380, 1806762, 1792306, 1900069, 1882160, 1885242, 1944230, 1932960, 1835446, 1777969, 1712459, 1641206, 1601538, 1574147, 1516099, 1467306, 1360809]
6519A360809K4150N330n1898P843m6879j01680R1221K4977J4515P5305j09M0587
6507A444171L1463M6345R9323j24813m7561k546o6607m4409N556L6905o6191q0404
6495A231232j28388o2300k7776q9960j4142n8821N2864n6065q7437j8279N4103
6484G95031O5958J07546k324n3825M4449n9205J0748k1358j03808M5052j0151
6473H18113q804n8029L9026j27666q5404R6481o1175J1469r1361q9084L0405N2283
6461E26254j4974O3596p7215n6098L3975m9192l01L2572Q6997m6401p951M708
6449D95970J633J0661n3584N7702P256m4412L4282l9181O0955n9554m7169M4729
6437D69288K3628P0702o8649j3128O9037L1922N3990L703j1568L8977k0630l4971
$$ y = [1360809, 1384959, 1390289, 1338391, 1346234, 1299355, 1197675, 1288896, 1313873, 1328388, 1403693, 1403584, 1444171, 1475634, 1521979, 1621302, 1496489, 1448928, 1446382, 1379775, 1335366, 1340922, 1377827, 1311636, 1231232, 1102844, 1040544, 1012768, 922808, 908666, 849845, 902709, 846644, 759207, 740928, 795031, 860989, 968535, 966211, 912386, 956835, 897630, 908378, 887020, 783212, 828264, 818113, 809309, 751280, 790306, 662640, 577236, 673717, 612542, 624011, 532650, 443566, 473971, 526254, 511280, 574876, 497661, 441563, 475538, 426346, 426045, 458617, 545614, 499213, 491262, 495970, 497603, 508264, 454680, 512382, 519638, 475226, 509508, 470327, 531282, 471728, 424559, 469288, 492916, 563618, 494969, 481841, 550878, 582800, 636790, 640493, 628925, 667902, 647272, 612301]
6425F12301R8037J1690j0885J21753j05065j0406Q8639P4940K7229m308o3834
6414H40091J38912J57915q9088K4551P5093N8382O9526L2890P9278m4138J22286
6403A465698R2714n5044K7471N9365M4971J2743R9320J06454J12609J67489J89901
6392B323691O3705J79991K53359K47168L05568L69947M33184M13117M47491L24366
6382E361587Q1473n2670K3039J29617J59802o0960k51018k47334m19826m18178
6372D305532k18999k20032j40789k1997k431j17989m7400j22371R4799P0466Q4406
6361C663195J98767K50889L06390J35008J31324K19551l6141l6608J0326P9014
6351D921715j11781k45569m29433m98106l02770k80633k62085j62080j76848j68375
$$ y = [612301, 710338, 722028, 711143, 832896, 727831, 717425, 806064, 881004, 908233, 903925, 840091, 979003, 1136918, 1047830, 1072381, 1147474, 1205856, 1275382, 1308272, 1387550, 1343412, 1465698, 1558412, 1503368, 1530839, 1590204, 1635175, 1647918, 1747238, 1853692, 1966301, 2133790, 2323691, 2387396, 2567387, 2820746, 3067914, 3373482, 3743429, 4176613, 4589730, 5037221, 5361587, 5443060, 5390390, 5413429, 5543046, 5702848, 5641888, 5390870, 5143536, 4723710, 4305532, 4086533, 3866501, 3725712, 3703715, 3701284, 3583295, 3535895, 3413524, 3508323, 3578789, 3663195, 3861962, 4112851, 4419241, 4554249, 4685573, 4905124, 4868983, 4832375, 4842701, 4921715, 4809934, 4564365, 4134932, 3636826, 3334056, 3053423, 2791338, 2629258, 2452410, 2284035]
6341B284035j62970k61649k29137n7123j11229j10861j02668j35799q7862L0202
6331A054939o9884r3805k7722j04269K0617k9786M3972j8868k9062K156m9843
6320F98445J0451r7488p0112m4222j9261n3855M125M5597j48607n7526Q6524j7736
6308C36335k4308J885P221N241k3425r4406Q3398K2722p0358L6164j24974Q5888
6296B41383m4272j2972K1929N4617m9992J7166n8211J84560j9146j75206J01653
6285B61509K7318j04399r474q435q7498L61Q1814j913j8469L1915k6985l3563
6273A12181k7523K5523l6960M5842k3932q010O5129n9463n4451o3701J33903K3221
6261A31759o7286O1128l3615j26989R7181k190j00660l3317N3641N2092M7949
$$ y = [2284035, 2121065, 1859416, 1630279, 1573156, 1461927, 1351066, 1248398, 1112599, 1024737, 1054939, 985055, 891250, 863528, 759259, 779876, 750090, 794062, 775194, 746132, 748288, 698445, 708896, 611408, 541296, 497074, 477813, 423958, 428083, 473680, 325073, 267547, 354071, 336335, 312027, 313912, 321133, 326374, 302949, 208543, 291941, 314663, 244305, 280469, 155495, 241383, 197111, 184139, 206068, 260685, 210693, 227859, 169648, 354208, 335062, 159856, 261509, 288827, 184428, 174954, 166519, 79021, 79382, 161196, 159283, 140814, 172729, 145744, 112181, 84658, 110181, 73221, 119063, 95131, 87121, 152250, 92787, 38336, -25365, 108538, 131759, 64473, 125601, 91986, -35003, 62178, 59988, -40672, -73989, -20348, 31744, 79693]
6250G9693l1736K9976J6703j03622L8978n2933j2666J02481p275K8055n4310o5298
6238c1954L0593M7252n846l1896K5854n077l9416r135p7621J48233k9478k8354
6226f845Q5636j16439M7706l4276L9362R357q1639R8184O3733r4870J6962l9119
6214a2248m267L0081p014L8247J16433j10152o9855O6233j7152K2700p3243k8807
6202d9044N6281O091L8036l6312o1068p2848R7607L5971o3078n9529P6850M6296
6190A5253K2397r1201m1171m684j7371O4257N9169l7792O850n7903N8296J6740
6178g160m9073M3288n1391Q9070n909q0885N6644R7091l9371r2194K0807l0920
6166e0003k024J02536K1027o5184P71L3231j24677l1029L4339N2400O2242p4405
$$ y = [79693, 47957, 77933, 94636, -8986, 29992, -22941, -35607, 66874, 59599, 87654, 33344, -31954, -1361, 45891, 40045, 8149, 34003, 28926, -10490, -19625, -97246, 50987, 21509, -6845, 78791, -37648, 10058, -24218, 15144, 24501, -57138, 41046, 104779, 9909, 26871, -12248, -16515, 13566, 6552, 44799, 161232, 51080, -18775, 47458, 30306, 53006, -20237, -49044, 7237, 13328, 51364, 15052, -46016, -118864, -21257, 14714, -48364, -107893, -31043, 15253, 37650, -53551, -94722, -99406, -116777, -52520, 6649, -31143, -24293, -82196, -23900, -7160, -56233, -12945, -64336, 24734, 18825, -62060, -5416, 91675, 52304, -39890, -19083, -50003, -52027, 50509, 71536, 6352, 7123, 40354, -84323, -115352, -81013, -28613, 33629, -40776]
6154d0776p2429l3239L5823P0409J8062k1972r284L4820L8353o0118K4043o3520
6142g9828p7504L4077j5910Q8754m4473J36500k9738j19170k0818O6358O5325
6131C573n8361L4297K3900m933L042q9078P106M246L4462K2973q7651R1607p4049
6118h8866J8112J01946J536j7888m5922P0398k8587j34507l9094P0261J09784
6107A7173J0035n2754o3780L4952J3047N4809j20589L0788J15902j8745l616L096
6095B0318j7819q5799L433o6118O6105M3534k5183Q8909l2536r1389Q2353q0602
6083i4794n3800J23514O3022o8419Q6837K4278j24370L7842M7788p8073N126j3589
6071d4638L0075j634K9669J8883k9847L888o4543K2416k2655J02687k5811m2320
$$ y = [-40776, -113205, -146444, -110621, -40212, -22150, -44122, -53406, -18586, 19767, -40351, -16308, -79828, -157332, -123255, -139165, -50411, -94884, 41616, 11878, -107292, -128110, -61752, 3573, -54788, -20491, 3409, -1524, 1518, -87560, -80454, -76208, -41746, -18773, -106424, -14817, -88866, -70754, 31192, 32728, 14840, -31082, 39316, 10729, -123778, -162872, -92611, 17173, 27208, -25546, -89326, -54374, -41327, 13482, -107107, -76319, 39583, 20838, 17222, 20318, 2499, -83300, -79867, -145985, -79880, -36346, -61529, 27380, -5156, -96545, -14192, -94794, -148594, -25080, 37942, -30477, 56360, 80638, -43732, -5890, 41898, -36175, -31049, -44638, -14563, -16197, 13472, 32355, 2508, 6396, -58147, -35731, -58386, 44301, 18490, -23830]
6059b3830k2994J08014m4704R912J3249j06157Q980J0823L2750Q1043n7554j11602
6047a02070n4484M4072O8215N0657Q3333r9740R9606J8792r9507L9017M7141j18301
6035b3269K4126m8167J2723o017n2925k1841N3646o3117K9741J00974k4496n1064
6023f9686K2140j1000m0574j0607K8154k5460O7557J9638q2492o1323J02548J2171
6011d8934J0527k2507r4517J50971k4412j465k1935J8441R373M6630j5103k3752
5999a6683m0759J82210o8117n5539J7347n8703J5365k344K3275p9040M2594M1059
5987F65k6921O5828j24783n9508J20901J9448J6849L3867n3542n5541l0033J7745
5975g5025L432j9125l0112K1516J566K3440r82J3115j299M7137q0293L318K3321
$$ y = [-23830, -46824, 61190, 16486, 26398, 39647, -66510, -57530, -46707, -13957, 67086, 9532, -102070, -156554, -112482, -44267, 6390, 89723, -10017, 89589, 108381, 8874, 47891, 95032, -23269, 857, -47310, -34587, -40604, -93529, -115370, -61724, -124841, -95100, 5874, -18622, -69686, -47546, -58546, -99120, -109727, -81573, -107033, -39476, -19838, -102330, -163653, -61105, -48934, -38407, -60914, -155431, -4460, -28872, -30337, -52272, -33831, -24458, 22172, 7069, -16683, -57442, 124768, 56651, 1112, 18459, -40244, -24879, -27223, -3948, -82988, -40394, 665, -26256, 39572, -85211, -144719, -23818, -4370, 12479, 46346, -7196, -62737, -92770, -75025, -71593, -90718, -120830, -99314, -97748, -74308, -75290, -62175, -63474, -16337, -96630, -93312, -69991]
5962f9991l5539o6264O2296K8993o547k0243M1309P6322j61325L8423O3144R8945
5950D9523n7062p1928J26466p0604p3230J928J38952o6189r2828O5451q7656K2526
5938a14651Q3900L3462q0174N6228P3011o624j93573N5706O764N208m32Q3000
5926A825J8243p2713k5794N6326m0380N371P185k3386R4473j9913N2776l4228
5914A9785K2469m9379m0513L6598n3251O1024m709m105M6277o6147l6582j12905
5902a81438j9483J02602n2823K0609J33989N5548L3795r2948l3076O0483n7267
5891c0009O2206k9732j06061k4516J24253K273J8131R6353o0500j26430M7886
5880b6146J8035j06464L1388O2395J9839k3157j60133O4269O4037m7112M6862
$$ y = [-69991, -105530, -171794, -109498, -80505, -87052, -107295, -65986, 10336, -150989, -112566, -49422, 49523, -7539, -79467, 46999, -23605, -96835, -94907, 44045, -22144, -114972, -49521, -137177, -114651, -30751, 2711, -77463, -21235, 51776, 45152, -148421, -92715, -85951, -80743, -81175, 1825, 20068, -52645, -78439, -22113, -62493, -57122, -49937, -73323, 21150, 1237, 54013, 19785, 42254, -7125, -47638, -11040, -64291, -3267, -7976, -12081, 34196, -31951, -68533, -181438, -200921, -98319, -151142, -130533, 3456, 59004, 92799, -149, -33225, 27258, -30009, 32197, 2465, -103596, -128112, -3859, -1586, 16545, 112898, 52398, -74032, -26146, -8111, -114575, -83187, -20792, -953, -24110, -184243, -119974, -55937, -103049, -56187]
5869e6187P0625l4540L7915J6541n0406j4283l3139K6242l2511n353j32886J29616
5857g8366R2243m9200M3643l7267K8396l7779q786L3409L8001l7273L7003j0831
5845A3193m3021R709q9230p8282N2271J94929o2120q6985M5219Q2095n2764M5731
5833C0745j04416n234P4408n5730q674N0999J3949P192j02285J22166o4365L6778
5821d467M0942m2022L3421O544o8258L3779K2564l431n461k4628Q777l6333K0100
5808a8473n1856n6121M7058N5843j6899P712P4619R465o8526N2053n0230m260
5796a9615k924m1475J9353L4941J3380J4222k2717m2454L6425P7629o2359K8025
5784C2431L0966j702J2912j1685p1529K0365N8663n0823J436L036j4700o9857
$$ y = [-56187, 14438, -20102, 17813, 34354, -16052, -30335, -63474, -37232, -69743, -75096, -207982, -78366, 13877, -35323, 8320, -28947, -551, -38330, -47116, -13707, 24294, -12979, 24024, 13193, -29828, -20119, -109349, -187631, -135360, 59569, -2551, -89536, -44317, 37778, -14986, 30745, -73671, -78905, -4497, -60227, -68901, -17902, -3953, 3239, -99046, 23120, -41245, -4467, 36475, -5547, 27874, 34418, -33840, -61, 22503, 19072, 13611, -11017, -2240, -38573, -18473, -70329, -126450, -79392, -23549, -40448, -32736, 41883, 51348, -17178, 34875, -15355, -19615, -22539, -64014, -44661, -9720, 3660, 17882, -4835, -47289, -10864, 66765, 4406, 32431, 63397, 61695, 74607, 62922, -8607, 11758, 70421, 19598, 21034, 24070, 9370, -60487]
5772f0487J8527N7534m4770J16081j18254k0418o965l1473N9293N0111q182o2766
5760e1769K1917Q0567m4911N0637Q1846j01499N1468m4685J6096J341k7889l451
5748B9668q8320J08391j0362J0834m2948K5652M6893o1929k9996K3246L6996o4398
5736a6273Q5492p5363o3581O7737L1711n9513O0412n5476M1914L6274K279m8091
5724G522K1791J24944n8239r6713O5582n7240N6369M6735p7181M604J04487r206
5712A33455j68010M1766M7585j3478m0608k7244p880R5840o6693m7887J9450J04382
5700G0678k6988l8639j2871R1815K8857q7032M5089J0131J7802J6767j13813Q0282
5688H2078l345O4998j33753m1437M176K1053N0995R6429j5156n5220P0126M3208
$$ y = [-60487, -41960, 15574, -29196, 86885, -31369, -51787, -58752, -90225, -30932, 19179, 10997, -51769, -29852, 50715, 5804, 56441, 138287, 36788, 88256, 43571, 59667, 61008, 33119, 29668, -58652, 49739, 39377, 50211, 7263, 32915, 79808, 17879, -12117, 11129, 48125, -16273, 69219, -6144, -69725, -1988, 29723, -29790, 30622, -24854, 17060, 53334, 55613, 7522, 29313, 154257, 96018, -695, 64887, 7647, 64016, 110751, 33570, 38174, 142661, 133455, -34555, 7211, 54796, 41318, 710, -26534, -34414, 61426, -5267, -53154, -33704, 70678, 43690, 5051, -7820, 83995, 112852, 25820, 70909, 81040, 98842, 115609, 1796, 82078, 78733, 143731, 9978, -31459, -27283, -6230, 44765, 141194, 126038, 70818, 140944, 184152]
5676A84152o6799O1988k5592o4104M9450o9927k1322K0138P275o198J0812j36604
5664e6731m7060J20405J35959l4583j08752J0423J23690j01470K1916p8536M5241
5653C0502R7805l8813N9585q6802N4309j3253j28437J794R4729n0059j4458J22097
5641A28999J5264L109r7903o571N6204l4605q1685l967Q2963J4765N099K5345
5629A07017l5158L542J1336l8039L3564m7869M5345M7110m4746P4710j78975l1835
5617e3998Q7323K8047O0553j643K0211p8746P3935j3502j3325J34822J7997M187
5605B65861J3911J19392o6578k5081j21102j3242L724j4983L0086j6811j19810
5594E5367L8202j4541k0040P9825l009l2408J16920n5290n8454l8187M896j7160
$$ y = [184152, 117353, 179341, 153749, 89645, 139095, 69168, 47846, 67984, 75259, 69061, 79873, -56731, -103791, 16614, 152573, 117990, 9238, 19661, 143351, 41881, 63797, -14739, 30502, 128307, 89494, 149079, 62277, 116586, 103333, -25104, -23310, 71419, 21360, 6902, 128999, 144263, 147372, 49469, 42898, 99102, 64497, -17188, -21155, 61808, 76573, 81672, 107017, 71859, 75401, 86737, 48698, 82262, 34393, 79738, 126848, 82102, 156812, -22163, -53998, 33325, 61372, 121925, 120282, 140493, 61747, 135682, 122180, 108855, 243677, 261674, 265861, 279772, 399164, 332586, 307505, 186403, 173161, 176885, 161902, 191988, 175177, 55367, 93569, 79028, 58988, 138813, 135804, 103396, 220316, 165026, 106572, 68385, 73281, 56121]
5582E6121N1214R428L3675q0416J8896n5130L0615k2450L2611R8230K7958m7550
5570A53202m9730m4942q765J7450L5466R3072n5342n8387o4435L7612J1357J2671
5558G9229m0314P1710m5850P3427p4087P4065K3644m3156l5347L5766k351q443
5546A08293L5032j9117n2408O9048m8118m5989R1992j0668j6671j22729q709O1521
5534D1477M8348r9196j00547J48757K5669k7252k2043O3999k3124j3072o435J55033
5522A91614n0632p8744j881M7322J4211n2997M394J26728K9124l0595j09332L1293
5510A20505j7276l2447Q06n251J3843K8196K0894o4861N0912l6974O2257J077
5498A41681J0581M7913q3350o9276M5627J01478o1133j08902L3729Q8069j5023
$$ y = [56121, 107335, 116763, 150438, 70022, 88918, 33788, 64403, 41953, 74564, 172794, 200752, 153202, 103472, 58530, 49765, 67215, 102681, 195753, 140411, 82024, 17589, 55201, 66558, 79229, 38915, 110625, 64775, 138202, 64115, 138180, 161824, 118668, 83321, 119087, 116736, 108293, 143325, 124208, 71800, 140848, 92730, 46741, 138733, 128065, 111394, -11335, -20044, 41477, 89825, -9371, -109918, 38839, 64508, 37256, 15213, 79212, 56088, 43016, 36581, 191614, 140982, 62238, 60357, 107679, 121890, 68893, 73287, 200015, 229139, 198544, 89212, 120505, 103229, 70782, 71588, 66337, 80180, 108376, 129270, 64409, 115321, 78347, 140604, 141681, 152262, 200175, 116825, 47549, 93176, 194654, 133521, 24619, 58348, 146417, 131394]
5487A31394j9110M3609p3636k6940j7685j3014k9694l3295J18816K2708o7564
5476C5589P4250L8658m7620R411K6846l632j4494l8382J2242l4608q101O281J22306
5463A78746k1635m2560q736K4601L1444L9226k9810o4543k9849N1226o7248O5235
5451A26097M5493l9363R5460j07760l9926O546J22924n4772m0058L7125k8311
5440A23455j0811M4544k3467R8763m9442l5128M5901R7366n0303r2902J0858P631
5428A66465p7488J09723m1032n8351R2999M5153m3312m2505M5189N6043l1294
5417B21590q068L5865j40127K8942j4065k4647k5630J2171J31584l741p7665K9486
5405A65695k8562M6567M1049Q658j04577o357p9302M1481Q8100P925J1853J15164
$$ y = [131394, 112284, 155893, 82257, 55317, 37632, 24618, -5076, -38371, 80445, 103153, 35589, 109839, 148497, 100877, 110288, 137134, 133502, 119008, 80626, 92868, 58260, 50159, 56440, 178746, 157111, 114551, 105815, 130416, 161860, 201086, 171276, 106733, 76884, 128110, 60862, 126097, 171590, 132227, 227687, 119927, 80001, 86547, 209471, 154699, 114641, 151766, 123455, 112644, 157188, 133721, 232484, 183042, 147914, 193815, 291181, 240878, 147976, 158834, 166465, 88977, 198700, 157668, 99317, 192316, 237469, 194157, 151652, 196841, 252884, 221590, 213522, 249387, 109260, 138202, 124137, 99490, 73860, 86031, 217615, 213874, 136209, 165695, 137133, 183700, 224749, 233407, 128830, 122473, 43171, 84652, 172752, 180677, 192530, 307694]
5393C07694o8074n5359o4807K4156l1135Q7712N579L5016k307Q3031j113p1814
5381B48579j5658N9847j1412j15298N1341K8641j2188o2840O62L6571L1563m6842
5369A92966J05220N370q6917K3846O5071N2060m8358r1107n3796j939Q2381j7504
5357B27293J7222k6285j06425P5310M4299m0927j7055O2783J94448j1251l3751
5346C85661L3314j20628o8976J1942L4308K6494L6140L4133p663p2752J9956J16641
5334D28570j2677j1176L2969l5773j1487J9948Q3250j8081j89203Q2527P4716
5323D43583k6181l5162O2769N1802J8386j7486q1861Q7476m0987J9049n056R2603
5311E68935p3607K9928N4296N2106J06159l483l1420N1913J41511j44941j73987
$$ y = [307694, 239620, 184261, 119454, 143610, 112475, 200187, 205766, 240782, 238475, 321506, 320393, 248579, 232921, 292768, 281356, 166058, 217399, 246040, 233852, 171012, 171674, 208245, 239808, 192966, 298186, 303556, 216639, 240485, 305556, 357616, 309258, 218151, 164355, 162416, 244797, 227293, 244515, 218230, 111805, 187115, 231414, 190487, 173432, 236215, 430663, 419412, 385661, 418975, 298347, 229371, 241313, 275621, 302115, 338255, 372388, 364725, 291973, 311929, 428570, 415893, 404717, 437686, 401913, 390426, 410374, 493624, 475543, 286340, 368867, 443583, 417402, 382240, 445009, 496811, 515197, 497711, 415850, 503326, 462339, 481388, 476332, 568935, 495328, 525256, 579552, 631658, 737817, 734334, 702914, 754827, 896338, 751397, 577410]
5300E77410M2665K3143P6306m2275l3284N1377k5293J26420p3527j0823P9111
5289G91230J9722r9121N9715M3305J03402q8546m7187l1456n8942j5728Q5326
5278G61720l4922N7836j43453J41415N8313j10978n9956j5499L0930j11654l3922
5267E39830O008R4991q1755Q1359o6645k0149Q7331p7564J0753l0639R6649l50
5255F39819k4563q4125k4325P1422j8962O4224R776L2374l2639n0976K9385k4256
5243E87154O8911O5249J9177l3977j9781N7453n2638L6632n5653N4634J02770
5232H29931o5961M1012l052j6505l6225n7740M625Q1954K9941j0244P3051J2016
5220H82803q8912p0157L9309O0071K8210L3429o8218o3767m706K3505L4451P2778
$$ y = [577410, 620075, 643218, 719524, 677249, 643965, 695342, 670049, 796469, 722942, 712119, 791230, 810952, 711831, 771546, 814851, 918253, 829707, 782520, 751064, 692122, 676394, 761720, 726798, 784634, 641181, 782596, 840909, 729931, 669975, 654476, 685406, 573752, 539830, 545838, 640829, 559074, 640433, 573788, 553639, 640970, 563406, 574159, 543520, 640169, 639819, 615256, 531131, 506806, 578228, 559266, 623490, 633266, 665640, 633001, 582025, 611410, 587154, 656065, 721314, 740491, 706514, 686733, 744186, 691548, 728180, 672527, 727161, 829931, 763970, 804982, 801930, 785425, 749200, 691460, 696085, 778039, 807980, 797736, 870787, 882803, 793891, 723734, 763043, 823114, 851324, 884753, 816535, 752768, 748062, 771567, 806018, 878796]
5208H78796o3959j2248L0947l2789J45223m7503P6168P671N2146p941l1022j1133
5196I84356q7427j5317J22859k0397p255L225R6199L1250K2056L5906K2827m8930
5184A139352L7638N7147R8315k080l8034J2421j7408N4128m224N257m3566N3192
5172A352138j3449Q3770M7292K266J6821L7579M7219R9624K7000N7660P9602L9618
5160A877140P4619N1206n2568j0310m2899n6586O1140Q3425J42015N1236q0794
5149B097624M1320J1094o555n1224O0455J09388M0315Q1859P9868J4657n9125
5138B419676J12193o2723n4372O8934L0294R697J10538J73391M2416Q9082j3627
5127B925499m873J69127P0841J58134J9072l4130J33087L2937J47974O2367J19034
$$ y = [878796, 814837, 802589, 833536, 800747, 945970, 898467, 974635, 982306, 1034452, 1026511, 995489, 984356, 896929, 881612, 1004471, 984074, 976819, 980044, 1076243, 1107493, 1129549, 1165455, 1188282, 1139352, 1176990, 1234137, 1332452, 1330372, 1292338, 1304759, 1287351, 1341479, 1337255, 1342512, 1298946, 1352138, 1338689, 1422459, 1469751, 1472017, 1488838, 1526417, 1573636, 1673260, 1700260, 1757920, 1837522, 1877140, 1951759, 2002965, 1950397, 1940087, 1897188, 1840602, 1901742, 1985167, 2127182, 2178418, 2097624, 2138944, 2150038, 2143483, 2092259, 2152714, 2262102, 2302417, 2384276, 2464144, 2478801, 2419676, 2531869, 2469146, 2414774, 2483708, 2514002, 2523699, 2634237, 2807628, 2850044, 2939126, 2925499, 2920626, 3089753, 3160594, 3318728, 3337800, 3303670, 3436757, 3469694, 3617668, 3680035, 3799069]
5116C799069J44852l6849J67022N8788K05590J7293J46179J78547J77462K62299
5106E120252J77566K94476K67569K20794K55071L61731L04817L55040M56472M69351
5096H283139N38575O12550P40359M66989K15391J3813K8052L21404K81450N52231
5086A2053953N97354P26081P62936P65052Q49202P30289R03350O89694O86286
5077A8764197N6572J24836K68732L61427P69013R60971R19342N92665N77185O84567
5067B4079507J077319J215537J403683J547006J401482J152951J224644J438276
5059C4540405K093417K342590K979948L741161M948098N913652O573726M796859
5051F7929856J090856k146799l491609k637474j062373P67757K268520L750427
$$ y = [3799069, 3943921, 3907072, 4074094, 4132882, 4338472, 4355765, 4501944, 4680491, 4857953, 5120252, 5297818, 5592294, 5859863, 6080657, 6335728, 6697459, 7002276, 7357316, 7813788, 8283139, 8821714, 9434264, 10174623, 10641612, 10857003, 10870816, 10898868, 11220272, 11501722, 12053953, 12651307, 13377388, 14140324, 14905376, 15754578, 16484867, 17388217, 18077911, 18764197, 18820769, 18945605, 19214337, 19575764, 20344777, 21305748, 22225090, 22817755, 23394940, 24079507, 25156826, 26372363, 27776046, 29323052, 30724534, 31877485, 33102129, 34540405, 36633822, 38976412, 41956360, 45697521, 50645619, 56559271, 63132997, 67929856, 69020712, 66873913, 63382304, 60744830, 59682457, 60450214, 62718734, 66469161]
5043F6469161L179280J351399N59826Q87781K171235K744830J243914j662408
5035G6945018l662738l835293k271392l02561P68969o29076k435406l395222k481317
5026E8700982n62068J234582K798539L711109J628866k655055o389359p982112
5018E0485484o996370n648907m281666l383600k671269k357087j897719j644386
5010B1604480j404137j265236j178908j038033q18428q06313n64985o15270m47476
5001A3465694l95543l64943l95610l98766l01427l60035k70765k69280k32860
4992A0476465k63163j01842k04144k03527j76537l18942n0490j21163m3246k46930
4982H746481j3412j4138k1749O7779j38282j21081n5828J11731J44259K7704K0142
$$ y = [66469161, 69648441, 70999840, 71559666, 72447447, 74618682, 77363512, 78607426, 76945018, 73282280, 69446987, 67175595, 66873034, 67642003, 67012927, 64577521, 61182299, 58700982, 58138914, 59373496, 62172035, 65883144, 67512010, 64856955, 58467596, 50485484, 43489114, 37840207, 33558541, 30174941, 27503672, 25146585, 23248866, 21604480, 20200343, 18935107, 17756199, 16718166, 15899738, 15093425, 14528440, 13913170, 13465694, 13070151, 12705208, 12309598, 11910832, 11609405, 11249370, 10978605, 10709325, 10476465, 10213302, 10111460, 9907316, 9703789, 9527252, 9208310, 9157820, 9036657, 8993411, 8746481, 8733069, 8718931, 8697182, 8764961, 8626679, 8505598, 8449770, 8561501, 8705760, 8733464, 8753606]
4971H753606L2400M632J41629M8114J55568P572P8165J65937L2789J93750J64325
4960I778487J14831L68763K16279J69629J64187J44839K07675K58282K36850J90271
4950A1850093L25519K93609J65184K85357L93966M05565L71094N11459M88556
4941A5090402M56037M78565N47023N12135N01401N39890N80524O32078N72872
4932A9910927O89401P39673P44813O50563J063695J093766J116233J463933J503757
4923B8976761J580876J736121J919165K042796K530249K905053L258471L628289
4915D8577781L607898L285341K228667J066656j83423r98027j283690j094763
4907E5206440m32719L28564R47361J515907K255581K855615L417225L989609M741766
$$ y = [8753606, 8786006, 8790638, 8932267, 8980381, 9135949, 9143521, 9221686, 9387623, 9420412, 9614162, 9778487, 9893318, 10262081, 10478360, 10647989, 10812176, 10957015, 11164690, 11422972, 11659822, 11850093, 12175612, 12469221, 12634405, 12919762, 13313728, 13719293, 14090387, 14601846, 15090402, 15546439, 16025004, 16572027, 17084162, 17585563, 18125453, 18705977, 19338055, 19910927, 20600328, 21340001, 22084814, 22735377, 23799072, 24892838, 26009071, 27473004, 28976761, 30557637, 32293758, 34212923, 36255719, 38785968, 41691021, 44949492, 48577781, 52185679, 55471020, 57699687, 58766343, 58582920, 57584893, 56301203, 55206440, 54773721, 55102285, 56049646, 57565553, 59821134, 62676749, 66093974, 70083583, 74825349]
4898G4825349N817957O740081P587900P812888O915233M569611J131719k411793
4890A12988945m807867n235083m802098l650672k828803k648276k216257j853058
4882H4946831j387239p40264P504J094604K129084L198997M060435M224654L479570
4873A01014176J992071M575j107339j407044p38937M7401L44450O7391j237402
4864I8979342l088599n110712o544975p226716o468852n380272m305005l388746
4856E7465465k659509j785570j214039q00389j74684M34035J004845J348035J729080
4847E5347269J856550J385491K53575j241062k727675l804757m266462m280986
4839D2521943l658605l380085k870601k538660k109083j840105j620742j516396
$$ y = [74825349, 80643306, 87383387, 94971287, 102784175, 109699408, 114269019, 115400738, 112988945, 108181078, 102945995, 98143897, 94493225, 91664422, 89016146, 86799889, 84946831, 83559592, 82819328, 82826832, 83921436, 86050520, 89249517, 93309952, 97534606, 101014176, 103006247, 103010822, 101903483, 100496439, 99757502, 99804903, 100149353, 100216744, 98979342, 95890743, 90780031, 84235056, 77008340, 70539488, 65159216, 60854211, 57465465, 54805956, 53020386, 51806347, 51005958, 50831274, 51265309, 52270154, 53618189, 55347269, 57203819, 58589310, 58842885, 57601823, 54874148, 51069391, 46802929, 42521943, 38863338, 35483253, 32612652, 30073992, 27964909, 26124804, 24504062, 22987666]
4831B2987666j284290r98084j025979q50418q67595q09540n51309m95107n56239
4822A5549105n21314m34046m71303l16927l56642l37210l44899k60405j98303
4813A2308056l09563j37717k01178j97681j84937p5759j03835j41228r3428q597
4803A0854133j87728k9242p2553L2041q7843Q5843P2435p2776L6335Q7620J11624
4792A0829889R6404K04448J05953J89741L75406K54828M03997L00781L46020L08966
4782A3416433K49830L04576J46491R2824O0923K22207K30958J50216K11040K30858
4772A5316356L78806M47120M21240N08529N03689O28338Q34793P53351N29844
4763B0322066N59841M22112L41341K97225L54081M35502O23617P14257Q09545
$$ y = [22987666, 21703376, 20705292, 19679313, 18828895, 17961300, 17151760, 16600451, 16105344, 15549105, 15027791, 14593745, 14122442, 13805515, 13448873, 13111663, 12766764, 12506359, 12308056, 11998493, 11860776, 11659598, 11461917, 11276980, 11201221, 11097386, 10956158, 10862730, 10854133, 10666405, 10637163, 10564610, 10596651, 10508808, 10594651, 10667086, 10594310, 10630645, 10718265, 10829889, 10926293, 11130741, 11236694, 11426435, 11801841, 12056669, 12460666, 12761447, 13107467, 13416433, 13666263, 13970839, 14117330, 14210154, 14271077, 14493284, 14724242, 14874458, 15085498, 15316356, 15695162, 16142282, 16563522, 17072051, 17575740, 18204078, 19038871, 19792222, 20322066, 20881907, 21304019, 21645360, 21942585, 22296666, 22732168, 23355785, 24070042, 24879587]
4754B4879587Q02027Q64966J050651R79180J140386J376319J222582J150662J143570
4745C4609930J210595J221297J477789J714903J972114K269086K526021L124267
4737E0126002L623824M153121N058496O132270O913558P358509O609931M712445
4729I4688156K160887j81132j282393r72281L74899J773375K789945K939078K078270
4720A04368804Q16565m71045q61515k03604J360773L651821N794556P953594Q005775
4711A30415724M798096L96904l793570n933779n690164m152915j742445O41231
4703A14939082K652861K780358P56785k509827n057344o236557o242149n519805
4695I5563404m172509k684799j396546j118486j520193k454716l537694m296179
$$ y = [24879587, 25681614, 26546580, 27597231, 28576411, 29716797, 31093116, 32315698, 33466360, 34609930, 35820525, 37041822, 38519611, 40234514, 42206628, 44475714, 47001735, 50126002, 53749826, 57902947, 62961443, 69093713, 76007271, 83365780, 89975711, 94688156, 96849043, 96667911, 95385518, 94413237, 94788136, 96561511, 99351456, 102290534, 104368804, 105185369, 104714324, 103852809, 103649205, 105009978, 108661799, 114456355, 122409949, 130415724, 135213820, 135610724, 131817154, 125883375, 120193211, 116040296, 114297851, 114939082, 117591943, 120372301, 121129086, 118619259, 113561915, 107325358, 101083209, 95563404, 91390895, 88706096, 87309550, 86191064, 84670871, 82216155, 78678461, 74382282]
4687G4382282m054598l303488k457829j297373l33543R8230J31438m35206j063025
4678F1666888j691334k405371k894271k919503k278211k074126j979725j826121
4670D3598226j483335j126365r27745o89516k31272q5434J61489L23074M60517
4661C9999639L33547L59521N14931M87221J03610p0105k42876j83466Q8100Q3311
4651D1473433L05527L75467P29786R84632J445248J826727K140394K507237K875033
4642E4663484L385030M079695M601040N566362O180652N256397J579308j694333
4634H3617635m020597m326828k640742o51341J222302K651905K101135O76587
4626G8630056J43934O391J154069K385678K635105P47833j649311l405473l426226
$$ y = [74382282, 70327684, 67024196, 64566367, 63268994, 62935451, 63033681, 63165119, 62729913, 61666888, 59975554, 57570183, 54675912, 51756409, 49478198, 47404072, 45424347, 43598226, 42114891, 40988526, 40060781, 39371265, 39139993, 39054559, 39216048, 39539122, 39999639, 40333186, 40692707, 41207638, 41694859, 41798469, 41728364, 41485488, 41302022, 41390122, 41473433, 41778960, 42154427, 42884213, 43868845, 45314093, 47140820, 49281214, 51788451, 54663484, 58048514, 62128209, 66729249, 72295611, 78476263, 83732660, 85311968, 83617635, 79597038, 75270210, 72629468, 71978127, 73200429, 75852334, 77953469, 78630056, 78773990, 78780381, 79934450, 82320128, 84955233, 85703066, 84053755, 80648282, 77222056]
4617G7222056k351610j297723k285834k896784l687758l282657j917853n8095
4609E9443742J383616K321390J848249r29777l775526n801717o531207n503149
4601D2455621m432572l488077k727281k152425j718316j288845j037374q14076
4593B4796655p89926n86395n99757p65477o57727q56605r60862p61171o52523
4584A8166212n28887j95534k38848m2051P3159L11947L91314O33228N09410O48553
4574A9728503N00918L89214J67067m51597j014365j331458j263874j261254j068767
4565A4394387q77132o77929m53454l56893o4769q7733k9842n0068j069M4187j32816
4554A1706869m33762l87735m71549l58845n59325o61668m89649m24502l61611
$$ y = [77222056, 74870446, 73572723, 71286889, 68390105, 64702347, 61419690, 59501837, 59443742, 60827358, 63148748, 64996997, 64067220, 60291694, 54489977, 47958770, 42455621, 38023049, 34534972, 31807691, 29655266, 27936950, 26648105, 25610731, 24796655, 24006729, 23420334, 22820577, 22055100, 21397373, 20540768, 19579906, 18818735, 18166212, 17637325, 17441791, 17202943, 17160892, 17234051, 17545998, 17937312, 18570540, 19079950, 19728503, 20229421, 20618635, 20785702, 20334105, 19319740, 17988282, 16724408, 15463154, 14394387, 13517255, 12839326, 12385872, 12028979, 11964210, 11876477, 11846635, 11796567, 11795498, 11839685, 11706869, 11273107, 10885372, 10413823, 10054978, 9495653, 8833985, 8344336, 7919834, 7558223]
4545G558223l37210k19591j74604q8543k30835o9795N8256j55566l16556k29520
4535E794259j8708p8267k09890k44685l60097j42866j26928k14478j40998j57248
4525D100094q4031r6580q3869r8120o4823j30129o3448k5882l6985p7153p5308
4514C263766j14325o2945j07400j5144m1253n5772o764j40260j42251L4105J35458
4503B747215l6578r4066p0357Q424n9282r9801k6421j6889k2449M0232o2086L6998
4491B344940p7093L5721J5065M6376m0482m3111J19809O2292m6514k2380p5798
4480B318825J5292J8942R486j00738K9773j5140r4388K4001o4894R3738q589M0182
4468B266490n7010Q7839R1144j8k9646P9506o2069j43259k9588J26552m9572j70754
$$ y = [7558223, 7221013, 7001422, 6826818, 6738275, 6507440, 6437645, 6495901, 6340335, 6023779, 5794259, 5775551, 5697284, 5487394, 5242709, 4882612, 4739746, 4612818, 4398340, 4257342, 4100094, 4016063, 3919483, 3835614, 3737494, 3672671, 3542542, 3479094, 3453212, 3416227, 3339074, 3263766, 3149441, 3086496, 2979096, 2963952, 2922699, 2866927, 2860163, 2719903, 2577652, 2611757, 2747215, 2710637, 2616571, 2546214, 2554638, 2495356, 2395555, 2369134, 2352245, 2329796, 2370028, 2307942, 2344940, 2267847, 2303568, 2318633, 2365009, 2324527, 2281416, 2401225, 2463517, 2417003, 2394623, 2318825, 2334117, 2353059, 2362545, 2261807, 2291580, 2276440, 2182052, 2206053, 2141159, 2234897, 2226308, 2266490, 2209480, 2297319, 2388463, 2388445, 2358799, 2438305, 2376236, 2232977, 2203389, 2329941, 2280369, 2109615]
4456B109615q3018q907k7404j43428m6377P5394p9453j05758m4484K9720r475
4445A666425j17697j54562Q2136P45P3239j85590K6135P6093o032l1212l3078
4434A396602j6037M3275m9233j48404K9755M3113O4396J36581o3145j77467L4121
4423A293557N847L1110j00329J6572N9604k9072q5039N555k2453m5491O7687J13842
4411A311390K6556J2333r9595M7108j4822J16444j27715K7969J1501J8260q4705
4400A244724q5061J69351J3668P3468O8446R3934Q0717L8290n0655J9924j8566
4389A648240l857L7415J07261J40884M5426l9382l5603J10368N6006R5205J5268
4378B177231P8084R4949M1106J11117J74367J06167J41863K81203J64438K00895
$$ y = [2109615, 2026597, 2017690, 1990286, 1846858, 1800481, 1875875, 1796422, 1690664, 1646180, 1675900, 1666425, 1548728, 1394166, 1476302, 1477047, 1550286, 1364696, 1390831, 1466924, 1460892, 1429680, 1396602, 1380565, 1423840, 1374607, 1226203, 1255958, 1299071, 1363467, 1500048, 1436903, 1259436, 1293557, 1299404, 1330514, 1230185, 1246757, 1306361, 1277289, 1192250, 1197805, 1175352, 1129861, 1197548, 1311390, 1337946, 1350279, 1250684, 1297792, 1282970, 1399414, 1271699, 1299668, 1311169, 1329429, 1244724, 1159663, 1329014, 1342682, 1416150, 1484596, 1578530, 1659247, 1697537, 1646882, 1666806, 1648240, 1644383, 1681798, 1789059, 1929943, 1975369, 1935987, 1900384, 2010752, 2066758, 2161963, 2177231, 2255315, 2350264, 2391370, 2502487, 2676854, 2783021, 2924884, 3206087, 3370525, 3571420]
4368C571420J62422M41383L58187M45508J96589q4819k69331k84909l27924k56955
4358C951571k02648q0361M0643J12157k012R8281J19470J61149L53894K93958
4348D846102L53867K70223O29899P53906Q58937J014053J388398J457852R62851
4339A2536088j28398j195115j622590j424998j044352o54699n54966l71193j88777
4330E351000k20243j59301m3091o2816J55596J46579J52331K73568M98651M65097
4320F557371N85939R42896J047318J198928J091327K15109q71075j426710j367810
4311G973293r68565p24074o54584l13904l00517l51238l34395j43143j17386q6696
4301C978791o5063L0526J6639O9367O4864K60307L02283K88447L55389L57615
$$ y = [3571420, 3733842, 4175225, 4533412, 4978920, 5175509, 5090690, 4821359, 4536450, 4208526, 3951571, 3748923, 3668562, 3709205, 3821362, 3819350, 3917631, 4037101, 4198250, 4552144, 4846102, 5199969, 5470192, 6100091, 6853997, 7712934, 8726987, 10115385, 11573237, 12536088, 12407690, 11212575, 9589985, 8164987, 7120635, 6465936, 5910970, 5539777, 5351000, 5130757, 4971456, 4928365, 4865549, 5021145, 5167724, 5320055, 5593623, 6092274, 6557371, 7143310, 8086206, 9133524, 10332452, 11423779, 11638888, 10767813, 9341103, 7973293, 7004728, 6280654, 5626070, 5312166, 5011649, 4660411, 4326016, 4182873, 4065487, 3978791, 3913728, 3944254, 3960893, 4030260, 4095124, 4355431, 4657714, 4946161, 5301550, 5659165]
4291E659165N9634J2007m62535m78432k90274k50975j45742k08659j72798k10728
4281C510663j35765q0937j95346j27823n5935l7L3814q3110j35287j3573J05442
4270B822106j9880Q4907P7072K452J8517J18833K05409J38713R773P1320N9589
4259C588811k7303r2939j18736j82083q7751l0426j0359n7348p3942j6759n3170
4248B837995l9135n1697O635J3028J02321O7151n380N3636R4385J86972J36331
4237C402242J49298J58984M7201J16464k5364j91506p1144j08285r1079l5991
4227C350820j2175J7358M1626j12321J11470k3204M3244L5554J65173M6812J65382
4216C829739Q6200J44168J15086J26027J50346J34717J60581L19685K06989J49532
$$ y = [5659165, 5718799, 5730806, 5268271, 4789839, 4499565, 4248590, 4102848, 3894189, 3721391, 3510663, 3374898, 3293961, 3098615, 2970792, 2914857, 2914820, 2948634, 2865524, 2730237, 2716664, 2822106, 2802226, 2887133, 2964205, 2966657, 2985174, 3104007, 3309416, 3448129, 3457902, 3529222, 3588811, 3561508, 3468569, 3349833, 3167750, 3079999, 3049573, 3039214, 2981866, 2907924, 2891165, 2837995, 2798860, 2747163, 2753798, 2766826, 2869147, 2936298, 2930918, 2984554, 3078939, 3265911, 3402242, 3551540, 3710524, 3757725, 3874189, 3848825, 3657319, 3586175, 3477890, 3386811, 3350820, 3338645, 3356003, 3397629, 3285308, 3396778, 3373574, 3416818, 3452372, 3617545, 3664357, 3829739, 3915939, 4060107, 4175193, 4301220, 4451566, 4586283, 4746864, 5066549, 5273538, 5423070]
4206E423070J10675J73419J59021L00902K96312N98821N73261P06526O29420R45428
4196I916855J279832J611163K051643K701811K915169Q00013k011077l229059
4188A6036350k711871j885338j367568p37283n31721l16144l33024k63128l59727
4179G530546j12803j97960o5514P989P5912P0259K57719L30329K61282j4081K2991
4168H166669M4396J08403J98973K91411K75550L57446K53654K14295K93061L55934
4158A0559792M61161M60125N33236O46749O04794P67185P33552Q79513M12354
4149A6058461N66290P87442R80315J102919J228127J302848J216124J464754J752456
4140B6459736K291269K819693K895448L366368L542966J209198j180271k073265
$$ y = [5423070, 5533745, 5707164, 5866185, 6167087, 6463399, 7062220, 7635481, 8342007, 8971427, 9916855, 11196687, 12807850, 14859493, 17561304, 20476473, 21276486, 19265409, 16036350, 13324479, 11439141, 10071573, 9334290, 8802569, 8486425, 8153401, 7890273, 7530546, 7417743, 7219783, 7154269, 7162258, 7238170, 7308429, 7566148, 7896477, 8157759, 8143678, 8166669, 8211065, 8319468, 8518441, 8809852, 9085402, 9442848, 9696502, 9910797, 10203858, 10559792, 11020953, 11481078, 12014314, 12661063, 13265857, 14033042, 14766594, 15646107, 16058461, 16624751, 17412193, 18392508, 19495427, 20723554, 22026402, 23242526, 24707280, 26459736, 28751005, 31570698, 34466146, 37832514, 41375480, 42584678, 41404407, 39331142]
4132C9331142j560789m56443J52021P88224J186934J418502J845155K024143K365183
4123D7094072J925141J572916J373032J923900K462785L494818M329313N763610
4115F9939587O740205Q412501R507690J1570900J3423701J8592651K4882731L3264535
4107A96334501M1113454M9077853J6508754l0420084n3389157m7871083l2321935
4100A39032303k3389498j5881425j2745640r650560q235184o087996n555239n028717
4092E2458044m828683l808036l528906k559430k258165j641256j433505p38441
4084C1661622p66796j79404m27703o9820K17985Q20294J442553K064052K342557
4075C7105340J184116k262074m212434m257442l225417k546925j827703j410718
$$ y = [39331142, 37770353, 37313910, 37465931, 38254155, 39441089, 40859591, 42704746, 44728889, 47094072, 49019213, 50592129, 51965161, 53889061, 56351846, 59846664, 64175977, 69939587, 76679792, 85092293, 94599983, 106170883, 119594584, 138187235, 163069966, 196334501, 237447955, 286525808, 303034562, 272614478, 219225321, 171354238, 139032303, 115642805, 99761380, 87015740, 77365180, 69129996, 63042000, 57486761, 52458044, 47629361, 43821325, 40292419, 37732989, 35474824, 33833568, 32400063, 31661622, 30894826, 30715422, 30287719, 30217899, 30435884, 31256178, 32698731, 34762783, 37105340, 38289456, 36027382, 31814948, 27557506, 24332089, 21785164, 19957461, 18546743]
4067A8546743j155449j033438r64231q47977n97273p95799n87930n97574l48327
4058A1618745m79337l64225m04157j99726k08752j33811k50415k09685k28178
4049I140459j09987n2561o5182n2794k105P4322N9910n6916R8346M5890Q703l0526
4037I057559l0724J46262J01827J75228M12798N31927M62634L65468L85027M94351
4027A2102357P46442J077703J448016K109469K725400L612141L362260j55808
4019B7027980l527165m648009l447558k356217j754217j230023j205187q68109
4011G991495n22666n53362n73240n04150l53868k90410l41026k28833l34127k91896
4001C997917k56119k03664j37633n1184q4161j53881j64828q6937j09017l7787
$$ y = [18546743, 17391294, 16357856, 15393625, 14545648, 13948375, 13152576, 12564646, 11967072, 11618745, 11139408, 10775183, 10371026, 10171300, 9962548, 9828737, 9578322, 9368637, 9140459, 9030472, 8977911, 8912729, 8859935, 8857830, 8932152, 8992062, 8935146, 9033492, 9079382, 9088085, 9057559, 9026835, 9173097, 9274924, 9450152, 9862950, 10394877, 10857511, 11222979, 11608006, 12102357, 12848799, 13926502, 15374518, 17483987, 20209387, 23821528, 27183788, 27027980, 23500815, 18852806, 15405248, 13049031, 11294814, 10064791, 8859604, 7991495, 7468829, 6915467, 6342227, 5838077, 5484209, 5193799, 4852773, 4623940, 4289813, 3997917, 3741798, 3538134, 3400501, 3349317, 3265156, 3111275, 2946447, 2859510, 2750493, 2712706]
3991B712706o6966n01m0292k17144o1357o2922n2066j52397j38052j8033n9877
3980A843099k05360r793q990p0763k0489j38316J2443q1668N5159m2935K0134
3969A352521L7927k1301j352q5909k02L6261n4142m3699K1252l8362j25117J3976
3957A091853k1178o6466J33823n9017L3177m8484j92950N1L1804l7677j05775
$$ y = [2712706, 2645740, 2645239, 2604947, 2387803, 2326446, 2263524, 2211458, 2059061, 1921009, 1902976, 1843099, 1637739, 1627946, 1618956, 1548193, 1527704, 1389388, 1401831, 1320163, 1375322, 1332387, 1352521, 1390448, 1369147, 1367795, 1281886, 1281684, 1317945, 1263803, 1220104, 1241356, 1202994, 1077877, 1091853, 1070675, 1004209, 1138032, 1079015, 1112192, 1063708, 870758, 870809, 902613, 864936, 759161]
$$ [...]
##END NTUPLES=NMR SPECTRUM
##END=
