##TITLE=1H_CG-1211-B-22
 CDCl3
 8 sc, 
 10.9.2024
##JCAMPDX= 6.0         $$ Bruker NMR JCAMP-DX V2.0
##DATA TYPE= NMR SPECTRUM
##DATA CLASS= NTUPLES
##ORIGIN= UXNMR, Bruker Analytische Messtechnik GmbH
##OWNER= root
$$ XWIN-NMR		Version 3.5
$$ Tue Sep 10 14:12:16 2024 Russian Standard Time (UT+4h)  she@DPX200
##.OBSERVE FREQUENCY= 200.1318
##.OBSERVE NUCLEUS= ^1H
##.ACQUISITION MODE= SIMULTANEOUS
##.ACQUISITION SCHEME= undefined
##.AVERAGES= 8
##.DIGITISER RES= 18
##SPECTROMETER/DATA SYSTEM= spect
##.PULSE SEQUENCE= zg30
##.SOLVENT NAME= CDCl3
##.SHIFT REFERENCE= (INTERNAL, CDCl3, 0, 20.9679)
##AUDIT TRAIL= $$ (NUMBER, WHEN, WHO, WHERE, WHAT)
$$ ##TITLE= Audit trail, XWIN-NMR		Version 3.5
$$ ##JCAMPDX= 5.01
$$ ##ORIGIN= Bruker BioSpin GmbH
$$ ##OWNER= she
$$ F:/spectra/data/she/nmr/H-F/1/pdata/1/auditp.txt
$$ ##AUDIT TRAIL=  $$ (NUMBER, WHEN, WHO, WHERE, WHAT)
(   1,<2024-09-10 14:10:56.12 +0400>,<she>,<DPX200>,
      <created by zg, POWCHK disabled, PULCHK disabled
       configuration hash MD5:
       00 E9 B6 7A A2 85 ED C7 34 08 36 98 17 FE 4E 26
       data hash MD5: 16K
       4E FE F7 2C 78 90 A2 54 38 26 BE 3C 8D 08 92 8F>)
(   2,<2024-09-10 14:10:59.39 +0400>,<she>,<DPX200>,
      <Start of raw data processing
       efp BC_mod = 2 LB = 0.24 FT_mod = 6 PKNL = 1 PHC0 = -25998.24 PHC1 = 17.38748 SI = 16K 
       data hash MD5: 16K
       D0 32 C0 9E 90 E6 DD 69 7C 44 DA 74 94 E8 D1 2D>)
(   3,<2024-09-10 14:11:27.87 +0400>,<she>,<DPX200>,
      <pk PHC0 = 1.469328 PHC1 = -1.4 
       data hash MD5: 16K
       E3 B8 53 28 1B 75 12 B1 4D 80 7F A8 8E B4 13 0D>)
(   4,<2024-09-10 14:11:31.25 +0400>,<she>,<DPX200>,
      <abs ABSG = 5 
       data hash MD5: 16K
       58 F3 67 E5 46 8D 0F 16 31 94 3E F8 54 8C 2D 57>)
$$ ##END=
$$ 
$$ hash MD5
$$ 39 2A 65 C8 5A A4 41 A2 4E E9 FC 93 88 E1 B7 03
##$RELAX= 
##$RELAX= 
##$RELAX= 
##$RELAX= 
##$RELAX= 
##$RELAX= 
$$ Bruker specific parameters
$$ --------------------------
##$DU= <F:/spectra>
##$EXPNO= 1
##$NAME= <H-F>
##$PROCNO= 1
##$TYPE= <nmr>
##$USER= <she>
##$AMP= (0..31)
100 100 100 100 100 100 100 100 100 100 100 100 100 100 100 100 100 100 
100 100 100 100 100 100 100 100 100 100 100 100 100 100 
##$AQSEQ= 0
##$AQ_mod= 1
##$AUNM= <au_zg>
##$AUTOPOS= <>
##$BF1= 200.13
##$BF2= 200.13
##$BF3= 200.13
##$BF4= 200.13
##$BF5= 200.13
##$BF6= 200.13
##$BF7= 200.13
##$BF8= 200.13
##$BYTORDA= 1
##$CFDGTYP= 0
##$CFRGTYP= 5
##$CHEMSTR= <none>
##$CNST= (0..31)
1 1 145 1 1 1 1 1 1 1 1 1 1 1 1 1 1 1 1 1 1 1 1 1 1 1 1 1 1 1 1 1 
##$CPDPRG= <>
##$CPDPRG1= <>
##$CPDPRG2= <>
##$CPDPRG3= <>
##$CPDPRG4= <mlev>
##$CPDPRG5= <mlev>
##$CPDPRG6= <mlev>
##$CPDPRG7= <mlev>
##$CPDPRG8= <mlev>
##$CPDPRGB= <>
##$CPDPRGT= <>
##$D= (0..31)
0 1.2 0 0 0 0 0 0 0 0.06 0 0.03 0 0 0 0 0.0002 0 0 0 0 0 0 0 0 0 0 0 0 
0 0 0 
##$DATE= 1725963055
##$DBL= (0..7)
120 120 120 120 120 120 120 120 
##$DBP= (0..7)
150 150 150 150 150 150 150 150 
##$DBP07= 0
##$DBPNAM0= <>
##$DBPNAM1= <>
##$DBPNAM2= <>
##$DBPNAM3= <>
##$DBPNAM4= <>
$$ [...]
##$SUBNAM3= <"">
##$SUBNAM4= <"">
##$SUBNAM5= <"">
##$SUBNAM6= <"">
##$SUBNAM7= <"">
##$SUBNAM8= <"">
##$SUBNAM9= <"">
##$SW= 24.0689170037331
##$SWIBOX= (0..15)
0 0 2 0 0 0 0 0 0 0 0 0 0 0 0 0 
##$SW_h= 4816.95568400771
##$TD= 16384
##$TD0= 1
##$TE= 0
##$TE2= 300
##$TE3= 300
##$TEG= 300
##$TL= (0..7)
0 120 120 120 120 120 120 120 
##$TP= (0..7)
150 150 150 150 150 150 150 150 
##$TP07= 0
##$TPNAME0= <>
##$TPNAME1= <>
##$TPNAME2= <>
##$TPNAME3= <>
##$TPNAME4= <>
##$TPNAME5= <>
##$TPNAME6= <>
##$TPNAME7= <>
##$TPOAL= (0..7)
0.5 0.5 0.5 0.5 0.5 0.5 0.5 0.5 
##$TPOFFS= (0..7)
0 0 0 0 0 0 0 0 
##$TUNHIN= 0
##$TUNHOUT= 0
##$TUNXOUT= 0
##$USERA1= <user>
##$USERA2= <user>
##$USERA3= <user>
##$USERA4= <user>
##$USERA5= <user>
##$V9= 5
##$VALIST= <valist>
##$VCLIST= <CCCCCCCCCCCCCCC>
##$VD= 0
##$VDLIST= <DDDDDDDDDDDDDDD>
##$VPLIST= <PPPPPPPPPPPPPPP>
##$VTLIST= <TTTTTTTTTTTTTTT>
##$WBST= 1024
##$WBSW= 4
##$XGAIN= (0..3)
0 0 0 0 
##$XL= 0
##$YL= 0
##$YMAX_a= 568888
##$YMIN_a= -453326
##$ZGOPTNS= <>
##$ZL1= 120
##$ZL2= 120
##$ZL3= 120
##$ZL4= 120
##$ABSF1= 20.89449
##$ABSF2= -3.174641
##$ABSG= 5
##$ABSL= 3
##$ALPHA= 0
##$AQORDER= 0
##$ASSFAC= 0
##$ASSFACI= 0
##$ASSFACX= 0
##$ASSWID= 0
##$AUNMP= <proc_1d>
##$AZFE= 0.1
##$AZFW= 0.1
##$BCFW= 0
##$BC_mod= 2
##$BYTORDP= 0
##$COROFFS= 0
##$CY= -3
##$DATMOD= 1
##$DC= 0
##$DFILT= <>
##$DTYPP= 0
##$F1P= 0
##$F2P= 0
##$FCOR= 1
##$FTSIZE= 16384
##$FT_mod= 6
##$GAMMA= 0
##$GB= 0
##$INTBC= 1
##$INTSCL= 3.70164e-10
##$ISEN= 128
##$LB= 0.24
##$LEV0= 0
##$LPBIN= 0
##$MAXI= 10000
##$MC2= 0
##$MEAN= 0
##$ME_mod= 0
##$MI= 1.114404
##$NCOEF= 0
##$NC_proc= -5
##$NLEV= 6
##$NOISF1= 3.799351
##$NOISF2= 2.8
##$NSP= 0
##$NTH_PI= 0
##$NZP= 0
##$OFFSET= 20.96794
##$PC= 1
##$PHC0= -25996.77
##$PHC1= 15.98748
##$PH_mod= 1
##$PKNL= yes
##$PPARMOD= 0
##$PSCAL= 0
##$PSIGN= 0
##$REVERSE= no
##$SF= 200.130012164208
##$SI= 16384
##$SIGF1= 3
##$SIGF2= 2
##$SINO= 5.538805
##$SIOLD= 16384
##$SREGLST= <1H.CDCl3>
##$SSB= 0
##$STSI= 16384
##$STSR= 0
##$SW_p= 4816.95568400771
##$SYMM= 0
##$S_DEV= 0
##$TDeff= 16384
##$TDoff= 0
##$TI= <>
##$TILT= no
##$TM1= 0
##$TM2= 0
##$TOPLEV= 0
##$USERP1= <user>
##$USERP2= <user>
##$USERP3= <user>
##$USERP4= <user>
##$USERP5= <user>
##$WDW= 1
##$XDIM= 16384
##$YMAX_p= 282456082
##$YMIN_p= -306691
$$ End of Bruker specific parameters
$$ ---------------------------------
##NTUPLES= NMR SPECTRUM
##VAR_NAME=  FREQUENCY,     SPECTRUM/REAL,   SPECTRUM/IMAG
##SYMBOL=    X,             R,               I
##VAR_TYPE=  INDEPENDENT,   DEPENDENT,       DEPENDENT
##VAR_FORM=  AFFN,          ASDF,            ASDF
##VAR_DIM=   16384,         16384,           16384
##UNITS=     HZ,            ARBITRARY UNITS, ARBITRARY UNITS
##FACTOR=    0.29402158847633, 1,            1
##FIRST=     4196.31396254358, 0,            0
##LAST=      -620.641721464135, 0,           0
##MIN=       -620.641721464135, -306691,     0
##MAX=       4196.31396254358, 282456082,    0
$$ Real data points
##PAGE= N=1
##DATA TABLE= (X++(R..R)), XYDATA
$$ [...]
7173A183447m5196Q2998l6638N6234M3784J8879M3846r1257J37520M1409p5222
7162A359804m9371l505N6039k427J04362k4425K4138M368K5987r835j192J03673
7150A587616k498J30682J252m7440J28669K7183p8072K7736N1284J86L9154L148
7138A868900M9977J9939K8407K3885j9006o911O2637O3770R4335O2943K5772J1380
7126B286028P9258P0230L1352P357J12463n8767J11714K7363Q9098j7018P3329
7115B812407j4976O6222k6226J14668Q0165J35134L4418J14539P4878R5464N8441
7104C545134J37899J21298J12055J17373J44728J68828J73349O9545J16227K9279
7094D735715o140O3896P3615O9055J42158J77431R4310J39432J50288J41479Q5707
$$ plain form
7173 1183447 1138251 1221249 1184611 1240845 1284629 1303508 1347354 1256097 1393617 1435026 1359804
7162 1359804 1310433 1306928 1362967 1360540 1464902 1440477 1464615 1468983 1494970 1485135 1483943 1587616
7150 1587616 1585118 1715800 1717052 1669612 1798281 1825464 1747392 1775128 1826412 1826598 1865752 1868900
7138 1868900 1918877 1938816 1967223 1991108 1972102 1965191 2027828 2091598 2185933 2248876 2274648 2286028
7126 2286028 2365286 2435516 2466868 2474225 2586688 2527921 2639635 2666998 2756096 2739078 2812407
7115 2812407 2797431 2863653 2837427 2952095 3032260 3167394 3201812 3316351 3391229 3486693 3545134
7104 3545134 3683033 3804331 3916386 4033759 4178487 4347315 4520664 4590209 4706436 4735715
7094 4735715 4729575 4793471 4867086 4936141 5078299 5255730 5350040 5489472 5639760 5781239 5866946
7083E866946R9614J07677K10554J75168K67955K71039K47328J43459L04995K60310
7073G955045L71066L68701L40911L89167M38367M09497M08666M81783M53650M28365
7063A2045218M99717L39406N18030N11174N49733N41621N83337P37710Q39014
7054A7164960P95842J134346J225014J586429J656160K218332K501698L197814
7046C1480595L491605M889534O618620R568928J1791484J6445440O660079m529876
7038H6416409j0335287j3247969j0203983p632121n252565m131325l049839k662990
7030B9900330j808492j521248j063305j082678o58879n42157j71375j48309J60721
7021B3064608K71844L76428L38201M52436L15837N23455M24384O63919O80963
$$ plain form
7083 5866946 5966560 6074237 6284791 6459959 6727914 6998953 7246281 7389740 7694735 7955045
7073 7955045 8326111 8694812 9035723 9424890 9863257 10272754 10681420 11163203 11616853 12045218
7063 12045218 12544935 12884341 13402371 13913545 14463278 15004899 15588236 16325946 17164960
7054 17164960 17960802 19095148 20320162 21906591 23562751 25781083 28282781 31480595
7046 31480595 34972200 39861734 46480354 56049282 67840766 84286206 90946285 86416409
7038 86416409 76081122 62833153 52629170 44997049 39744484 35613159 32563320 29900330
7030 29900330 28091838 26570590 25507285 24424607 23765728 23223571 23052196 22903887 23064608
7021 23064608 23336452 23712880 24051081 24503517 24819354 25342809 25767193 26431112 27112075
7012B7112075Q68252R58023J116032J399934J937623K291321K985855L456287
7004D2125402L050863J882902J198443J180108J849144K323949J162220l66185
6996E4406846j346235j714434j130307n50105R7379M45326Q95196J134280J607645
6987E3845591K041150K496343K979229L653469M739320O072805P492336R374193
6979I2694436R958810J0654188J0557068J0905653J1214802Q096385M446130k579718
6971A55947754j0557480j4109418j4966558j2497792r645666p047851n185855
6964H1937134l746462k826261j759805r85522k9003O22901J677989K569728L805045
6955H1265744N335846P518472J0058024J3392593J3754422J3902171J1285293
$$ plain form
7012 27112075 27980327 28938350 30054382 31454316 33391939 35683260 38669115 42125402
7004 42125402 45176265 47059167 48257610 49437718 51286862 53610811 54773031 54406846
6996 54406846 53060611 51346177 50215870 49665765 49763144 50208470 51103666 52237946 53845591
6987 53845591 55886741 58383084 61362313 65015782 69755102 75827907 83320243 92694436
6979 92694436 102653246 113307434 123864502 134770155 145984957 154081342 158527472 155947754
6971 155947754 145390274 131280856 116314298 103816506 94170840 87122989 81937134
6964 81937134 78190672 75364411 73604606 72619084 72590081 73212982 74890971 77460699 81265744
6955 81265744 86601590 94120062 104178086 117570679 131325101 145227272 156512565
6948A56512565N579526j636369j0061210j5478197j7556800j6152887j3592363
6941H7614265j0462134q532327o665496n544290m554442l839656l321453k973035
6933D1721432k557772k349819k014883j874739j626977j554265j380298j176656
6925B7186023j210789j112307r91837j045641p58022p87455o34783o17463m96101
6916A9531625n25926m42243m48993l89924l72955l42528l22332l08449l80220
6907A5998055k12044k29024j97981j73726j70512j97057r4320j26189p1227j33194
6897A4392781j61126j33535j6001q0834m2134m0351K6398Q9474M6908L4849J64305
6886A4280734K14153K19282K25361J62191K46673L86340L32138L41593L95535
$$ plain form
6948 156512565 162092091 160455722 150394512 134916315 117359515 101206628 87614265
6941 87614265 77152131 68619804 61954308 56410018 51855576 48015920 44694467 41721432
6933 41721432 39163660 36813841 34798958 32924219 31297242 29742977 28362679 27186023
6925 27186023 25975234 24862927 23871090 22825449 22067427 21279972 20645189 20027726 19531625
6916 19531625 19005699 18563456 18114463 17724539 17351584 17009056 16686724 16378275 15998055
6907 15998055 15786011 15556987 15359006 15185280 15014768 14817711 14723391 14597202 14525975 14392781
6897 14392781 14231655 14098120 14082119 14001285 13959151 13918800 13945198 14034672 14081580 14116429 14280734
6886 14280734 14494887 14714169 14939530 15101721 15348394 15734734 16066872 16408465 16804000
6877A6804000L77754K72020M12345L65899L97204K71512L53424L98323L39374
6868A9991855M40641L30665M26713M78609M62131M57954M93045O57241O90442
6859B4429296Q36884R45491R33962J091473J228567J345879J506470J626014J783521
6850C5727557K129627K721366L195245L799930M352413M727933M580879L450159
6842F4685109K484408J651225O22885j114160k780847l824323m032065l537816
6834E4154416k714229j908216j247133q41530k11750K59364P22077J139134J654502
6825E1006635K157699K811580L676099M710541N678142O415949O306344M986528
6817H7749517K859073M42079j391493k147554k035262k031191k498338k785615
$$ plain form
6877 16804000 17181754 17453774 17866119 18232018 18629222 18900734 19254158 19652481 19991855
6868 19991855 20432496 20763161 21189874 21668483 22130614 22588568 23081613 23738854 24429296
6859 24429296 25266180 26211671 27145633 28237106 29465673 30811552 32318022 33944036 35727557
6850 35727557 37857184 40578550 43773795 47573725 51926138 56654071 61234950 64685109
6842 64685109 67169517 68820742 69443627 68329467 65548620 61724297 57692232 54154416
6834 54154416 51440187 49531971 48284838 47443308 47231558 47490922 48212999 49352133 51006635
6825 51006635 53164334 55975914 59652013 64362554 70040696 76456645 82762989 87749517
6817 87749517 90608590 91050669 89659176 87511622 85476360 83445169 80946831 78161216
6809G8161216k703304k148987j129407j9185J052809K556816M130880N950188
6801H5851026P547078Q424510P540451N244507K786296L12968j595421k960178
6793A13151237m135376m769994m914983n063101n287739n850076n870816n735459
6785G1523693n014570m038527l102645k195140j493742p54140j49348P37684J491774
6776E7005039K435267L466544M503204N207363N085140M189293J711563j350449
6768H2252964l256023m260571m674735m908776n095722m950349m768250m327017
6760D6011521l907767l283762k810744k335509j860853j639385j277074j026719
6752B7869708p93978p17076p01810p00345p21128p12405o69536n23762o34808
$$ plain form
6809 78161216 75457912 73308925 72179518 72160333 73213142 75769958 79900838 85851026
6801 85851026 93398104 101822614 109363065 114607572 117393868 117706836 116111415 113151237
6793 113151237 109015861 104245867 99330884 94267783 88980044 83129968 77259152 71523693
6785 71523693 66509123 62470596 59367951 57172811 55679069 54924929 54775581 55513265 57005039
6776 57005039 59440306 62906850 67410054 72617417 77702557 81891850 83603413 82252964
6768 82252964 78996941 74736370 70061635 65152859 60057137 55106788 50338538 46011521
6760 46011521 42103754 38819992 36009248 33673739 31812886 30173501 28896427 27869708
6752 27869708 27075730 26358654 25656844 24956499 24235371 23522966 22853430 22329668 21694860
6743B1694860o23050n83496p14734p91820p25618p44165o92154p19029o23832
6734A5476962n89392n31983l93362l28677k47368l62431j52786j73972j32530
6725A2564461j26387j21283j37008l49242k20400l06505l10919l42624l99918
6716A0250175m62335l41426m26907l53513l09684l66888k14757k37692k46605
6707G290368j86246p6387k18585j26674j54569j5875J6564n9029l4348j14148
6697F321071j87265o6662k4381j09259k30699k23866j88937k30247r2732j64267
6687D802756j40456j99446j15181r0612r7730J8002j21602q9758j90066j04468
6677C671439j13173q4538j01454p5731m7639n6026r900p3545j35150j7549p0948
$$ plain form
6743 21694860 21071810 20488314 19773580 18981760 18256142 17511977 16819823 16100794 15476962
6734 15476962 14887570 14355587 13962225 13633548 13386180 13023749 12870963 12696991 12564461
6725 12564461 12438074 12316791 12179783 11830541 11610141 11303636 10992717 10650093 10250175
6716 10250175 9787840 9446414 9019507 8665994 8356310 7989422 7774665 7536973 7290368
6707 7290368 7104122 7027735 6809150 6682476 6527907 6512032 6528596 6469567 6435219 6321071
6697 6321071 6133806 6067144 6042763 5933504 5702805 5478939 5290002 5059755 4967023 4802756
6687 4802756 4662300 4462854 4347673 4257061 4159331 4177333 4055731 3965973 3775907 3671439
6677 3671439 3558266 3473728 3372274 3296543 3248904 3192878 3182978 3109433 2974283 2956734 2885786
6666B885786p5712m2807l9431j03470m8451o6943r2433j16544p2820m4734n4613
6655B127828k6887n4312n0060n0372N6907m4165j65123o7214J6474o7355m9784
6644A625937l1109r785m9599k4893K2799J4761M2403j0872m8498J5576p631j03255
6632A435834j7898J2160j1577J0292r0792n0273j3292k8026L1208q3434O5114
6621A259316n3706j6417J278J4696K625m5537j5104m6657J0243m2869k5050J7148
6609A059966K9319J5796J7735l7608l7350l8135O1483J5668r3045M4508j5777
6598A022560p7812l0106J5704J6306j24631N011N8686J00341r4963j8762l1835
6587H40499J3025M0474J1033m9326m968k5097o5L5594M4389L6548J1393m6396
$$ plain form
6666 2885786 2810074 2767267 2727836 2624366 2575915 2508972 2416539 2299995 2227175 2182441 2127828
6655 2127828 2100941 2046629 1996569 1946197 2003104 1958939 1793816 1726602 1743076 1675721 1625937
6644 1625937 1594828 1585043 1535444 1510551 1533350 1548111 1590514 1579642 1531144 1546720 1539089 1435834
6632 1435834 1417936 1430096 1418519 1428811 1338019 1287746 1274454 1246428 1277636 1194202 1259316
6621 1259316 1205610 1189193 1190471 1205167 1207792 1162255 1147151 1100494 1110737 1067868 1042818 1059966
6609 1059966 1089285 1105081 1122816 1085208 1047858 1009723 1071206 1086874 993829 1038337 1022560
6598 1022560 944748 914642 930346 946652 822021 827032 885718 986059 891096 872334 840499
6587 840499 853524 893998 905031 855705 850737 825640 825575 861169 905558 942106 953499 907103
6575I07103N2302K0290j8489k7045R4684R461n1421N1452n61J5656P6781r0633
6563A039580j6677M0982J397o6064o0624q210k7348J3693m5639j7818n9780L7577
6551H31069P0612m5714j4490P8424o117N7480M3768l189j0294j4357J35420j5739
6539A106873j9342M7164j4799n9533m2369L5032N6560l6820p6509k7099O7452
6528A036610M1435o6901K8302n0231K8486j04554l425l8992l5133O4979L4235
6517I34811k853k3711M3795m8347m5040J482l1722l8425l486K8971q0789r106
6505G25580m25O5519j4396Q190N6207p356L9154J63l6862p2260J9756j5183k9345
6492G38742n9298k4876o849r9398R3809K2905j03788M3258k390k741m3977M1142
$$ plain form
6575 907103 959405 979695 961206 934161 1028845 1038306 986885 1038337 1037776 1053432 1130213 1039580
6563 1039580 1022903 1063885 1065282 999218 938594 930384 903036 916729 871090 853272 793492 831069
6551 831069 901681 855967 841477 919901 913784 971264 1015032 1011843 1001549 987192 1122612 1106873
6539 1106873 1087531 1134695 1119896 1060363 1017994 1053026 1109586 1072766 996257 969158 1036610
6528 1036610 1078045 1011144 1039446 989215 1017701 913147 909722 870730 835597 900576 934811
6517 934811 931958 908247 952042 903695 858655 860137 828415 789990 786504 815475 734686 725580
6505 725580 725155 790674 776278 784468 840675 833319 872473 872636 835774 763514 783270 768087 738742
6492 738742 679444 654568 647719 548321 642130 665035 561247 604505 602115 599374 555397 596539
6480E96539m6984p0415j2033j00676O7056l5072N9599K9906K9459l6268j3651
6469D67460j942M4004L567p8944M8950n0841M3675j3962m768n6179N1119m222
6457D47917L7797N0852n7173O8167m6513m9507M1269N202K7555J3783n4115O4567
6445E49801j0257m7342j7864J6410M9073r448R595l762K0160m4891M8259l584
6433E56150l4040L2829L2688L1838l2858K2212K8263n8325L9972M5259J7399L2251
6421G13638L0979j7830o974j4531k1781O2587M1305L9852N9931P690L3490L108
6409I31464j471L2053m4402L1153M1215N9093P9381J32531K2325k975J12750N6711
6397A449828L1722Q2384n5824Q5389L2847L5162P3025O4710Q3324J10750Q7008
$$ plain form
6480 596539 549555 479140 467107 366431 433487 398415 458014 487920 517379 481111 467460
6469 467460 465518 509522 513089 434145 483095 432254 475929 461967 457199 401020 452139 447917
6457 447917 485714 536566 479393 547560 501047 451540 492809 498011 525566 539349 485234 549801
6445 549801 539544 492202 474338 490748 539821 530373 539968 536206 556366 511475 559734 556150
6433 556150 522110 554939 587627 619465 586607 608819 637082 578757 618729 663988 681387 713638
6421 713638 744617 726787 719813 705282 683501 746088 787393 827245 887176 894866 928356 931464
6409 931464 929993 962046 917644 948797 990012 1049105 1128486 1261017 1283342 1280367 1393117 1449828
6397 1449828 1481550 1563934 1508110 1593499 1626346 1661508 1734533 1799243 1882567 1993317 2080325
6386B080325R3782O4356J68529O3799J43567K23765J90562J68387K30743L45940
6376C773755K68676K57552K67813K71340J00272J29672R1665L0657j01195o6119
6366E024088m7981j81555j72833j63963k47662j24475j43081j56074m4459o9691
6356C672314o6560j95M5205p515k5312L2420J14049R4718J87473O7591o450J45372
6344D253110K1542M5308o7343q5012j59183j02277k75719k72999l36202l00545
6334B720680j31392k31614j15351m9301k24431j73527r8341n4420p2706j55280
6324A414317J447j03050m9269j06266j4209r4805p8809o1570l8654M5085o8743
6313H45474j01085l2231K7973j2670k2738r8259M3242q031p8063O9519J1067l9527
$$ plain form
6386 2080325 2174107 2238463 2406992 2470791 2614358 2838123 3028685 3197072 3427815 3773755
6376 3773755 4042431 4299983 4567796 4839136 4939408 5069080 5160745 5191402 5090207 5024088
6366 5024088 4976107 4794552 4621719 4457756 4210094 4085619 3942538 3786464 3742005 3672314
6356 3672314 3605754 3605559 3650764 3643249 3617937 3650357 3764406 3859124 4046597 4114188 4107738 4253110
6344 4253110 4274652 4319960 4252617 4167605 4008422 3906145 3630426 3357427 3021225 2720680
6334 2720680 2589288 2357674 2242323 2193022 1968591 1795064 1696723 1642303 1569597 1414317
6324 1414317 1415764 1312714 1263445 1157179 1142970 1048165 969356 907786 869132 914217 845474
6313 845474 744389 712158 740131 727461 704723 606464 649706 641675 563612 633131 644198 604671
6301F04671j4254k2855K8148r6700j01838M3691O2802o7008j8269M6292n2313
6290D12367q9646l760q67m6649M7752n4211j6229P4693m2343J4235p5509N7281
6278B77114Q4505r1639l6611r9860N1010N6040m7120M2632k5057R661j2161p614
6266B00900m4935M6358k734j8155J6066j6498o905r163m495p321J06716J5363
6254B75197n0417p1404m3202J1100l3797K1345K5434j0649l3245M2141Q7458o1249
6242A58712J9738r8846J612M8729k1740o0353p664L1830K8400j9911J0027N484
6230I6018o7591O5540l0726r2999O3592J24330m460l2461r0182l4109O9266k5721
6218D0497J1147M3183l91l1037r5320J34094k2809m0640j8540J9896j1692m7868
$$ plain form
6301 604671 590417 567562 595710 499010 397172 440863 503665 436657 418388 464680 412367
6290 412367 322721 318961 318094 271445 319197 264986 248757 323450 281107 295342 219833 277114
6278 277114 361619 269980 233369 133509 184519 240559 193439 236071 211014 220675 208514 200900
6266 200900 155965 202323 199589 181434 197500 181002 174097 164934 160439 153118 259834 275197
6254 275197 224780 153376 110174 121274 87477 108822 134256 123607 90362 132503 219961 158712
6242 158712 178450 79604 81216 129945 108205 47852 40188 72018 100418 80507 90534 96018
6230 96018 28427 93967 63241 -29758 33834 158164 153704 121243 31061 -3048 66218 40497
6218 40497 51644 94827 94436 63399 -31921 102173 79364 38724 20184 40080 28388 -19480
6206a9480K5212k117k7544P2315L1720J9393l5741k5145N9232r5517L627K6274
6194C2229m6830Q4676l5718l2563P2038j6868m7811j11775M1734R2800K0017m4665
6182G264M5876k6214J2867k0213r774J5333j067m254k1578k8969L5421K5824k9551
6169I65J553L8026L0716M4058q0761o5109K2994k0052J6079R2107l0103p9461
6157b8988R2169p1160k1748K6319j0195l0077K547P5220l0899m6627N2652L2886
6145D2099o6644L7532L7443m804j26992M1624O8732m6925l8270L1490N4277l1920
6133b358k9072m1497J14492l582j4979R6668r4150k218M784L0354j0302p044p7798
6120c6702R3181N2921q1864n9938Q9983n081p4095j1005l6684N8114R128M5745
$$ plain form
6206 -19480 5732 3615 -23929 48386 80106 99499 63758 38613 97845 2328 5955 32229
6194 32229 -14601 70075 34357 1794 73832 56964 9153 -102622 -60888 31912 51929 7264
6182 7264 53140 26926 39793 19580 9806 25139 24072 19818 -1760 -30729 4692 30516 965
6169 965 2518 40544 71260 115318 34557 -30552 -7558 -27610 -11531 80576 50473 -28988
6157 -28988 63181 -7979 -29727 -3408 -13603 -43680 -41133 34087 3188 -43439 9213 42099
6145 42099 -24545 12987 50430 45626 -81366 -39742 28990 -17935 -56205 -24715 29562 -2358
6133 -2358 -31430 -72927 41565 37983 23004 119672 25522 23304 28088 58442 48140 41096 -36702
6120 -36702 56479 109400 27536 -32402 57581 52500 -21595 -32600 -69284 -11170 -2042 43703
6108D3703P2776l5989o6891O55N6539Q595o3091l8137L7185P3689m7204L34k0021
6095B2143J7128j08075M6585M5901k8528m3170M7121J3138p3729R7659j3827J627
6083B3973j702j11071O4796O6545k3300L6440q6508k0252J5760J247n3381L2308
6071e5145Q4762o4435J7275k3031M4215K8482j4375l2414j1800l258J3459k6784
6059d3049j4216J4481K8932J924n9466K0890k9782O7541J6036l5157N0375m4167
6047b5658N8574r174r4524K7266J2133m4624O3586L4616o9023O7636J4268q0686
6035d5610L3640L9678K940j570j3196Q449m545j3132M1300l096l4676j4860n3052
6022e7730M7864q928M5727m4908M018L8175k9962j343j10301K7354L1708r082
$$ plain form
6108 43703 116479 80490 13599 14254 70793 79388 16297 -21840 15345 89034 41830 42164 22143
6095 22143 39271 -68804 -22219 23682 -4846 -48016 -895 12243 -61486 36173 22346 23973
6083 23973 22271 -88800 -24004 42541 19241 55681 -30827 -51079 -35319 -34072 -87453 -55145
6071 -55145 29617 -34818 -17543 -40574 3641 32123 17748 -14666 -26466 -29724 -16265 -43049
6059 -43049 -57265 -42784 -13852 -11928 -71394 -50504 -80286 -12745 3291 -31866 18509 -25658
6047 -25658 32916 23742 -70782 -43516 -31383 -76007 -12421 22195 -46828 20808 35076 -45610
6035 -45610 -11970 27708 30648 29078 15882 24331 19786 6654 47954 44858 10182 -4678 -57730
6022 -57730 -9866 -18794 26933 -17975 -13957 24218 -5744 -7087 -117388 -90034 -58326 -67408
6010f7408N3651M4142p8458m1893N1665P6506q5138K6650J1265j8237K0232p460
5998a4483j1745j4212K0021o0699Q047K7843J2636n1649K1040J9702n4127P9520
5986a8106L7192j3127l6094o060o5173L3914K0086l854J3268N22o8320M3101k0508
5973h3159J6011J45192m5089q1112L5992o303P5474p2443K8010j4121o844Q089
5961c03q0151L0838K6684N057P235l3460m8423M4975K7837P6231o6601q85M314
5948f652l2691o9570M6668K4440l0284K4570k5061M4216L9272R422J7705l6202
5936E833k3328L5143p9912Q2091N8793J0217m3955k9212L7675p3580m5734L0603
5924c5366J44140q3987p5151k7330j3503M1297L3290J2771M9218k0102Q626j0046
$$ plain form
6010 -67408 -13757 30385 -48073 -89966 -38301 38205 -46933 -20283 -9018 -27255 -7023 -14483
5998 -14483 -26228 -40440 -20419 -81118 -73071 -45228 -32592 -84241 -63201 -43499 -97626 -18106
5986 -18106 19086 5959 -30135 -36195 -101368 -67454 -47368 -51222 -37954 -37432 -105752 -62651 -83159
5973 -83159 -67148 78044 32955 -48157 -12165 -18468 57006 -15437 12573 -1548 -8392 -303
5961 -303 -80454 -49616 -22932 -17875 -10640 -44100 -92523 -47548 -19711 56520 -10081 -10966 -6652
5948 -6652 -39343 -108913 -62245 -37805 -68089 -43519 -68580 -24364 14908 24330 42035 5833
5936 5833 -17495 17648 -62264 19827 78620 88837 44882 15670 53345 -20235 -65969 -35366
5924 -35366 108774 24787 -50364 -77694 -91197 -49900 -16610 -3839 45379 25277 33903 23857
5912B3857r6958m9130R1808j1421k9147k4148J36576j7127p6647M8768j8577p022
5900b9168O2449j61334L910N8875n187K8773n4091L9370O7664j00602P6076k3105
5888c6370j334m0839k8442M4853M6779k3212j8811O3308p8949M0820J6750J4142
5876a305J9389j4976r758O4298k4737m1R137l3460K7019n4631p996K9246J1741
5863A3926n3739M2353M345M372q528N1732p2828r4209P7203P2265k5314m7000
5851c5422J6485P4869K6991n0520m7551m6712K0792l742J962l4861L5611L9447
5839b651J8153p807L3809K0452K8415m4610m7984K9785k1283r9309L0268L8122
5827b4640M14k0894k0530k7844O7531J7575L3671p2945J4917J7387j5095j5681
$$ plain form
5912 23857 -73101 -122231 -30423 -41844 -70991 -95139 41437 24310 -52337 -3569 -22146 -29168
5900 -29168 33281 -128053 -124143 -65268 -70455 -41682 -95773 -56403 11261 -89341 -13265 -36370
5888 -36370 -37704 -78543 -106985 -62132 -15353 -38565 -57376 5932 -73017 -32197 -15447 -1305
5876 -1305 18084 3108 -6650 57648 32911 32870 42007 8547 35566 -19065 -27061 2185 13926
5863 13926 -39813 2540 6885 11257 2729 54461 -18367 -112576 -35373 36892 11578 -35422
5851 -35422 -18937 55932 82923 32403 -15148 -61860 -41068 -44810 -42848 -77709 -42098 -2651
5839 -2651 15502 7695 41504 61956 90371 45761 -2223 27562 6279 -93030 -62762 -24640
5827 -24640 -24226 -45120 -65650 -93494 -25963 -8388 25283 -47662 -32745 -15358 -30453 -46134
5815d6134k9335k6703M2502L3706l7613j04543R0755M632q86J971l1657M728Q1838
5802a6739q191J06615l5318l4286k9154r828M6505Q983L5775o1404k8230l1557
5790e6829k2530J9217J0853r538M9452l7862L8841P244l3039r76K4666k7440N5775
5777A7834m0509M6850m1686j2659M6730L6987j4730k3882n5534N867n4732M184
5765h5280M1132o6329J6923j3002O4498K5373P8101n1858j8695K6098o5372L7965
5753a0446l0864l1679Q4433o2363n5178J386p117M6189L4489k2866P078O1795
5741A4857M0119j02463p46k0654P66M220J2601O895p974j3313L3877K7544k6994
5728c1265l0290j5825k986j550j0412n436J5625n6398K2420R5658o458j081L0531
$$ plain form
5815 -46134 -75469 -102172 -59670 -25964 -63577 -168120 -77365 -72733 -73619 -71648 -103305 -98577 -16739
5802 -16739 -24930 81685 46367 12081 -17073 -26901 19604 28587 64362 2958 -25272 -56829
5790 -56829 -79359 -60142 -49289 -58827 -9375 -47237 -8396 -1152 -34191 -35167 -10501 -37941 17834
5777 17834 -22675 24175 -17511 -30170 16560 53547 38817 14935 -40599 -34732 -89464 -85280
5765 -85280 -44148 -110477 -93554 -106556 -42058 -16685 61416 9558 -9137 16961 -48411 -10446
5753 -10446 -41310 -72989 11444 -50919 -106097 -104711 -111828 -65639 -31150 -54016 -46938 14857
5741 14857 54976 -47487 -48233 -68887 -68121 -63901 -51300 -44405 -52379 -65692 -31815 -4271 -31265
5728 -31265 -61555 -77380 -80366 -81916 -92328 -97764 -82139 -138537 -116117 -20459 -26917 -27998 2533
5715B533p907l5534l3508l2005M7333M9750p3818L6155o1339P4008j5629l4844
5703h4805K7800M432k4150R8061p0755j5949O6466l1334q6098J6131K7598J7268
5691e5335L1922l325K6439j6658k2060K1120p436l0758M5953J423K125p147Q064
5678e673k315p183N1790o3780L4926l2176m0761K2537M4410N4268o442o4075k7190
5665d1664K9627L8358o4139l9809K5176R221K1472O36J4271k681m1310L5259r245
5652b4828Q648K3779m020j9701k2390P4224k9850J3649j0851k136M170K0898q7397
5639e5805P885P491K1526l0912K3066L0115K194m7707k4600j8784J27073J7187
5627E8729n0815J8511M9257j4704p8288Q0872l7849j4771N478l3479p7574K9116
$$ plain form
5715 2533 -5374 -40908 -74416 -106421 -59088 -9338 -83156 -47001 -108340 -34332 -49961 -84805
5703 -84805 -57005 -52573 -76723 21338 -49417 -65366 1100 -30234 -116332 -100201 -72603 -55335
5691 -55335 -23413 -26738 -299 -16957 -39017 -17897 -25333 -56091 -10138 -8715 -6590 -13737 -5673
5678 -5673 -7988 -15171 36619 -27161 7765 -24411 -65172 -42635 1775 56043 49601 -14474 -41664
5665 -41664 -12037 26321 -37818 -77627 -52451 -43230 -21758 -21122 -6851 -9532 -50842 -15583 -24828
5652 -24828 -16180 7599 3579 -16122 -38512 35712 5862 19511 8660 6524 10694 31592 -55805
5639 -55805 -47920 -40429 -18903 -49815 -26749 3366 5560 -42147 -66747 -85531 41542 58729
5627 58729 7914 26425 75682 60978 -17310 63562 25713 10942 16420 -17059 -94633 -65517
5615f5517R4934j0052J00971n2068l1871L1821m14L5799J03929O1349j4648q5799
5603A68434q3107k8068j0955L2557m0566J0509m3370m3816m509P5922J1702o6977
5591b2244m5226P2000M7703k3629n4031L9587l1436K9713K4624p4427m0152M6695
5579c0823p949L1133n3490j8305M1296n3491n825j9802L5413P3226J1014j3723
5567a1326n6162p742m8691M2135O374K775J19871l2077L500o1358n932j8752p736
5554g5121M6155R984K4067l6526M3485K6238r553o3778p247M3931k2184Q9996
5542F9447r1279P36j4077K1380Q0124n1098l9543K7563M765J5910k7269o0340
5530f3681l1756J2465L3916q377K9978R104r341j6794N3671m821j0586Q1k6987
$$ plain form
5615 -65517 29417 19365 120336 68268 36397 68218 67804 103603 207532 268881 254233 168434
5603 168434 85327 57259 46304 78861 38295 48804 5434 -38382 -42891 33031 44733 -22244
5591 -22244 -67470 4530 52233 28604 -25427 14160 -17276 12437 37061 -37366 -77518 -30823
5579 -30823 -38772 -7639 -61129 -79434 -38138 -91629 -97454 -117256 -81843 -8617 2397 -11326
5567 -11326 -67488 -75230 -123921 -81786 -75412 -72637 47234 15157 18657 -42701 -48633 -67385 -75121
5554 -75121 -28966 -18982 5085 -31441 12044 38282 28729 -35049 -42296 1635 -20549 69447
5542 69447 -21832 -21096 -35173 -13793 66331 15233 -24310 3253 8018 23928 -3341 -63681
5530 -63681 -95437 -82972 -49056 -57433 -27455 -18351 -27692 -44486 9185 4364 -6222 -6141 -33128
5517c3128p172O6123K2769n0274k1860J9447K6363o6751m9209P7373J0504k3065
5505b8880j0592p232K4889J3342O194m0153Q538M7342Q590k3148L3021m6598O258
5492h429o9372M7950J4073o5369J32726k2211j5794n826r7541J28341m8582j7323
5480b7357Q4287k0358Q31m8785K0397K3828p6116o282Q4608k9379n2539q252j6536
5467g1653R468O5120O366M6549o435O803o3164j2076M8968k8549l1821j2805M6426
5454C197n9522N3186r441j3847N1402j2383K2915L797q1937l491J7110k7475M0757
5441a5732O5881k0375l9905L3969j5457J7656J5257j5069o2342J8252r772j1936
5429c9573M0641M6776O070m0569l7707n7301P2875L1022n8145M4134k425m44J1288
$$ plain form
5517 -33128 -40300 25823 48592 -1682 -23542 -4095 22268 -44483 -93692 -16319 -5815 -28880
5505 -28880 -39472 -46704 -21815 -8473 -2279 -42432 -33894 13448 22038 -1110 31911 -14687 -8429
5492 -8429 -77801 -29851 -15778 -81147 51579 29368 13574 7748 -89793 38548 -10034 -27357
5480 -27357 56930 36572 37403 -11382 9015 32843 -43273 -49555 35053 5674 -46865 -55117 -71653
5467 -71653 -62185 2935 9301 55850 49415 56218 -6946 -19022 29946 1397 -30424 -43229 3197
5454 3197 -56325 -3139 -12580 -26427 24975 12592 35507 39304 -42633 -46124 -29014 -56489 -15732
5441 -15732 50149 29774 -10131 23838 8381 26037 41294 26225 -36117 -17865 -27637 -39573
5429 -39573 1068 47844 53914 13345 -24362 -81663 -8788 22234 -35911 8223 5798 5354 16642
5416A6642J254K6866L617q1686L3781N188j6078p6846J9654O9470p440l294P081
5403a791k5058l2834L9468K7780j764m8650J06806m0072l027J8024q6039k5192
5391g2349J5495P9613M915L5093m0386q5262M1664r30O0799k918k0140n425N6752
5378F6921o185k5097K5865r306l7815O317Q695N1451l0753l3717J5974q134K4814
5365D9030K3668O2821n253q3087j7534P6597o7050P604J4382k1229j997l1753
5353F199N2548K2947j0870n5379R2380o280n1491O6220k6436M3749l1252l2191
5341G0144K2977M9739J0556o0301j1042M8836M8115k4977L2308m5654n9896l0664
5329E0141M8143R0316l9147Q474l8783M5472J17667k1893p7833o846N3117P3257
$$ plain form
5416 16642 17896 44762 48379 -33307 474 5662 -10416 -87262 -67608 1862 -5578 -8872 -1791
5403 -1791 -26849 -59683 -20215 7565 5801 -42849 63957 23885 20858 38882 -47157 -72349
5391 -72349 -56854 22759 27674 62767 22381 -62881 -21217 -22147 38652 35734 15594 10169 66921
5378 66921 60736 35639 61504 52198 14383 20700 29395 80846 50093 16376 32350 24216 49030
5365 49030 72698 135519 130266 47179 29645 106242 39192 46796 61178 39949 37952 6199
5353 6199 58747 81694 70824 15445 107825 101545 50054 116274 89838 133587 102335 70144
5341 70144 93121 142860 153416 93115 82073 130909 179024 154047 186355 140701 80805 50141
5329 50141 98284 188600 149453 157927 119144 164616 282283 260390 182557 175711 228828 302085
5317C02085n0059M65l2699L1760q057l358N333P0619q407M0557R6251O9682m4477
5304D69695l6155K7611k2626J0743n9510L0769j0405n356J15854j06731J2723
5293D26612K1593K7360N1808l6745P4790k0787o7620j2296L782N6469n4627K4462
5281D94801O411l0616Q831l3924K3059k8418N4597m058l8907P789l7330p1783
5269C50452k903K7500J5670k1073q1870K9458j3413R906l9197n6276o237j23K9113
5256B41007q963N7842M1793L990n9220O800l9735M9884M6388L1545K228j437j5011
5243C57111j7678k6738J2584o7031O6934p363Q9184l074o012L4229n4952Q2571
5231D59765j2593o3522m494P5832J9439L5548o2932J3063O964J4411O0446p1054
$$ plain form
5317 302085 252026 252491 219792 251552 243495 240137 245470 316089 307682 348239 444490 514172 469695
5304 469695 433540 461151 438525 449268 389758 420527 410122 404766 520620 413889 426612
5293 426612 448205 475565 527373 490628 565418 544631 477011 464715 468497 524966 470339 494801
5281 494801 501212 470596 479427 445503 468562 440144 494741 490683 451776 459565 422235 350452
5269 350452 347549 375049 390719 369646 287776 317234 303821 313727 274530 218254 212017 211894 241007
5256 241007 232044 289886 331679 335669 276449 283249 243514 293398 339786 371331 373559 372122 357111
5243 357111 339433 312695 325279 258248 325182 317819 407003 403929 397917 432146 377194 459765
5231 459765 447172 383650 379156 454988 474427 509975 447043 460106 467070 481481 541927 470873
5219D70873R148p2403K3781P9730p093O727O827j1606m5134O0018R2579r7453
5207E15994k6636J0740M0013m323k0121J7358L1025K4612J6415q9797M9142R0107
5195F54529l2972K8289j2462J0428M3981L8017O776p090J7671p6125J05644J07598
5183H84284l1935l946k1555m7639N1586K0876O457P9944L4265q3350N0917M5881
5171I85785l5294M7061m2181K61P2126O4124m3899J15780L3958k595M6031n4845
5159A186312P5776J10885k8290m0972m3230J7901J5248N2902N960k2653J02892
5148A432731N4845P3281P5333j6555J16751m522L2621J3249N1459Q2944l3567
5137A878570l1843L0304N5649k1153Q64Q0032J5221Q5325P6436K5248O1889n629
$$ plain form
5219 470873 480021 407618 431399 511129 504036 510763 517590 505984 460850 520868 613447 515994
5207 515994 489358 500098 540111 535788 515667 533025 564050 588662 605077 515280 564422 654529
5195 654529 621557 649846 637384 647812 691793 729810 736586 729496 747167 671042 776686 884284
5183 884284 852349 848403 826848 779209 830795 851671 858128 938072 972337 888987 939904 985785
5171 985785 950491 997552 955371 955632 1027758 1091882 1047983 1163763 1197721 1195126 1241157 1186312
5159 1186312 1262088 1372973 1344683 1303711 1260481 1278382 1293630 1346532 1352492 1329839 1432731
5148 1432731 1487576 1560857 1636190 1619635 1736386 1731864 1764485 1777734 1829193 1912137 1878570
5137 1878570 1846727 1877031 1932680 1911527 1912391 1992423 2007644 2092969 2169405 2194653 2256542 2250913
5125B250913R8988P2287J17364M815K4056J40558O9981Q4942J37337N1159L4507
5114C086907P8734R4605P0231J19779J58868Q1081K23938J67773K29976J33370
5104D445262K01354J28658K54204L24978K14919K90948L55023L69109L98297N55116
5094G537868O16247N57750L76243K57181J37623J67774L05790L05593M31003O88828
5084A1381900Q90027P83002Q81033Q13277Q42972P49269O41762K97610J57567
5075A7438419J58817L09454O07752P55239P15776P55288P03152P09448Q33965
5066B2987310J048732J121059J240242J248231J087820J127279J219391J605843
5058C2685907J802064K358637K929831M080316N146167O329796O545404L922933
$$ plain form
5125 2250913 2349901 2422188 2539552 2544367 2568423 2708981 2778962 2863904 3001241 3052400 3086907
5114 3086907 3165641 3260246 3330477 3450256 3609124 3690205 3914143 4081916 4311892 4445262
5104 4445262 4646616 4775274 5029478 5354456 5569375 5860323 6215346 6584455 6982752 7537868
5094 7537868 8154115 8711865 9088108 9345289 9482912 9650686 9956476 10262069 10693072 11381900
5084 11381900 12271927 13054929 13935962 14749239 15592211 16341480 16983242 17280852 17438419
5075 17438419 17597236 17906690 18514442 19269681 19985457 20740745 21443897 22153345 22987310
5066 22987310 24036042 25157101 26397343 27645574 28733394 29860673 31080064 32685907
5058 32685907 34487971 36846608 39776439 43856755 49002922 55332718 61878122 65801055
5050F5801055O81596j673528k894289k326759r58395N93211K200440L325961K205376
5041F6954668J214650J061254J583474K645299K594965O46343j744305l143639
5033G1812709l105227j970726k40959J84381j442164k478799k806298k102755
5025E7850162k69437J566516L099948L560908O99048l035592n713381o907334
5017E0850838o673923n545473m333502l644177k923565k490358k106833j762728
5009B1370279j490351j394437j205454r23342p93687p62696o94549o26897m96306
5000A2982560m24771m65452m42860m06984m04801k64487k96299k36004k08537
4991I832365k79888k00135j50120k60451j57422j06502k10083j71708o8911n5703
$$ plain form
5050 65801055 66482651 64809123 61914834 59588075 58629680 59222891 61423331 64749292 66954668
5041 66954668 68169318 69230572 70814046 73459345 76054310 76700653 74956348 71812709
5033 71812709 68707482 66736756 66495797 66680178 65238014 62759215 59952917 57850162
5025 57850162 57580725 59147241 62247189 65808097 66507145 63471553 57758172 50850838
5017 50850838 44176915 38631442 34297940 30653763 27730198 25239840 23133007 21370279
5009 21370279 19879928 18485491 17280037 16356695 15563008 14800312 14105763 13478866 12982560
5000 12982560 12557789 12092337 11649477 11242493 10837692 10573205 10276906 10040902 9832365
4991 9832365 9552477 9352342 9202222 8941771 8784349 8677847 8467764 8296056 8227145 8171442
4981H171442j17315n0956r0256N168l0084q1275l3962k2823l0893j5138L238R426
4969G716572o1273n7046K9764K8135O9381N7272P3261J18638L9189J16717J68355
4958H298965J03784J13106R8919R5088P4789J39435P6633J15220K7792K01665
4948I345396J92599J67543K53676J84151K35724L10388L51842L00748L10342K84631
4938A1937040L51651M10998M08977L55976L18362N38101L79861M24761O18678
4929A5744405N14982O81741P32718Q00789Q04280R57122J159951J138906J430532
4920B3965426J489075J585704J874200J987591K139914K015647J969106J802855
4912C8829518J354072R27611M78101Q9163j10660j14937M607Q1468L82877Q08059
$$ plain form
4981 8171442 8054127 8003171 7912915 7918083 7887999 7806724 7772762 7749939 7719046 7703908 7707146 7716572
4969 7716572 7655299 7598253 7628017 7656152 7725533 7782805 7856066 7974704 8013893 8130610 8298965
4958 8298965 8402749 8515855 8614774 8709862 8784651 8924086 9000719 9115939 9143731 9345396
4948 9345396 9537995 9705538 9959214 10143365 10379089 10689477 11041319 11342067 11652409 11937040
4938 11937040 12288691 12699689 13108666 13464642 13783004 14321105 14700966 15125727 15744405
4929 15744405 16259387 16941128 17673846 18474635 19278915 20236037 21395988 22534894 23965426
4920 23965426 25454501 27040205 28914405 30901996 33041910 35057557 37026663 38829518
4912 38829518 40183590 41111201 41589302 41678465 41567805 41452868 41457475 41538943 41921820 42729879
4902D2729879J179451J597962J928408K418245K913473L182622L463307L538476
4894F2951823L086532K467950J469392J57742j200676k366163l035559l340501
4886F0190540l232744k938427k524744j966636j472055r02075m65644k3699L31099
4877D6995615O41802R85473R79769P53504K08546n06155j284722j999664k650918
4868D4123250k819512k933757k800826k632464k342061k180958j948771j752810
4860B4712091j566039j329529j285174j089443r79040r44612q84878p26302o40251
4851A5266823o62691n75259n65619m66602m91042m56182m01520m64095m22324
4842A0761489l47774j95680k95732k81643k80361k85652k26217k50275k29404
$$ plain form
4902 42729879 43909330 45507292 47435700 49853945 52767418 55950040 59413347 62951823
4894 62951823 66038355 68506305 69975697 70133439 68932763 66566600 63531041 60190540
4886 60190540 56957796 54019369 51494625 49527989 48055934 47153859 46688215 46664516 46995615
4877 46995615 47637417 48622890 49602659 50356163 50564709 50058554 48773832 46774168 44123250
4868 44123250 41303738 38369981 35569155 32936691 30594630 28413672 26464901 24712091
4860 24712091 23146052 21816523 20531349 19441906 18462866 17518254 16633376 15907074 15266823
4851 15266823 14604132 14028873 13463254 12996652 12505610 12049428 11647908 11183813 10761489
4842 10761489 10413715 10218035 9922303 9640660 9360299 9074647 8848430 8598155 8368751
4833H368751j23998k37032j61775r2699k65885j78539j28623j65550j05958j32910
4823F775782r7133n6489r7949j50686j26653J6900m6017n4297n9528p2905j9337
4812F011688r9858m6840K8780n6396k4859L3334j1212M36r60J55008M3244R112
4800F041477O7194J8611P1666J73706J81966J15924J76375J14704J40818J89120
4790G291561K56035K23382J97826J97531L04167K62749J79942K34510K49209J56158
4780I553070J11506J10485J03511O8397J20009J74852J77245K46772K06906K77182
4770A1149935K68207M34770M47384M75537L62258L19588L87420K37714J50589
4761A4233402J73760J07041J87503J53836J91185K45358K69078M02589L48439
$$ plain form
4833 8368751 8244753 8007721 7845946 7753247 7487362 7308823 7180200 7014650 6908692 6775782
4823 6775782 6678649 6622160 6524211 6373525 6246872 6263772 6217755 6163458 6103930 6031025 6011688
4812 6011688 5911830 5864990 5893770 5837374 5812515 5845849 5834637 5835073 5834113 5989121 6032365 6041477
4800 6041477 6108671 6127282 6198948 6372654 6554620 6670544 6846919 6961623 7102441 7291561
4790 7291561 7547596 7770978 7968804 8166335 8470502 8733251 8913193 9147703 9396912 9553070
4780 9553070 9664576 9775061 9878572 9946969 10066978 10241830 10419075 10665847 10872753 11149935
4770 11149935 11418142 11852912 12300296 12775833 13138091 13457679 13845099 14082813 14233402
4761 14233402 14407162 14514203 14701706 14855542 15046727 15292085 15561163 15963752 16312191
4752A6312191L46571M06651N88484N41375N85606P23791Q33998R43655J117702
4743B2400024J125812J295142J587711J813427K239387K571176L013960L733332
4735C9779971M527916N440540N799450N222800L288708P41745j957386l568213
4727E9275531l969621l490487k689757j766919j008135k91969M39989J166976
4719D7665608K020634K715757L953516N525882P177998Q775903Q696325N473671
4711I2005294J132554l251126o462822p754407p655629o738155n551943m380391
4703E1343375l491579k660550j918512j349685p65940j63428M62218J086529J746607
4694D4289035K227917J927435J161177j53209j763350k942007l294363l307220
$$ plain form
4752 16312191 16658762 17065413 17653897 18195272 18780878 19504669 20338667 21282322 22400024
4743 22400024 23525836 24820978 26408689 28222116 30461503 33032679 36046639 39779971
4735 39779971 44307887 49748427 55547877 60770677 64059385 64801130 62843744 59275531
4727 59275531 55305910 51815423 49125666 47358747 46350612 46058643 46498632 47665608
4719 47665608 49686242 52401999 56355515 61881397 69059395 77835298 86531623 92005294
4711 92005294 93137848 89886722 83423900 75669493 68013864 61275709 55723766 51343375
4703 51343375 47851796 45191246 43272734 41923049 41157109 40993681 41455899 42542428 44289035
4694 44289035 46516952 48444387 49605564 49452355 47689005 44746998 41452635 38145415
4686C8145415k880431k168742j785721j197010q30134m36228k98720k14380k15607
4677B8118442j63053k72443m62985m75229m10510l43623l273O5924J09402L46162
4667B6508814L93123M97353O11196P01530N92648N71044N58995M17610K80868
4658C1133181J31549M9672J66404K75780L15499M17041O36478R88391J243231
4649C5357226J594814J739453K107168K349176K932607L678602M773659N899508
4641F0432213O974882O089100K388220r04259l159279l658005k458399p46317
4633F4958156J003342K450935J657589L93335k38232q98J311821K852341L159438
4624G7547827J192636j116866k561825k802882j944712j091644k156629l026864
$$ plain form
4686 38145415 35264984 33096242 31310521 30113511 29283377 28847149 28548429 28334049 28118442
4677 28118442 27955389 27682946 27219961 26744732 26334222 25990599 25987326 26053250 26162652 26508814
4667 26508814 26901937 27399290 28010486 28712016 29304664 29875708 30434703 30852313 31133181
4658 31133181 31264730 31314402 31480806 31756586 32072085 32489126 33125604 34113995 35357226
4649 35357226 36952040 38691493 40798661 43147837 46080444 49759046 54532705 60432213
4641 60432213 67407095 73496195 75884415 74980156 71820877 68162872 65704473 64958156
4633 64958156 65961498 68412433 70070022 70463357 70225125 70224227 71536048 74388389 77547827
4624 77547827 78740463 77623597 75061772 72258890 70314178 69222534 67065905 64039041
4616F4039041l490559l099028j894415j9556J500930K687740K224527o31449l354368
4607E7962863n397232o059680n569234m672974l690714l010741k499645k048522
4599B5014121j769327j444209j260290j095612q29047o48540m40548k57321m19469
4590A6849758m28167m80145n11259o46980n58500p41149n98533m88531m71003
4581A1925491l33555k30022j69021k20909m8705N2102r7135o6198q5803J02493
4571A0828738K521j37086k15034k68652l45184m29705m55680n18094m13281m88713
4561G559830l84179k82288j82240j20613j01280q4366r4621j28004k13687j14081
4551E854471k03514j06897k36861k16161j97839j66451k10409j41174j18420k01688
$$ plain form
4616 64039041 60548482 57449454 55555039 55535483 57036413 59724153 61948680 61317231 57962863
4607 57962863 52565631 46505951 40936717 36263743 32573029 29562288 27062643 25014121
4599 25014121 23244794 21800585 20540295 19444683 18615636 17967096 17526548 17269227 16849758
4590 16849758 16421591 15941446 15430187 14783207 14224707 13483558 12885025 12396494 11925491
4581 11925491 11591936 11361914 11192893 10971984 10923279 10975381 10878246 10812048 10726245 10828738
4571 10828738 10831259 10694173 10479139 10210487 9865303 9435598 8979918 8461824 8048543 7559830
4561 7559830 7175651 6893363 6711123 6590510 6489230 6404864 6310243 6182239 5968552 5854471
4551 5854471 5650957 5544060 5307199 5091038 4893199 4726748 4516339 4375165 4256745 4055057
4541D055057j41756j37011l9099j10577k02963j08433m6185j5630K0518o3837
4531C210084j72797j1363r2510q4340j3314j09597m6710r7186o1183l196j10154
4520B407734l3804k5727m7814l0463m1030m3768l5782p3074J22842r7372m4469
4509B057273K4646r7944J9398o4883J5361J1376m8691p336K490j3803j02717j4627
4497A780543K6506q7206j3454O7930L9742k1882K488P2337k8241j3510Q934K4657
4485A858844q8934k4938j9836l204m7156J18262r013q340j8689M70K3285q1998
4473A698753K4647J3088k0791m4908J08564J2841n3097m0345m5146q287N1434
4462A696753p2652o594L5186k396p3970J9336j21015j8455M6056p6722q3231N8177
$$ plain form
4541 4055057 3913301 3776290 3737191 3626614 3423651 3315218 3269033 3253403 3273921 3210084
4531 3210084 3037287 3025924 2933414 2849074 2835760 2726163 2679453 2582267 2521084 2517888 2407734
4520 2407734 2373930 2348203 2300389 2269926 2228896 2185128 2149346 2076272 2199114 2101742 2057273
4509 2057273 2081919 1983975 2003373 1938490 1953851 1965227 1916536 1909200 1911690 1897887 1795170 1780543
4497 1780543 1807049 1719843 1706389 1774319 1814061 1792179 1794667 1867004 1838763 1825253 1834187 1858844
4485 1858844 1769910 1744972 1725136 1721932 1674776 1793038 1784025 1775685 1756996 1757466 1780751 1698753
4473 1698753 1723400 1736488 1715697 1670789 1779353 1792194 1739097 1698752 1653606 1645319 1696753
4462 1696753 1624101 1617507 1652693 1650297 1576327 1595663 1474648 1456193 1502249 1425527 1342296 1400473
4450A400473m1686q395L1319r6143q6776l5405m6907R1656p188P016p7297M1771
4438A172438k1593k7581p1785J8761m9133O6461o5053L4399R7761r3792q0849
4427I80034N6160k7258K4993J0252o1297q3995M4986L1237o6965L0974N351l6118
4415I08354L9012n5242K4508m105j3258K7897J0910J7275l9933p2492O6200j2490
4403H96636k097N5142J2489N5817M19R4057r4420M7107M6927j12370k7702J18524
4391A090529l4228P697k4913P524R4373m0702Q9253n225m1638K6252J05354J1308
4379A285584k3995m2181M2716J6229l939J5822R0837K3174j0391J7146Q7413L8318
4367A536733J996O6844N6664Q4209J65310Q8250j3389m923k8446j20817j42095
$$ plain form
4450 1400473 1358787 1350392 1381711 1285568 1198792 1163387 1116480 1208136 1200948 1207964 1130667 1172438
4438 1172438 1150845 1123264 1051479 1070240 1021107 1087568 1022515 1056914 1154675 1060883 980034
4427 980034 1036194 1008936 1033929 1044181 982884 898889 943875 975112 908147 939121 944472 908354
4415 908354 947366 892124 916632 912527 899269 927166 938076 955351 915418 842926 909126 896636
4403 896636 894539 949681 962170 1017987 1018406 1112463 1018043 1065150 1112077 999707 972005 1090529
4391 1090529 1056301 1063998 1039085 1046609 1140982 1100280 1189533 1184308 1142670 1168922 1274276 1285584
4379 1285584 1261589 1219408 1262124 1278353 1274414 1290236 1381073 1404247 1393856 1411002 1498415 1536733
4367 1536733 1538729 1605573 1662237 1746446 1911756 2000006 1986617 1981694 1953248 1832431 1690336
4356A690336k5990l1093j1221k3574R295l270Q576P3667L1596l496J35811J73438
4344B024075K60481K07158K91177L13256M19485M42469M28978K44815N5211k72457
4334D414648m32586m68815l93904l14624k33730j96246o9398j93694l1392j40106
4324A940153r575k2364N2733O7217L7581P1350J34698J44357J98938K40990L28067
4313C184145L80684K11344o2931k35517l83720l55179k76783k05037o9289j76371
4303B011346j08010l142n4438q5040q1857J5111m7433J3830K4301R0917K9687
4292A805272L7892Q5132J53990O6007K9543K323j37477j08641l6515j32379o9826
4281A695321j38673r2906J1006R122j03808N649n5277k6170P0468K9574p2592
$$ plain form
4356 1690336 1664346 1633253 1622032 1598458 1607753 1604483 1613059 1686726 1718322 1714826 1850637 2024075
4344 2024075 2284556 2491714 2782891 3096147 3515632 3958101 4387079 4631894 4687105 4414648
4334 4414648 3982062 3513247 3119343 2804719 2570989 2374743 2305345 2111651 2080259 1940153
4324 1940153 1930578 1908214 1960947 2028164 2065745 2137095 2271793 2416150 2615088 2856078 3184145
4313 3184145 3564829 3776173 3713242 3477725 3094005 2738826 2462043 2257006 2187717 2011346
4303 2011346 1903336 1900194 1845756 1760716 1678859 1693970 1646537 1660367 1684668 1775585 1805272
4292 1805272 1843164 1928296 2082286 2148293 2177836 2180159 2042682 1934041 1897526 1765147 1695321
4281 1695321 1556648 1463742 1474748 1483870 1380062 1385711 1330434 1304264 1374732 1404306 1331714
4270A331714l9627Q8071L202j07760K343L9586k2806K0030Q5489O8867M9749P45
4258A519603N8249M9988l2510j6185n8638O0988O5836R4315j04465l7691m6156
4247A553334J72m792o3859j4630n8522J12222n030K605J03421O3815R8300o201
4235A780835j6724J00138L431Q5525P0204l6623L6656l3394P3972R031K0297L0861
4223B124209N6564j5584J06087N7515K6948M7072J59571Q1972J14790Q3283J23418
4212B965845l4167O3125J97138J26505J55557M2193J52795J85072P1702J64675
4202D090440K18421K83465L01517L79150M03362M88771O45122P46526Q81971J357054
4192I795799J738830K485956K305749K39172j047727j943034k003385j607077
$$ plain form
4270 1331714 1292087 1380158 1383360 1275600 1277943 1317529 1294723 1314753 1400242 1469109 1518858 1519603
4258 1519603 1577852 1627840 1595330 1579145 1520507 1581495 1647331 1741646 1637181 1599490 1553334
4247 1553334 1553506 1548714 1484855 1470225 1411703 1523925 1518895 1521500 1624921 1688736 1787036 1780835
4235 1780835 1764111 1864249 1867680 1953205 2023409 1986786 2023442 1990048 2064020 2073051 2093348 2124209
4223 2124209 2180773 2165189 2271276 2328791 2355739 2402811 2562382 2644354 2759144 2842427 2965845
4212 2965845 2931678 2994803 3191941 3318446 3474003 3516196 3668991 3854063 3925765 4090440
4202 4090440 4308861 4592326 4893843 5272993 5676355 6165126 6810248 7556774 8438745 9795799
4192 9795799 11534629 14020585 16326334 16565506 15517779 13574745 11571360 9964283
4184I964283j152265p54478o68989m86618m70531k55793j67585j97468j32312
4175E678244P6302L0094o833J8026J40535L8912J73947J45576K14191J22345L42232
4164F973571J61888K64251M43432K98428L97076M24465K37112L13087K73615L90875
4154A0177800L52945O48842N12458P67644N74002M40446M02597O90511O86700
4145A5253945Q85275R05169J214375J310143J586808J869981K354568K866411
4137B8246675L485163M376489L742609Q53356p05809k106159j836951j251153
4129C4804220m28872m5579K37625L03002O57258P83611J280036J300604J700036
4120D0591941J745254J943694K145028K934865L420240M315763M861708O246635
$$ plain form
4184 9964283 8812018 8057540 7388551 6901933 6431402 6175609 6008024 5810556 5678244
4175 5678244 5754546 5784640 5777807 5795833 5936368 5975280 6149227 6294803 6508994 6631339 6973571
4164 6973571 7135459 7399710 7843142 8141570 8538646 8963111 9200223 9513310 9786925 10177800
4154 10177800 10530745 11179587 11692045 12459689 13033691 13474137 13876734 14567245 15253945
4145 15253945 16139220 17044389 18258764 19568907 21155715 23025696 25380264 28246675
4137 28246675 31731838 36108327 39850936 40704292 39998483 37892324 36055373 34804220
4129 34804220 34375348 34329769 34567394 34870396 35527654 36311265 37591301 38891905 40591941
4120 40591941 42337195 44280889 46425917 49360782 52781022 57096785 61958493 68205128
4112F8205128P057731Q835601J0527738J3512234J7914663K5936670L3707778
4105A85697543M5393726M4500756O864057j8820915l7365908m1089953l3397857
4098A51781449k4817935j8912181j4810063j2021695r917467p800763o556073
4091E6945272n579601n050524m219231l511421k907256k462247k043682j714776
4083B9456534j556169j467525j476778j500497j198646j203965j026970j009526
4075A9016458p59345q69168p18401o55010n31102o44164m94342o80042n18027
4066A3146857n77811l90464l54381m52870m96785l63090m68763k75012k78106
4057I489575k51507m03600k03141l70550j49059k97161l32689l37972j59342k93905
$$ plain form
4112 68205128 75262859 84098460 94626198 108138432 126053095 151989765 185697543
4105 185697543 231091269 275592025 282456082 263635167 226269259 185179306 151781449
4098 151781449 126963514 108051333 93241270 81219575 71302108 63501345 56945272
4091 56945272 51365671 46315147 42095916 38584495 35677239 33214992 31171310 29456534
4083 29456534 27900365 26432840 24956062 23455565 22256919 21052954 20025984 19016458
4075 19016458 18257113 17387945 16669544 16014534 15483432 14839268 14344926 13664884 13146857
4066 13146857 12569046 12178582 11824201 11371331 10874546 10511456 10042693 9767681 9489575
4057 9489575 9238068 8834468 8631327 8260777 8111718 7814557 7481868 7143896 6984554 6690649
4047F690649j79139k25550r5967j31945k9539j05876M342j13455j57126j08508
4037E547886p0492r7983O2185j40829j00401n6060N8551P6247Q7695N4101Q0235
4026E501135O2525Q3823K3737K63812L85395N96645P74192R73105L09175l74613
4016H598931o83537q88392q89998o62225m94403l32988m07111l34306k28954j80606
4006C496411j90464j32743j22185j49138j64930M851j10925j44101j55195K181
3996B333762m1754j28296p5788p6618k9794k9449j03078K4949o220l372l9016
3985A825326j32718j6713r0213R732k1319l7005P6553n8919p0060J7959r9084
3974A403539r732M8264q872N3121m2755m005p9369L3234o6879K9136K8757m5097
$$ plain form
4047 6690649 6511510 6285960 6189993 6058048 6028509 5922633 5926975 5813520 5656394 5547886
4037 5547886 5477394 5379411 5441596 5300767 5200366 5144306 5202857 5279104 5366799 5420900 5501135
4026 5501135 5563660 5647483 5671220 5935032 6320427 6917072 7691264 8664369 8973544 8598931
4016 8598931 7915394 7027002 6137004 5474779 4980376 4647388 4240277 3905971 3677017 3496411
4006 3496411 3305947 3173204 3051019 2901881 2736951 2741802 2630877 2486776 2331581 2333762
3996 2333762 2292008 2163712 2087924 2011306 1981512 1952063 1848985 1873934 1867714 1864342 1825326
3985 1825326 1692608 1675895 1585682 1595414 1574095 1537090 1613643 1554724 1484664 1502623 1403539
3974 1403539 1393807 1442071 1433199 1486320 1443565 1439560 1360191 1393425 1326546 1355682 1384439 1339342
3962A339342m7966j44915o7519Q5l0228L1993r1497N8224j2245k7763k3379K3318
3950A007450Q391l4088k3858j21648R5723R215J2992m9320M5370j12160K0565
3939H58632l4858J4072p519k2978J4342k0955k2348Q822l7687n5002j3533l897
3927F77091O2524M1141l1127r86j7149L4706j4556k2545q2159Q615P8605n4779
3915F79381q6839j04125l4906J15867n6686K2587j8146k3976k9136N5717O4821
3904E84559R056M1133K6664o278r60M0694l857j1969j4618k5006N677p686k9354
3891F08055j7387m5654o76L8693n1915J3464P4204K8506P832J25610r0756k2752
3879F67224Q4054l6296o684M5440l6954K9144J15174J23311L7505M0838P4138
$$ plain form
3962 1339342 1291376 1146461 1078942 1079027 1048799 1080792 989295 1047519 1035274 1007511 984132 1007450
3950 1007450 1015841 981753 957895 836247 931970 941185 954177 904857 950227 838067 858632
3939 858632 823774 837846 830327 807349 821691 800736 778388 787210 749523 694521 680988 677091
3927 677091 739615 780756 749629 748643 731494 766200 751644 729099 646940 655555 734160 679381
3915 679381 592542 488417 453511 569378 512692 535279 517133 493157 464021 519738 584559
3904 584559 593615 634748 661412 655134 654174 694868 691011 679042 664424 639418 645095 637409 608055
3891 608055 590668 545014 544338 583031 531116 544580 618784 647290 655122 780732 689976 667224
3879 667224 751278 714982 708298 753738 716784 745928 861102 984413 1021918 1062756 1136894
3868A136894K19909K78382J72653N3123k9751k79364k05522j82220r3294r5510
3858I75300j0235j31142j31515O0311j03227q3209q1929m1820k5478O7756m541
3847D90271k9870P026p9832J4469r613Q305o8194j3014k4967N707K4839L7367
3835C62494L7307o2126m6014J7690p630j5896J4097J5211k6895O796p4627j4369
3823B06038K1794q6356J29148L7793q189L3253r875m4770l5448m1472j8058P7830
3811B61688N5481m0555k3316l1481K0826K8781N0218o6781m0203L1991N0697K4693
3799C22039l4274J8853n3707k1287l213m1492o1109J5246Q806P2000m6696j9508
3787A55658M0141l5648J16203j8809L1562n0605n3982J1592j1041n098k4006L1093
$$ plain form
3868 1136894 1356803 1635185 1807838 1860961 1831210 1551846 1346324 1164104 1070810 975300
3858 975300 965065 833923 702408 762719 659492 576283 494354 452534 427056 494812 490271
3847 490271 460401 467427 387595 402064 392451 400756 332562 319548 294581 300288 325127 362494
3835 362494 399801 337675 291661 309351 301721 285825 299922 315133 288238 295034 220407 206038
3823 206038 227832 141476 270624 308417 300228 333481 323606 278836 243388 201916 183858 261688
3811 261688 317169 276614 253298 221817 242643 271424 321642 254861 214658 246649 297346 322039
3799 322039 287765 306618 252911 231624 228411 186919 125810 141056 149862 221862 175166 155658
3787 155658 195799 160151 276354 257545 289107 238502 184520 196112 185071 179973 155967 187060
3775A87060J3304K6527j2371J5891n6100m4815K5012l3451L3896N506K0848M977
3763A86284l5647m0534M2192N4348J8362j4890N0037l1721L0176r0744l3193Q9612
3751B24282q9146o7921P5497j9819m4294M9302P1585k5886q341J5396K178K2218
3739B05051m1r0586L1077O3275m7235n0293O7289K2698k5901k8170K8603L3325
3727B09092m9973O2611j9371j9794N2664j6830L7543l4971n9586o2720j0751N0889
3715A38803q6954m741Q9881o5188M7035L1416M9883l0498n913l8072L8373K6617
3703A90642j0546N0408J0550r0389o6980K9039K0672M7393n3382J8316m9421N3146
3691A49448P2198j39727k6476M5212O1646p5257K5272o7026L2578N6256M3850
$$ plain form
3775 187060 200364 226891 214520 230411 174311 129496 154508 121057 154953 160459 181307 186284
3763 186284 150637 110103 152295 206643 225005 210115 260152 228431 258607 167863 134670 224282
3751 224282 135136 67215 142712 122893 78599 127901 199486 173600 165259 180655 182833 205051
3739 205051 205010 114424 145501 208776 161541 111248 178537 201235 175334 147164 175767 209092
3727 209092 159119 221730 202359 182565 235229 218399 255942 220971 161385 98665 87914 138803
3715 138803 51849 47108 136989 71801 118836 150252 200135 169637 163724 125652 164025 190642
3703 190642 180096 230504 241054 150665 83685 112724 133396 180789 127407 145723 96302 149448
3691 149448 221646 81919 55443 100655 162301 87044 112316 45290 77868 134124 177974
3680A77974l385Q752M4912m058m8313K3673Q589k3171k9726l6058M5712j7954
3668A46947M5041o9322o968J0669L7972m2177L4810K9162l1428M6208j3365k2293
3656A65256L0465M5003j3179j4496K5443K4125J5017j9150K0415j3056Q8851M6928
3644D01622L2908L4683N799n0233k6836q9123j3809m284k8216j31780L9679L5853
3632B06263n5260M885n6092p9449N1678k8595M7683M6601k3217K3522o9037p555
3620F1427l0094P051L3960L9115m4888o7543K2415O4764j1880J0429Q3077q8263
3608G9570K7903l6484M2095j4535J06229r6966n3373K3069N7105P2658n6772O518
3596A57017q529L915n0709K7387N840m0280k5513L1703M8406q0683J03169q587
$$ plain form
3680 177974 174589 183341 228253 224195 175882 199555 208144 184973 155247 119189 164901 146947
3668 146947 191988 122666 115698 126367 164339 122162 156972 186134 154706 200914 187549 165256
3656 165256 195721 240724 227545 213049 238492 262617 277634 258484 278899 265843 354694 401622
3644 401622 434530 469213 475012 424779 397943 308820 295011 290727 262511 130731 170410 206263
3632 206263 151003 155888 99796 20347 72025 43430 91113 137714 114497 138019 68982 61427
3620 61427 31333 38384 72344 111459 66571 -972 21443 86207 74327 84756 167833 79570
3608 79570 107473 70989 113084 98549 204778 107812 54439 77508 134613 207271 150499 157017
3596 157017 148488 152403 101694 129081 134921 94641 69128 100831 149237 68554 171723 163136
3584A63136J2428m617j4377M2564p0974M7564J2207O1135k7927o701P921J7387
3572B39746n055q0330j8607p268K4083m1410l1237P8798m1212m1477L8222r198
3560A05055O0023o461P80L215o8222Q432k8293q865M1936O3583k7543K308J8917
3547A64865n475m1622N1570P2816j07008m1173J7594P916M6277J4530L2799M406
3535B17495j997R765l364n3237O8388r5008k54K9899O0658P040l7811M5544p393
3522B39725r8298O1617l5298K7072K4522P38l6569L7766r435l5532j343L7114
3510B12079R205p5647J14054m0175k2469J9682K0583j78M0950j0751q531k0765
3498B38037N2805J4409j54743K0122K6748P0580J12202K1458m3203k6697J2884
$$ plain form
3584 163136 175564 170947 156570 199134 128160 175724 187931 249066 221139 214438 222359 239746
3572 239746 234691 154361 135754 128486 152569 111159 79922 158720 117508 76031 114253 105055
3560 105055 165078 158617 159397 162612 94390 102822 74529 65664 107600 171183 143640 145948 164865
3547 164865 159390 117768 169338 242154 135146 93973 111567 119483 165760 180290 213089 217495
3535 217495 215498 225263 221899 168662 237050 142042 141788 171687 232345 239385 201574 247118 239725
3522 239725 141427 203044 167746 194818 219340 220078 183509 221275 211840 176308 174965 212079
3510 212079 221284 145637 259691 219516 197047 216729 237312 237134 278084 267333 258802 238037
3498 238037 290842 305251 150508 170630 197378 267958 380160 401618 358415 331718 344602
3487C44602l0295J6208o8760m2419J35454M4372L1168n4156p9974N9836n8700
3476B97336J1369R4456K3337p4701p1262J73263m9003r6148N3952Q676J1340o8045
3464C14570j3716K1865J20841m2997n9518M7138n2851m6877k102J1803N7799q8458
3452B67497J14022j7801k3532n8926l9537R8503M3320R348o6348j3182n0258k2427
3440B40679n1677l10P9869k2977M5929N577p5284L2201l3417j999N3134l6197
3428B35528K575M8626l5427j6140J1273J8488l8803k9416j5395L9649J1517m3409
3416A89066M0663K6821j102N1708j37053P8711J20282p3190n6892k118K6487n6466
3404B06917M1422M0403p394M8072o1905K1214n8127J8610L6722k9618P1261J5341
$$ plain form
3487 344602 314307 330515 261755 219336 354790 399162 430330 376174 296200 356036 297336
3476 297336 308705 403161 426498 351797 280535 453798 404795 308647 362599 371275 382615 314570
3464 314570 300854 322719 443560 400563 341045 388183 335332 288455 286353 298156 355955 267497
3452 267497 381519 363718 340186 281260 241723 340226 383546 392894 326546 313364 263106 240679
3440 240679 189002 188692 268561 245584 291513 297090 221806 254007 220590 218591 271725 235528
3428 235528 238103 286729 251302 235162 246435 264923 226120 196704 181309 220958 232475 189066
3416 189066 229729 256550 255448 307156 170103 248814 369096 295906 239014 236896 263383 206917
3404 206917 248339 288742 281348 329420 267515 288729 230602 249212 285934 256316 327577 342918
3392C42918p760j2127o7l8042k3866J9128P0884L6684l0065M5418j0897l6898
3380C55310k3734L2450j217J1293J4891K1728q420R8275n9473m736m2483N4537
3368D48421N8438J5307r263k9395N0228R92P9264N2470P000J5895k9502N5389
3356G15244K6454n1121P3551j789L1263J8849N4441m9265Q1859k9875Q6425P8943
3344A034979j73o2022J08838J39745O1674J0429N894J47098J332P2614J01248
3333A621656k9269J12554L7290M3248P2507J06458J03114J06242O3513J26895
3323B364208J04168J03026J47064R211P1942J17391Q5048J07210J08535J54222
3313C372025L6351P0281N2032k195P9287p8364n6046K1860r8639m8851l0200q7758
$$ plain form
3392 342918 335158 323031 322964 284922 261056 280184 351068 387752 357687 403105 392208 355310
3380 355310 331576 364026 362809 374102 388993 410721 402301 500576 441103 436367 393884 448421
3368 448421 506859 522166 512903 483508 533736 534728 613992 666462 673462 689357 659855 715244
3356 715244 741698 690577 764128 762339 793602 812451 866892 817627 899486 869611 956036 1034979
3344 1034979 1034806 972784 1081622 1221367 1283041 1293470 1299364 1446462 1447794 1520408 1621656
3333 1621656 1592387 1704941 1742231 1785479 1857986 1964444 2067558 2173800 2237313 2364208
3323 2364208 2468376 2571402 2718466 2727677 2799619 2917010 3002058 3109268 3217803 3372025
3313 3372025 3408376 3478657 3530689 3528494 3607781 3529417 3473371 3495231 3396592 3347741 3317541 3229783
3301C229783j03751j32910o1080m5037j49362j91541o9351r6536j25680j14900
3291B139635m9263m3795j22899n9626o5148p5091l7313j44459m8686j8941p5350
3280A399064p495o551o4740n7570l5786J1236j81244n5048R3944j15286j9064
3269I61460o0211J0380k3972p233k4540L2076r3745k6583P677j5854n869n8819
3257F94767K441k0261j9907n3683k010J1287o2149M1614M0109r199n516r1369
3245E26124l2032L3683M832l5608K6105m4453o1505N2561k1833O995R80n1025
3233D04824k1370N6502n7911O7041K8918l1803L0208n2561R110p0455J4016m2608
3221C33911j0077p710L5065l5342m9448N7130N8605l5715k4783k0962J6403J3014
$$ plain form
3301 3229783 3126032 2993122 2932042 2887005 2737643 2546102 2476751 2380215 2254535 2139635
3291 2139635 2090372 2046577 1923678 1864052 1798904 1723813 1686500 1542041 1493355 1474414 1399064
3280 1399064 1391569 1385018 1320278 1262708 1226922 1238158 1056914 1001866 1095810 980524 961460
3269 961460 901249 911629 887657 880424 855884 887960 794215 767632 775309 759455 753586 694767
3257 694767 697208 676947 657040 603357 601347 612634 550485 592099 632208 623009 617493 526124
3245 526124 494092 527775 532607 496999 523104 478651 417146 469707 447874 454869 455849 404824
3233 404824 383454 439956 382045 449086 478004 446201 476409 423848 432958 362503 376519 333911
3221 333911 323834 316124 351189 315847 266399 323529 382134 346419 321636 300674 317077 330091
3209C30091O7730N158j05639M482N960O794J7348Q153r025j7539j7127L8653K7779
3196C62818q1391j0713N9028r345j0285K3861n7532N4641r4770K8447n414p832
3184B51513K3026M8657k5587o075o1137M3592m4782N5339J02115n6130K1597p870
3172C44258r9685J8523L6030L9101K3838p3656l537l7419J979J792r098J2533
3160B54659l0932L0186O031k7425K7464l5169k3955K1213j7692N3264k1592k6268
3148B09784N2068q6159m600M9820m8931M6385P7633k8861k1457m701j6782k3826
3136B00373Q0729o2043o2786j836L6961N340k0583r4856K1538P6296N6966L496
3124B39595m7371L5170o153q1662m6864M562N5564N4744o188O7838j07146k0253
$$ plain form
3209 330091 397821 402979 297340 301822 307782 314576 331924 340077 331052 313513 296386 335039 362818
3196 362818 281427 270714 329742 320397 310112 333973 276441 331082 236312 264759 259345 251513
3184 251513 274539 323196 297609 291534 230397 273989 229207 284546 386661 330531 352128 344258
3172 344258 244573 263096 299126 338227 362065 288409 284872 247453 249432 251224 242126 254659
3160 254659 223727 253913 259944 232519 259983 224814 200859 222072 204380 257644 236052 209784
3148 209784 261852 175693 171093 220913 171982 218367 296000 267139 245682 240981 224199 200373
3136 200373 281102 219059 156273 154437 191398 196738 176155 81299 102837 179133 236099 239595
3124 239595 192224 227394 221241 139579 92715 97277 152841 207585 201397 269235 162089 141836
3112A41836J516M1019N9173n9808o63q696K2867J0220j3245q219j9626m4055J4595
3099A36914L2215J8643k3899L9124L3433m6429N1109o3942J6799M36j0970R5586
3087B79019N566j4721j2727J2231Q640k9131p8895J12305J9512l5722p3342P8854
3075B71589k458J332l1645L1621j5677K8376j6037k8531K3354O1171M890M7504
3063C75489J3471k5598l0065P307l0218L5796M4502m4388r2231N6025j7824n5311
3051B36955K082J2660O4687J3184k1409L3564L8887m0485M968Q3368j4190J6275
3039D30546J5851L2519k716n0654N0781j3216L2036P6139r8216p4114L5669R8661
3027E33286N7276J2322p5175K0265R2643L813L0793J849L9753j4567p546n6894
$$ plain form
3112 141836 143352 184371 243544 183736 183073 174377 197244 207464 194219 186000 166374 122319 136914
3099 136914 169129 187772 163873 202997 236430 190001 241110 177168 193967 194403 183433 279019
3087 279019 284585 269864 257137 269368 278008 248877 169982 282287 301799 266077 192735 271589
3075 271589 269131 270463 238818 270439 254762 283138 267101 238570 261924 323095 327985 375489
3063 375489 388960 363362 333297 340604 310386 346182 390684 346296 254065 310090 292266 236955
3051 236955 239037 251697 316384 329568 308159 341723 380610 340125 345093 428461 414271 430546
3039 430546 446397 478916 476200 425546 476327 463111 495147 571286 473070 398956 434625 533286
3027 533286 590562 602884 527709 547974 640617 644430 675223 677072 716825 702258 694712 637818
3015F37818L3654N9875P0766p1780Q5029J5028N0318O9451N0927r192O6332J5182
3003A073408N1827k2486N7200N6009l11J0409L5158J5768O471R8895L8708R0846
2991A511902N3721M3901P5168M3936J03007N3106r034P1087J18226Q5748Q5273
2980B236041R1137R9768J81494J23190J44429K40545J86290R7995J60355J55948
2970C717192J12415J25075M2735k6810j15498p7143r766q0222q9267j17440j10379
2959C370892j45942j26763k464L9314j2211n2955J3556M4517J07609Q6414K27358
2948C549325L34291M04774L25059J1073k32232l96588l55868j92866j90681k61679
2938B994608j45917j74240r3685n926o6110Q5719Q5563J08273J37262J51155J03519
$$ plain form
3015 637818 671472 731347 802113 730333 815362 830390 880708 950159 1001086 991894 1058226 1073408
3003 1073408 1125235 1102749 1159949 1215958 1215647 1226056 1261214 1276982 1283453 1382348 1421056 1511902
2991 1511902 1565623 1609524 1684692 1728628 1831635 1884741 1875707 1946794 2065020 2150768 2236041
2980 2236041 2327178 2426946 2608440 2731630 2876059 3116604 3302894 3400889 3561244 3717192
2970 3717192 3829607 3954682 3997417 3970607 3855109 3777966 3768200 3687978 3598711 3481271 3370892
2959 3370892 3224950 3098187 3095723 3135037 3122826 3069871 3083427 3127944 3235553 3321967 3549325
2948 3549325 3883616 4288390 4613449 4624522 4392290 3995702 3639834 3446968 3256287 2994608
2938 2994608 2848691 2674451 2580766 2574840 2508730 2594449 2680012 2788285 2925547 3076702 3180221
2927C180221J71824L83228N86787N24635Q57703P08498J12865k91845o71007p04056
2917D858853n91171n66521l97642l62499k61750k10100j46553j03388m6366n7387
2907B115476l7338l2067J2787M2490k5920J50805J71461L36227K54439L28408
2897C316768J36578k14815l17970l11025l82314k60210j52716k42589j96919m4749
2887A330039M663j33074j36763k1689j10652R490o4851j06289l2729M010l2764
2876G09391o0265K0262R55q0123k5257K0081k0033j8043q560j4714m9879l9816
2864D33999k3104j5724Q0348p3406n407k3128j4224N3908P073m2460r3048K6288
2852C11115l5166Q0879O1496j43024l2694N2841O9011j05586J5868R5111q8228
$$ plain form
2927 3180221 3352045 3735273 4322060 4846695 5704398 6412896 6525761 6233916 5562909 4858853
2917 4858853 4267682 3701161 3303519 2941020 2679270 2469170 2322617 2219229 2172863 2115476
2907 2115476 2078138 2046071 2058858 2101348 2075428 2226233 2397694 2733921 2988360 3316768
2897 3316768 3453346 3238531 2920561 2609536 2227222 1967012 1814296 1571707 1374788 1330039
2887 1330039 1334702 1201628 1064865 1043176 932524 942014 877163 770874 738145 742155 709391
2876 709391 649126 669388 670343 590220 564963 585044 565011 546968 538408 523694 473815 433999
2864 433999 410895 395171 475519 402113 396706 373578 359354 413262 420335 377875 284827 311115
2852 311115 275949 356828 418324 275300 242606 295447 364458 258872 274740 369851 281623
2841B81623j9051N3459M7859j27388O1329L437r9277L7094J6488q0251K0666O4718
2829B60706l6937N014p1806Q7441k4284o6098J45842o5271M4953o2596m0358k633
2817A73973L6559o5446o859J313P458J1857K0599Q6j9959J20270j07525l3078
2805A39248N221L1111n1813j5335M1736J4229K4605K5627k1171L5434l0440m8775
2793A49677L15L6532N7878M9829r6190n5402L6969Q2244N6N10m8464N5841M0328
2780C10123n5686l3224M9511q170J11901J0103k6794j6114k1247M6087l7003p783
2768C21704J6608M0693M0578K2877P646M8165M289j9915R5948J9911k5219J922
2756E75207l6643N993m358N272L1790q488J0911P4453L9264M4541O2162L1317
$$ plain form
2841 281623 262572 316031 363890 236502 297831 301268 201991 239085 255573 175322 195988 260706
2829 260706 223769 228783 156977 244418 220134 154036 299878 234607 279560 216964 176606 173973
2817 173973 210532 145086 138227 139540 146998 158855 179454 179540 159581 279851 172326 139248
2805 139248 144469 175580 123767 108432 150168 164397 189002 214629 193458 228892 198452 149677
2793 149677 149992 186524 244402 294231 198041 142639 179608 261852 261908 262418 213954 269795 310123
2780 310123 254437 221213 270724 262554 374455 384558 357764 341650 320403 366490 329487 321704
2768 321704 338312 379005 419583 442460 450106 498271 502560 482645 578593 598504 573285 575207
2756 575207 538564 544557 540199 545471 577261 568773 579684 654137 693401 737942 800104 831421
2744H31421P0347N3123k2221n582R4410K8247L3344L8212J27616J11830L8440
2733A399187M8284k4462O8831k4627L4743j8873k8020j080O8039r0703M7679R3354
2721A572352k1231n1572N2583J8751M1667J4698Q6370J29672J38456Q6587J07185
2710B175518J81619R7789p3932j50336k47302j30134l9284q7877k26792j35713
2700A363556j2094k9667n9544q9845j0707N8816m7503j5869l0251L7247P767n6505
2688A115401K7141P158O914n8783k8034p8001K6838J9938j44983p6230p5288j25530
2676F16541l6381J3304M6536n614m1965o035m2294p0020P697n1530l2203K6227
2664D24263r856j9888k1088o8088J8691q876k7184n0580O489n2978l3140O7286
$$ plain form
2744 831421 901768 954891 932670 927088 1021498 1049745 1083089 1121301 1248917 1360747 1399187
2733 1399187 1447471 1423009 1491840 1467213 1501956 1483083 1455063 1453983 1522022 1431319 1478998 1572352
2721 1572352 1551121 1499549 1552132 1570883 1612550 1627248 1713618 1843290 1981746 2068333 2175518
2710 2175518 2357137 2454926 2380994 2230658 1983356 1853222 1813938 1726061 1499269 1363556
2700 1363556 1351462 1321795 1262251 1172406 1161699 1220515 1173012 1157143 1126892 1164139 1171906 1115401
2688 1115401 1142542 1149700 1156614 1097831 1069797 991796 1018634 1038572 893589 817359 742071 616541
2676 616541 580160 593464 640000 634386 592421 586386 544092 474072 481769 430239 398036 424263
2664 424263 414407 394519 373431 305343 324034 315158 287974 237394 243883 190905 157765 225051
2652B25051o9819M9513O9426n2353k0379R65L4163k4610l8496K8899o9638K4363
2640A57085o1781K164p267n638M5030q3539K3384L7673j0096j2391m692J6005
2628I5937K1032k4563Q996P236M5471K039J8641n0656N195K8L3473j09824M7919
2615A00924P9941j14489p937j1219J572L6974j4982N539N355J2877J7912J4728
2603A27195n8316j8025k3542m6273K8942L5617L1045l5386K7943l2609M2601q8583
2591i391P4582N3809L3892l0098l5519J9807r6534J14063k3219N142n1181M4993
2579A00346o5031j9479l0031K6308r866K8141l7825N8072K8814p6458M7221j1655
2567C8557j1888N0689k4483K7987K2311m1639n306J2588L6252l6547l0708k0097
$$ plain form
2652 225051 155232 204745 274171 221818 201439 202404 236567 211957 173461 202360 132722 157085
2640 157085 95304 97468 90201 84563 129593 46054 69438 107111 97015 84624 79932 95937
2628 95937 116969 92406 101402 108638 154109 156148 174789 124133 129328 129356 162829 53005 100924
2615 100924 180865 66376 58439 47220 48792 85766 70784 76323 81678 94555 112467 127195
2603 127195 68879 50854 27312 -18961 9981 45598 76643 41257 69200 36591 79192 -9391
2591 -9391 65191 119000 152892 122794 87275 107082 10548 124611 101392 106534 55353 100346
2579 100346 35315 15836 -14195 12113 2247 30388 -7437 50635 79449 2991 50212 38557
2567 38557 26669 77358 52875 80862 103173 61534 56228 68816 105068 68521 37813 17716
2555A7716m9990L5925N7756o197k0510L7281n6538l0846O3284l9146K6795p37
2543C4793K8011j2886n8417j6518N0476l9591j20576O3108J51052m943J1581o8053
2531A8037M5014j06060L117P5769L4711n6807L0250l2207Q8263j01699P0700p9644
2519a0556n5368R6873n8773K2613R068J9429L1148m7845L0024J09340o5479m4130
2507C6344l6075Q597l2707J219n613M5137j9657M8924K825J7806o3164N0208l0878
2494B2966r408L2754l9041N8082l1375l5068M5648k7463j4001l924m5475p553
2482e3858P2441m1519k2438Q1354l8889j1985p227p578J7933n2653k744K3313
2470d3850N0754Q309k9018k2332J5307N551o8545Q5053J8832k3765k4403Q979
$$ plain form
2555 17716 -32274 3651 61407 55210 34700 71981 15443 -15403 47881 8735 35530 34793
2543 34793 62804 49918 -8499 -25017 25459 -14132 -134708 -71600 79452 74509 86090 18037
2531 18037 63051 -43009 -39892 35877 70588 13781 44031 11824 100087 -1612 69088 -10556
2519 -10556 -65924 30949 -27824 -5211 3857 23286 54434 6589 36613 145953 80474 36344
2507 36344 269 8866 -23841 -22622 -28235 16902 -2755 46169 48994 66800 3636 53844 22966
2494 22966 13558 46312 7271 65353 33978 -1090 44558 17095 3094 -830 -46305 -53858
2482 -53858 18583 -22936 -45374 35980 -2909 -14894 -22121 -29699 -11766 -64419 -67163 -43850
2470 -43850 6904 15213 -13805 -36137 -20830 -15279 -83824 1229 20061 -3704 -28107 -19128
2458a9128K1719k8824J5679L629K5060J413n359l4113K0505k2659m6748Q92o2643
2445a30577L7990O0428N4004q773m5975k2894O1189L0488r613o6643q4992K0577
2433a04791L9810R8238l402m5814n6122P7442j1852J4171q7971O0195M4631p8627
2421e4092k818m7832N3543K9055q152J0544J968j6661K9844J339L667O478m8343
2408d1460L1442L2168j3398p441p416j4698J0453l0315N6826P317o3258L8464
2396a316k882L9879r3439m343K7411J9938l3420N9549p297l6689m2574M2940R4993
2383F2750j9811j8902n6472k1920k7769M6418q474M1055j856N4158k2628r2066
2371f5517M4276L5540K4494n8436L6657m695p7884K9361n8940N0753M6900p9932
$$ plain form
2458 -19128 2591 -26233 -10554 -6925 18135 19548 14189 -19924 581 -22078 -68826 -67934 -130577
2445 -130577 -92587 -32159 21845 13072 -32903 -55797 5392 35880 26267 -40376 -125368 -104791
2433 -104791 -64981 33257 29855 -15959 -72081 5361 -6491 7680 -80291 -20096 24535 -54092
2421 -54092 -56910 -104742 -51199 -22144 -30296 -19752 -17784 -34445 -4601 -3262 405 6883 -41460
2408 -41460 -10018 22150 8752 1311 -6105 -20803 -10350 -40665 16161 23478 -39780 -1316
2396 -1316 -4198 35681 -57758 -62101 -34690 -14752 -48172 11377 4080 -32609 -75183 -32243 62750
2383 62750 42939 24037 -32435 -54355 -82124 -35706 -44180 -3125 -4981 49177 26549 -65517
2371 -65517 -21241 14299 38793 -19643 17014 12319 -65565 -36204 -95144 -44391 2509 -77423
2359g7423L0371K7848o345M1436K412k9181Q919j6642K6799j9075j9846p5771
2347a06498N4732l4428N0212O5340k4492K052j4528M4028P656n1378l0902R2024
2335E3818L4454p7959P1652j4607m024o8197n7772M4128J207N594p862J0256L7772
2322B8460J8251M9690o8146j5414K2723l3688j5771N8402O8984k3611R677J6497
2310A16054J8678o0236l9650k8769m4058j276J47980K8239m2998J8235R093j41757
2298b0465J455K9777j1169l0248Q1445J1712o9805j1027K0913k5997L4184K7517
2286C8292p8004q9698K9137R8445P367Q439L442o8069l6994N6928N6177k253K8364
2273E1573p5358L416L8684N0131k7771r9338O1289N9852j8416k3512K1299l3625
$$ plain form
2359 -77423 -47052 -19204 -25549 15887 18299 -10882 -1963 -18605 8194 -10881 -30727 -106498
2347 -106498 -51766 -86194 -35982 29358 4866 6918 -7610 36418 44074 -7304 -38206 53818
2335 53818 88272 10313 81965 67358 63334 -4863 -62635 -18507 -17300 -11706 -19568 -9312 28460
2322 28460 46711 96401 28255 12841 35564 1876 -13895 44507 113491 89880 99557 116054
2310 116054 134732 74496 34846 6077 -37981 -39257 108723 136962 93964 112199 121292 -20465
2298 -20465 -19010 10767 -402 -30650 50795 62507 -7298 -18325 2588 -23409 10775 38292
2286 38292 -39712 -129410 -100273 -1828 5539 13978 17420 -50649 -87643 -30715 25462 23209 51573
2273 51573 -23785 -20369 18315 68446 40675 -58663 2626 62478 44062 20550 41849 8224
2261H224k0604l6956J5450N5925j3917K0903l5944l4457j0016N1350M7400o7360
2249b0002l4181P1306k6146R901J9833J1924Q5231n9486O9985r6772J5984R6891
2237A44468q5967j8084L1877o7015p28j9837O7030K7900r8566m416O9340k102
2225D3900L778L2546o562k153j1108j5887q1430J11172l8567o4942P0751m0990
2213E08R0556J7982j7640p3755K1356N2745j9213l0221M4357l2097J3435L6990
2201A05003l4090k2871j8613j4145M7622n940k9817J03141p1529J2935j3903M5022
2189A02815m6158O3716N8134j05025l4451Q384L4378k857K2983L415n6650J10754
2177A59438r85K9793M632n092m5412J7589Q3147L4598o0453j4015J04788J4531
$$ plain form
2261 8224 -12380 -49336 -33886 22039 8122 29025 -6919 -41376 -51392 -42 47358 -20002
2249 -20002 -54183 17123 -9023 878 20711 32635 117866 58380 128365 31593 47577 144468
2237 144468 58501 40417 72294 5279 4551 -15286 51744 79644 -18922 -23338 46002 43900
2225 43900 47678 80224 73662 71509 60401 44514 -36916 74256 35689 -29253 41498 508
2213 508 91064 109046 91406 17651 39007 91752 72539 42318 86675 54578 68013 105003
2201 105003 70913 48042 29429 15284 62906 56966 27149 130290 58761 71696 57793 102815
2189 102815 56657 120373 178507 73482 39031 47415 81793 78936 101919 105334 48684 159438
2177 159438 158453 188246 192878 187786 142374 159963 243110 277708 217255 203240 308028 322559
2165C22559J923k9492N7878L1581L4842l2968N665P163L6504M0216J8425p307
2153D86989m8680R5678P164N99l5015J54007O2563l4020L8090J06770j5725J17289
2141I35709M6439J61251N7385j8843J23089K5298R6765P4889J23118P8869J18080
2130A822049J21319P6553J99484J75363J31661J54335J38471L05315L07222M04884
2120C836656K96063L69145M17851N49258P50593J011466J428552J974701K609990
2111A3244275L392211Q41326j343878k478803k646839j921660j424635j085477
2103F576520r14934p38595n27220l24400k58400l00882m19392l12690l04543k32754
2093B242710k46813o6611j15328j44822m8564k4847j34487j33433j04205r5773
$$ plain form
2165 322559 324482 294990 352868 384449 419291 386323 391988 399151 435655 475871 494296 486989
2153 486989 438309 533987 541151 541750 506735 660742 723305 689285 727375 834145 818420 935709
2141 935709 982148 1143399 1200784 1181941 1305030 1330328 1427093 1501982 1625100 1703969 1822049
2130 1822049 1943368 2019921 2219405 2394768 2526429 2680764 2819235 3124550 3431772 3836656
2120 3836656 4132719 4501864 4919715 5468973 6219566 7231032 8659584 10634285 13244275
2111 13244275 16636486 17477812 16133934 13655131 11008292 9086632 7661997 6576520
2103 6576520 5661586 4922991 4395771 4071371 3812971 3512089 3092697 2780007 2475464 2242710
2093 2242710 1995897 1929286 1813958 1669136 1620572 1595725 1461238 1327805 1223600 1127827
2083A127827r8398j0273m7721N410l9132l0816p0420j42779r6116O8302j5002
2072F50882n38M2471j1296n2936n5982q7815M7598k4365n3461k7310O3085K621
2060D92954o0007m6684N641j8751k1037n7817M1545k0293o2281M0750M9461o8804
2048B74677n1508L0004Q55J3929j6909M2202m2186q968o5194k8511N3450j2765
2036A89076L8207J6605K5935p2618r666K2006j7175M2370M4272j5595o0923n2931
2024A49563l8648j2370M4526o538m8291q766M1918q072J5469J1770k9987M5268
2012A55842m3382l1565p8790J01874N9810j20458j1781L5570J7919n3226j4652
2001A7161R630M5499M9843n8700J7508k8501L518N6943L0400k7358K0527N8368
$$ plain form
2083 1127827 1029429 1019156 971435 976845 937713 906897 836477 693698 597582 665884 650882
2072 650882 650344 692815 681519 628583 572601 484786 532384 508019 454558 427248 490333 492954
2060 492954 432947 386263 391904 373153 352116 294299 335844 315551 253270 294020 343481 274677
2048 274677 223169 253173 254028 267957 251048 293250 251064 242096 176902 148391 201841 189076
2036 189076 227283 243888 269823 197205 187539 209545 192370 234740 279012 263417 202494 149563
2024 149563 110915 98545 143071 136533 88242 79476 121394 113322 128791 140561 110574 155842
2012 155842 112460 80895 2105 103979 163789 43331 31550 67120 85039 31813 17161
2001 17161 26791 72290 122133 63433 80941 52440 55958 112901 143301 115943 136470 194838
1989A94838n4315O352n1768q1782N6254L2733m4484P3604q3186l384j2199M7910
1977H0573M8029k8672l3280j3965j9234o2383O3149K069l18J804L7883J4015m1695
1964D7975L1280j4242l2696M0559L5143O230n8668J6524j8385p0179j70O7039
1952E0410k7030L1820O5582n0589p1659K8313N1163N3738n4236o2759l8441Q201
1940a5487L3248l9409n8770J09255N5752l1269l1308m5097L5248j2910r932O1332
1928E0653J2971q8812N7362L0666k5968q0439P8964O5735l6487o8608N7679n92
1916E3124K9341J2437l6373o911p468o3531N6421J15133p076l1938K577R554j00213
1903B5077M0485K5086j0302N006J6632l425m7092m0697k9991m5243P2171j6070
$$ plain form
1989 194838 140523 146875 95107 13325 69579 102312 57828 131432 48246 44862 32663 80573
1977 80573 128602 99930 66650 52685 33451 -28932 34217 36286 35968 37772 75655 89670 47975
1964 47975 79255 65013 32317 72876 108019 114249 55581 72105 53720 -16459 -16629 50410
1952 50410 23380 55200 120782 70193 -1466 26847 78010 131748 77512 14753 -23688 -15487
1940 -15487 17761 -21648 -80418 28837 84589 53320 22012 -23085 12163 -747 -10679 50653
1928 50653 63624 -25188 32174 62840 36872 -43567 35397 101132 64645 -3963 53716 53124
1916 53124 82465 94902 58529 51618 44150 -19381 37040 152173 145097 113159 115736 125290 25077
1903 25077 65562 90648 80346 85352 101984 98559 51467 10770 -19221 -64464 7707 -8363
1891h363m2996j745j8352N1856p941r469J4121J1775L0461J2103N1288p0387n6616
1878d4265r33L6251n7388J5603K7499j9299O2698N9570J401M1314n712r9154m9565
1865c1980j2632K4404K7208k6719J0527j2418k27P2114r790m8674m8442N199r501
1852f0931K6532K6105j1020L2037m4103J0535O0952j9680l3015Q10K7445k7149
1840a1482l106M5639k7767M2996l4788r775m2934J9676j6495K073M1035n565J307
1827H14l3945l1363K1221j4808n445p667M5511J361J941N528r32R1969k7906p4306
1813b8027l7628P735Q46R3705j8126n939J7477q0908Q318o8101K0123R3268L5755
1800C8498j5137k5576k0972l5281N5941Q968q54q4799P3823J9530l0908j7081
$$ plain form
1891 -8363 -51359 -53104 -71456 -19600 -27541 -37010 -22889 -11114 19347 31450 82738 12351 -44265
1878 -44265 -45198 -8947 -66335 -50732 -23233 -42532 20166 79736 81137 122451 116739 17585 -31980
1865 -31980 -44612 -20208 7000 -19719 -9192 -21610 -21837 50277 40487 -8187 -56629 -51430 -60931
1852 -60931 -34399 -8294 -19314 12723 -31380 -20845 40107 20427 -12588 -11778 15667 -11482
1840 -11482 -14588 31051 3284 46280 11492 1717 -41217 -21541 -38036 -35963 5072 -493 814
1827 814 -33131 -64494 -43273 -58081 -63526 -71193 -25682 -24321 -22380 -16852 -17784 74185 46279 -28027
1813 -28027 -65655 -57920 -57074 36631 18505 12566 30043 -50865 -42547 -110648 -90525 2743 38498
1800 38498 23361 -2215 -23187 -58468 -2527 6441 5587 -79212 -5389 14141 -16767 -33848
1788c3848m0231L7920K2670n7168K1303m6597M9591N1779k5060r440j9214M1847
1776f448J4372j6961N9651j7054j2264K7292j0351m260l3010j8986N5572n9933
1764b2380L9196m1881l5463N8846o2966k1120J15051Q059L024O114m5740L0582
1752C1322n3688j2611P0183J787q3870q769P652j3358M8255j7675m4453O1258
1740a3967J3298K4489J6464K002m9626M39m8495L6535l2210J3478J04117m928
1728F1596m8662L2604n7377j9728N9017k9456L8078k2671J8468q1654N6354M4023
1716E0592r843n3235m7329R9136j05324L598M8074l2630m3599k3561O1483K7526
1704b5112J3569o0265l0028J08385K0964o7661J6689L1672n6129l8879Q4250K9552
$$ plain form
1788 -33848 -74079 -36159 -13489 -70657 -49354 -95951 -46360 5419 -19641 -29081 -48295 -6448
1776 -6448 7924 -9037 50614 33560 21296 48588 38237 33977 967 -18019 37553 -22380
1764 -22380 16816 -25065 -60528 -1682 -64648 -85768 29283 37342 40366 46480 740 31322
1752 31322 -22366 -34977 35206 36993 -46877 -55646 -47994 -61352 -13097 -30772 -75225 -13967
1740 -13967 -669 23820 40284 42286 -7340 -6901 -55396 -18861 -51071 -37593 66524 61596
1728 61596 12934 45538 -11839 -31567 27450 -2006 36072 13401 31869 -49785 6569 50592
1716 50592 40749 -12486 -59815 39321 -66003 -62405 -14331 -46961 -90560 -114121 -52638 -25112
1704 -25112 -11543 -71808 -101836 6549 27513 -40148 -23459 8213 -47916 -86795 -2545 27007
1692B7007l5106n4110R9108K7056k3279m901r159k2234j2403O8876q712m5448
1680F695k4299m6397N6639J0559K2185L6146j3501L0568m4986m6286k0681p8453
1668a11811M3805L1880M481k6771m8530Q8252J5178J3923m861n2748R931q505
1656d5776J0428M9623j5188k8736k421M5547q9084L1168k3870R0856L4882m0831
1644A6598o8076N7154p9897J3917M5533K7195p3827o7605Q3967K4237K1108m4546
1632d4242M180j4485N0857L3577j03896j2723J29619J3513j338r049j0028n7069
1620b1084k6457L7593k419j7633M0778k0781j8430m2469P5892L245J1037j4216
1608E056p0373L3113M038J3076j1801j3680j8929P017K0983L6789k8218Q949J4381
$$ plain form
1692 27007 -8099 -62209 36899 63955 40676 35775 26616 4382 -8021 60855 52143 6695
1680 6695 -17604 -64001 -7362 3197 25382 61528 48027 78595 33609 -12677 -33358 -111811
1668 -111811 -68006 -36126 -31645 -58416 -106946 -18694 -3516 10407 5546 -47202 -37271 -45776
1656 -45776 -35348 14275 -913 -29649 -32070 13477 -75607 -44439 -68309 22547 57429 16598
1644 16598 -51478 5676 -74221 -60304 -14771 12424 -61403 -129008 -45041 -20804 304 -44242
1632 -44242 -40062 -54547 -3690 29887 -74009 -86732 42887 56400 55062 46013 35985 -21084
1620 -21084 -47541 -9948 -12367 -30000 10778 -10003 -28433 -70902 4990 8235 19272 5056
1608 5056 -65317 -32204 -28166 -15090 -26891 -40571 -59500 -52483 -31500 5289 -22929 -13980 401
1595D01j2270J6553j6636k9584J3332K0332J7249k858j6644m5648j2401M5906
1583b2268m8555q8483l489M5241Q7293M0261r1753O6709K9037O0472j3740m7986
1571A2739J191o9461K4684N035L3836n3483o2287K4127O5800M743l4224M9903
1559B603m7334K7816L7678J4485o7019j3541J7431M1990N7045m1389k5092l9956
1547c5283L9788k2375K4468j1894q0459J2808O1839o214j0400j3386m34K1299
1535b0243N216p0384j9095N3610O5567l6259m538k3051r0602J38425L2483L7493
1523F8622K916j4698j1920q8871J6347P9214l3323m7478j7150K8271k8193l6895
1511h3158j1737K6597M971k3355j5947N8755L2609j2326j2316K0253K8493l5820
$$ plain form
1595 401 -11869 4684 -11952 -41536 -28204 -7872 9377 6519 -10125 -55773 -68174 -22268
1583 -22268 -70823 -159306 -162795 -117554 -30261 10000 -81753 -15044 13993 74465 60725 12739
1571 12739 13930 -55531 -30847 -25812 8024 -45459 -107746 -83619 -17819 -13076 -47300 2603
1559 2603 -44731 -16915 20763 35248 -31771 -45312 -27881 14109 71154 29765 4673 -35283
1547 -35283 4505 -17870 6598 -5296 -85755 -72947 -11108 -17322 -27722 -41108 -41542 -20243
1535 -20243 -15027 -85411 -104506 -50896 14671 -21588 -26126 -49177 -139779 -1354 31129 68622
1523 68622 71538 56840 44920 -43951 -27604 51610 18287 -29191 -46341 -18070 -46263 -83158
1511 -83158 -94895 -68298 -63327 -86682 -102629 -43874 -11265 -23591 -35907 -15654 12839 -22981
1499b2981M3690K1699J1058m4634j9678L1568o3227j7649l0405J2162N3772k3253
1487d7878l009O7571r4062J7436N6085l0151j006o274m286N99P8731l8654R0127
1474H5229j3307p6217k6474k428J1562L4933q0902K9740K9114K7209J8264j2617
1462B4106k6444J7206K9752l6951n7558J8751J7806k4049m4337K0882J9706K4743
1450a6387M6633j14873O0989L4019O024k6915J5016J1353j9455M8203J327o039
1438C9895l6311n3377P374K5611M7504J6667j10989j0730O8924m0920J882M550
1426c9920j9780K326L1212o626J1498k7755l8766j1955O2667k6574N3615J1702
1414A644j7237K5032j1653l4419Q5229k0824l500L9976p290l5592n4346L8267
$$ plain form
1499 -22981 20709 42408 53466 8832 -10846 20722 -42505 -60154 -90559 -78397 -24625 -47878
1487 -47878 -50887 16684 -77378 -59942 -3857 -34008 -35014 -41288 -45574 -44975 33756 -4898 85229
1474 85229 71922 -4295 -30769 -33197 -21635 13298 -67604 -37864 -8750 18459 36723 24106
1462 24106 -2338 14868 44620 7669 -49889 -31138 -13332 -37381 -81718 -60836 -41130 -16387
1450 -16387 30246 -84627 -23638 10381 16405 -10510 4506 15859 -3596 44607 45934 39895
1438 39895 3584 -49793 -42419 -16808 30696 47363 -63626 -74356 -5432 -46352 -44470 -39920
1426 -39920 -59700 -57374 -26162 -32788 -21290 -49045 -87811 -99766 -37099 -63673 -10058 1644
1414 1644 -15593 9439 -2214 -36633 48596 27772 24272 64248 56958 21366 -32980 5287
1402E287L5107L9886n0953r3930J0365L6793O3914p1126m8478J3255J01752L2474
1390G4346j36041O8590j2273k2706p9638N9690L5796l4136M009K0685j2185J8080
1378a5783L4629O620r0480J6996M0961n3460J6313O9527n277o2056r556P07K7248
1365b3611O0068l6906K2872M911n9514J2877M1101M4241q2834k1107J0617m5770
1353g3055J7265J741O8573l6135K3370j3689j8047K5210J6189K0143m0021J1426
1341B970L264l2537Q66R541j7755K0487L5111J2166l0119K5677n483M9787r744
1328F4231q7862p8295O312J47769j15908Q5113k3755j183Q3537j12836J5295p175
1316b4757k9687m4086R1333m8996k5961k2791J7283N3251O860J4977L5972p5008
$$ plain form
1402 5287 40394 80280 29327 -64603 -54238 -17445 46469 -24657 -73135 -59880 41872 74346
1390 74346 -61695 6895 -5378 -28084 -107722 -48032 -12236 -46372 -42363 -21678 -33863 -15783
1378 -15783 18846 25466 -65014 -48018 -7057 -60517 -44204 25323 20046 -42010 -51566 -50859 -23611
1365 -23611 36457 -449 22423 27334 -32180 -19303 21798 66039 -16795 -37902 -27285 -73055
1353 -73055 -55790 -54049 14524 -21611 1759 -11930 -29977 -4767 11422 31565 -8456 2970
1341 2970 6234 -26303 -25437 -15896 -33651 -13164 21947 34113 3994 29671 24188 73975 64231
1328 64231 -23631 -101926 -95614 52155 -63753 21360 -2395 -3578 79959 -32877 -17582 -24757
1316 -24757 -54444 -98530 -7197 -56193 -82154 -104945 -87662 -34411 -27551 -12574 23398 -51610
1304e1610l4173k38O255M4891K9232j0102Q568K0197n5928L9756K2952q0965Q3238
1291B2073L0467P979j6541j9481j9884j3237j6471J8613K8499j6558m5887N1719
1279A1291L6238o8354P273N667N9422j9335o3401m3202k794N9431M2814n9611
1267c4561R952j3502O5786m6717P9271J2962q4268Q803j2341K8584j3639l5453
1255c5123K7397n0333m801P7o2094Q5080K4107k3407r895P9338k4264r0729P2885
1242a1762k2894o6175K4809J6441L1568o421O5879O7218o6388l2926j7548N344
1230a2855J8647m8926K5530L1190m474J414N761r6676O4881P3902q8076J8440
1218a1242J3071N5131n8183n501k8420m1741R7334J0729q630n3780O6570K918
$$ plain form
1304 -51610 -85783 -86021 -79766 -34875 -5643 -15745 -7177 13020 -42908 -3152 19800 -61165 22073
1291 22073 52540 60519 43978 24497 4613 -8624 -25095 -6482 22017 5459 -40428 11291
1279 11291 47529 -20825 -13552 -7885 51537 32202 -31199 -74401 -77195 -17764 25050 -34561
1267 -34561 -24609 -38111 27675 -19042 60229 73191 -11077 -2274 -14615 13969 330 -35123
1255 -35123 -7726 -58059 -62860 -62783 -124877 -39797 -15690 -39097 -48992 30346 6082 -84647 -11762
1242 -11762 -34656 -100831 -76022 -59581 -28013 -34434 31445 98663 32275 -651 -18199 -12855
1230 -12855 5792 -43134 -17604 13586 9112 10526 16287 -80389 -15508 58394 -29682 -11242
1218 -11242 1829 56960 -1223 -6724 -35144 -76885 20449 31178 22548 -31232 35338 38256
1206C8256n149q8715r972O1430o7666M3264N1685P823n3594N0007k5586J4647
1194A6430O373r0666L5536O0775l5944r3805M5039L7569J9680p3952j5273j4114
1182a02352Q5430p7312L6694J8319p72M3229Q532m2773k3090J8575J2513R247
1170a3760k4432K1486m9939J09043J513n2198l6373N5303m9105K6646k2274P227
1158b6863J6123q713j1944l2825K8222M1138j6016j4293R55O6840k7580o2206
1146d7162M8231o1600N1511J669L1289o764j3980L6124o8763J3817J6420Q684
1134I476j433O145k1105N493m2813K9650J1865k2649K652J6423K1362M0499r7539
1121d1974N0784K3654n1124r6902K3109M0833L5669L3635l2962J3371p7533J18418
$$ plain form
1206 38256 33107 -55608 -65580 -4150 -71816 -28552 23133 30956 -22638 27369 1783 16430
1194 16430 22803 -67863 -32327 28448 -7496 -101301 -56262 -18693 987 -72965 -88238 -102352
1182 -102352 -16922 -94234 -57540 -39221 -39993 3236 11768 -31005 -54095 -35520 -23007 -13760
1170 -13760 -38192 -16706 -66645 42398 43911 -8287 -44660 10643 -38462 -11816 -34090 -26863
1158 -26863 -10740 -19453 -31397 -64222 -36000 5138 -10878 -25171 -24216 42624 15044 -47162
1146 -47162 1069 -60531 -9020 -7351 23938 17174 3194 39318 -29445 -15628 792 9476
1134 9476 8043 14188 -6917 -1424 -44237 -14587 -2722 -25371 -22719 -6296 15066 55565 -41974
1121 -41974 8810 32464 -18660 -115562 -92453 -51620 -15951 17684 -15278 -1907 -79440 38978
1109C8978k6102k853J3395K1076l7317N5922m0253k892p608j8018R171J6600m7604
1096b7505m3729P5570M531k0235o7879q386R1032M1648n1365J5320p322k6644
1084b4964L7837r816K0133o5125o0150M6749M1168J3170J2816o3681L1730l5326
1072e5459O025k1224M2446O429k0157N5756n0663l1192q4771J32429O8151n692
1060D2078k0371J031J8703k3449O02M1462j3723n6380j8024K2532l259K9257r3264
1047g2805J06903M1989O3330m9181q6038n52k27k1289o2407N1619J4341k8038
1035d2355o289L4391j4184M0372n7052K1297k8048K4592J7165p3074Q5239J0812
1023A2866o1381l9162K06R2184M5291n8493n7493O2705p532R412J1344m7886l8503
$$ plain form
1109 38978 12876 10023 23418 44494 7177 63099 22846 19954 12346 -5672 3499 20099 -27505
1096 -27505 -71234 4336 8867 -11368 -79247 -87633 3399 45047 -6318 9002 1680 -24964
1084 -24964 12873 3057 23190 -41935 -102085 -55336 -14168 -998 11818 -51863 -20133 -55459
1072 -55459 -49434 -70658 -28212 -21783 -41940 13816 -36847 -68039 -152810 -20381 47770 42078
1060 42078 21707 22738 41441 17992 18594 60056 46333 -10047 -28071 -5539 -8798 20459 -72805
1047 -72805 34098 76087 139417 90236 4198 3646 3419 -17870 -80277 -28658 -14317 -42355
1035 -42355 -48644 -14253 -28437 11935 -45117 -23820 -51868 -27276 -10111 -83185 2054 12866
1023 12866 -48515 -87677 -87471 4713 50004 -8489 -65982 -3277 -10809 -1397 9947 -37939 -76442
1010g6442J5488J17863n0253m8233J6543K1550k6719J1725J8786l4898K5704j9871
998b8757J3052M0499Q024l5705m9493J9866Q1015p773J3108r5390M0955P8305
986G7706j56553M9835N2690Q955k7305n109M8520m8538l8261L1320m0707O0664
974A3217k5326j01549P3978N6322K2162J173K649k9797L4732j01864K2846L0440
962a017M5877k9512n591M280J453m8235K7197n580n4829R9624m8113M702o421
949a6165n610K1979l866q9251M5700o1429Q1937M7217J6695j1144Q481J1265o1534
936a5725k6771J2575j3778Q6439j447k0375K3527J861n8539o9807L7879M4695
924E34N1223k4169N276l1266k3722J2842J6411p18l9826J2842M2207O4281l1313
$$ plain form
1010 -76442 -60954 56909 6656 -41577 -25034 -3484 -30203 -18478 308 -34590 -8886 -28757
998 -28757 -15705 24794 32818 -2887 -52380 -32514 48501 40728 53836 -41554 -599 77706
986 77706 -78847 -29012 23678 32633 5328 219 48739 201 -38060 -6740 -47447 13217
974 13217 -12109 -113658 -39680 16642 38804 39977 42626 12829 47561 -54303 -31457 -1017
962 -1017 44860 15348 9757 14037 15490 -32745 -5548 -11128 -65957 33667 -14446 -9744 -16165
949 -16165 -21775 204 -3662 -92913 -47213 -108642 -26705 20512 37207 26063 34544 45809 -15725
936 -15725 -42496 -29921 -43699 42740 41293 20918 44445 46306 -12233 -82040 -44161 534
924 534 51757 27588 32864 1598 -22124 -9282 7129 6411 -33415 -20573 21634 85915 54602
911E4602N639o5541Q893Q4386l2355m4585j2905K9253o9599J8288M5933J6544
899C8553l086k3444j3029M8529p8633J05877O0735o0533j36596M1927j1226J086
887b9840K3105O398J9591N8678q1879M3117o9330n7699L4877J06253o521l1683
875A5067m8578m3004J8336K3002L3638m6785n526O1497J6776k3697R196r335J3933
862A4520k6795N7861m0618l036K5909j3435J1255k9338j4177Q4754j08378M1714
850B36j0084N5299n1344k4774K4374n2565J0081L8012L925L2006r222K2604K364
837D0912K4995k3470p3648Q559N0359n580P222K089m2774K0752q1143M1989J02826
824G3088n2071L1319P5971r1364J3915J5348n209p7743J3843O4226k9948M4719
$$ plain form
911 54602 60241 -5300 3593 87979 55624 11039 -1866 27387 -42212 -23924 22009 38553
899 38553 35467 12023 -1006 47523 -31110 74767 135502 74969 -61627 -19700 -30926 -29840
887 -29840 -6735 -337 19254 77932 -3947 39170 -30160 -87859 -52982 53271 46750 15067
875 15067 -33511 -76515 -58179 -35177 -1539 -48324 -53850 7647 24423 726 9922 587 14520
862 14520 -12275 45586 4968 1932 27841 14406 25661 -3677 -17854 66900 -41478 236
850 236 -9848 45451 -5893 -30667 -6293 -58858 -48777 -10765 -6840 25166 15944 38548 40912
837 40912 65907 42437 -31211 -22652 27707 22127 29349 31438 -11336 9416 -71727 -29738 73088
824 73088 21017 52336 128307 36943 50858 66206 60997 -16746 -2903 61323 31375 76094
812G6094r6993p599J4938p4264P6422r326r243P1931n0135o567j1841O624K3055
799C096O2844r3246K7341J5502l8730L0656K3745J6265r8187j9712M393J3753
787e2280J6495N5231K9994p7469k0178O4881l0090j3456K1486j1334j1261J986
775b5995O667o4803J9981J3773O8490l51k3938k2032o670M46l4957Q8211q6381
762f7559m5719O6508Q586N3223N0183o043j3689J0034p6140J3669M3420J1358
750D7831j5451m5720O6081n995l6226R036J8965j7454L2048L8609o8794K2289
738D5219K2211j04222N5004P812J8085r0474L7916m4093n1025L5730J0827j6157
726g3167M4657r8674P9820Q5800o8813j0106P9816K574n2785j9334K2165k408
$$ plain form
812 76094 -20899 -28498 -13560 -87824 -11402 -20728 -29971 41960 -8175 -14742 -26583 -19959 3096
799 3096 65940 -27306 35 15537 -23193 7463 31208 47473 -50714 -70426 -66033 -52280
787 -52280 -35785 19446 49440 -28029 -48207 16674 -13416 -26872 -5386 -16720 -27981 -25995
775 -25995 -19328 -84131 -64150 -50377 18113 17762 -6176 -28208 -34878 -34432 -69389 18822 -67559
762 -67559 -113278 -46770 -38184 15039 65222 59179 45490 55524 -20616 -6947 36473 47831
750 47831 32380 -13340 52741 46746 10520 19556 38521 21067 53115 91724 22930 45219
738 45219 67430 -36792 18212 26024 44109 -46365 -8449 -52542 -103567 -67837 -57010 -73167
726 -73167 -28510 -127184 -47364 38436 -30377 -40483 39333 41907 -10878 -30212 -8047 -10455
714a0455p0668N7353N1504L6594K8529m4791j6489l8322m3781L9863M7317L3051
702F9705j5866P9842r9103M235L211P8659j9683n5779o493n557j1935M0376k0123
689D1489J230p1334P2776N4299r0229K029j0223n2066K1456k3793O5782k3665
$$ plain form
714 -10455 -81123 -23770 27734 64328 92857 48066 31577 -6745 -50526 -10663 36654 69705
702 69705 53839 133681 34578 38813 42024 120683 101000 45221 38728 33171 21236 61612 41489
689 41489 42719 -28615 44161 98460 8231 10260 37 -52029 -30573 -54366 11416 -12249
$$ [...]
##END NTUPLES=NMR SPECTRUM
##END=
