##TITLE=1H_CG-1211-A6
 CDCl3
 8 sc, 
 2.9.2024
##JCAMPDX= 6.0         $$ Bruker NMR JCAMP-DX V2.0
##DATA TYPE= NMR SPECTRUM
##DATA CLASS= NTUPLES
##ORIGIN= UXNMR, Bruker Analytische Messtechnik GmbH
##OWNER= root
$$ XWIN-NMR		Version 3.5
$$ Mon Sep  2 14:16:03 2024 Russian Standard Time (UT+4h)  she@DPX200
##.OBSERVE FREQUENCY= 200.1318
##.OBSERVE NUCLEUS= ^1H
##.ACQUISITION MODE= SIMULTANEOUS
##.ACQUISITION SCHEME= undefined
##.AVERAGES= 8
##.DIGITISER RES= 18
##SPECTROMETER/DATA SYSTEM= spect
##.PULSE SEQUENCE= zg30
##.SOLVENT NAME= D2O
##.SHIFT REFERENCE= (INTERNAL, D2O, 0, 20.9606)
##AUDIT TRAIL= $$ (NUMBER, WHEN, WHO, WHERE, WHAT)
$$ ##TITLE= Audit trail, XWIN-NMR		Version 3.5
$$ ##JCAMPDX= 5.01
$$ ##ORIGIN= Bruker BioSpin GmbH
$$ ##OWNER= she
$$ F:/spectra/data/she/nmr/H-F/1/pdata/1/auditp.txt
$$ ##AUDIT TRAIL=  $$ (NUMBER, WHEN, WHO, WHERE, WHAT)
(   1,<2024-09-02 14:14:35.89 +0400>,<she>,<DPX200>,
      <created by zg, POWCHK disabled, PULCHK disabled
       configuration hash MD5:
       00 E9 B6 7A A2 85 ED C7 34 08 36 98 17 FE 4E 26
       data hash MD5: 16K
       32 78 FD B7 73 C2 6A FD E3 96 9B D4 20 53 24 BE>)
(   2,<2024-09-02 14:14:38.85 +0400>,<she>,<DPX200>,
      <Start of raw data processing
       efp BC_mod = 2 LB = 0.24 FT_mod = 6 PKNL = 1 PHC0 = -25995.79 PHC1 = 15.98748 SI = 16K 
       data hash MD5: 16K
       31 F0 E0 53 D3 32 64 EB 60 28 DE 75 68 CE 15 3F>)
(   3,<2024-09-02 14:15:10.57 +0400>,<she>,<DPX200>,
      <pk PHC0 = 2.083289 PHC1 = -3.6 
       data hash MD5: 16K
       7F A9 D7 2B A0 35 A0 94 1F 60 84 32 32 CC 56 D5>)
(   4,<2024-09-02 14:15:14.93 +0400>,<she>,<DPX200>,
      <abs ABSG = 5 
       data hash MD5: 16K
       DD 82 69 BE 21 12 95 E4 22 5D 81 17 1F E4 DF 17>)
$$ ##END=
$$ 
$$ hash MD5
$$ 3E 1A A5 C3 64 F5 A9 89 87 F5 36 6D 35 39 C2 B9
##$RELAX= 
##$RELAX= 
##$RELAX= 
##$RELAX= 
##$RELAX= 
##$RELAX= 
$$ Bruker specific parameters
$$ --------------------------
##$DU= <F:/spectra>
##$EXPNO= 1
##$NAME= <H-F>
##$PROCNO= 1
##$TYPE= <nmr>
##$USER= <she>
##$AMP= (0..31)
100 100 100 100 100 100 100 100 100 100 100 100 100 100 100 100 100 100 
100 100 100 100 100 100 100 100 100 100 100 100 100 100 
##$AQSEQ= 0
##$AQ_mod= 1
##$AUNM= <au_zg>
##$AUTOPOS= <>
##$BF1= 200.13
##$BF2= 200.13
##$BF3= 200.13
##$BF4= 200.13
##$BF5= 200.13
##$BF6= 200.13
##$BF7= 200.13
##$BF8= 200.13
##$BYTORDA= 1
##$CFDGTYP= 0
##$CFRGTYP= 5
##$CHEMSTR= <none>
##$CNST= (0..31)
1 1 145 1 1 1 1 1 1 1 1 1 1 1 1 1 1 1 1 1 1 1 1 1 1 1 1 1 1 1 1 1 
##$CPDPRG= <>
##$CPDPRG1= <>
##$CPDPRG2= <>
##$CPDPRG3= <>
##$CPDPRG4= <mlev>
##$CPDPRG5= <mlev>
##$CPDPRG6= <mlev>
##$CPDPRG7= <mlev>
##$CPDPRG8= <mlev>
##$CPDPRGB= <>
##$CPDPRGT= <>
##$D= (0..31)
0 1.2 0 0 0 0 0 0 0 0.06 0 0.03 0 0 0 0 0.0002 0 0 0 0 0 0 0 0 0 0 0 0 
0 0 0 
##$DATE= 1725272075
##$DBL= (0..7)
120 120 120 120 120 120 120 120 
##$DBP= (0..7)
150 150 150 150 150 150 150 150 
##$DBP07= 0
##$DBPNAM0= <>
##$DBPNAM1= <>
##$DBPNAM2= <>
##$DBPNAM3= <>
##$DBPNAM4= <>
##$DBPNAM5= <>
$$ [...]
##$SUBNAM3= <"">
##$SUBNAM4= <"">
##$SUBNAM5= <"">
##$SUBNAM6= <"">
##$SUBNAM7= <"">
##$SUBNAM8= <"">
##$SUBNAM9= <"">
##$SW= 24.0689170037331
##$SWIBOX= (0..15)
0 0 2 0 0 0 0 0 0 0 0 0 0 0 0 0 
##$SW_h= 4816.95568400771
##$TD= 16384
##$TD0= 1
##$TE= 0
##$TE2= 300
##$TE3= 300
##$TEG= 300
##$TL= (0..7)
0 120 120 120 120 120 120 120 
##$TP= (0..7)
150 150 150 150 150 150 150 150 
##$TP07= 0
##$TPNAME0= <>
##$TPNAME1= <>
##$TPNAME2= <>
##$TPNAME3= <>
##$TPNAME4= <>
##$TPNAME5= <>
##$TPNAME6= <>
##$TPNAME7= <>
##$TPOAL= (0..7)
0.5 0.5 0.5 0.5 0.5 0.5 0.5 0.5 
##$TPOFFS= (0..7)
0 0 0 0 0 0 0 0 
##$TUNHIN= 0
##$TUNHOUT= 0
##$TUNXOUT= 0
##$USERA1= <user>
##$USERA2= <user>
##$USERA3= <user>
##$USERA4= <user>
##$USERA5= <user>
##$V9= 5
##$VALIST= <valist>
##$VCLIST= <CCCCCCCCCCCCCCC>
##$VD= 0
##$VDLIST= <DDDDDDDDDDDDDDD>
##$VPLIST= <PPPPPPPPPPPPPPP>
##$VTLIST= <TTTTTTTTTTTTTTT>
##$WBST= 1024
##$WBSW= 4
##$XGAIN= (0..3)
0 0 0 0 
##$XL= 0
##$YL= 0
##$YMAX_a= 456093
##$YMIN_a= -336588
##$ZGOPTNS= <>
##$ZL1= 120
##$ZL2= 120
##$ZL3= 120
##$ZL4= 120
##$ABSF1= 20.94738
##$ABSF2= -3.121752
##$ABSG= 5
##$ABSL= 3
##$ALPHA= 0
##$AQORDER= 0
##$ASSFAC= 0
##$ASSFACI= 0
##$ASSFACX= 0
##$ASSWID= 0
##$AUNMP= <proc_1d>
##$AZFE= 0.1
##$AZFW= 0.1
##$BCFW= 0
##$BC_mod= 2
##$BYTORDP= 0
##$COROFFS= 0
##$CY= -3
##$DATMOD= 1
##$DC= 0
##$DFILT= <>
##$DTYPP= 0
##$F1P= 0
##$F2P= 0
##$FCOR= 1
##$FTSIZE= 16384
##$FT_mod= 6
##$GAMMA= 0
##$GB= 0
##$INTBC= 1
##$INTSCL= 3.70164e-10
##$ISEN= 128
##$LB= 0.24
##$LEV0= 0
##$LPBIN= 0
##$MAXI= 10000
##$MC2= 0
##$MEAN= 0
##$ME_mod= 0
##$MI= 1.114404
##$NCOEF= 0
##$NC_proc= -7
##$NLEV= 6
##$NOISF1= 3.799351
##$NOISF2= 2.8
##$NSP= 0
##$NTH_PI= 0
##$NZP= 0
##$OFFSET= 20.96059
##$PC= 1
##$PHC0= -25993.71
##$PHC1= 12.38748
##$PH_mod= 1
##$PKNL= yes
##$PPARMOD= 0
##$PSCAL= 0
##$PSIGN= 0
##$REVERSE= no
##$SF= 200.130013634579
##$SI= 16384
##$SIGF1= 3
##$SIGF2= 2
##$SINO= 5.538805
##$SIOLD= 16384
##$SREGLST= <1H.CDCl3>
##$SSB= 0
##$STSI= 16384
##$STSR= 0
##$SW_p= 4816.95568400771
##$SYMM= 0
##$S_DEV= 0
##$TDeff= 16384
##$TDoff= 0
##$TI= <>
##$TILT= no
##$TM1= 0
##$TM2= 0
##$TOPLEV= 0
##$USERP1= <user>
##$USERP2= <user>
##$USERP3= <user>
##$USERP4= <user>
##$USERP5= <user>
##$WDW= 1
##$XDIM= 16384
##$YMAX_p= 480938500
##$YMIN_p= -886730
$$ End of Bruker specific parameters
$$ ---------------------------------
##NTUPLES= NMR SPECTRUM
##VAR_NAME=  FREQUENCY,     SPECTRUM/REAL,   SPECTRUM/IMAG
##SYMBOL=    X,             R,               I
##VAR_TYPE=  INDEPENDENT,   DEPENDENT,       DEPENDENT
##VAR_FORM=  AFFN,          ASDF,            ASDF
##VAR_DIM=   16384,         16384,           16384
##UNITS=     HZ,            ARBITRARY UNITS, ARBITRARY UNITS
##FACTOR=    0.29402158847633, 1,            1
##FIRST=     4194.84323504572, 0,            0
##LAST=      -622.112448961988, 0,           0
##MIN=       -622.112448961988, -886730,     0
##MAX=       4194.84323504572, 480938500,    0
$$ Real data points
##PAGE= N=1
##DATA TABLE= (X++(R..R)), XYDATA
$$ [...]
6915H7680619j812851j440899j638322j884545k062796j765813j359361j458077
6907G4257955o97296m77972q22079p43343L58380J83911P9716M61307J98431J06368
6897G2905378M11548N78736M19321R28556J017116M81309N51474M44333M53037
6888G8190808R60531J111954J023811J598187J725103K292595K656908L103161
6880I2663058L411386K837463K177174J792148J928226J961576J666462Q51077
6872A09288570N44455L46872L22423N14325M44157J86398k35052l42013J21414
6863A11191549J021409J295549J789800K947483L694215M382218N211672N277420
6855A36811315M788304L737468L966632N308569P060342Q955928J0501032R986845
$$ plain form
6915 87680619 85867768 84426869 82788547 80904002 78841206 77075393 75716032 74257955
6907 74257955 73560659 73082687 72260608 71517265 71875645 72059556 72139272 72600579 72799010 72905378
6897 72905378 73316926 73895662 74314983 75243539 76260655 76741964 77293438 77737771 78190808
6888 78190808 79151339 80263293 81287104 82885291 84610394 86902989 89559897 92663058
6880 92663058 96074444 98911907 101089081 102881229 104809455 106771031 108437493 109288570
6872 109288570 109833025 110179897 110502320 111016645 111460802 111647200 111412148 111070135 111191549
6863 111191549 112212958 113508507 115298307 118245790 121940005 126322223 131533895 136811315
6855 136811315 141599619 145337087 149303719 154612288 161672630 170628558 181129590 191116435
6847A91116435P698570L096797l92838l64135Q22692j968201q435759j1266179
6839A80307382j1138344r214978o824482m916478l299053j825476k66170R37247
6831A43759648K267097K688794K955553L637570M477535O077186P348788Q855750
6823A82067921J0885717J1447107Q564966M558043q15112n445696o358848m457996
6815B00446102l244449m830512o192903n397609l460641j147626J419513L578873
6807A81170748O662917R499483J1998842J4910761J4916613J1081959N098407
6800B55339730O05355l101700o427522p769968o745904p208771p987543p794712
6792B08908965p524345r180784j0430135r735035q010913o196118m182916k468980
$$ plain form
6847 191116435 198815005 201911802 201518964 201154829 201977521 200009320 191573561 180307382
6839 180307382 169169038 159954060 153129578 148213100 144914047 143088571 142822401 143759648
6831 143759648 146026745 148715539 151671092 155308662 159786197 165863383 173212171 182067921
6823 182067921 192953638 204400745 212965711 217523754 216708642 211262946 204904098 200446102
6815 200446102 197201653 192371141 186178238 180780629 177319988 176172362 177591875 181170748
6807 181170748 187833665 197333148 209331990 224242751 239159364 250241323 255339730
6800 255339730 255945085 252843385 246415863 238645895 231899991 224691220 216703677 208908965
6792 208908965 201384620 192203836 181773701 172038666 164027753 157831635 153648719 151179739
6784A51179739q20403R35760K556633M416719O799903Q868001J0670450J1673938
6776A96280740J0442520P946555L336920l763544q030109q555060q032969q260835
6768A81364218r388002r517882r679234q977518p880411o572686n163339m374242
6760A19810904l560912k631864j425676p97717J66494J172947K628646L476825
6752A18839647L816978K814636N53453q89966j807331j729372j074674l12428
6744A20210943j058278k925109m660630n933066o195544n597497m967090m342818
6736H4530911l797021k930586k235405j806720j474665j125979o61464j30095
6728G0368976M41145M89091l99775r04129j246090j230641j195571j751855k396759
$$ plain form
6784 151179739 150359336 151295096 153851729 158268448 165068351 173936352 184606802 196280740
6776 196280740 206723260 214669815 218006735 214243191 206213082 197658022 189625053 181364218
6768 181364218 171976216 162458334 152779100 143801582 135921171 129348485 124185146 119810904
6760 119810904 116249992 113618128 112192452 111394735 111561229 112734176 115362822 118839647
6752 118839647 122656625 125471261 126024714 125134748 123327417 121598045 120523371 120210943
6744 120210943 119152665 116227556 111566926 105633860 99438316 93840819 88873729 84530911
6736 84530911 80733890 77803304 75567899 73761179 72286514 71160535 70499071 70368976
6728 70368976 70810121 71299212 70899437 69995308 68749218 67518577 66323006 64571151 62174392
6719F2174392k805577l087014k800757k688631k564279k181773j785828j523583
6711D2736950j611003j400484j097902j414989q58994p22589p37045k22872J0725
6702C4681797k21487k35501p25415q91932r38842n03276r07503j266117j332710
6693B7659014j207855j046901r66369q18816q77242q40671q77316n32941m60488
6684B0030415o16857m26064l87345m33775o03457n36601p37260l62918k49980
6675A5676158n63121l70768l88419j98193k55934r8414k98490n44601k19225j96743
6665A2542250m23732k61681p0305k80460k03799k57872l74003k16454j40084r9186
6655A0214674o9007p2166k37265j87112j60003l2615j85954k82987m6550J65144
$$ plain form
6719 62174392 59368815 56281801 53481044 50792413 48228134 46046361 44260533 42736950
6711 42736950 41125947 39725463 38627561 37212572 36353578 35630989 34893944 34671072 34681797
6702 34681797 34460310 34224809 33499394 32607462 31668620 31165344 30257841 28991724 27659014
6693 27659014 26451159 25404258 24437889 23619073 22741831 21901160 21023844 20490903 20030415
6684 20030415 19413558 18987494 18600149 18166374 17562917 17026316 16289056 15926138 15676158
6675 15676158 15113037 14742269 14353850 14155657 13899723 13801309 13502819 12958218 12738993 12542250
6665 12542250 12118518 11856837 11786532 11506072 11302273 11044401 10670398 10453944 10313860 10214674
6655 10214674 10145667 10073501 9836236 9649124 9489121 9456506 9270552 8987565 8941015 9106159
6645I106159p116k80400k01116r8844J04898k90720K58064O7152l48075j41919
6635H168083L6092J3945l70509m33605k0204J95760l09575j00653J65789K2665
6625G367788j7267o3944k91380K88170K168j16994N4965j36635L2128p3667J60326
6614G205658R1940l23298Q2284K75147L9897j20797Q5296J34748k24784L9724
6604G285815k4873K5014M0335n4786J50551j53442L21824j24952J36501l7765
6594G564222K94290Q0362L85309K99011m2904K52122L00169M48403O06939N56714
6584A0744637P75862R47061R86545J461301J424917J092702M98388m10017l08915
6575A7212481Q0985M53154J08318o49949q94135j285431j152328r28328p00775
$$ plain form
6645 9106159 9099043 8818643 8617527 8518683 8623581 8332861 8590925 8658077 8310002 8168083
6635 8168083 8204175 8218120 7847611 7414006 7393802 7589562 7279987 7179334 7345123 7367788
6625 7367788 7350521 7286577 6995197 7283367 7285535 7168541 7223506 7086871 7118999 7045332 7205658
6614 7205658 7297598 6974300 7056584 7331731 7371628 7250831 7336127 7470875 7246091 7285815
6604 7285815 7260942 7285956 7326291 7271505 7422056 7268614 7590438 7465486 7601987 7564222
6594 7564222 7858512 7938874 8324183 8623194 8580290 8832412 9132581 9580984 10187923 10744637
6584 10744637 11520499 12467560 13454105 14915406 16340323 17433025 17931413 17521396 17212481
6575 17212481 17293466 17746620 17854938 17204989 16310854 15025423 13873095 12944767 12243992
6566A2243992n83756m74087j75106j36657J0906O9083J10071K69226L23047O05715
6556A2262434P79458J089248M60352O15778N05092j50285r1526K620Q6314O8892
6546A5628377q58373j316029j097555r28983o48259p69513p32342l03432n26085
6537H447806l47821p6517n01223K1204j99182p3518l6626l18742j34904m3804
6527F736673j46554k04887n9276j06399k5224K02860p2588m41576M9992J07003
6517F040024k07320j08990m716n9870J43384k56598l5745j744k79362K1062J81544
6506E431669J00553j5996K3517j40951K71752k56595j28169J16413k76716J32558
6496E258035k23177J26074J523J6241m1673r4432k98886n1722L336J01360J08987
$$ plain form
6566 12243992 11660236 11186149 11011043 10874386 10885292 10954375 11064446 11333672 11656719 12262434
6556 12262434 13041892 14131140 14591492 15207270 15712362 15562077 15470551 15473171 15559485 15628377
6546 15628377 14770004 13453975 12356420 11427437 10779178 10009665 9277323 8973891 8447806
6537 8447806 8099985 8023468 7522245 7543449 7344267 7270749 7234123 6915381 6780477 6736673
6527 6736673 6590119 6385232 6325956 6219557 6194333 6397193 6324605 5883029 5933021 6040024
6517 6040024 5832704 5723714 5718998 5659128 5802512 5545914 5510169 5508425 5229063 5250125 5431669
6506 5431669 5532222 5516226 5539743 5398792 5670544 5413949 5285780 5402193 5125477 5258035
6496 5258035 5034858 5160932 5162455 5178696 5137023 5042591 4743705 4691983 4695319 4796679 4905666
6485D905666j57030j11645J09415K1104K8144R8886r9994k10800P790L33019L97555
6474E322110L6014l27565k80851O8779j48870K43183j55445n3845K81910N6074
6464E041494j33956j94016N3751N6171j9582k08587N51858j14112q9929J03092
6454E046184k74138m584J49599J56378J29512k6523q9760m3097M3636J24703m3193
6443E168717N912L99122k51233J34887Q019m3736k2850K48248M8717l2149L40277
6432F003931J01677p9302P9304M24326p8147J46940J94680j56145J22653J73961
6422F933878K60914M25911M0591K61747L14437J72783J40602M39469L50742o4263
6412I276811K51259M29861L26700J34926K10759J26106K58659L82325N20630L24638
$$ plain form
6485 4905666 4748636 4636991 4746406 4767510 4795654 4894540 4794546 4583746 4591536 4924555 5322110
6474 5322110 5358124 5030559 4749708 4818487 4669617 4912800 4757355 4703510 4985420 5041494
6464 5041494 4907538 4713522 4767273 4823444 4803862 4595275 5147133 5033021 4943092 5046184
6454 5046184 4772046 4767462 4917061 5073439 5202951 5176428 5086668 5043571 5087207 5211910 5168717
6443 5168717 5174629 5573751 5322518 5457405 5465424 5421688 5398838 5647086 5695803 5663654 6003931
6432 6003931 6105608 6026306 6105610 6529936 6451789 6598729 6793409 6637264 6759917 6933878
6422 6933878 7194792 7620703 7661294 7923041 8237478 8410261 8550863 8990332 9341074 9276811
6412 9276811 9528070 9957931 10284631 10419557 10630316 10756422 11015081 11397406 11918036 12242674
6402A2242674J70780M22787L98560P35941K64757J49195M63356N92238M54717
6393A5895005O74227M77524J42420K30873O60713O90397P57154Q29165J052844
6384B1410322Q37740J539638J294198J754019K369452K630528L018410L429055
6376C8283362L051750J527623N83854R0658K40170J98520O39419n99936j457188
6367D2558232k037986k426281k227653j818691j511278j334335q55035n99179
6359B9747794m79496l22828M6840k1293M42757J231678J047256J185381J368827
6350C4246916J068264Q27129M78141L16853L07217j20110M3827j048154k369910
6341C3750173k465342k577403k726844j959738j901734j613952j151001j434988
$$ plain form
6402 12242674 12413454 12836241 13234801 13970742 14235499 14384694 14848050 15440288 15895005
6393 15895005 16569232 17046756 17189176 17420049 18080762 18771159 19528313 20357478 21410322
6384 21410322 22248062 23787700 25081898 26835917 29205369 31835897 34854307 38283362
6376 38283362 41335112 42862735 43446589 43537247 43777417 43975937 44615356 44015420 42558232
6367 42558232 40520246 38093965 35866312 34047621 32536343 31202008 30346973 29747794
6359 29747794 29268298 28945470 28992310 28971017 29413774 30645452 31692708 32878089 34246916
6350 34246916 35315180 36142309 36620450 36937303 37244520 37124410 37168237 36120083 33750173
6341 33750173 31284831 28707428 25980584 24020846 22119112 20505160 19354159 17919171
6333A7919171j347615j152496q76713r82446r55420o68252p51242o67953o53994
6324I863040l54642n26367k74044l70982l59376j58687l88872k77886k62741r9403
6314F790040l65684l92801j21993k55509n3026j8062k87458k31816K30345l87998
6304D906038j51389l44829k29342q8990k50893M1061p7252j58892N8815k22033
6294C482294k6701j330k45944N7333j40567n9420m3292m5969J07829j15876j91812
6283B776545Q0623J27749Q1616k72824o6157K9398k29787r2025J13469k61330
6273B287277j81254J64324j29721J57869q9627j14403k11769N5673L29927p1345
6263B196951k19653j88354J03358o6131j35298K0491m2244r8887P5493J15391
$$ plain form
6333 17919171 16571556 15419060 14542347 13559901 12604481 11936229 11184987 10517034 9863040
6324 9863040 9508398 8982031 8707987 8337005 7977629 7818942 7430070 7152184 6889443 6790040
6314 6790040 6424356 6031555 5909562 5654053 5601027 5582965 5295507 5063691 5294036 4906038
6304 4906038 4754649 4409820 4180478 4091488 3840595 3881656 3804404 3645512 3704327 3482294
6294 3482294 3455593 3454263 3208319 3265652 3125085 3065665 3022373 2976404 3084233 2968357 2776545
6283 2776545 2857168 2984917 3066533 2793709 2727552 2756950 2527163 2435138 2548607 2287277
6273 2287277 2106023 2270347 2140626 2298495 2208868 2094465 1882696 1938369 2268296 2196951
6263 2196951 1977298 1788944 1892302 1826171 1690873 1711364 1669120 1570233 1645726 1761117
6253A761117R5002m86097K40342m76409L0585k512J08317K20473j82492k03567
6243A104759k7708l6971k22491K69059j63023P0007J87594j43546p1114j15957
6233H50609O2081J97830j19046j57719J69444M983k83896R965K21890j77418k5378
6222G53345q728j17608p181p567m9178O7535R3161N7330jQ1766k51249k78240
6210C33385J53882o083j0424J54847k19248P0388J26631k8612k7412j12463Q4517
6199E19408M6053K47321j61191l5345j19370q2960O8298j80640K21516K5778j45600
6188D03268J791K67034P4777j46063n727n2281k9737n9898J3186J61113o4194
6177E63269m28l56517m6220J56345o2529k935J82687J28j22075J56804o4464m8664
$$ plain form
6253 1761117 1856119 1370022 1610364 1133955 1164540 1162028 1270345 1490818 1308326 1104759
6243 1104759 1077051 1040080 817589 1086648 923625 993632 1181226 1037680 966566 850609
6233 850609 912690 1110520 991474 833755 1003199 1008182 724286 734251 956141 778723 753345
6222 753345 744617 627009 619828 612261 563083 630618 723779 781109 781108 862874 611625 333385
6210 333385 487267 481184 470760 625607 406359 476747 603378 574766 547354 434891 519408
6199 519408 565461 812782 651591 616246 496876 413916 482214 301574 523090 548868 403268
6188 403268 405059 672093 746870 600807 595080 542799 513062 453164 466350 627463 563269
6177 563269 562841 206324 160104 316449 253920 250985 433672 433800 311725 468529 404065 355401
6165C55401P4772R4836p7222j4911k1957J32333k51556q959P7068k5475K7449
6154C61779j07243J39360l4637m8250k0906J58780q3030j87588q1495j98204P5133
6143b6301J70424J32622O8177L16N8515R3658k39773j01851K52556q9642L3466
6132C52167l5291j33879L11715p2554j72699K4169P9226m6736j00602q014J28214
6121C25716k19344l4905M3457m3575J61496n215Q682Q2052k00107M8161L8467
6110B04885J03228J27700j26760j45416O2049J45327J09721J2748j08591L8763
6100D23654O41q8024K6112k2331P0353q6064j51678J56482K00023j43037o0425
6089C25706p668k1869m591p2018J02420M4753j8797q8489j54305K12240q0976
$$ plain form
6165 355401 430173 525009 447787 432876 410919 543252 291696 282737 359805 334330 361779
6154 361779 254536 393896 359259 311009 290103 448883 365853 178265 96770 -101434 -26301
6143 -26301 144123 276745 344922 345238 403753 497411 257638 155787 408343 318701 352167
6132 352167 316876 182997 494712 422158 249459 273628 352854 306118 205516 197502 325716
6121 325716 106372 71467 114924 71349 232845 227630 236312 318364 118257 166418 204885
6110 204885 308113 435813 309053 163637 225686 371013 480734 493482 384891 423654
6100 423654 424295 336271 362383 340052 410405 324341 172663 329145 529168 386131 325706
6089 325706 318038 296169 291578 219560 321980 366733 347936 259447 105142 317382 236406
6078B36406L04560q5986j49700J58701j9315j7181j30874K13962M2197k08414
6068C44356k0390O5875J70245n2927k45695K2453q407k9652j25237P2821J34616
6057C28058K0895j08045k19770K61676J48130l3158q4380j39181j09946k3166
6047D1113o4306J61250j20009J00816P4197k51823K24293R1538J35980R4239l11979
6036A75309k7421k4709J42376j46512n5760K48549J46350l44048j31241L87764
6026C70657k76322j06535O3427R3406k38435J23188p4272R1266j45694L4630J51374
6015H6690j6312n1201K4934K05007j88888j2758M9484m5324n2810J26195n0027
6004G4990J85462j95871l66503J00010L6322J18493k152J55320R3184j34013J22437
$$ plain form
6078 236406 540966 454980 305280 463981 444666 427485 296611 510573 552770 344356
6068 344356 323966 389841 560086 507159 261464 283917 275510 245858 120621 193442 328058
6057 328058 348953 240908 21138 282814 430944 397786 313406 174225 64279 41113
6047 41113 -23193 138057 18048 118864 193061 -58762 165531 257069 393049 487288 175309
6036 175309 147888 123179 265555 119043 63283 311832 458182 114134 -17107 370657
6026 370657 94335 -12200 51227 144633 -93802 29386 -44886 46380 -99314 -64684 86690
6015 86690 70378 19177 44111 249118 60230 47472 96956 51632 -1178 125017 74990
6004 74990 260452 64581 -301922 -201912 -165590 -47097 -49249 106071 199255 65242 187679
5993A87679j24407j01518L09021l96040Q6085K2097P7072m6030J43448l6312p5371
5982D5724J26774P2954o2593k24365M8157P5749J54907K07618k52652m7882k94718
5971a50327k15335K23291J50915k32069Q5638K38560j347N2416k55960K38388
5961A34170k22553O7287Q6780O8604m0987q8674J98657j94847J65594k92764j84938
5950c03671K21169K6027N1854m168k07194J85695P7455M662J44695p8499J6575
5939A34600J05454j69619j6340J7335o4730r7083J37845m5826n1159O5388P9978
5928I5843J65147j56203j83974J84782q2141K6877L9713j33893J41647N9386J22967
5917B80151j58642J97367j75984J14325k0191j04815j49172j27451K61545O0465
$$ plain form
5993 187679 63272 -38246 270775 -125265 -39180 -17083 59989 13959 157407 121095 45724
5982 45724 172498 245452 182859 -41506 6651 82400 237307 444925 192273 144391 -150327
5971 -150327 -365662 -142371 8544 -223525 -137887 100673 99326 151742 -104218 134170
5961 134170 -88383 -21096 65684 134288 93301 4627 203284 8437 174031 -118733 -303671
5950 -303671 -82502 -56475 -4621 -8789 -215983 -30288 47167 51829 196524 118025 134600
5939 134600 240054 70435 54095 71430 6700 -90383 47462 1636 -49523 15865 95843
5928 95843 260990 104787 -79187 105595 23454 50331 90044 -43849 97798 157184 280151
5917 280151 121509 318876 142892 257217 237026 132211 -16961 -144412 117133 177598
5907A77598p5451J68553j52781k76364K83005p7071N7105q0176n6839J19472p3380
5896A3671O4268O1035J42431l37766Q6717J12516j68819J78218L0241p0457r6030
5885A6025J13651j88228J56346M5348l11825J24160J00221o3110n8738P7927L6083
5874D7860r0873o8112N8158n7460L06085j29954j8442o4537J08136J4269r8260
5863F870k4750J4980q7450n3844l2743K54263M5465J0881K37444k24459j63226
5852a6569J45337J02188m0165J41936k16473j01894j92912O323K19940K9079n9759
5841A7031l6402P1140N9322Q6567j62241j32088J30637k5832J17293J66712j80273
5830A11866l5103K223m6656O173J72381m463j0695o7458n4033q8179K16829r1056
$$ plain form
5907 177598 102147 270700 117919 -158445 124560 47489 104594 24418 -32421 87051 13671
5896 13671 77939 138974 281405 -56361 30356 142872 -25947 152271 182512 112055 16025
5885 16025 129676 -58552 97794 143142 -168683 -44523 55698 -7412 -66150 11777 47860
5874 47860 -43013 -111125 -52967 -110427 195658 65704 47262 -17275 90861 105130 6870
5863 6870 -17880 -2900 -90350 -144194 -176937 77326 122791 133672 371116 146657 -16569
5852 -16569 128768 230956 190791 332727 116254 14360 -178552 -172229 47711 76790 17031
5841 17031 -19371 51769 111091 197658 35417 -96671 33966 8134 125427 292139 111866
5830 111866 76763 78986 32330 38503 210884 206421 195726 128268 74235 -13944 202885 111829
5818A11829j49800P0764O798n8647P6990J23685j68201M5815j9478r0318K17854
5807A67291q9237K12382j8875j80694j95500Q7426k9511L0269m1416K03716J8519
5796A64370O8764L3198n5909K10402k29493P9736l5053P4336m3090p6314k3075
5785A67872j53326r5945k5226J40552j55358J19071J83417O1592L8336l3060j2716
5774B35209J30951J25317k96092j52438l5774L3484k8823J15409j34481n4179
5764f1417J47942K21088m55534J73014K8066P8780j81645L2473n3518K97606K0719
5753B47574j45504M3406j08140M6753j51290J11573K9520J34202j26816j17474
5743c6196j7635Q5842Q8750k50652O0316J04355J95174j10095n0019J8240l5569
$$ plain form
5818 111829 -37971 32793 39591 -19056 57934 181619 13418 59233 39755 -50563 167291
5807 167291 78054 290436 271561 90867 -104633 -17207 -46718 -16449 -57865 145851 164370
5796 164370 233134 266332 210423 420825 191332 271068 236015 310351 267261 190947 167872
5785 167872 14546 -81399 -106625 33927 -121431 -2360 181057 242649 280985 247925 235209
5774 235209 366160 491477 195385 42947 7173 40657 11834 127243 -7238 -61417
5764 -61417 86525 307613 -147921 25093 53159 131939 -49706 -17233 -70751 226855 247574
5753 247574 102070 145476 37336 84089 -67201 44372 73892 208094 81278 -36196
5743 -36196 -53831 32011 120761 -129891 -69575 34780 229954 119859 69840 88080 52511
5732E2511K5458o3238j47797L38291L7358J130K6420j17031k47720J02157L8798
5721D6337j93738J02622J56262J2581l6829O7020K21456r2790j89382J65727o5869
5710A93397j47909K33767J2140j05876n1698K59685J20523l08072J2424P5932
5700B94313j83211M0001L5245J1291O5721j67523j108J79733k385J26775J65184
5689E64036k03566j13762k0173J08849l5944j01696J29064o5182j5498P5149M1204
5678C62481k4662j52591J11679K5328N0230O3302n4114j09193P8592j4072n2818
5667B84162N5850N6403j73772J6539P0189Q5951m5759O3981k75257J6236l9141
5656A15382J65584N3587j3009K1531p0043K3474K14150m8369j53966k27551J21942
$$ plain form
5732 52511 77969 14731 -133066 205225 242583 243713 270133 153102 -94618 7539 46337
5721 46337 -147401 -44779 111483 124064 87235 154255 375711 282921 93539 259266 193397
5710 193397 45488 279255 291395 185519 133821 393506 514029 205957 218381 294313
5700 294313 111102 151103 186348 197639 263360 95837 94729 274462 272077 398852 564036
5689 564036 360470 246708 226535 335384 299440 197744 326808 261626 246128 321277 362481
5678 362481 337819 185228 296907 322235 372465 435767 381653 272460 351052 336980 284162
5667 284162 340012 396415 222643 239182 309371 395322 349563 413544 138287 154523 115382
5656 115382 280966 334553 321544 343075 273032 296506 510656 462287 308321 80770 202712
5645B02712K03396Q9210k20450J28779N3979j67472K67102j908l63686o1888J74892
5634C04666K7639o8016J55025l2406j56094o578J36597K22097k12831p3613r0547
5623B05939L16418L0875j30736P7929j44213J41687Q012n5004M2135J0340J04261
5612F07643K19840p2549j59314K24943J74833j23330J47349k33391k40191r146
5602E36687j40419J10136J60903j30749R1886j22447J14385j20600R2328K43392
5592H35502k14441J29354j5433k95328p7743j37021J46798J52029o9142q8340
5582C66235J99211p6011k29747j96107J22558J44286O7698Q8634j66610J26969
5572D47116j88924J58473P5735J07564q6699j81128R2023J9031J67504j1808j86291
$$ plain form
5645 202712 406108 495318 274868 403647 457626 290154 557256 555348 191662 129774 304666
5634 304666 332305 264289 419314 386908 230814 224236 360833 582930 370099 296486 205939
5623 205939 522357 553232 422496 500425 356212 497899 505911 450907 493042 503382 607643
5612 607643 827483 754934 595620 820563 995396 872066 1019415 786024 545833 536687
5602 536687 396268 506404 667307 536558 628444 505997 620382 499782 592110 835502
5592 835502 621061 750415 734982 439654 361911 224890 371688 523717 454575 366235
5582 366235 565446 489435 259688 63581 186139 330425 398123 486757 320147 447116
5572 447116 258192 416665 492400 599964 513265 332137 424160 443191 610695 598887 412596
5561D12596J46345j20111P4117p6591k64764L59619k8730L9298J79905m4139K18414
5550H95959l95765j26261k0970L7499m3945Q8760j35007k4539l3476L9109J25354
5539D06718J56750p773M3428j43312J26807j3938O6881k8783O9936J58583J6661
5528H51958k63237r3231L6559m337k14623n0275J81590m1620j27211K37531J05013
5517F18117O3866j22253m31003K46296O3389o7146J10640K59901k09931n9673
5507D72203L5293k8909j27780k05349K18814M22944m01247L422L64701L4492j19295
5496F69289N2349o8724P8308j3071l95141J6937J91503n5269K4845K6881J14589
5485F42496j44812P3003o6775j2164J56236k94413k1625J06899N9098J49288J44216
$$ plain form
5561 412596 558941 438830 512947 436356 171592 531211 502481 541779 721684 677545 895959
5550 895959 500194 373933 352963 390462 346517 435277 300270 275731 242255 281364 406718
5539 406718 563468 555695 599123 455811 582618 568680 635561 606778 676714 835297 851958
5528 851958 588721 495490 532049 527712 313089 262814 444404 402784 275573 513104 618117
5517 618117 681983 559730 128727 375023 438412 371266 481906 741807 531876 472203
5507 472203 507496 478587 350807 145458 364272 787216 385969 389391 754092 788584 669289
5496 669289 721638 652914 731222 718151 323010 339947 531450 476181 501026 527907 642496
5485 642496 497684 570687 503912 491748 647984 353571 331946 438845 497943 647231 791447
5474G91447k45584K20K7708K01661k34092n3244J2418K27654K05920l08901l7936
5463E87271M94968k0256j76826j57806q1037L31337k11319O612q9529k14587O2500
5452E31328J61339J60658J00033J34467J14579k25912K8104J27721J59221k49415
5442A042123l68887P2221K855M3118L54433k11110J58132K6460j96734J15374
5432A037985j22144p2649K07736K22416l88338r8605J28267O2224m7350N6668
5422I86210K4330J1398K8788j15658j13708R2585J15474p3455j05448r5321K49835
5411A005030J45700k38500M201n4467l6314K17263Q4555K16750n2490k12082j21414
5400I58232J43832L615j80067J47048L583l5190K17727j04267L5740J41741j07689
$$ plain form
5474 791447 545863 546083 573791 775452 541360 488116 500534 728188 934108 625207 587271
5463 587271 1082239 1061983 885157 727351 646314 977651 766332 772944 683415 468828 531328
5452 531328 692667 853325 953358 1087825 1202404 976492 1004596 1132317 1291538 1042123
5442 1042123 673236 745457 748312 791430 1145863 934753 1092885 1119345 922611 1037985
5432 1037985 915841 843192 1050928 1273344 885006 786401 914668 976892 929542 986210
5422 986210 1010540 1021938 1050726 935068 821360 913945 1029419 955964 850516 755195 1005030
5411 1005030 1150730 912230 916431 861964 825650 1042913 1127468 1344218 1291728 1079646 958232
5400 958232 1102064 1105679 925612 1072660 1076243 1041053 1258780 1154513 1190253 1331994 1224305
5389A224305k29282o6491N0586J29603N6707r4343J49778J91937P3192j43322
5379A342670j014k0287j0210p9913N5243J59338o8042P8714j11119J97392p3098
5368A469674l24961n5164K31751O1092N6871k65013K56208N8267k14357j54691
5358A119677L0967K10195o7292J88784q7482m7036R4885P2556j18894J50490j553
5347A545297k30204N5893K99522o3143n0644J35644R8260Q855k02722j93753Q8864
5336A491869J10464K05720P3829R1713L07016l70974j9817j13479p1400Q4878
5326A789819J51631L15070j14706p1193R3350r6602l9452M5187Q5879l4933O6283
5315B190333J01972k15228K23181k2296r4943J94749K45479j9465j15341k18102
$$ plain form
5389 1224305 995023 928532 979118 1108721 1165428 1071085 1220863 1412800 1485992 1342670
5379 1342670 1341656 1321369 1311159 1231246 1286489 1445827 1377785 1456499 1345380 1542772 1469674
5368 1469674 1144713 1089549 1321300 1382392 1439263 1174250 1430458 1488725 1274368 1119677
5358 1119677 1150644 1360839 1293547 1482331 1394849 1347813 1442698 1515254 1396360 1546850 1545297
5347 1545297 1315093 1370986 1670508 1607365 1556721 1692365 1790625 1799480 1596758 1403005 1491869
5336 1491869 1602333 1808053 1881882 1973595 2280611 1909637 1889820 1776341 1704941 1789819
5326 1789819 1941450 2256520 2141814 2070621 2163971 2067369 2027917 2073104 2158983 2124050 2190333
5315 2190333 2292305 2077077 2300258 2277962 2183019 2377768 2623247 2603782 2488441 2270339
5305B270339O8326J76863j08790J01099P4154k4220P8926q0691J37404J5817J6014
5294B725241r7770J3211k42826J13764M3683Q4411n4448N3915J77331J39844j96459
5283B759897J7025J07188n793j01047o7017m6025j20103r3586o3969J47055k6803
5272B506822m4135j29465N8894j0388J89545k4969K282J52480K7954k01076j10904
5261B417040L06721j03984p7145R568M4768K02527Q9323l6500p8114J45991k3813
5250B896382N3957r8292j58679J19085K55737j07694R0679k32991K31234j41184
5240B908234J55166J02650J58691n8019l2426R3271m2372N6232O6200o2434l6366
5229C308827n1737P1039L7411L19294r6j75141J58042k69154O9952K27109J18659
$$ plain form
5305 2270339 2338665 2515528 2406738 2507837 2581991 2557771 2636697 2556006 2693410 2709227 2725241
5294 2725241 2627471 2640682 2397856 2511620 2555303 2639714 2585266 2639181 2816512 2956356 2759897
5283 2759897 2776922 2884110 2878317 2777270 2710253 2664228 2544125 2450539 2386570 2533625 2506822
5272 2506822 2462687 2333222 2392116 2381728 2571273 2546304 2548586 2701066 2729020 2527944 2417040
5261 2417040 2723761 2619777 2542632 2552200 2596968 2799495 2888818 2852318 2774204 2920195 2896382
5250 2896382 2950339 2852047 2693368 2812453 3068190 2960496 3051175 2818184 3049418 2908234
5240 2908234 3063400 3166050 3324741 3266722 3234296 3327567 3285195 3341427 3407627 3345193 3308827
5229 3308827 3257090 3328129 3365540 3684834 3684738 3509597 3667639 3398485 3468437 3695546 3814205
5218C814205q9433K08458m0797j6592r8386O9010j62806O9280P3990R8388P7475
5207D002792R1473J7639Q2338O7811P1080j32473K24244J35119J36430K20076
5197D916529K8931j43531j02229N8647J2435J86229K84471R1061k21395P4713
5187E185861j30525P3151K85788L1957j78463m333L79773J57253r1402K66497
5177E975557q9774K27628p6821j0059m961q2785L37862l5249K24229N6269K15812
5166F737708N6996P9777P3728Q4096K4888k6720J06059J63283j43362K34861Q1475
5155G472789J54979K20778O0559K10209j9955K50005m1705L78180J32680Q6793
5145H905312J69599k61251J59978J5258J85616J98397J79744R0027j1705R3656
$$ plain form
5218 3814205 3724772 3933230 3892433 3875841 3777455 3846465 3683659 3752939 3826929 3925317 4002792
5207 4002792 4094265 4111904 4194242 4262053 4333133 4200660 4424904 4560023 4696453 4916529
5197 4916529 4945460 4801929 4699700 4758347 4770782 4957011 5241482 5332543 5111148 5185861
5187 5185861 5055336 5128487 5414275 5446232 5267769 5263436 5643209 5800462 5709060 5975557
5177 5975557 5885783 6113411 6036590 6026531 6021570 5938785 6276647 6241398 6465627 6521896 6737708
5166 6737708 6794704 6874481 6948209 7032305 7057193 7030473 7136532 7299815 7156453 7391314 7472789
5155 7472789 7627768 7848546 7909105 8119314 8099359 8349364 8307659 8685839 8818519 8905312
5145 8905312 9074911 8813660 8973638 8988896 9174512 9372909 9552653 9642680 9630975 9724631
5135I724631K70701M27033K42426K20005J92283L38308L50351K24798J56622J17547
5125A2264705K60573L34400j4615J33537O22785R3296Q3046K84508M02679L96677
5115A4861591J65804L61786P98022L98188M9094O84938P34535M08626J77121N65275
5105A9204980M25231O47389P29795Q79875J012936J075972P94461P24129R47739
5096B6442507Q40333P11586J192444J213687J569962J835348K251919K153629
5088C8211415K738510L394965L247752K943331J833574N24483l89874m17818L14969
5079E2401307J097941J637256K272254K432540J978279J562400J706172K262983
5071F7351132K752726K612117J501459P24011Q55701J485540K311471L245315
$$ plain form
5135 9724631 9995332 10422365 10664791 10884796 11077079 11415387 11765738 11990536 12147158 12264705
5125 12264705 12525278 12859678 12845063 12978600 13601385 13694681 13777727 14062235 14464914 14861591
5115 14861591 15027395 15389181 16187203 16585391 16634485 17319423 18053958 18462584 18639705 19204980
5105 19204980 19630211 20277600 21007395 21887270 22900206 23976178 24770639 25494768 26442507
5096 26442507 27282840 27994426 29186870 30400557 31970519 33805867 36057786 38211415
5088 38211415 40949925 44344890 47592642 50535973 52369547 52894030 52504156 52086338 52401307
5079 52401307 53499248 55136504 57408758 59841298 61819577 63381977 65088149 67351132
5071 67351132 70103858 72715975 74217434 74941445 75797146 77282686 79594157 82839472
5063H2839472L434419L628124M231695O032421Q477732J0634433R646520L981726
5055A32906542j127698m293250n570950m699843k221975J68954L192913M045916
5047A22400609J528770l24102R41144L235325M320763K515316j873086n152169
5039A27592570n664940l884788j348164N89644p22707m109662m853071l582246
5031A04016636j612901N49647L261534N576892M394755k829024q640245j0318811
5023I4398483j0187214r160347p597676o107048m756830m088166l200020k916304
5015D6384878k471037j815681j969985j775274j318535j327242j328058j202593
5007C3176473r71023o06610o53485o98804p94525j52032l54148m44625m12662
$$ plain form
5063 82839472 86273891 89902015 94133710 100166131 108643863 119278296 128924816 132906542
5055 132906542 131778844 127485594 121914644 117214801 114992826 115161780 118354693 122400609
5047 122400609 123929379 123605277 124546421 127781746 132102509 134617825 132744739 127592570
5039 127592570 121927630 118042842 116694678 117284322 116561615 112451953 107598882 104016636
5031 104016636 102403735 102953382 106214916 111791808 116186563 113357539 104717294 94398483
5023 94398483 84211269 75050922 67453246 61346198 56589368 52501202 49301182 46384878
5015 46384878 43913841 42098160 40128175 38352901 37034366 35707124 34379066 33176473
5007 33176473 32205450 31598840 30945355 30246551 29452026 29299994 28945846 28501221 28088559
4998B8088559j57767k22037m55545l22896j03422K45002M441k40401K9219j22768
4988B6742385k54570N8040K8714j78407J48831R7520K03337j34447L04791L29246
4978B7345440N6528M28002K70366J36829J09076L52068N62576M48168N05679M06241
4968C0620973M30860J61303N55733L33804K97777M81979N54130K94762L09464
4959C4040785N90752L27269O43482R5164N8102O02860N31464M72881O76923M76863
4949C8516545M94211N52932M62085O53783O23253P01371N82786N94781P46783
4940D3928530O03660N33116P28666N71849M57695R07172P65946P18143Q67437
4931E0082214J386617J578939J588507J666846K039552K117966K587026K831586
$$ plain form
4998 28088559 27930792 27708755 27253210 26930314 26826892 27071894 27076335 26835934 26865153 26742385
4988 26742385 26487815 26545855 26574569 26396162 26544993 26642513 26845850 26711403 27016194 27345440
4978 27345440 27401968 27829970 28100336 28237165 28346241 28698309 29260885 29709053 30214732 30620973
4968 30620973 31051833 31213136 31768869 32102673 32400450 32882429 33436559 33731321 34040785
4959 34040785 34631537 34958806 35602288 35697452 35755554 36358414 36889878 37362759 38039682 38516545
4949 38516545 39010756 39563688 40025773 40679556 41302809 42004180 42586966 43181747 43928530
4940 43928530 44532190 45065306 45793972 46365821 46823516 47730688 48496634 49214777 50082214
4931 50082214 51468831 53047770 54636277 56303123 58342675 60460641 63047667 65879253
4923F5879253L085528L914581M619551M505090M658813L741990K404390R19343
4915I3728539o11850j648506k027535j576631j133731k57650N10282J379179K266402
4906I0628499L318078L961355N280808O148731P514664Q832243R365499R093070
4898A44142947P080232L616244j111896n535923q646141r309854q681256p180135
4890A14374218n479940m426623k998255j943953n89386J29894Q84660J859664
4882A01810279K621849L820059L901429L420694J576083r76261l728051n962819
4874A06483262o509471o619170n781811m607190l868769l344831k957255k721543
4866G0073222k891167k745038k947038k787203k729703k570852k339719k002458
$$ plain form
4923 65879253 68964781 72879362 77498913 82004003 86662816 90404806 92809196 93728539
4915 93728539 93116689 91468183 89440648 87864017 86730286 86472636 86982918 88362097 90628499
4906 90628499 93946577 97907932 103188740 109337471 116852135 125684378 135049877 144142947
4898 144142947 151223179 154839423 153727527 148191604 139545463 130235609 121554353 114374218
4890 114374218 108894278 104467655 101469400 99525447 98936061 99065955 99950615 101810279
4882 101810279 104432128 108252187 112153616 115574310 117150393 116174132 112446081 106483262
4874 106483262 99973791 93354621 87572810 82965620 79096851 75752020 72794765 70073222
4866 70073222 67182055 64437017 61489979 58702776 55973073 53402221 51062502 49060044
4858D9060044j949997j448722j482480j010434r00828r21553m29878k57087l52184
4849D0306881L5201k29334k65392o77050o36144q54452j464343j393297j197690
4840C3624380j160216r42110o41254j087667n10410q79349o58974k30354l42861
4831B7171185o01314k03462o21515j90784j72411k29048k33061l24922n5954M0823
4821B4579537j28679m0377m9865K02276p5641J03559K80913N8641J62252M74047
4811B5566663Q7126K46053M05400M30660Q7260L63959O22004M91671O52831Q26699
4801B9780326Q08404R52128Q71522O94641J342022J244071J450621J449470J697166
4792D0290371J846344J849324J643749J421835R08857M96488J88643L6648k45817
$$ plain form
4858 49060044 47110047 45661325 44178845 43168411 42267583 41346030 40916152 40659065 40306881
4849 40306881 40342082 40112748 39847356 39170306 38534162 37679710 36215367 34822070 33624380
4840 33624380 32464164 31522054 30880800 29793133 29282723 28403374 27744400 27514046 27171185
4831 27171185 26569871 26366409 25744894 25554110 25381699 25152651 24919590 24594668 24538714 24579537
4821 24579537 24450858 24410481 24360616 24562892 24487251 24590810 24871723 24930364 25092616 25566663
4811 25566663 25653789 25899842 26305242 26735902 26823162 27187121 27809125 28300796 28953627 29780326
4801 29780326 30588730 31540858 32412380 33107021 34449043 35693114 37143735 38593205 40290371
4792 40290371 42136715 43986039 45629788 47051623 47960480 48456968 48645611 48682259 48436442
4783D8436442J3456K71346K88560P45915N98240Q11153R27313J411664J692108
4774E5196197K016528K024157K586976K468970J749462Q14761k1038j104547j734596
4765F3996870j659604j604729j050313r01306l14833k32756q6988L94319N19245
4756E9059905Q08618Q61278Q74152J333057J619379J742481J364988J542919J365986
4747G0572763J634340J604177J844735K370959L573330M658203N853058P114362
4739I9225927Q546096R054155O572988K658313j752897m721030n491002n194700
4731A08897850l839645k159688j209981L43675J719950K506190L564228M144336
4723A13966915M915810O332854Q318460J0860783J3468339J0891581L493057l897289
$$ plain form
4783 48436442 48449898 48721244 49009804 49755719 50353959 51165112 52092425 53504089 55196197
4774 55196197 57212725 59236882 61823858 64292828 66042290 66857051 66836013 65731466 63996870
4765 63996870 62337266 60732537 59682224 58780918 58466085 58233329 58146341 58540660 59059905
4756 59059905 59868523 60729801 61603953 62937010 64556389 66298870 67663858 69206777 70572763
4747 70572763 72207103 73811280 75656015 78026974 81600304 86258507 92111565 99225927
4739 99225927 107772023 116826178 123399166 126057479 124304582 119583552 114092550 108897850
4731 108897850 105058205 102898517 101688536 102032211 103752161 106258351 109822579 113966915
4723 113966915 118882725 125215579 133534039 144394822 157863161 168754742 172247799 168350510
4715A68350510q558061j1360301j1781582j0435210q543221o079088m289098k969521
4707A04334428j266418n3643K39893J55691j16608K98913N50164J252945J793078
4698A07188443Q11082r39900k634519m510035n192286m770880m146768k947308
4690H2857829k009387j051929l8484P73155J881206K074580J101291n14336j485994
4681H3587931j874529k521990j756345j395754p4234M60557K10650o48491l6523
4672G5951272M37833O04647J331623R72394N47829n32989o69136o57898j12663
4663G7872912l12533m75808j000075j034033K07181J190126J708830K499040K609727
4654H3265367K784191K178938J751806J943544L040835M638780O767581R025745
$$ plain form
4715 168350510 159792449 148432148 136650566 126215356 117672135 111593047 107303949 104334428
4707 104334428 103068010 103014367 103254260 103409951 103293343 103592256 104142420 105395365 107188443
4698 107188443 107999525 107059625 104425106 99915071 94722785 89951905 85805137 82857829
4690 82857829 80848442 79796513 79758029 80531184 82412390 84486970 85588261 85073925 83587931
4681 83587931 81713402 79191412 77435067 76039313 75965079 76425636 76636286 75987795 75951272
4672 75951272 76389105 76993752 78325375 79297769 79845598 79312609 78643473 77985575 77872912
4663 77872912 77560379 77084571 76084496 75050463 75257644 76447770 78156600 80655640 83265367
4654 83265367 86049558 88228496 89980302 91923846 94964681 99603461 106371042 115396787
4646A15396787R833212N784690r85181m896155n231873m579344k235086N74112
4638A13661162L049477L863120J417427p28132p04649J061981L432222N409750
4630A30462358L313064j161862m309782m592498l078612j530364k370428m856489
4622A11875387o254822m970789l397376j565536J062580L098317M212256J307566
4614A05367583m691813q767916r088503q321793p896088o272015n460932m265742
4606E0602781l431384l012771k406114k107433j691255j590919j563362j198630
4598C3600913j131604p50680n81423r29441o56348o97250r44146r05477p42781
4589B6261763n81461o54416n96027o02143n07069l36901k13457k39399n9363J82815
$$ plain form
4646 115396787 125229999 131014689 130029508 125133353 119901480 115322136 113087050 113661162
4638 113661162 116710639 120573759 121991186 121263054 120558405 121620386 125052608 130462358
4630 130462358 133775422 132613560 128303778 123711280 120632668 119102304 116731876 111875387
4622 111875387 105620565 100649776 97252400 95686864 96749444 99847761 104060017 105367583
4614 105367583 100675770 91907854 82819351 74497558 66601470 60329455 54868523 50602781
4606 50602781 47171397 44158626 41752512 39645079 37953824 36362905 34799543 33600913
4598 33600913 32469309 31718629 31137206 30207765 29551417 28854167 27910021 27004544 26261763
4589 26261763 25680302 25025886 24429859 23827716 23320647 22983746 22770289 22530890 22471527 22654342
4579B2654342j77788j28775k06485M6433k28388N3849k93753K22741j72986o33744
4569B1135446j281877j208040p35766p28877o23141o34458l05802l35010l47229
4560A4935246J62709r1l97365l10323J6189j60793m55869m50490k87648o80337
4550A2371228n25066k53147n13106k96032j88933p490l46460l62352k8367p577
4540I842698q1751k32969j51478k77315p9974j46131j47536n5837l21128p4492
4530H274087m07242K1124j95262q3634k39644n7449j62724J88419R592j82951
4520G164316k18001m03433j9938N847p6225p3483M28495m24194j48387J54817
4510F389814o7783r5238j03614J89801k22166m8452J22010k727M717r2358p9552
$$ plain form
4579 22654342 22476554 22347779 22141294 22187727 21959339 22013188 21719435 21942176 21769190 21135446
4569 21135446 19853569 18645529 17909763 17180886 16557745 15923287 15617485 15282475 14935246
4560 14935246 15097955 15097864 14700499 14390176 14406365 14245572 13789703 13339213 13051565 12371228
4550 12371228 11846162 11593015 11079909 10783877 10594944 10587454 10240994 9878642 9850275 9842698
4540 9842698 9760947 9527978 9376500 9099185 9019211 8873080 8725544 8669707 8348579 8274087
4530 8274087 7866845 7887969 7692707 7609073 7369429 7311980 7149256 7337675 7347267 7164316
4520 7164316 6946315 6542882 6522944 6528791 6452566 6379083 6807578 6383384 6234997 6389814
4510 6389814 6322031 6226793 6123179 6312980 6090814 6042362 6164372 6161645 6166362 6074004 5994452
4499E994452j45825J023J25643l7693j01956J24065q2897N1758j66706K4452K01466
4488E987782l09838J70942o8763L53515J75198k41461M7021J33834j81791J2956
4478F079395K462j79759o1425K20247j62679J18622k4004R585k01616j39866j04018
4467E556944J18171J74025k1178j16799Q1120k15207l20666N5212n478P6633l91332
4456D991445J32890L07700n2479j57955k11200j35608N4742k16648j19409J57444
4446D750922Q1711J89484O6954j73053q9544j1814L4897l7904j16163j64648K18028
4435D748870l5416j34849k70743M5140j539M5607j31586J67512o6893P5524Q5603
4424D527230j25774K8134K37846j97240M0484o3979R7803j43281K7310J71368
$$ plain form
4499 5994452 5848627 5849650 5975293 5937600 5835644 5959709 5876812 5928570 5761864 5786316 5987782
4488 5987782 5677944 5848886 5780123 6133638 6308836 6067375 6114396 6248230 6066439 6079395
4478 6079395 6081857 5902098 5840673 6060920 5898241 6016863 5992859 6002444 5800828 5660962 5556944
4467 5556944 5675115 5849140 5827962 5711163 5792283 5577076 5256410 5311622 5306144 5382777 4991445
4456 4991445 5124335 5432035 5379556 5221601 5010401 4874793 4929535 4712887 4593478 4750922
4446 4750922 4832633 5022117 5089071 4916018 4826474 4814660 4849557 4811653 4695490 4530842 4748870
4435 4748870 4713454 4578605 4307862 4353002 4351463 4397070 4265484 4432996 4366103 4441627 4527230
4424 4527230 4401456 4429590 4667436 4470196 4510680 4446701 4544504 4401223 4428533 4599901
4414D599901N023K47892j26381p418k11659n3464n4200J46552j08213K60396j6196
4403D682233N3708K51180p062j84703q7686L8539Q053l8094K21178n820L9062
4392D970588J35201Q5872J7798o8544J34113L48299m2705j30800N0696R0116J95643
4381E786277Q2135J18153K50819N7954N36261K32812J15667O5998J77386L52823
4371G776285L48582L19162L45961P89552M85283L35869k75789k06115l45343l48079
4361I225368l01450k71324k04134L4500J61449j01274L60784K01104L21450L42537
4351I769010L78385N98591P90399O64853J121153J606044J768122K488578K240938
4342B1426073J162115m56550j540413k088186j783793j548379j116707j086857
$$ plain form
4414 4599901 4604924 4852816 4726435 4719017 4507358 4453894 4399694 4546246 4438033 4698429 4682233
4403 4682233 4735941 4987121 4980059 4795356 4707670 4746209 4754262 4716168 4937346 4931526 4970588
4392 4970588 5105789 5191661 5209459 5140915 5275028 5623327 5580622 5449822 5500518 5590634 5786277
4381 5786277 5868412 5986565 6237384 6295338 6831599 7064411 7180078 7246076 7423462 7776285
4371 7776285 8124867 8444029 8789990 9579542 10064825 10400694 10124905 9918790 9573447 9225368
4361 9225368 8923918 8652594 8448460 8482960 8644409 8543135 8903919 9105023 9426473 9769010
4351 9769010 10147395 10745986 11536385 12201238 13322391 14928435 16696557 19185135 21426073
4342 21426073 22588188 22131638 20591225 18503039 16719246 15170867 14054160 12967303
4334A2967303o48420n05835m16297l04919J47953j25217J12377L64398K86473
4325A1877816M70995N35973N83515J131240J428410J839322J901304J839079K84010
4316B1891664j333707j662295j754295j445172j169468r05510q03396o11563p38737
4307A1467521j54193j98950m52665O5956j8847j40011l4621j32044k4940L26634
4297A0703840M89345M88392P79981M75073K27298k55905j31430m77133m01051
4288A1898410l49027j54923n8052m38867o021k75495l65197m70450j24394P6412
4278I732396k45143N0051j44072l1329o0944j613n351K83086O7194O8499J65095
4267I877869K71314J71909K5826L98240M86623M11276J99545l4284K5471k56003
$$ plain form
4334 12967303 12318883 11813048 11396751 11091832 11239785 11114568 11226945 11591343 11877816
4325 11877816 12348811 12884784 13468299 14599539 16027949 17867271 19768575 21607654 21891664
4316 21891664 20557957 18895662 17141367 15696195 14526727 13621217 12817821 12206258 11467521
4307 11467521 11313328 11114378 10661713 10727669 10708822 10568811 10534190 10402146 10377206 10703840
4297 10703840 11193185 11681577 12461558 12936631 13163929 12908024 12776594 12299461 11898410
4288 11898410 11549383 11394460 11336408 10897541 10891520 10616025 10250828 9780378 9655984 9732396
4278 9732396 9487253 9537304 9393232 9361903 9300959 9299346 9293995 9577081 9644275 9712774 9877869
4267 9877869 10149183 10321092 10346918 10745158 11231781 11643057 11842602 11808318 11833789 11577786
4257A1577786k24442m57121o0306k72578j17500k4008j72696p8168L0575J05928
4247A0307470j40868r336K7144N9687J36151K00303K87798M71442K31604M4220
4237A1615615L62219K72399J08060J07954k56321k47847j58406N0172j07504J4754
4227A1761095j31145j99980k42053J10722j81556l7431J61924J24839R6059P2423
4217A1534897Q9566K71345K98775N3146K38224L91405M27096K50569K60570K44508
4207A4060101K68220K47031K82202K76542M95700K10738O55128N46839P68602
4198A7811103P57198J253572J867019J550346Q311q00899r80839p67111l23600
4189B0375100o09383J37666J9286K04806M54524N81954N15570L63261N67198M34372
$$ plain form
4257 11577786 11353344 10896223 10835917 10563339 10445839 10421831 10249135 10170967 10201542 10307470
4247 10307470 10166602 10157266 10184410 10244097 10380248 10580551 10868349 11339791 11571395 11615615
4237 11615615 11977834 12250233 12358293 12466247 12209926 11962079 11803673 11853845 11746341 11761095
4227 11761095 11629950 11429970 11187917 11298639 11117083 11079652 11241576 11366415 11462474 11534897
4217 11534897 11624463 11895808 12194583 12247729 12485953 12877358 13304454 13555023 13815593 14060101
4207 14060101 14328321 14575352 14857554 15134096 15629796 15840534 16495662 17042501 17811103
4198 17811103 18568301 19821873 21688892 23239238 23247549 22446650 21465811 20698700 20375100
4189 20375100 19765717 19903383 19922669 20127475 20581999 21163953 21679523 22042784 22609982 23044354
4179B3044354J32514K07785J65113K43642L66863O72522P95252Q83285P58822
4170B7270152J018802Q71347J208409J106035R70248J418481J444228J065914
4162C6373616J485592J505083J229602J049356R84457J278971J757214K082076
4154D7745967K589247L013141L595115L466876M063962M734444N289245N916272
4146H0414269P635891R083179J0959587J1939864J4307799J8880989K4316415
4139A77537993J2810201j0887897j8462015j7384767j5419064j0808383p291510
4132A10094558m661379k154282r67407J518052K978563M346989O092158P607236
4124A24854488P275103L988473M50140M36296J471463L458304N530959Q018178
$$ plain form
4179 23044354 23176868 23384653 23549766 23793408 24160271 24832793 25628045 26511330 27270152
4170 27270152 28288954 29160301 30368710 31474745 32444993 33863474 35307702 36373616
4162 36373616 37859208 39364291 40593893 41643249 42627706 43906677 45663891 47745967
4154 47745967 50335214 53348355 56943470 60410346 64474308 69208752 74497997 80414269
4146 80414269 88050160 97133339 108092926 120032790 134340589 153221578 177537993
4139 177537993 190348194 179460297 160998282 143613515 128194451 117386068 110094558
4132 110094558 105433179 103278897 102311490 103829542 106808105 111155094 117247252 124854488
4124 124854488 132129591 136118064 136568204 137004500 138475963 141934267 147465226 155483404
4116A55483404J0034754J3592106J8131371K3819457L1333054M6215284O1000408
4109C59609838Q0423558M0905104l9991289o3245537o0169801n4357429m1638857
4102B21535587l1807874k3987781j8200493j4306560j0525496q341014o980406
4095A07385963o755334o273886o289332n289294m240795l214817k899651j892870
4087G0529984j810247p25803p5616N58225J173344J961954K800231L789218N263847
4078H3465137P783116J1140958J4807778J4436346l38347j2621620j4523696j4291609
4070H9858063j2154505r359965p269152n728070m460352l685725k819666k521479
4062D1859149k315071k040508k063018k200721j670537j368122r85667j028532
$$ plain form
4116 155483404 165518158 179110264 197241635 221061092 252394146 298609430 359609838
4109 359609838 440033396 480938500 440947211 377701674 317531873 263174444 221535587
4102 221535587 189727713 165739932 147539439 133232879 122707383 114366369 107385963
4095 107385963 100630629 94356743 88067411 82778117 78537322 75322505 72422854 70529984
4087 70529984 68719737 67993934 67918318 68476543 69649887 71611841 74412072 78201290 83465137
4078 83465137 91248253 102389211 117196989 131633335 131294988 118673368 104149672 89858063
4070 89858063 77703558 68343593 61074441 55346371 50886019 47200294 44380628 41859149
4062 41859149 39544078 37503570 35440552 33239831 31569294 30201172 29215505 28186973
4054B8186973r61791r84153n73641m92268p42633l52065l76413j10808J59294
4045B3752495j55928l75624o186J23861R5320Q5416j36082j66045J4823M66781
4035B3698831M67301O98117J118138R60704M40501Q30522J359711J606630K759901
4026C3940356L960421N526202P048152L501631l469730o041805o141586n458014
4018C2865627m397481l268694k218008j774265j698662j179710q88202r40690
4010A6499915r89548n14016l71846m67082n23274o32860o94781n30373r44804
4001A0831331k68249p17639n61239j94166l16331j93897n20107L7464j04511j50040
3991G842616j45872j26706k65682l49691j26943k75234k45514j12541n6181k18797
$$ plain form
4054 28186973 27225182 26241029 25667388 25175120 24432487 24080422 23704009 23593201 23752495
4045 23752495 23596567 23220943 23214757 23338618 23433938 23519354 23383272 23217227 23232050 23698831
4035 23698831 24166132 24864249 25982387 26943091 27383592 28214114 29573825 31180455 33940356
4026 33940356 37900777 43426979 50475131 53976762 50507032 44465227 38323641 32865627
4018 32865627 28468146 25199452 22981444 21207179 19508517 18328807 17440605 16499915
4010 16499915 15510367 14996351 14624505 14157423 13634149 13001289 12306508 11776135 10831331
4001 10831331 10563082 9845443 9284204 9090038 8773707 8579810 8059703 8097167 7992656 7842616
3991 7842616 7696744 7570038 7304356 6954665 6827722 6552488 6306974 6194433 6138252 5919455
3981E919455j82080j18067l18091k26133Q4139k5632k28905L2415k21309m2372
3971D673420M307j09651j63178j38868l13514q9305N644J98161R969j83857j76115
3960C717013l6850m7855P2420k37911k38804K50317J42188j88663k86522J79561
3950C324894J23744j62079p448q8557l00492j57547J50013j82509q0618q3344
3940B536057Q5853P8899l29684J02585k8429p2535Q1719l054l9496j04631P8395
3929B385679K24545l04148k06793J96853q1931j112J33061j16836k4338j32288
3919B072692j50621J5136K70490j03782K8316J13401k38604j57767m3158k1352
3909A784751J58939J26713P4832K04797P9474j58778L02237J73475k3563l10346
$$ plain form
3981 5919455 5737375 5619308 5301217 5075084 5159223 5133591 4904686 4937101 4715792 4673420
3971 4673420 4677727 4568076 4404898 4266030 3952516 3863211 3868855 4067016 4076985 3893128 3717013
3960 3717013 3680163 3632308 3704728 3466817 3228013 3478330 3620518 3431855 3145333 3324894
3950 3324894 3448638 3286559 3279111 3190554 2890062 2732515 2882528 2700019 2619401 2536057
3940 2536057 2621910 2700809 2371125 2473710 2445281 2372746 2454465 2451411 2411915 2307284 2385679
3929 2385679 2610224 2306076 2099283 2296136 2214205 2213093 2346154 2229318 2204980 2072692
3919 2072692 1922071 1937207 2207697 2103915 2132231 2245632 2007028 1849261 1806103 1784751
3909 1784751 1943690 2070403 2145235 2350032 2429506 2270728 2572965 2746440 2722877 2412531
3899B412531k17708K4271k9460M5413p0469L4893m1523j09223p4613J5210O2554
3888B051876j5825Q715J00979j21609R0036M2395K80k90125J41169O4905l3706
3877B039090J66482J44214O9038J53535K79747L96074K61933K55833p8403m38681
3867C248862l97172j50934n83922j21771P234m91781o7850J91387j55733j00477
3857A377843J77185o9307J77219j00885j42755j54563k6521o4778P3685j47526
3847A099597o1282J60439j76278j20076K51762J69020o9432J29843K50031k06394
3837A427230P6439J04635j79981n4011j77365M946j25169L3331m6663j96781J17257
3826I83868M2223J49182l3649o9147O9605p2424m3478j31353j04570K0279m4822
$$ plain form
3899 2412531 2194823 2219094 2189634 2235047 2164578 2199471 2157948 2048725 1974112 1989322 2051876
3888 2051876 2036051 2044766 2145745 2024136 2114172 2156567 2156847 1866722 2007891 2072796 2039090
3877 2039090 2205572 2349786 2418824 2572359 2852106 3248180 3510113 3765946 3687543 3248862
3867 3248862 2851690 2700756 2116834 1995063 2002297 1510516 1442666 1634053 1478320 1377843
3857 1377843 1555028 1485721 1662940 1562055 1419300 1264737 1238216 1173438 1247123 1099597
3847 1099597 1038315 1198754 1022476 902400 1154162 1323182 1253750 1383593 1633624 1427230
3837 1427230 1503669 1608304 1428323 1374312 1196947 1201893 1076724 1110055 1063392 866611 983868
3826 983868 1026091 1175273 1141624 1072477 1142082 1069658 1026180 894827 790257 810536 765714
3815G65714J90943j74036n7243k7743k8020k21371L23027J68754j95112J17971
3805H62884j14741j5498L6046J87871q2124K0950j71589J57222P5918k00157p668
3794G49114J2331J65478j22343j6998K66151j90551P9987K036j34491P1121r1552
3783G90283n084k6886K24094q6954k62786j76886L15040p0109n8051O7353j59014
3772E51000K49224o5119q3728o1867K609j08004M0188Q8349K2681O4790m1690
3761F58433M9845J7094J00109o8999k11852k7554J89845P2223q6656Q4251r0478
3750F86261N1951P961J4443j93025r0693K34445o8790J27822P4890k44817k8213
3739E72235M4451k69814J9479j8969J04379J30089q6786J9074K66539j17830K1524
$$ plain form
3815 765714 956657 782621 725378 697635 669615 448244 771271 940025 744913 862884
3805 862884 748143 732645 768691 956562 874438 895388 723799 881021 956939 756782 749114
3794 749114 761445 926923 804580 787582 1053733 863182 943169 945205 810714 881835 790283
3783 790283 785199 758313 982407 895453 632667 455781 770821 700712 642661 710014 551000
3772 551000 800224 735105 651377 589510 592119 484115 524303 612652 635333 700123 658433
3761 658433 708278 725372 825481 756482 544630 517076 706921 779144 692488 776739 686261
3750 686261 738212 746173 760616 567591 476898 711343 642553 770375 845265 600448 572235
3739 572235 616686 346872 366351 347382 451761 581850 495064 514138 780677 662847 684371
3728F84371r330k05769m3551n1993P655N837J23590j00237K08101O3159j41027
3717E40806N9991O0836l2767n0113M2795M236J21319Q5797j81617K0176l5049
3706F36410K55947q352j23199J28312q9938J5713k10770J0814K42207k65234M6325
3695F38235K37741j07721P1460j34207P7503J75913k26861n4452n6004J57313
3685G78920P4230Q307K2345m7197j66957K54989j25453J20511j34422J3286R8827
3674H97386k45077K0080O3686L4162K00589j34758j69874J12651o9419Q475M0161
3663G58062o0665J59277J31002j34681P1887P0944o10j15841R8164o56J73217
3652A150100k32952J03259R7705K94074L60644J01683j22585q2731J2035n21267
$$ plain form
3728 684371 675041 469272 425721 373728 381383 387220 510810 410573 618674 681833 540806
3717 540806 600797 661633 628866 578753 621548 625784 747103 832900 651283 671459 636410
3706 636410 892357 884005 760806 889118 799180 814893 604123 614937 857144 591910 638235
3695 638235 875976 768255 839715 705508 783011 958924 732063 677611 621607 778920
3685 778920 853150 861457 883802 836605 669648 924637 799184 919695 785273 798559 897386
3674 897386 652309 672389 736075 770237 970826 836068 666194 778845 709426 717901 758062
3663 758062 697397 856674 987676 852995 924882 995826 995216 879375 977539 976883 1150100
3652 1150100 917148 1020407 1118112 1412186 1772830 1874513 1751928 1669197 1681232 1159965
3642A159965q556o1120Q6123o1879r6568P4676j15092j56996j10719J04623M2192
3631H56649P3446j17224P1400J65282k09038j47210k7698P1228Q9928J14630P5169
3620A016562j54544J81688j91472Q6288n365k24145K9825J90539j7532j544k7686
3609H82614m3434J37268J0613j08965K44330m6301N4852k71382Q1785j07706j4648
3598H19026O9942R4683j10143j4010j5346k55494J59705j49637J7556K7400K16280
3587H59962j0316o3524Q7522L2607K40720K22917K1137j81869j56718J58972j98291
3576A013119O5634K6513J7718R7450J26917k69141k29035M1980J16305q6086n8447
3565H62927J4404Q7349k07738P2230N0189Q9910J12178j1607k93701j66105P3830
$$ plain form
3642 1159965 1151409 1090289 1176412 1114533 1017965 1092641 977549 820553 709834 814457 856649
3631 856649 930095 812871 884271 1049553 840515 693305 665607 736835 826763 941393 1016562
3620 1016562 862018 1043706 852234 938522 933157 709012 738837 929376 911844 910300 882614
3609 882614 839180 976448 987061 878096 1122426 1076125 1130977 859595 941380 833674 819026
3598 819026 888968 983651 873508 859498 844152 588658 748363 598726 616282 643682 859962
3587 859962 849646 786122 873644 906251 1146971 1369888 1391025 1209156 1052438 1211410 1013119
3576 1013119 1078753 1105266 1122984 1220434 1347351 1078210 849175 891155 1007460 921374 862927
3565 862927 877331 964680 756942 829172 879361 969271 1081449 1069842 776141 610036 683866
3554F83866K01768J37228j9044j11779N8429J17026j45691m3717R1993J24780
3544A094859r6547N1402P9748R1903K6589j13038J24637Q7586Q6969O6542j92781
3533A307869K8302j34615j35781J72288K479O6862N5572P7759p402J8534J7581
3522A469448k21105J54750O5349J13609P4245K3579m1446r2908J26983j01335
3512A571169l8708N4137O2530J7086O9489J92905l1746j1171L71182o0982r0924
3501B104967R4855j66377J90481j87316m2356N4244q7482J46531l4302p995L33064
3490B398314q3115o8445k9377M7976J2931J06834L6762J656j45613O6295N1090
3479B395308o7298j93053j24708N2365M6830P6032j08388J86839o9960r306k68558
$$ plain form
3554 683866 885634 1022862 1003818 892039 950468 1067494 921803 878086 970079 1094859
3544 1094859 998312 1049714 1129462 1221365 1247954 1134916 1259553 1347139 1434108 1500650 1307869
3533 1307869 1336171 1201556 1065775 1238063 1240542 1307404 1362976 1440735 1433333 1451867 1469448
3522 1469448 1248343 1403093 1468442 1582051 1656296 1679875 1638429 1545521 1672504 1571169
3512 1571169 1532461 1586598 1649128 1666214 1735703 1928608 1896862 1885691 2256873 2195891 2104967
3501 2104967 2199822 2033445 2223926 2036610 1994254 2048498 1961016 2107547 2073245 2065250 2398314
3490 2398314 2315199 2246754 2217377 2265353 2278284 2385118 2421880 2423536 2277923 2344218 2395308
3479 2395308 2328010 2134957 2010249 2062614 2109444 2185476 2077088 2263927 2193967 2184661 1916103
3468A916103J98682K00877n846k15242n8818J39191J45920K1878l11J12635j96464
3457B258605l5776K72237n1367n7703K6462k22624K30201J14795k60553J81733
3447B456010J0965k04727K8416L2350M671q2279R5440p6552j02013J34151j10780
3436B185652R113K91203O2115o1014o8621l8823j22314K3072J28663P7437o2345
3425B424138O7374j28839J50993j858O3088r5877o4084J55266j59373o5133J34506
3414B480201J11252Q9607k47252q6534J49762P4967J70155j12843J08838O2147
3404B800300j30907j2099J37826m6901J87546j72998j70759K06040J82929P3083
3394C054060m5665K3394J75472j89575j66458L37169o0831p7774j78113K9048
$$ plain form
3468 1916103 2114785 2315662 2309816 2094574 2035756 2174947 2320867 2342745 2342434 2455069 2258605
3457 2258605 2222829 2495066 2443699 2385996 2412458 2189834 2420035 2534830 2274277 2456010
3447 2456010 2466975 2262248 2290664 2323014 2327685 2245406 2340846 2264294 2162281 2296432 2185652
3436 2185652 2194765 2485968 2548083 2487069 2418448 2379625 2257311 2280383 2409046 2486483 2424138
3425 2424138 2491512 2362673 2513666 2511808 2574896 2479019 2414935 2570201 2410828 2345695 2480201
3414 2480201 2591453 2681060 2433808 2347274 2497036 2572003 2742158 2629315 2738153 2800300
3404 2800300 2669393 2657294 2795120 2748219 2935765 2762767 2592008 2798048 2980977 3054060
3394 3054060 3008395 3031789 3207261 3017686 2851228 3188397 3127566 3049792 2871679 2900727
3384B900727K35681J5795K7291J60916k5914j6706K73214O3431k62591J54763
3374C526607K94617k84001j81171k301J3029J18452K80830K03145J01223o0320
3364D010110J71859q6084J12693J11815k11228o0043K07580K30985j07656k69130
3354D110901J05694K29579J9305K03016L1351L5222O9367k93494L15025L13588
3344E139554K3214J02209J67456J38756q0088q5261K40492J08328L749J91899
3334E950308Q2144m2103Q0362N3379M99668J01334J0831K79613P9223J49622M12891
3323G657272j40756J29441M56574J46902L20287K30287J83499K58939L98977P9427
3313I720849K70035L49007M77131K15710M54376M97461M70279N96235M45167J68074
$$ plain form
3384 2900727 3136408 3152203 3179494 3340410 3314496 3297790 3571004 3634435 3371844 3526607
3374 3526607 3821224 3537223 3356052 3353751 3366780 3485232 3766062 3969207 4070430 4010110
3364 4010110 4181969 4095885 4208578 4320393 4109165 4049122 4256702 4487687 4380031 4110901
3354 4110901 4216595 4446174 4465479 4668495 4699846 4735068 4804435 4510941 4825966 5139554
3344 5139554 5162768 5264977 5432433 5571189 5491101 5405840 5646332 5754660 5758409 5950308
3334 5950308 6032452 5990349 6070711 6124090 6623758 6725092 6735923 7015536 7094759 7244381 7657272
3323 7657272 7516516 7645957 8102531 8249433 8569720 8800007 8983506 9242445 9641422 9720849
3313 9720849 9990884 10339891 10817022 11032732 11487108 11984569 12454848 13051083 13496250 13664324
3303A3664324L95367N66883N70401N53412M44516M34748M37004K15263M01532
3294A7683450K28158J49220j32868L3293k56225q4189k12028k20264m17192l59848
3284A6411507l06544k79739n01036l99972n80486k71297k37341l46566l02191
3275A3186335n98624j22701j81783l38250k51923k93822l13408j88316k07928
3266A0689580l58021n9480J18013l87363j84070l57162J21991o025J4686l13085
3256I279064j74951k31674J43781k12268k641l218n5060J29632k61044J6708o2059
3245H566270J40781j6109k76101j44528l65258m4273o3083J45706L01358k59978
3235G984785k34950k2950J95071n8256J53893N967j32333L9583j27924o6829K05565
$$ plain form
3303 13664324 14059691 14626574 15196975 15750387 16194903 16629651 17066655 17281918 17683450
3294 17683450 17911608 18060828 17927960 17961253 17705028 17620839 17408811 17188547 16771355 16411507
3284 16411507 16104963 15825224 15324188 14924216 14343730 14072433 13835092 13488526 13186335
3275 13186335 12587711 12465010 12283227 11944977 11693054 11399232 11085824 10897508 10689580
3266 10689580 10331559 10272079 10390092 10002729 9818659 9461497 9583488 9577463 9592149 9279064
3256 9279064 9104113 8872439 9016220 8803952 8801311 8798093 8743033 8872665 8611621 8628329 8566270
3245 8566270 8707051 8690942 8414841 8270313 7905055 7860782 7797699 7943405 8244763 7984785
3235 7984785 7749835 7726885 7921956 7863700 8017593 8023560 7891227 7930810 7802886 7736057 7941622
3224G941622n8600K10101j39043j95882J94518m990R631j02618j2891m1585M7190
3213G847453r0711j03575J58112J09414J74484J75521K78905k01835k12461L07874
3203H443181p2930p6215q662R7743J9862Q1164K63602j6185l72760J99406L1288
3192H589494m0067j79827k37874J89170Q3965L56923j20448p9978J54976P9278
3182H795612J47535L9018J53875J20569K3476j61654k08126p3346J5177J86842
3172I038978R1370J2444O0945l4276J27470M0871m1873k83001j95170M8445q3557
3161H782646L12812K73785m7399Q5697o4856N9468n3716n4220J95169k2000J03028
3150I570414k81018j54500n7265J65604k4006j95093J77757j0049j31106J97580
$$ plain form
3224 7941622 7883022 8093123 7954080 7758198 7952716 7947726 7957357 7854739 7841848 7800263 7847453
3213 7847453 7756742 7653167 7811279 7920693 8095177 8270698 8549603 8347768 8135307 8443181
3203 8443181 8370251 8294036 8285374 8383117 8402979 8484143 8747745 8731560 8358800 8558206 8589494
3192 8589494 8549427 8369600 8131726 8320896 8404861 8761784 8641336 8561358 8716334 8795612
3182 8795612 8943147 8982165 9136040 9256609 9280085 9118431 8910305 8836959 8852136 9038978
3172 9038978 9130348 9142792 9203737 9169461 9296931 9337802 9295929 9012928 8817758 8866203 8782646
3161 8782646 9095458 9369243 9321844 9407541 9342685 9402153 9348437 9294217 9489386 9467386 9570414
3150 9570414 9289396 9134896 9077631 9243235 9219229 9024136 9201893 9191844 9060738 9258318
3140I258318m44115O5423J26624j30910P7757L526o4978L08517r6840J6885J72299
3129I292506n8938j07800k4966L3960o93o0903q0613K66158j66953J14269l17487
3118H888540K43405P4349J30134J03240j99961p402J02914j51523J84803K20798
3108I589297O4013M5995O0969r2721J26298L30523m0076j95922M472Q7085M46
3097I980379K61746J86979k50497L39853L10403K07201K94251N566R6087N5990
3087A1487958m1166K43128O2680K43987J42201O1972J30108p5060K2484J55456
3077A2433748L83550k73746L14978J67004J06948J75309J00472K47463L90811
3068A4046537K62134L32209L36601J53875J88254J21303N11061J40272P4391n7433
$$ plain form
3140 9258318 8814203 8879626 9006250 8875340 8953097 8956623 8891645 9200162 9103322 9120207 9292506
3129 9292506 9233568 9125768 9100802 9134762 9134069 9073166 8992553 9258711 9091758 9206027 8888540
3118 8888540 9131945 9206294 9336428 9439668 9239707 9232305 9335219 9183696 9368499 9589297
3108 9589297 9653310 9699305 9760274 9667553 9793851 10124374 10084298 9888376 9892848 9979933 9980379
3097 9980379 10242125 10429104 10178607 10518460 10828863 11036064 11330315 11335881 11431968 11487958
3087 11487958 11446792 11689920 11752600 11996587 12138788 12200760 12330868 12255808 12278292 12433748
3077 12433748 12817298 12543552 12858530 13025534 13132482 13307791 13408263 13655726 14046537
3068 14046537 14308671 14640880 14977481 15131356 15319610 15440913 15951974 16092246 16166637 16109204
3058A6109204L3569K29101J8125J85966M8323K24918M08755K86625L5961K54120
3048A7834667L53905L19750N76942K41218M05504L11474L2940L96198M60065N58622
3038B1491285L80802L37002M35798O80576L81681M5573K65079O20439K57149K78681
3028B5174065L60835J57605K43901P44150N26931L14547P00192O75828M92592
3019B9390646N59372O30828O56367Q77360Q03049J060358Q47991P94888J045812
3010C6666671J207953P99721N46251J117790Q46712Q48514Q44015P88604R52425
3001D4618656R96733Q55318J069280J055333J480140J112884J603753J697697
2993E4489794J839727J951260J832306K260332K113704K283565K624574K938533
$$ plain form
3058 16109204 16142773 16371874 16389999 16575965 16624288 16849206 17257961 17544586 17580547 17834667
3048 17834667 18188572 18508322 19085264 19326482 19731986 20043460 20076400 20472598 20932663 21491285
3038 21491285 21872087 22209089 22644887 23325463 23707144 23752717 24017796 24638235 24895384 25174065
3028 25174065 25534900 25692505 25936406 26680556 27207487 27522034 28222226 28898054 29390646
3019 29390646 29950018 30580846 31237213 32114573 32917622 33977980 34825971 35620859 36666671
3010 36666671 37874624 38674345 39220596 40338386 41185098 42033612 42877627 43666231 44618656
3001 44618656 45615389 46470707 47539987 48595320 50075460 51188344 52792097 54489794
2993 54489794 56329521 58280781 60113087 62373419 64487123 66770688 69395262 72333795
2985G2333795L421989L436917L615923L783031M379086N117194N582949O030815
2977A07701699N888425O010572O108906N423117M419284L359512J657743k79850
2969A40289408k488500m225137n607934n683897n596148m993510m639669l949107
2961A03105506l410389l048423k927193k564696k328432j963889j421888n68983
2953H4871613J69179J80933n94776j841127k823726l128773k872488l094703k705694
2944F8160438k616994k291750k178097j563881j155822r91436p77012q46760l00302
2935E5438384k43222j22980K75045N05666J243231K059819K697822L859480K576352
2926F8289597o10438k978430m259718m713216m213730l677559k854805k312672
$$ plain form
2985 72333795 75755784 79192701 82808624 86591655 90970741 96087935 101670884 107701699
2977 107701699 113590124 119600696 125709602 131132719 135552003 138911515 140569258 140289408
2969 140289408 137800908 133575771 127967837 122283940 116687792 111694282 107054613 103105506
2961 103105506 99695117 96646694 93719501 91154805 88826373 86862484 85440596 84871613
2953 84871613 85040792 85221725 84626949 82785822 79962096 76833323 73960835 70866132 68160438
2944 68160438 65543444 63251694 61073597 59509716 58353894 57362458 56585446 55738686 55438384
2935 55438384 55195162 55072182 55347227 55852893 57096124 59155943 61853765 65713245 68289597
2926 68289597 67679159 64700729 60441011 55727795 51514065 47836506 44981701 42669029
2918D2669029j791321j630951r82106r38204p68453n89096o63264n23321l07964
2909C4474349m7230J71118N17902M53006J149678J729640J039787l22020j301193
2900C7865037k177435k547197k095426j588576j331223j039351r91445r55603
2892B5138781o78091o30177n20212n28610n01964n81476k94859k50344n15092
2883B0637956o57682l96205j73917j00439l69434l87514l48789k89000j97693
2874A7717283k45802r1109k12928k59198j94724j17300k27091O409j55953l69550
2864A5850037l33765j22545R3266j49464k3147j23447k36754k19148P7096l5857
2854A4776272j31706P5095l12360j95282j76664p4825p9096K5795o4011r8229
$$ plain form
2918 42669029 40877708 39246757 38264651 37326447 36557994 35968898 35305634 34782313 34474349
2909 34474349 34427119 34598237 35116139 35569145 36718823 38448463 39488250 39166230 37865037
2900 37865037 35687602 33140405 31044979 29456403 28125180 27085829 26094384 25138781
2892 25138781 24460690 23830513 23310301 22781691 22279727 21698251 21403392 21153048 20637956
2883 20637956 19980274 19584069 19410152 19309713 18940279 18552765 18203976 17914976 17717283
2874 17717283 17471481 17380372 17167444 16908246 16713522 16596222 16369131 16375540 16219587 15850037
2864 15850037 15516272 15393727 15486993 15337529 15314382 15190935 14954181 14735033 14812129 14776272
2854 14776272 14644566 14719661 14407301 14212019 14035355 13960530 13881434 13907229 13843218 13744989
2844A3744989j55378j38632o1931j28095j96756J5190r4147J629j54293l41494
2834A2491082l9562j94220o9428J47052k15178n1282P6768o4093p7781O1599l18510
2823A1746447J8504J32587o8251L038k18265j49201j35388J8276J26109J29299
2813A1603155j47891k28797l1665L068L4435r4905O3566j8199o5433J07894j20251
2802A1104977k3004j2889J88364J78264m2286L14461P6627n6080J53505m6687
2792A1835252P0477L53170o857N1045L12708j0138K71030L16256K62390J71012
2782A3626345j7923N47167N44749K04212K63517M96167N52291N37376K81712L0924
2772A7066537K42384J49715m9555K64236R649L22036L64763L50056J75559L44688
$$ plain form
2844 13744989 13589611 13450979 13389048 13260953 13064197 13079387 12985240 12986869 12832576 12491082
2834 12491082 12451520 12257300 12187872 12334924 12119746 12068464 12145232 12081139 12003358 12064957 11746447
2823 11746447 11764951 11897538 11829287 11832325 11614060 11464859 11329471 11347747 11473856 11603155
2813 11603155 11455264 11226467 11194802 11197870 11232305 11137400 11200966 11182767 11117334 11225228 11104977
2802 11104977 11081973 11069084 11257448 11435712 11393426 11707887 11784514 11728434 11881939 11835252
2792 11835252 11905729 12258899 12252042 12303087 12615795 12605657 12876687 13192943 13455333 13626345
2782 13626345 13608422 14155589 14700338 14904550 15168067 15664234 16216525 16753901 17035613 17066537
2772 17066537 17308921 17458636 17409081 17673317 17682966 18005002 18369765 18719821 18895380 19240068
2762A9240068K37418N3244J75985J82158N52901M30297O09186N11941M76706P78197
2752B3248101R53496J134592J231953J131746O02976L11456R6743L19485R12829
2743B9943377R77176J147886J561389J564765J243348J118936R22897P85114P05982
2734C9970870M79141M25357K46823L64298M03963O68944O94973Q70836R31157
2725D5056362R72914J180919J338115Q84347R92703J484067J862200K240094K750333
2716E8762054L404748L670462K673226p6964j973502l083109l328672k839670
2708E7208573k510443j734039j204401q16912l12165m76826K27044K31607L78458
2699E0990896O21688Q06431O21389M11431M49851J99182K8142l64016p71880j447366
$$ plain form
2762 19240068 19477486 19530730 19706715 19888873 20441774 20872071 21481257 21993198 22469904 23248101
2752 23248101 24201597 25336189 26568142 27699888 28302864 28614320 28711063 29030548 29943377
2743 29943377 30920553 32068439 33629828 35194593 36437941 37556877 38479774 39264888 39970870
2734 39970870 40450011 40875368 41122191 41486489 41890452 42559396 43254369 44125205 45056362
2725 45056362 46029276 47210195 48548310 49432657 50425360 51909427 53771627 56011721 58762054
2716 58762054 62166802 65837264 68510490 68433526 66460024 63376915 60048243 57208573
2708 57208573 54698130 52964091 51759690 50942778 50630613 50153787 50380831 50612438 50990896
2699 50990896 51612584 52419015 53040404 53451835 53901686 54100868 54129010 53764994 52993114 51545748
2689E1545748j810495j999035k097257k007793j629791j323209j291917p54600
2681C8631651q28935p78770o19263m40513q00046n44306r32523r98480j269511
2672C1419304j278119j340113j354578j589136j098417j282877r37285p92889
2664B1745890j020101r25770p12157n24859o45187p11440n59637k78074n06365
2655A5862300o93262k69726m68521m73812l95949n22624l55211m59250n85384
2646A1638561l01378k69730m51366k22759k49675k05988l94125k89253k17541
2637I036746O1677j55770k56134l51627j8307j94479l30925k16822J06905k94996
2627G386268l59573J75288J14073k00768k59307n11858P3889k42124k09621k63079
$$ plain form
2689 51545748 49735253 47736218 45638961 43631168 42001377 40678168 39386251 38631651
2681 38631651 37802716 37023946 36404683 35964170 35164124 34619818 33687295 32688815 31419304
2672 31419304 30141185 28801072 27446494 25857358 24758941 23476064 22538779 21745890
2664 21745890 20725789 19800019 19087862 18563003 17917816 17206376 16646739 16368665 15862300
2655 15862300 15169038 14899312 14430791 13956979 13561030 13038406 12683195 12223945 11638561
2646 11638561 11337183 11067453 10616087 10393328 10143653 9937665 9543540 9254287 9036746
2637 9036746 9098423 8942653 8686519 8334892 8316585 8122106 7791181 7574359 7681264 7386268
2627 7386268 7026695 7201983 7316056 7115288 6855981 6344123 6418012 6175888 5966267 5703188
2617E703188Q1232J70425m00742r4257j05101J61375j54869k80106l8412j52423
2607D890310r2050j88854r2358p1678k13832J1110r4558P2098k01399r7962l0680
2596C890147N8527j36916q5585j60971k25271M3302K3186k29219j25695j38483
2586B913022J03826m0152k56102J89362k38598r7737O9594o4582j4015N2940l59174
2575B258384J30272J305o8333k9962R8248j72679L2301l2082J71762k01015m1657
2564B146544K16j73159N8827J09045j06287k98140J51304R2298o792J38128k90425
2553A821559j0243R5460l0954o6298Q4535K9815j02370J18920k20950J99183K2673
2542A941330k00009k71618Q6997J9126l0792L12700l0790j18676k03516O9118
$$ plain form
2617 5703188 5784420 5954845 5554103 5459846 5354745 5516120 5361251 5081145 5042733 4890310
2607 4890310 4798260 4609406 4517048 4445370 4231538 4242648 4148090 4220188 4018789 3920827 3890147
2596 3890147 3948674 3811758 3726173 3565202 3339931 3383233 3406419 3177200 3051505 2913022
2586 2913022 3016848 2976696 2720594 2909956 2671358 2573621 2643215 2578633 2564618 2617558 2258384
2575 2258384 2388656 2389961 2321628 2291666 2389914 2217235 2249536 2217454 2389216 2188201 2146544
2564 2146544 2146760 1973601 2032428 2141473 2035186 1737046 1888350 1980648 1973856 2111984 1821559
2553 1821559 1811316 1906776 1875822 1809524 1894059 1923874 1821504 1940424 1719474 1918657 1941330
2542 1941330 1741321 1469703 1556700 1575826 1545034 1857734 1826944 1708268 1504752 1573870
2532A573870K54332k39314k21544K44854k40251R4422N7653k44010j30620Q0412
2522A229804N6323q7282R6168P2167J06140j48505k2088L24446r7833j12119K1404
2511A438625q9998m0594J14550k1006j56356P7772K819K3399l9826N4147J5460
2500A378992l2165j98537j06539J57511o8692j44641J19762k01141L5711N2174
2490I92435J66049q4446m5653k9307o7364m2170N3451K02949j58759O688J23203
2479A117076j76143J52451o155m6162k2026o3766j58972J75495j16795p0809J46341
2468I30535n7254J67275j74006J22950k05397m7378J28386K22383M7055k47966
2458H86583j29203k2655N8505k70936K25054j69089J77587j47312j57475J90249
$$ plain form
2532 1573870 1828202 1588888 1367344 1612198 1371947 1466369 1524022 1280012 1149392 1229804
2522 1229804 1286127 1198845 1295013 1367180 1473320 1324815 1302727 1627173 1529340 1417221 1438625
2511 1438625 1348627 1308033 1422583 1401577 1245221 1322993 1325812 1349211 1309385 1363532 1378992
2500 1378992 1346827 1148290 1041751 1199262 1130570 985929 1105691 904550 940261 992435
2490 992435 1158484 1074038 1028385 999078 931714 889544 942995 1145944 987185 993873 1117076
2479 1117076 940933 1093384 1087229 1041067 1019041 955275 796303 971798 855003 784194 930535
2468 930535 873281 1040556 866550 989500 784103 736725 865111 1087494 1134549 886583
2458 886583 757380 734725 793230 522294 747348 578259 755846 608534 451059 641308
2448F41308K27253j28282r7581N2233J28904k29111J35356n4842k38961K06804
2438F43081J18589p0076q3998l5675j19131K12763k4089j39874k49247L09256
2428E61599q5376j01642J75916P5778j16707k13591K68304J16005M2308j41668
2418E80926K5715n1657M9338l316k68874K34208j55525p3857J31489L112J53635
2407F25194k38831k07941J57434k1831K8203j61089R2098k31152J39006K05682
2397C86773J3999l31888J48376K03634k83095J10261K13702O5158M6934l1214
2387E42640j51205M1229p9587O1180p3402J8548J46557l4180l56707K52422J31043
2376D98538n3232J26574j70136O2280J09333j98711J19220k11676j307K8587j2785
$$ plain form
2448 641308 868561 740279 642698 694931 823835 594724 730080 675238 436277 643081
2438 643081 761670 691594 607596 571921 452790 665553 641464 501590 252343 561599
2428 561599 476223 374581 550497 626275 509568 295977 564281 680286 722594 580926
2418 580926 606641 554984 604322 601006 332132 566340 410815 336958 468447 471559 625194
2407 625194 386363 178422 335856 314025 342228 181139 273237 42085 181091 386773
2397 386773 400772 68884 217260 420894 137799 248060 461762 526920 573854 542640
2387 542640 391435 432664 353077 414257 340855 359403 505960 471780 115073 367495 498538
2376 498538 445306 571880 401744 464024 573357 374646 493866 282190 280883 309470 296685
2365B96685J80808o01548K79352J88037p3640j53554j79199K80524J11051q3385
2355B45131l429o4931l265K74110j08259l8821J25201k0519q9017L3144k34143
2344A15202R7896O516q3408P7016j06619P7696J37076o5893k90931R4771q1212
2333b1890K76853K7949j77393r205j66249J57101J91509m9p4355J2604j4829m6894
2321A55152P9285j24501j2053K09216R5835m4872O5839j67923l2021J14913K3607
2310C62477o6422J07486l4971k32861k58806O3877R7015O6781J69618L7021l643
2299C07572j11760j56222J35107J0315m5595o2451J42968J10535j61145N6596
2289B25920L3262K0787n8633q0507n6313J45647j7200n4450j99978L4266J53785
$$ plain form
2365 296685 477493 -124055 155297 343334 269694 116140 -63059 217465 328516 245131
2355 245131 241702 176771 173506 447616 339357 300536 425737 405218 316201 349345 115202
2344 115202 213098 219614 136206 213222 106603 184299 321375 255482 -35449 59322 -21890
2333 -21890 254963 282912 105519 96314 -69935 87166 278675 278626 204271 216875 202046 155152
2321 155152 234437 109936 97883 307099 402934 358062 423901 255978 223957 338870 362477
2310 362477 296055 403541 368570 135709 -123097 -59220 37795 104576 274194 311215 307572
2299 307572 195812 39590 174697 185012 139417 76966 219934 330469 169324 225920
2289 225920 259182 279969 221336 140829 84516 230163 212963 158513 -41465 -7199 146586
2278A46586j92919J22605j64515K39163J21760j82896O4603R4197j15971k22362
2268h9749J40686m5999J88246K8802l5938J28802p3060j82733M0826q2646J8916
2257C6153J58137k10398O9956o4641J60119N4123r3888j00772P3556J86932M6406
2246C15683j44417r8898K08571n6165m17136K69845K72203Q2576R4630l13362
2236B13530N6782m4184P6622j53882j7175J14558R96j07302J5498K45274o6902
2225C33815R488N5840j96259j4745j6440k28661K68812K05994j73176J24023j50381
2214B18310R7429N2293J11762j43406N0611J6815n3119k17138J41215K66119l4
2203E40857k84715l8212J19496J78528O3559j72304l3988R6314J32133k0767J3207
$$ plain form
2278 146586 -46333 76272 -88243 150920 272680 89784 154387 248584 132613 -89749
2268 -89749 50937 4938 193184 221986 186048 314850 241790 59057 99883 17237 36153
2257 36153 194290 -16108 53848 -10793 149326 203449 109561 8789 82345 269277 315683
2246 315683 171266 72368 280939 224774 -192362 77483 349686 432262 526892 213530
2236 213530 270312 226128 302750 148868 131693 246251 247247 139945 155443 400717 333815
2225 333815 343303 399143 202884 188139 171699 -56962 211850 417844 244668 368691 218310
2214 218310 315739 368032 479794 336388 386999 403814 350695 133557 274772 540891 540857
2203 540857 256142 217930 337426 515954 579513 407209 373221 469535 601668 580901 594108
2192E94108K06778j40810m6094J7625j6959J8686J68734M9489j0308Q4599j07219
2181H18629m2573P9669R2228J00702N4484k95957q3047J20124J88107j06318n4257
2170H71791J29780N4175j13752l6877K06559l5447L1717J46492o351J54484L21480
2159A724051L155n6252l1887j81784n5944J70921J91726j57698O2563J13823N2250
2148A834924k28984K95074J30683L06511j3525j27524J81097J95521K48153J71563
2138B993493K68239L31314L40385J94747L22020K83514K49977K65378O54232O32107
2128F535406O38804Q21843Q01752J009101P78271R04425J676533J393612K418320
2119A6978067K866049M295567N111148Q738909L463967o300473o239431n573205
$$ plain form
2192 594108 800886 660076 613982 631607 614648 633334 802068 851557 841249 925848 818629
2181 818629 776056 855725 947953 1048655 1103139 807182 724135 844259 1032366 926048 871791
2170 871791 1001571 1055746 941994 905117 1111676 1076229 1107946 1254438 1248087 1402571 1724051
2159 1724051 1727206 1670954 1639067 1457283 1401339 1572260 1763986 1606288 1668851 1782674 1834924
2148 1834924 1605940 1901014 2031697 2338208 2324683 2197159 2378256 2573777 2821930 2993493
2138 2993493 3261732 3593046 3933431 4128178 4450198 4733712 4983689 5249067 5903299 6535406
2128 6535406 7174210 7996053 8797805 9806906 10585177 11489602 13166135 14559747 16978067
2119 16978067 19844116 24139683 29250831 37989740 41453707 35153234 28913803 23340598
2111B3340598m197417l185042k403573j580052j229327j291984n00436l08780
2103H643987n37040p65990n53124m64464p82493m12343m85777n76045k41068k94860
2093C530783L6099m27840l03294j51866Q4696k50405j88569j00252r298l1811
2083B188243q2154j82352J54998j94087k02485r3563j08540k72577K2308M5017
2073A274808k2269j17077j01262L2597k77772L5982j011J43615k28263Q4328L74674
2062A198350k11116j67479K07285P3109l10024j63942o1754N715J00537m238j51998
2051E14445m3848r328K8236K5673O1941P4777M7276N7075j89890o3522j72178
2040C30657o4048P5495J89017j41020j88251J03971J59351j50344Q7927p9157
$$ plain form
2111 23340598 19143181 15958139 13554566 11974514 10745187 9453203 8952767 8643987
2103 8643987 8106947 7340957 6787833 6323369 5540876 5128533 4642756 4066711 3825643 3530783
2093 3530783 3566882 3139042 2835748 2683882 2768578 2518173 2329604 2229352 2220054 2188243
2083 2188243 2106089 1923737 2078735 1884648 1682163 1588600 1480060 1207483 1229791 1274808
2073 1274808 1252539 1135462 1034200 1066797 789025 825007 823996 967611 739348 823676 1198350
2062 1198350 987234 819755 1027040 1100149 790125 626183 564429 570144 670681 666443 514445
2051 514445 470597 461269 489505 515178 577119 651896 699172 756247 566357 502835 330657
2040 330657 266609 342104 531121 390101 201850 305821 465172 314828 402755 323598
2030C23598R1247p4239O7681j64446K75815J3350l73450N148P633l1738O2077
2019B02676r3861J35733r5224j8247K60126l55916K05689N1597p7131k9219K47304
2008D33527J64325l53648j90660K50241j19800k05464J12946l06299k1582K20135
1998a6279J27377r9207L651M1611m5395k93825R1540J1577O7072J51171J4116
1987E3409j12875r6908j15741j8748K74329L517o9066J78386K76160k70991K08552
1976C10024k00225j14954j15245j7871J12667l9694J27089k4325J17128k9834
1966A24760j20790M0262k25747J98222j65196j9293K25177K8689j96108R2480
1956a7544J57578j97126K12079j31045m12019R2122L86707p8595R5277J1509j02310
$$ plain form
2030 323598 414845 340606 408287 243841 519656 533006 159556 164704 172337 140599 202676
2019 202676 108815 244548 149324 131077 391203 35287 240976 292573 215442 186223 433527
2008 433527 597852 244204 53544 303785 183985 -21479 91467 -214832 -236414 -16279
1998 -16279 111098 11891 15542 57153 11758 -282067 -190527 -178950 -111878 39293 53409
1987 53409 -59466 -156374 -272115 -290863 -16534 -13017 -82083 96303 372463 101472 310024
1976 310024 109799 -5155 -120400 -138271 -25604 -65298 61791 37466 154594 124760
1966 124760 3970 44232 -181515 16707 -148489 -167782 57395 86084 -110024 -17544
1956 -17544 140034 -57092 154987 23942 -388077 -295955 90752 12157 107434 118943 16633
1945A6633o8058m7460L4136k408L36249L8263n5131k51833O369O9727j0309k11158
1933a44980M4493L75526k71361O1127J3931l2714q8507J58253k76084K31825l7908
1922C3601j94183K4075K84929P5170m21386j0498L31920J208m4688N7730k865
1911A35013j54262K4930N4393r1432r2906M7661J51435j01823j31585K7974k8490
1900a59092J57899r7350J9960j43566n9366K70080N0532P1373P8r8846r4087K5032
1888e7353M6296K8142j32373n7985k56054J43440P6153q354k9767J25208j7088
1877a39735P045o1660N6518q7945j14704o7590J74371O9062m5703j80881J11181
1866b80041J88586k22031R3862K3240R4898R9733Q9767k27084r8236J80086j41766
$$ plain form
1945 16633 -51425 -98885 -64749 -67157 269092 307355 252224 391 6760 76487 66178 -144980
1933 -144980 -100487 275039 3678 64805 78736 46022 -42485 115768 -160316 71509 33601
1922 33601 -160582 -136507 148422 223592 -197794 -208292 123628 124836 80148 137878 135013
1911 135013 -19249 5681 60074 -31358 -124264 -76603 74832 -26991 -158576 -130602 -159092
1900 -159092 -1193 -98543 -78583 -222149 -281515 -11435 39097 110470 110548 11702 -82385 -57353
1888 -57353 -11057 17085 -115288 -173273 -429327 -285887 -209734 -218088 -247855 -122647 -139735
1877 -139735 -132690 -194350 -137832 -225777 -340481 -408071 -233700 -164638 -210341 -391222 -280041
1866 -280041 -91455 -313486 -219624 -196384 -101486 -1753 88014 -139070 -237306 -57220 -198986
1855a98986R3410q444k30789L755L06506J26365j97870J00629L7437m8463N8711
1844D2261l07682O2759K21291k202M6220r4999k981L18246j92875K7145L7284
1833A54467l56787J5127J2404L91465k84303l71126K9872K09582J43038N4313
1823a948j80614P903l9589j25314P9610J60983P2145k02683K38819m0260N8603
1812B7655j85675J00724J25952k25884l9672l2430l325r5486K15997K95715j12222
1801G1349q4753j39978J86572o1647k09750j99208J26034J73480m0525J0322J13142
1790e4962M147K20368j55873p9128J72085k62488J53815J70997j29882J49138
1780A88217r1700l5904j4774j52932n9744O5240R9884K1112m0567q7321O0981
$$ plain form
1855 -198986 -105576 -114020 -344809 -341054 -34548 91817 -106053 -5424 32013 -16450 42261
1844 42261 -265421 -202662 18629 16427 62647 -32352 -35333 282913 90038 117183 154467
1833 154467 -202320 -187193 -174789 216676 -67627 -438753 -408881 -199299 -56261 -1948
1823 -1948 -182562 -174659 -214248 -339562 -259952 -98969 -26824 -229507 9312 -30948 27655
1812 27655 -158020 -57296 68656 -157228 -196900 -229330 -232655 -328141 -112144 183571 71349
1801 71349 -13404 -153382 33190 -28457 -238207 -437415 -311381 -137901 -178426 -168104 -54962
1790 -54962 -50815 169553 13680 -65448 106637 -155851 -2036 168961 39079 188217
1780 188217 96517 60613 45839 -107093 -166837 -101597 -1713 19399 -21168 -108489 -47508
1769d7508k60328o2306K089L06343n8194n1007k9632m6332K75380j57120J83349
1758E4734k69895J5473J20123m5557o1204k33234M1946K26404R7808m9845q2641
1747a85888L5604j84999J41746L6448j55146M0456J13949j0131M6703O1545k20483
1736b80196L26043j79428j08347m731J4602K5633M3670q9420J49364j20623k2546
1725b45979J18392K1772j69017K79738j81935q2579J90001J59686L9376k45378
1715a15923K0304r114k03164L06973r3255q0120r5261J02403K85876j32570j73565
1704a87416l5352k1455M4582k31911j04970K95286J18536n5437q4679K5045J22585
1693a15186J10698O5729q7857r2636k21077o3574N2043R5769N2031K41173j91135
$$ plain form
1769 -47508 -307836 -370142 -368053 -61710 -119904 -170911 -200543 -246875 28505 -128615 54734
1758 54734 -215161 -199688 -79565 -125122 -186326 -419560 -377614 -151210 -53402 -103247 -185888
1747 -185888 -150284 -335283 -193537 -157089 -312235 -271779 -157830 -167961 -121258 -59713 -280196
1736 -280196 45847 -133581 -241928 -246659 -232057 -206424 -162754 -252174 -102810 -223433 -245979
1725 -245979 -127587 -105815 -274832 4906 -177029 -259608 -69607 90079 129455 -115923
1715 -115923 -95619 -104733 -307897 -924 -94179 -174299 -269560 -167157 118719 -13851 -187416
1704 -187416 -222768 -244223 -199641 -431552 -536522 -241236 -122700 -178137 -262816 -237771 -115186
1693 -115186 -4488 61241 -26616 -119252 -340329 -403903 -351860 -256091 -204060 37113 -154022
1682a54022o2133L00615K6563j64169p2367o1837k24443J50318J07551L5049L2345
1671h6530J33360o9626j68842j00514J68363n7984k5122Q9849j30243j61568J33190
1660b75667K91038L05j82322K4186j16683O4688k29240Q4505j2868Q389P6465
1649b67204K64858J04969p1842m0416l180o6070J7195l59887J85232K66163n2010
1638b2192Q4649k21246J19310j688k73594j04482Q2101K07274L0433j23390J49865
1627g2960P7257r5476k10709N1993K60596p5714k39969L5191R1720P6261J49670
1616D7860j69417k17848J96332M4732R143j72529l0969L8845K40737j98527n6178
1605b67819K89709j45112M1568O5788j82339o8768J70314k84296J97648J34506
$$ plain form
1682 -154022 -216155 84460 111023 -53146 -125513 -187350 -411793 -261475 -153924 -118875 -86530
1671 -86530 46830 -22796 -191638 -292152 -123789 -181773 -206895 -117046 -247289 -408857 -275667
1660 -275667 15371 15676 -166646 -142460 -259143 -194455 -423695 -339190 -352058 -343669 -267204
1649 -267204 -2346 102623 30781 -9635 -12815 -78885 -61690 -421577 -236345 29818 -22192
1638 -22192 62457 -158789 -39479 -41167 -314761 -419243 -337142 -129868 -99435 -222825 -72960
1627 -72960 4297 -91179 -301888 -249895 10701 -65013 -304982 -269791 -178071 -101810 47860
1616 47860 -121557 -339405 -143073 -98341 -89198 -261727 -292696 -253851 -13114 -211641 -267819
1605 -267819 21890 -123222 -81654 -15866 -198205 -266973 -96659 -380955 -183307 -48801
1595d8801j36688Q9106N4846m3140l0780J1178J52566l9831o8641j38367N0794
1584a47758J61668l6161j50665j79372m7123K17252P0782Q4798j52803P1994j05724
1573b13112p2990P357J74372k22194J60790P4620p6497p9053k47021J33708K96624
1562f3396Q2096j06165Q9829j34102O6085n2886j73935M1166K47179n3287J0978
1551d6438J67251l45504L1465J4995p5135K38722O0386M9554J57965j88620l59042
1540b94401O5864K47065J26353n7460l6609k34072n373O1636K5966k23718J58309
1529a66440k60017J25086J40883k32109J27187K22046k23050M8494J87664J10309
1519H0053j78757j65467n4683J72157q4292Q9308J89430n1946j19892k55849N6275
$$ plain form
1595 -48801 -185489 -96383 -41537 -84677 -115457 -104279 48287 8456 -60185 -198552 -147758
1584 -147758 13910 -22251 -172916 -352288 -399411 -182159 -111377 -26579 -179382 -107388 -213112
1573 -213112 -286102 -278745 -104373 -326567 -165777 -91157 -167654 -246707 -493728 -360020 -63396
1562 -63396 18700 -87465 2364 -131738 -65653 -118539 -292474 -251308 -4129 -57416 -46438
1551 -46438 120813 -224691 -193226 -178231 -253366 -14644 45742 95296 253261 64641 -294401
1540 -294401 -228537 18528 144881 87421 50812 -183260 -188633 -126997 -101031 -324749 -166440
1529 -166440 -426457 -301371 -160488 -392597 -265410 -43364 -266414 -217920 -30256 80053
1519 80053 -98704 -264171 -318854 -146697 -230989 -141681 47749 -4197 -124089 -379938 -323663
1508c23663J62471k12192M8463j33596J54730K64254K21376j51741k41330J67652
1498d3576O4942o8572m7059l4647j45196M1557k9187J9622K71010k40449J55282
1487e6273K42041l3866n907j93864j17423R6120j937M2809P8142k46686K77818
1476H0974k9726j0037l5821j4228o9569L729R1683N6249j07446K00184l0792j66058
1464c0858j60854R5139k2052j6239J0219m1698m9170R058J07844n2598J30671
1453b0538J02264j00009j82040O8008o8269k5278K7565J47143j64067p6092k9094
1442c20407K62727j1980m2359Q0314L0957j04904K8999J76583o6781k14284l88
1431a81523K12134j12569j91835J86253J30672m8317N9697R5476k67224N8034
$$ plain form
1508 -323663 -161192 -373384 -324921 -458517 -303787 -39533 181843 30102 -211228 -43576
1498 -43576 21366 -47206 -94265 -128912 -274108 -232551 -261738 -242116 28894 -211555 -56273
1487 -56273 185768 151902 145995 -47869 -165292 -69172 -71109 -28300 49842 -196844 80974
1476 80974 51248 41211 5390 -8838 -78407 -74678 17005 73254 -34192 165992 135200 -30858
1464 -30858 -191712 -96573 -118625 -134864 -124645 -166343 -215513 -206455 -98611 -151209 -20538
1453 -20538 81726 -18283 -200323 -132315 -200584 -225862 -198297 -51154 -215221 -291313 -320407
1442 -320407 -57680 -69660 -112019 -31705 -748 -105652 -76653 99930 33149 -181135 -181523
1431 -181523 30611 -81958 -273793 -87540 43132 -5185 54512 149988 -117236 -59202
1421e9202p9438o1855K7441N7388K14288r1069l35580q7181K98410Q1555J50634
1410A15391n8939K04383l91475J24295j29418P5568K8697j14233N7618m4995J6838
1399a16270L6596j98547J9786j0927J96952Q1020j9526l40746Q5265K04405k49962
1388c11954o7045K52563j55870o226M8845n0996M8687K2501K69933j70005j44293
1377b63860K50751l8851j06469N5966J07350k10785R1290r8385r4486J61724K18464
1366G2709j69603m6456j36457k10162M24369J51283j69066J31235q2443j51377
1356a85968J67081j40032N023j8138J62185K4254j39082k17019J96627N199J09485
1345c0385o0831L05474k53258j9057K67013k06694n0409j44254J1395j32632k5642
$$ plain form
1421 -59202 -138640 -200495 -173054 -115666 98622 7553 -328027 -415208 -116798 -35243 115391
1410 115391 56452 260835 -130640 -6345 -135763 -60195 -31498 -145731 -88113 -133108 -116270
1399 -116270 -79674 -278221 -258435 -269362 -72410 8610 -10916 -351662 -266397 -61992 -311954
1388 -311954 -378999 -126436 -282306 -288532 -239687 -290683 -241996 -219495 50438 -119567 -263860
1377 -263860 -13109 -51960 -158429 -102463 4887 -205898 -114608 -212993 -307479 -145755 72709
1366 72709 -96894 -143350 -279807 -489969 -65600 85683 -83383 47852 -34591 -185968
1356 -185968 -18887 -158919 -153896 -172034 -9849 14405 -124677 -341696 -145069 -139870 -30385
1345 -30385 -91216 214258 -39000 -58057 208956 2262 -48147 -192401 -181006 -313638 -339280
1334c39280K88420J2358J96593O0548k97540j75868N2591l9993l1341J8711K66266
1323A1465m706J00333k63311j77612L39586J015l61973K39155Q9658j3597Q3940
1312D3953k26115r1951j7168j5413J79508J79795j06100M4618J68843k43060L3477
1301d9613k7922p1312j06902J22042J44732j39272K96615Q7708l95717P8417K8918
1290c2306O5244M588k33785j6782J69174N4316j13313L8009J0704Q7054o4572
1279c1669j57070K5376J13408J59442R65J01961q8282j77915q4872m0918K62663
1268H3089l25453K20312q691O3977m3390J1818o1535M896J40269J15623k37212
1257c6297k83157R8855l9007Q4508p5303J25890o1818K02370j24557j28018J89526
$$ plain form
1334 -339280 -50860 -38502 158091 218639 -78901 -254769 -202178 -242171 -273512 -254801 11465
1323 11465 6759 107092 -156219 -333831 5755 6770 -355203 -116048 -26390 -39987 43953
1312 43953 -182162 -274113 -291281 -306694 -127186 52609 -53491 -8873 159970 -83090 -49613
1301 -49613 -77535 -148847 -255749 -133707 11025 -128247 168368 256076 -139641 -61224 -32306
1290 -32306 32938 37526 -196259 -213041 -43867 10449 -102864 -64855 -54151 32903 -31669
1279 -31669 -188739 -163363 -49955 109487 110452 212413 124131 -53784 -138656 -179574 83089
1268 83089 -242364 -22052 -30743 33234 -10156 1662 -59873 -54977 85292 200915 -36297
1257 -36297 -319454 -220599 -259606 -175098 -250401 -124511 -186329 16041 -108516 -236534 -47008
1246d7008k07975n1493M4614J07806L7865K7778l7801M8025P0993o3085K26439
1235A56158p3602j48771j15686O0849J52931l2930K01226l79636J62157j0422
1225b7726l20289L15000j01410M10o6067N5293n2161m0356K01927Q1822j31807
1214h5364j2840r4728J26461O7201K6657J08559k87923n082Q9755j81479k12849
1203d61632N41585r7200j18926j59346K5207J18723o4269J06413J24860j91006
1193a75591R5134j53470m6390M7520j56914K30149J41918J45971L2285j21248
1183C9364j40655R5803j03870Q3600J50976j40656J97418k06475J05150K7126
1173A07781k5466O820j48666R4875n1288L8926k06750K10262l35308k20704L26477
$$ plain form
1246 -47008 -254983 -306476 -261862 -154056 -116191 -88413 -126214 -78189 -7196 -70281 156158
1235 156158 82556 -66215 -181901 -121052 31879 -1051 200175 -179461 -17304 -27726
1225 -27726 -348015 -33015 -134425 -134015 -200082 -144789 -196950 -237306 -35379 46443 -85364
1214 -85364 -98204 -192932 -66471 730 27387 135946 -151977 -157059 -67304 -248783 -461632
1203 -461632 79953 -17247 -136173 -295519 -270312 -151589 -215858 -109445 15415 -175591
1193 -175591 -80457 -233927 -280317 -232797 -389711 -159562 -17644 128327 160612 39364
1183 39364 -101291 -5488 -109358 -25758 125218 -15438 181980 -24495 80655 107781
1173 107781 82315 89135 -59531 35344 -15944 22982 -183768 26494 -308814 -529518 -203041
1162b03041K51102M8820J8713r6912K8891L7335j28281R0886j21263p0564J58260
1151A3946J18613l6788q6479j82860m3988J79996K08408j71462j05018k2897k144
1140a30673q0615J48090K89873l41968j42723J67042L8535J532j56710J70174
$$ plain form
1162 -203041 48061 96881 115594 18682 47573 84908 -43373 47513 -73750 -144314 13946
1151 13946 132559 95771 9292 -173568 -217556 -37560 170848 -614 -105632 -128529 -130673
1140 -130673 -211288 -63198 226675 -115293 -258016 -90974 -52439 -50907 -207617 -37443
$$ [...]
##END NTUPLES=NMR SPECTRUM
##END=
