##TITLE=1H_CG-1211-A5
 CDCl3
 8 sc, 
 2.9.2024
##JCAMPDX= 6.0         $$ Bruker NMR JCAMP-DX V2.0
##DATA TYPE= NMR SPECTRUM
##DATA CLASS= NTUPLES
##ORIGIN= UXNMR, Bruker Analytische Messtechnik GmbH
##OWNER= root
$$ XWIN-NMR		Version 3.5
$$ Mon Sep  2 14:08:30 2024 Russian Standard Time (UT+4h)  she@DPX200
##.OBSERVE FREQUENCY= 200.1318
##.OBSERVE NUCLEUS= ^1H
##.ACQUISITION MODE= SIMULTANEOUS
##.ACQUISITION SCHEME= undefined
##.AVERAGES= 8
##.DIGITISER RES= 18
##SPECTROMETER/DATA SYSTEM= spect
##.PULSE SEQUENCE= zg30
##.SOLVENT NAME= D2O
##.SHIFT REFERENCE= (INTERNAL, D2O, 0, 20.9474)
##AUDIT TRAIL= $$ (NUMBER, WHEN, WHO, WHERE, WHAT)
$$ ##TITLE= Audit trail, XWIN-NMR		Version 3.5
$$ ##JCAMPDX= 5.01
$$ ##ORIGIN= Bruker BioSpin GmbH
$$ ##OWNER= she
$$ F:/spectra/data/she/nmr/H-F/1/pdata/1/auditp.txt
$$ ##AUDIT TRAIL=  $$ (NUMBER, WHEN, WHO, WHERE, WHAT)
(   1,<2024-09-02 14:07:04.20 +0400>,<she>,<DPX200>,
      <created by zg, POWCHK disabled, PULCHK disabled
       configuration hash MD5:
       00 E9 B6 7A A2 85 ED C7 34 08 36 98 17 FE 4E 26
       data hash MD5: 16K
       1F E4 C5 6F BD 5F FA 66 78 0C E1 1F 51 5E FA 0E>)
(   2,<2024-09-02 14:07:06.23 +0400>,<she>,<DPX200>,
      <Start of raw data processing
       efp BC_mod = 2 LB = 0.24 FT_mod = 6 PKNL = 1 PHC0 = -25989.17 PHC1 = 8.187479 SI = 16K 
       data hash MD5: 16K
       37 67 12 9E 2F E4 4E 2C E7 A1 FB 09 79 A9 F8 F5>)
(   3,<2024-09-02 14:07:34.07 +0400>,<she>,<DPX200>,
      <pk PHC0 = -6.620401 PHC1 = 7.8 
       data hash MD5: 16K
       A1 8B 58 8D 70 E4 D6 6A 3A F0 CB FC B5 2F 9D 1A>)
(   4,<2024-09-02 14:07:38.31 +0400>,<she>,<DPX200>,
      <abs ABSG = 5 
       data hash MD5: 16K
       EC 26 4C 54 92 BC 4C CC BF 22 80 33 E4 D9 5F 79>)
$$ ##END=
$$ 
$$ hash MD5
$$ 82 C6 79 06 F0 2D 52 1C 84 23 0B 07 E2 23 05 5E
##$RELAX= 
##$RELAX= 
##$RELAX= 
##$RELAX= 
##$RELAX= 
##$RELAX= 
$$ Bruker specific parameters
$$ --------------------------
##$DU= <F:/spectra>
##$EXPNO= 1
##$NAME= <H-F>
##$PROCNO= 1
##$TYPE= <nmr>
##$USER= <she>
##$AMP= (0..31)
100 100 100 100 100 100 100 100 100 100 100 100 100 100 100 100 100 100 
100 100 100 100 100 100 100 100 100 100 100 100 100 100 
##$AQSEQ= 0
##$AQ_mod= 1
##$AUNM= <au_zg>
##$AUTOPOS= <>
##$BF1= 200.13
##$BF2= 200.13
##$BF3= 200.13
##$BF4= 200.13
##$BF5= 200.13
##$BF6= 200.13
##$BF7= 200.13
##$BF8= 200.13
##$BYTORDA= 1
##$CFDGTYP= 0
##$CFRGTYP= 5
##$CHEMSTR= <none>
##$CNST= (0..31)
1 1 145 1 1 1 1 1 1 1 1 1 1 1 1 1 1 1 1 1 1 1 1 1 1 1 1 1 1 1 1 1 
##$CPDPRG= <>
##$CPDPRG1= <>
##$CPDPRG2= <>
##$CPDPRG3= <>
##$CPDPRG4= <mlev>
##$CPDPRG5= <mlev>
##$CPDPRG6= <mlev>
##$CPDPRG7= <mlev>
##$CPDPRG8= <mlev>
##$CPDPRGB= <>
##$CPDPRGT= <>
##$D= (0..31)
0 1.2 0 0 0 0 0 0 0 0.06 0 0.03 0 0 0 0 0.0002 0 0 0 0 0 0 0 0 0 0 0 0 
0 0 0 
##$DATE= 1725271623
##$DBL= (0..7)
120 120 120 120 120 120 120 120 
##$DBP= (0..7)
150 150 150 150 150 150 150 150 
##$DBP07= 0
##$DBPNAM0= <>
##$DBPNAM1= <>
##$DBPNAM2= <>
##$DBPNAM3= <>
##$DBPNAM4= <>
##$DBPNAM5= <>
$$ [...]
##$SUBNAM3= <"">
##$SUBNAM4= <"">
##$SUBNAM5= <"">
##$SUBNAM6= <"">
##$SUBNAM7= <"">
##$SUBNAM8= <"">
##$SUBNAM9= <"">
##$SW= 24.0689170037331
##$SWIBOX= (0..15)
0 0 2 0 0 0 0 0 0 0 0 0 0 0 0 0 
##$SW_h= 4816.95568400771
##$TD= 16384
##$TD0= 1
##$TE= 0
##$TE2= 300
##$TE3= 300
##$TEG= 300
##$TL= (0..7)
0 120 120 120 120 120 120 120 
##$TP= (0..7)
150 150 150 150 150 150 150 150 
##$TP07= 0
##$TPNAME0= <>
##$TPNAME1= <>
##$TPNAME2= <>
##$TPNAME3= <>
##$TPNAME4= <>
##$TPNAME5= <>
##$TPNAME6= <>
##$TPNAME7= <>
##$TPOAL= (0..7)
0.5 0.5 0.5 0.5 0.5 0.5 0.5 0.5 
##$TPOFFS= (0..7)
0 0 0 0 0 0 0 0 
##$TUNHIN= 0
##$TUNHOUT= 0
##$TUNXOUT= 0
##$USERA1= <user>
##$USERA2= <user>
##$USERA3= <user>
##$USERA4= <user>
##$USERA5= <user>
##$V9= 5
##$VALIST= <valist>
##$VCLIST= <CCCCCCCCCCCCCCC>
##$VD= 0
##$VDLIST= <DDDDDDDDDDDDDDD>
##$VPLIST= <PPPPPPPPPPPPPPP>
##$VTLIST= <TTTTTTTTTTTTTTT>
##$WBST= 1024
##$WBSW= 4
##$XGAIN= (0..3)
0 0 0 0 
##$XL= 0
##$YL= 0
##$YMAX_a= 413539
##$YMIN_a= -467796
##$ZGOPTNS= <>
##$ZL1= 120
##$ZL2= 120
##$ZL3= 120
##$ZL4= 120
##$ABSF1= 20.97822
##$ABSF2= -3.090912
##$ABSG= 5
##$ABSL= 3
##$ALPHA= 0
##$AQORDER= 0
##$ASSFAC= 0
##$ASSFACI= 0
##$ASSFACX= 0
##$ASSWID= 0
##$AUNMP= <proc_1d>
##$AZFE= 0.1
##$AZFW= 0.1
##$BCFW= 0
##$BC_mod= 2
##$BYTORDP= 0
##$COROFFS= 0
##$CY= -3
##$DATMOD= 1
##$DC= 0
##$DFILT= <>
##$DTYPP= 0
##$F1P= 0
##$F2P= 0
##$FCOR= 1
##$FTSIZE= 16384
##$FT_mod= 6
##$GAMMA= 0
##$GB= 0
##$INTBC= 1
##$INTSCL= 3.70164e-10
##$ISEN= 128
##$LB= 0.24
##$LEV0= 0
##$LPBIN= 0
##$MAXI= 10000
##$MC2= 0
##$MEAN= 0
##$ME_mod= 0
##$MI= 1.114404
##$NCOEF= 0
##$NC_proc= -6
##$NLEV= 6
##$NOISF1= 3.799351
##$NOISF2= 2.8
##$NSP= 0
##$NTH_PI= 0
##$NZP= 0
##$OFFSET= 20.94737
##$PC= 1
##$PHC0= -25995.79
##$PHC1= 15.98748
##$PH_mod= 1
##$PKNL= yes
##$PPARMOD= 0
##$PSCAL= 0
##$PSIGN= 0
##$REVERSE= no
##$SF= 200.130016279041
##$SI= 16384
##$SIGF1= 3
##$SIGF2= 2
##$SINO= 5.538805
##$SIOLD= 16384
##$SREGLST= <1H.CDCl3>
##$SSB= 0
##$STSI= 16384
##$STSR= 0
##$SW_p= 4816.95568400771
##$SYMM= 0
##$S_DEV= 0
##$TDeff= 16384
##$TDoff= 0
##$TI= <>
##$TILT= no
##$TM1= 0
##$TM2= 0
##$TOPLEV= 0
##$USERP1= <user>
##$USERP2= <user>
##$USERP3= <user>
##$USERP4= <user>
##$USERP5= <user>
##$WDW= 1
##$XDIM= 16384
##$YMAX_p= 348216616
##$YMIN_p= -666921
$$ End of Bruker specific parameters
$$ ---------------------------------
##NTUPLES= NMR SPECTRUM
##VAR_NAME=  FREQUENCY,     SPECTRUM/REAL,   SPECTRUM/IMAG
##SYMBOL=    X,             R,               I
##VAR_TYPE=  INDEPENDENT,   DEPENDENT,       DEPENDENT
##VAR_FORM=  AFFN,          ASDF,            ASDF
##VAR_DIM=   16384,         16384,           16384
##UNITS=     HZ,            ARBITRARY UNITS, ARBITRARY UNITS
##FACTOR=    0.29402158847633, 1,            1
##FIRST=     4192.19760500686, 0,            0
##LAST=      -624.758079000853, 0,           0
##MIN=       -624.758079000853, -666921,     0
##MAX=       4192.19760500686, 348216616,    0
$$ Real data points
##PAGE= N=1
##DATA TABLE= (X++(R..R)), XYDATA
$$ [...]
6129D2150o3867l3848J72074j73353r9135P9969M2365M794m065j23831j6133J25857
6117d7023J13270m6292P5271j10310k2476J1309m9811M9868k7660m3217O1854
6106c5217Q863o7041J61822J2921j14777k3005j7793j1875p3989J32844L0174
6095B927j00548Q2709J5239l3652k3637M6207J28518p2370j01073N2934O4878
6084F2132j11048k9562Q7723R6228j85638K3687P0990l7705J37764j4898o2592
6073C7081l1670K0345m8855K2155L3783j00948l2218K20001j58164j18725j33648
6062b90863J77253j4936K4775J753j3235k6756Q0762N1422j9721l6981J5826o792
6050e7493p3795L9899K1637r3215q844k6735Q7705J05664q545j74910k6995J50785
$$ y = [42150, -21717, -55565, 116509, -56844, -155979, -76010, -33645, -28851, -32916, -156747, -172880, -47023, 66247, 19955, 95226, -15084, -37560, -26251, -76062, -26194, -53854, -97071, -35217, -26354, -93395, 68427, 81348, -33429, -56434, -74227, -86102, -160091, -27247, 2927, -97621, -14912, 327, -33325, -56962, -10755, 117763, 45393, -55680, -2746, 62132, -48916, -78478, 9245, 105473, -80165, -56478, 14512, -23193, 114571, 99673, 37081, 5411, 25756, -23099, -944, 32839, -68109, -100327, 119674, -38490, -157215, -290863, -113610, -128546, -103771, -102018, -115253, -142009, -61247, -9825, -29546, -66527, -50701, -57493, -131288, -91389, -69752, -162967, -171811, -198546, -110841, -5177, -13722, -188632, -215627, -64842]
6038f4842p27N5440j29141P9204m2838j6077Q2947R0218n6615m8253J2530l0735
6026f8889K462o6117k6193L0811j1810J06891Q1317j35434O8749m3395r6703J12951
6014d5360m2947m4562J35799J9661p2892M464K2048j14669J06683P9496j04081
6003e6360k2807p2618M3617P8116o4139J06214j4095j8420o5716n1205M7448n8044
5991a48009J53630n3109M5136j06097R7037j04696J12319m3342j356n4539O2302
5980d0724o8925m5143J28670j45172O0556P2152q9531m4680R5591J10670p8981
5969d5517k9620p9472l2767Q0426N0250o6922n4600M1230l0421R3771j02159k611
5957a78412O927J6598J14702o3678L9363n7276L0028O0677J4012q6893K9712k4380
$$ y = [-64842, -65569, -10129, -139270, -60066, -102904, -118981, -36034, 54184, -2431, -50684, -38154, -68889, -66427, -132544, -158737, -127926, -139736, -32845, 48472, -86962, -18213, -61608, -158311, -45360, -88307, -132869, 2930, 22591, -50301, -45837, -23789, -138458, -31775, 47721, -56360, -79167, -151785, -108168, -30052, -94191, 12023, -2072, -20492, -86208, -137413, -89965, -148009, 5621, -47488, -2352, -108449, -11412, -116108, -3789, -47131, -48487, -103026, -40724, -109649, -154792, -26122, -171294, -110738, -38586, -128117, -172797, -77206, 33464, -45517, -75137, -154609, -187376, -106950, -56700, -123622, -178222, -136992, -167413, -73642, -175801, -178412, -171485, -154887, -40185, -103863, -64500, -121776, -91748, -31071, -17059, -103952, -74240, -98620]
5945i8620M0466k9174L3361Q2417q4072M2147L8161o8598j05525J38857m6849
5934e7429P5739n0029p0484j828J8128P5424L1606j56434J7605l0433n1101k5652
5922b24888J19104J06691j8705q0240K3788O0238j11450n0628R8552M0558j23643
5911a60623K7384M2485k3697l2518Q0363K7321L2415o9928k1242P0348o7098r9135
5899a93925k5190J03270N2179K4493o6779J90033k1151j72660m8077J1061K5938
5888a20808q518o6623P7254O5868R9326l5420q8685n3672M6075m3977O6044r5631
5876a58767p4145R218J27750J3937n5443k0254N1836N3187m4794L9017r448J326
5864f6580p0794N1537r3073O9019O486r8616l546O7309l5938Q2600j8142r0427
$$ y = [-98620, -58154, -87328, -53967, 28450, -55622, -13475, 24686, -43912, -149437, -10580, -57429, 18310, -31719, -102203, -104031, -85903, -10479, 21127, -135307, -117702, -148135, -199236, -224888, -105784, 907, -17798, -98038, -74250, -14012, -125462, -176090, -77538, -36980, -160623, -133239, -90754, -114451, -146969, -66606, -39285, -6870, -76798, -98040, -27692, -94790, -193925, -219115, -115845, -63666, -39173, -105952, 84081, 62930, -109730, -157807, -146746, -120808, -129326, -195949, -118695, -52827, 46499, 11079, -77606, -131278, -85203, -129180, -63136, -158767, -232912, -223694, -95944, -82007, -137450, -157704, -105868, -52681, -97475, -58458, -67906, -66580, -137374, -85837, -178910, -109891, -103405, -202021, -205567, -138258, -174196, -91596, -109738, -200165]
5852b00165o7699M8450N2892m7446Q4293J06988O4277q9811Q55r8753N9349K6777
5840e9993n7720J35770L552J04273j46736j20484Q1750r9918Q350Q2849O6164
5829b143r7276L1086K5537n1212o6772P2138R8633n485p0973o8043j19840P1305
5817a83045J37675k3672P420m4986K8420J21622j6012o1396p6077J7717R5186
5806B852p4880m6066L2779o3081J1686J31967J0127p7578Q1216m2922m9336l3342
5794a16578L7785K5721N1463K4142o8386N377j34830R7358k5896K8155o4634O1323
5782g9000k4696k6061Q3620O086j1792M5998j08531j950K4143n3961P3427N4966
5770a7751m3337j8568j3160J25033r3500l6336j37194J79652J036P5267m1614
$$ y = [-200165, -267864, -219414, -166522, -213968, -129675, -22687, 41590, -48221, -47366, -146119, -86770, -59993, -117713, 18057, 21609, 125882, -20854, -141338, -59588, -159506, -151156, -68307, -2143, -99419, -68333, -42796, -94008, -160780, -88642, 9991, 4506, -66467, -134510, -254350, -183045, -45370, -69042, -61622, -106608, -78188, 43434, 27422, -33974, -110051, -92334, 2852, -72028, -118094, -85315, -148396, -136710, -4743, 5384, -72194, 9022, -33900, -83236, -116578, -78793, -53072, -1609, 22533, -45853, -40476, -175306, -77948, -103844, -75689, -140323, -79000, -103696, -129757, -46137, -40051, -51843, -5845, -114376, -116326, -92183, -146144, -72717, -17751, -61088, -79656, -92816, 32217, -61283, -97619, -234813, -55161, -54125, 21142, -20472]
5759b0472o7486Q2272j03308m1092P5196K7592J2607j19336j4452J81716j42567
5748a29330Q125O6256J0802j00089j5532J37240L4254j43672K6342l0934L753
5737a32785p3514J02134k0609l901O8922p1329J50619j35228N6251K3278p1757
5726a07919N1282N5111l1731P3074j9765q3376J06977K0431j41242J2404N5786
5715h968r3290m453q500L6107j13323R3285N5074K1349J3131M160J9763M8726
5703F3061o4930Q9336r6383q9006R8983P4783r4435r2301n3376P7692O8098K9997
5691A1519m528j0837r7901k5303J6196K1540m3841R960M8023L7770p5312J0554
5679a02160J1804j68097Q0319O1205K9501q8894J20269o8671K7213J0919j7452
$$ y = [-20472, -87958, -5686, -108994, -150086, -74890, -47298, -34691, -154027, -168479, 13237, -129330, -121205, -54949, -44147, -144236, -159768, -22528, 11726, -131946, -105604, -136538, -132785, -206299, -104165, -124774, -128675, -59753, -131082, 19537, -115691, -59440, -36162, -107919, -56637, -1526, -33257, 39817, 20052, -63324, 43653, 64084, -77158, -64754, -8968, -102258, -106711, -115211, -79104, -192427, -99142, -44068, -22719, -9588, -5428, 14335, 63061, -1869, 87467, -8916, -97922, 1061, 75844, -18591, -110892, -164268, -86576, -18478, 11519, 6991, -3846, -101747, -127050, -110854, -89314, -133155, -123195, -75172, -37402, -112714, -102160, -90356, -258453, -178134, -116929, -87428, -176322, -56053, -124724, -97511, -86592, -104044]
5668a04044J9976p8589M1579J20869n434j70112M0245P3868N0726n8161Q418q1446
5656a42105O231J6848L2585O9076M8398l8860N2512l3471Q776r2095p0827L8503
5644a04429J6955L1576L6327N991l3221q965O4435O6669j60122L0574R339l7921
5632h2792L2419K8823N610j3615k5092O7233n7429o6646R2500M3228r7300J8667
5620e4394P6502N2360P825Q4605o6074j05575P425K1117J62845M1292p0323K2743
5608A80348m9218k39989J14114J3454r7476J19739k2922l4436K907q8312M2953
5597e8838L0721m6466L9590k3306j4807p473O1609l5336J9109r965n0374q3119
5585a78655J72914R1527r104o3384O7455m8161p0171K560K2217k1706p6928q471
$$ y = [-104044, -84068, -162657, -121078, -209, -5643, -175755, -135510, -61642, -10916, -69077, -60659, -142105, -135874, -119026, -86441, -17365, 31033, -7827, 44685, 11214, 19990, -72105, -142932, -104429, -87474, -55898, -19571, -13580, -46801, -55766, 8669, 75338, -84784, -54210, -44871, -82792, -50373, -21550, -15940, -29555, -54647, 12586, -44843, -111489, -18989, 24239, -73061, -54394, 22108, 74468, 82293, 166898, 100824, -4751, 2674, 23791, 186636, 227928, 157605, 180348, 131130, -108859, 5255, 18709, -78767, 40972, 18050, -16386, -13479, -101791, -58838, -28117, -74583, -34993, -58299, -73106, -80579, -18970, -54306, -35197, -45162, -95536, -178655, -5741, 85786, 76682, 13298, 80753, 32592, -37579, -35019, -12802, -34508, -111436, -119907]
5573a19907J8201J2778n451l7293o9272Q2445m3947q0320P6583j278n626M9733
5561a23354l641O5754j2007j03901L3799j289N1336m5487N6907q944p1349J09866
5549e2310O784K3941N1938o0412N1233r856k43170J25978o185J12153n6477l8054
5537i4437j18416j184P9390K9516q9283J35142J8040j6586n4371O4555j3951N3101
5525h484p0602j8849M1872j8047N5977L308J0346q8768J25034j14799j8914J3829
5513h8097M6482j10802N6075L7213j2947M6118l7615j82124J13465N71O513k7999
5501a53147M3925L655o512P8880n4936L499p1091k0280L1535K6814L5258q6260
5489a68660L4421N8045l3370l3239l9202m0119P8329J08325L803o1001m508R966
$$ y = [-119907, -101706, -88928, -94379, -131672, -200944, -118499, -162446, -242766, -166183, -167461, -173087, -123354, -126995, -61241, -73248, -177149, -143350, -144639, -93303, -138790, -81883, -90827, -162176, -52310, -45526, -21585, 30353, -30059, 21174, 11318, -231852, -105874, -112059, 94, -56383, -94437, -212853, -214037, -134647, -105131, -194414, -59272, -41232, -57818, -112189, -47634, -61585, -8484, -79086, -97935, -56063, -74110, -18133, -14825, -4479, -93247, 31787, -83012, -101926, -88097, -41615, -152417, -96342, -59129, -72076, -25958, -63573, -245697, -132232, -131661, -125148, -153147, -109222, -105567, -112079, -33199, -88135, -84636, -155727, -176007, -144472, -117658, -82400, -168660, -134239, -76194, -109564, -142803, -182005, -222124, -143795, -35470, -31667, -92668, -97176, -87210]
5477h7210J10828M5863q4737o1170J04125m4855q9390l6406l9738J44290M34k5894
5465f3860N1210Q2858j44324j17810P1692L4003J56277q1602r5313N33O9804N5173
5453A8641n6159n0456n2765J2205M3797Q0104j05533P6153L4658K7849m4722j6249
5441c2477N5442j75035O0011R6706R530k895j11484M518P0573J6751o7865O4009
5429a2216Q7199m2994j25887N2080R2707j13256j6900o806L0114l4277N5613P9437
5417D4814j56068P2748m7612N2429m5039M5232N1171r424n436J8603q6310r0650
5405a55542J11817N9732k9055j3232j0416K159M0599m0253n448k0298Q9445J401
5393C0909k4581k77Q5121n3037n7405p4983P7230L8058r3918M3361N4640q7875
$$ y = [-87210, 23618, 69481, -15256, -76426, 27699, -17156, -106546, -142952, -182690, -38400, -37966, -63860, -12650, 70208, -74116, -191926, -120234, -86231, 70046, -11556, -106869, -106336, -36532, 18641, -37518, -87974, -140739, -128534, -84737, -4633, -110166, -34013, 645, 28494, -16228, -32477, 22965, -152070, -92059, 4647, 14177, 11282, -100202, -95684, -25111, -8360, -76225, -12216, 74983, 31989, -93898, -41818, 50889, -62367, -79267, -86073, -55959, -90236, -34623, 44814, -111254, -38506, -86118, -33689, -78728, -33496, 17675, 8251, 2815, 21418, -64892, -155542, -43725, 16007, -13048, -26280, -36696, -34537, 6062, -34191, -39639, -59937, 29508, 30909, 6328, 6051, 91172, 38135, -19270, -94253, -17023, 21035, -72883, -29522, 25118, -62757]
5381f2757j59004R1329J33344O4866q6732N31M0139k905o7647K6715L2586j7983
5369g518M3640k8881m2579J5395l6984p320o4511J38316K4865j1803P7259j96019
5357i6140N2102N4140K8880q4223l5598L0791J51025l1322p8334j04737M1571
5346g1845q237J42148j1560j05294q0028K8403M0864J6803L784k368O2417n319
5334I768l6058m2877l4317J3355L8660J6677M0395j34191N6385m3180J03835K1274
5322I726Q3910r518j8539j05018j3429J38661J7020j21705m6970Q6534J03984
5311A24656j24440m3619K7767Q6273j03783l8870q1378J70365J6454j6223p4844
5300e7642k5428O8475J3328Q9670R7847q4299p0223O350K4754N7742n9734j7385
$$ y = [-62757, -221761, -130432, 2912, 67778, -18954, -18423, 21716, 18811, -48836, -22121, 10465, -7518, 36122, 7241, -35338, -19943, -56927, -64247, -128758, 9558, 34423, 22620, 99879, -96140, -44038, 10102, 38982, -45241, -80839, -50048, 100977, 69655, -8679, -113416, -71845, -80082, 62066, 50506, -54788, -134816, -106413, -65549, -48746, -44962, -47330, 15087, 9768, -26290, -69167, -103484, -90129, -51469, -34792, 5603, -128588, -72203, -115383, -11548, 9726, 93636, 84118, 65579, -39439, -52868, 85793, 102813, -18892, -65862, 20672, 124656, 216, -43403, -15636, 70637, -33146, -72016, -153394, 16971, 33425, 17202, -57642, -83070, -14595, -1267, 88403, 186250, 101951, 31728, 38078, 62832, 120574, 60840, 43455]
5288D3455k1949l0118J2209o3112K9780J05307r0227O3965K731N3024l3990r3310
5276b2235j8025K6919k8915O9806j5320N8789n1804J14014j24062k9240J08059
5265H7986l8872K9320J02199p9226j5923J7411j8978j18648N3016o836N888q7461
5253g0124M4988O6239l6182Q3897L9752j47592Q9350P857O6157M593p0418j15803
5241c7286N2963O6173m9425P8143j16173O3397Q633L851N0318K3894j5966q2990
5229D5532r7226P6030K3931Q4513M5785m8041j11811O9678j1013J27596N1462
5218B56436j16759L7819j6450K2496M0138j07793M8183k9897k6736m9216j0784
5207D7437L0607N8686O5322J7239N0578j54920n4423J03468K0771n6419J13676
$$ y = [43455, 21506, -8612, 3597, -59515, -29735, 75572, -14655, 49310, 52041, 105065, 71075, -22235, -40260, -13341, -42256, 27550, 12230, 71019, 19215, 133229, 9167, -20073, 87986, 49114, 78434, 180633, 101407, 85484, 102895, 83917, -34731, 18285, 11449, 17337, -70124, -25136, 41103, 4921, 88818, 128570, -19022, 70328, 78185, 144342, 148935, 78517, -37286, 15677, 81850, 32425, 110568, -5605, 57792, 66425, 70276, 120594, 144488, 128522, 45532, -51694, 24336, 48267, 132780, 178565, 130524, 18713, 88391, 77378, 204974, 256436, 139677, 177496, 161046, 183542, 223680, 115887, 164070, 134173, 107437, 58221, 47437, 78044, 136730, 202052, 219291, 269869, 114949, 60526, 163994, 184765, 128346, 242022]
5196B42022N687j03380N0792k703M2588L4192o4000O1435M9300M6805j48691k8424
5184A85623M1361l7554Q825O9161j5214l6361J70346o0386o3508m8675j2543J44130
5172C45205J9817j05052J9582P2672l1869O7733j8886N9257p4274j26357Q2680
5161C10508m8122j1614Q8550N133N753m2964l4818J34885j10035L2585K156L2561
5149C64578m0397L0782O1204P6231j07179L0122N3372k7189L853O0252o080K0153
5137E19702J17617j22712K4091J8621j00205L6208J37067M252m5001M720k9867
5126E64493r0536M247q616O4494N4538p5975n7770N7420M7439j9547J10290O2866
5114G13343n0871p8684J0813J05783l3177k8989j4172J63149j2729P2441k8937
$$ y = [242022, 247709, 144329, 195121, 192418, 235006, 269198, 205198, 266633, 315933, 362738, 214047, 185623, 226984, 189430, 198255, 267416, 252202, 215841, 386187, 325801, 262293, 213618, 201075, 345205, 365022, 259970, 279552, 352224, 320355, 388088, 369202, 428459, 354185, 227828, 310508, 262386, 250772, 339322, 344455, 350208, 307244, 272426, 407311, 297276, 329861, 332017, 364578, 324181, 354963, 416167, 492398, 385219, 415341, 468713, 441524, 445377, 505629, 499549, 519702, 637319, 514607, 538698, 557319, 457114, 493322, 630389, 634641, 589640, 594360, 564493, 473957, 478204, 469588, 534082, 588620, 512645, 454875, 512295, 559734, 540187, 650477, 713343, 662472, 583788, 594601, 700384, 667207, 638218, 624046, 787195, 774466, 846907, 817970]
5103H17970j59987P8834m8706k446l3951J2366O3049M0159n9343r0462o3874Q7318
5091F40927J20038k4771N0411J02049r4781m4716R0126k7246Q4969n7847M9952
5080H89111j87913n0232K30706o4620O274J12914M3622m3042Q810n18k7493k6526
5068H91093N5077K9177j9287P4021l6948N611R959J09860n2211o7819J23453J15034
5056A237020l7881k3487O2978m4545j49906l135J59005R4187o9981j40690p4699
5045A008866O1210M1016P5053M8641L7845j30938l2830J04075p7513L4640j10376
5034A059689J20058L0865J15328o257p3223M5967j9495J1640K37672p4928n7503
5023A389813k170j9486J19184N8500K1858M334L9002J2305L9826R604j19811J45181
$$ y = [817970, 657983, 736817, 688111, 685665, 651714, 664080, 727129, 767288, 707945, 617483, 553609, 640927, 760965, 736194, 786605, 888654, 793873, 749157, 839283, 812037, 897006, 839159, 889111, 701198, 650966, 881672, 817052, 823326, 936240, 979862, 936820, 945630, 945112, 917619, 891093, 946170, 975347, 956060, 1030081, 993133, 998744, 1008703, 1118563, 1066352, 998533, 1121986, 1237020, 1199139, 1175652, 1238630, 1194085, 1044179, 1041044, 1200049, 1294236, 1224255, 1083565, 1008866, 1070076, 1111092, 1186145, 1234786, 1272631, 1141693, 1108863, 1212938, 1135425, 1170065, 1059689, 1179747, 1210612, 1325940, 1319683, 1246460, 1292427, 1272932, 1284572, 1522244, 1447316, 1389813, 1387643, 1368157, 1487341, 1545841, 1567699, 1572033, 1611035, 1623340, 1663166, 1672770, 1552959, 1698140]
5011A698140R6720j28978N861J05262J66533l5841k0807k441O6408N9156Q5922
5000B095935K6075J4975l6707Q5276J23535L4727R0546l3935N9491L0457J54136
4989B644511O4884L2024P5740O3159K14728J03965J11272M7835N8362J08874L341
4978C528695O4304J48947O9723P4575N7683J83265J21148M4366J10998J66821
4968D570525O2093K44646Q8783N1211J58933L20285L5241K26874K48930O3188
4958F070709K36753L34300J91270J14354J43115K00180J29091J52342K34005J22179
4948G928298J63373L53953L11117K34330L23251L64455M70984L90000L49521N10133
4938A1399415O13556O79946N45359M62431M64160L39654K53839J85027L87620
$$ y = [1698140, 1794860, 1665882, 1671743, 1777005, 1943538, 1907697, 1886890, 1884449, 1950857, 2010013, 2095935, 2122010, 2136985, 2100278, 2185554, 2309089, 2343816, 2434362, 2400427, 2459918, 2490375, 2644511, 2709395, 2741419, 2817159, 2880318, 3095046, 3199011, 3310283, 3358118, 3416480, 3525354, 3528695, 3592999, 3741946, 3811669, 3886244, 3943927, 4127192, 4248340, 4292706, 4403704, 4570525, 4632618, 4877264, 4966047, 5017258, 5176191, 5496476, 5531717, 5758591, 6007521, 6070709, 6307462, 6641762, 6833032, 6947386, 7090501, 7290681, 7419772, 7572114, 7806119, 7928298, 8091671, 8445624, 8756741, 8991071, 9314322, 9678777, 10149761, 10539761, 10889282, 11399415, 12012971, 12692917, 13238276, 13700707, 14164867, 14504521, 14758360, 14943387, 15331007]
4929A5331007L44752M92712M37934N80009L26498L22614L19165M67104L86533
4920A9008328L50113O23220Q63442P84642J105088J184766J079341Q72507Q26415
4911B6697862N53953N47130P86000J033105J138153J260089J237253J160760J230620
4902C5644925R74927J020271Q67900O98453L38870j71011m93847n11775p48659
4893C7620054o79120n40443k62047m9339J37207M82306J011017J173600J496032
4884D0389267J744681J910796K325876K629092K883566K882213K135989R22278
4876E7823758r76878l039688m306154m720458m210649l361561k701875j994395
4868C2512100j378049q65611n78123j62378J68779P51515R53496J346519J638530
$$ y = [15331007, 15675759, 16168471, 16606405, 17186414, 17512912, 17835526, 18154691, 18621795, 19008328, 19358441, 19981661, 20845103, 21629745, 22734833, 23919599, 24998940, 25871447, 26697862, 27251815, 27798945, 28584945, 29618050, 30756203, 32016292, 33253545, 34414305, 35644925, 36619852, 37640123, 38508023, 39206476, 39545346, 39374335, 38880488, 38368713, 37620054, 36940934, 36400491, 36138444, 36089105, 36226312, 36708618, 37719635, 38893235, 40389267, 42133948, 44044744, 46370620, 48999712, 51883278, 54765491, 56901480, 57823758, 56846880, 53807192, 49501038, 44780580, 40569931, 37208370, 34506495, 32512100, 31134051, 30268440, 29690317, 29527939, 29696718, 30448233, 31401729, 32748248, 34386778]
4859C4386778J844992J601019P06067n24738j793993k748998l272318l103346
4851B7095463k712576k307065k015401j618280j355655j213063j087634r20976
4843A3864813p89106o51542p07557n08761m38164m98228l97885l43276l13395
4834I216899l19308k79050k96076j17867j41156r4514o2600m6340j59009j51051
4824G549928l3194k1456L0312j31822N2015l412L4572L5994p4178M6119J70099
4813G654977R9341J79227J73269J05283R7313J23605j34209J4164n6455k7216
4803H229299J33147J45404L1685J40734J33118J90830K16771L26130K19082L39269
4793A0105469L65024M11270L64299M40271L83536L13422K60342K41782J81014
$$ y = [34386778, 36231770, 37832789, 38538856, 38014118, 36220125, 33471127, 30198809, 27095463, 24382887, 22075822, 20060421, 18442141, 17086486, 15873423, 14785789, 13864813, 13075707, 12424165, 11716608, 11207847, 10769683, 10271455, 9873570, 9530294, 9216899, 8897591, 8618541, 8322465, 8204598, 8063442, 7968928, 7906328, 7859988, 7700979, 7549928, 7516734, 7495278, 7525590, 7393768, 7445783, 7442371, 7476943, 7512937, 7438759, 7484878, 7654977, 7754318, 7933545, 8106814, 8212097, 8309410, 8433015, 8298806, 8312970, 8256515, 8229299, 8362446, 8507850, 8539535, 8680269, 8813387, 9004217, 9220988, 9547118, 9766200, 10105469, 10470493, 10881763, 11246062, 11686333, 12069869, 12383291, 12643633, 12885415, 13066429]
4784A3066429L39920K80661M59035N00501M32627L99609L70692L78974N1212J88157
4774A6467817L40763L38290M65712N16027O13850R81280P97123R54859R77725
4765B2453446P79421O30268O61415N14641P75918M63787q2916l93446m65276m81863
4755B4855395m72151k52632N9057K78239P28170Q56491J185534J355257J258927
4746B9852287J128786R08424J072919J219324J368241J741611J721285J864078
4738D0876955K176230K427813K281859J345885J9461j344271k593383k960805
4730D2229744k684018k142868j678128q41171m75221K101J47016M68489R41167
4721C5967111J465082J912678K586644L465044M334810M756021L375444N09922
$$ y = [13066429, 13406349, 13687010, 14146045, 14646546, 15079173, 15478782, 15849474, 16228448, 16279660, 16467817, 16808580, 17146870, 17612582, 18128609, 18742459, 19723739, 20520862, 21475721, 22453446, 23232867, 23863135, 24524550, 25039191, 25815109, 26278896, 26195980, 25802534, 25337258, 24855395, 24383244, 24130612, 24189669, 24467908, 25196078, 26052569, 27238103, 28593360, 29852287, 30981073, 31889497, 32962416, 34181740, 35549981, 37291592, 39012877, 40876955, 43053185, 45480998, 47762857, 49108742, 49128203, 47783932, 45190549, 42229744, 39545726, 37402858, 35724730, 34883559, 34408338, 34410439, 34557455, 35025944, 35967111, 37432193, 39344871, 41931515, 45396559, 49731369, 54487390, 57862834, 58372756]
4713E8372756j966317l528565m504468m682456m505090l643247l039590k457795
4705C0045228j750458j380782j007788o49670n08084l50655J12029K83899N43580
4696B5337299R20596Q65641P86481k1536o84099j222569j876588k039500j927498
4687B0138227j748396j278600j153098r04092q60577p88549o93255o49948m02158
4678A1659554l70118l52049k72606m14709k77294k81361j23612k11498j02013
4669I254294l46234j83130M001j45133L0965m4712j1312r1231P8279J61714J61309
4658H868810K29443J51641J77159k16119k82875k43749l41292m36948l65798n44141
4648F996131l03769l68284j03773j07052k6597Q6105P4108L04304K49520M54433
$$ y = [58372756, 56406439, 52877874, 48373406, 43690950, 39185860, 35542613, 32503023, 30045228, 28294770, 26913988, 25906200, 25256530, 24748446, 24397791, 24509820, 24793719, 25337299, 26257895, 27123536, 27910017, 27888481, 27204382, 25981813, 24105225, 22065725, 20138227, 18389831, 17111231, 15958133, 15054041, 14193464, 13404915, 12711660, 12061712, 11659554, 11289436, 10937387, 10664781, 10250072, 9972778, 9691417, 9567805, 9356307, 9254294, 8908060, 8724930, 8728931, 8583798, 8614763, 8570051, 8558739, 8467508, 8545787, 8707501, 8868810, 9098253, 9249894, 9427053, 9210934, 8928059, 8684310, 8343018, 7906070, 7540272, 6996131, 6692362, 6324078, 6220305, 6113253, 6086656, 6172761, 6246869, 6551173, 6800693, 7255126]
4638G255126K62366j07336k48698j44901k58324o01697o09970l54644k82613m42789
4628D466520k28845p0240j40858l1586j56487r3298j38442P609j86319n9605l2986
4617C335463Q3200j26293L6434J522L6481L9340J02342M1981L5196J07105M4875
4606C737646K04326J93373J25118L7243l5637j88012j40084l3936r1294j20227
4596C688516k754O5395J20609J49126K20287K03772K85873K74029L80127K79959
4586E664939M28838N92065K75259J32905K07147J75007k47486q30941o31706m88989
4576E277038l86255j67169j34948p9703K1871K30111K74045M01107L40166J82440
4566E958703K22961J48391J82134M7320l04622k95536n16825n31147m31136l67990
$$ y = [7255126, 7517492, 7410156, 7161458, 7016557, 6758233, 6156536, 5546566, 5191922, 4909309, 4466520, 4237675, 4167435, 4026577, 3994991, 3838504, 3745206, 3606764, 3614373, 3428054, 3368449, 3335463, 3418663, 3292370, 3328804, 3330326, 3366807, 3406147, 3508489, 3550470, 3585666, 3692771, 3737646, 3941972, 4135345, 4260463, 4297706, 4262069, 4074057, 3933973, 3900037, 3808743, 3688516, 3685762, 3751157, 3871766, 4020892, 4241179, 4444951, 4730824, 5004853, 5384980, 5664939, 6093777, 6685842, 6961101, 7094006, 7301153, 7476160, 7228674, 6397733, 5766027, 5277038, 4890783, 4723614, 4588666, 4508963, 4530834, 4760945, 5034990, 5436097, 5776263, 5958703, 6181664, 6330055, 6512189, 6559509, 6254887, 5959351, 5442526, 4911379, 4480243, 4112253]
4556D112253l06765k82078k61719p8529j23663r1718l7457J26249P4931K5722
4546C157226r3796l4471q006j38088j9902r0173l38462j66595j79062k00682j76736
4535A711253N0848j577l84099p0183J30448k0010j16410j7646j01135K0673j1344
4524A190818J02742Q541n948j25429o2373j27512l1371J1540K8753R7822m7857
4513A039726k0517M0606j33175R6947N7851p0627o2795L0293q7641q1277P0152
4502H79543J1699Q160r4805K6758N4951L4067q1382o6968P5796N1176j25616P7193
4490H50572j5621n3585j8197j08252l6446K6804j8886L3892k7326m3018J40744
4479G30681Q6228n8682j14917l0977K568N6566O6877K4549o023j07484R4576o4155
$$ y = [4112253, 3805488, 3523410, 3261691, 3183162, 3059499, 2967781, 2930324, 3056573, 3131504, 3157226, 3063430, 3028959, 3020953, 2882865, 2862963, 2772790, 2434328, 2267733, 2088671, 1887989, 1711253, 1762101, 1760524, 1376425, 1306242, 1436690, 1416680, 1300270, 1282624, 1181489, 1202162, 1190818, 1293560, 1302101, 1296153, 1170724, 1108351, 980839, 949468, 961008, 989761, 1087583, 1039726, 1019209, 1059815, 926640, 1023587, 1081438, 1010811, 948016, 978309, 890668, 809391, 879543, 891242, 899402, 804597, 831355, 886306, 920373, 838991, 772023, 847819, 898995, 773379, 850572, 834951, 781366, 763169, 654917, 618471, 645275, 626389, 660281, 632955, 589937, 730681, 816909, 758227, 643310, 612333, 614901, 671467, 738344, 762893, 756870, 649386, 743962, 679807]
4467F79807j14049J45175l3483m0857o5283K1325j13646l9942R1289q1J3029J3060
4455E56344k8288Q6764r7894J9343j6799r0690R3973p7832L6939m3725j5909M9597
4443D71823o889o2548K7583Q4560n7055l8846j9376m7775O5239j09227J01170
4432D08659m3623R9900p0599k3076n418P3214r2924N0539O7856m0217J1257r4840
4420C40728O477n7574P8985N0736M3286r2480N9641n9103N4654o3387n700j12575
4408B43688J16995J4002O2820m7550o3971P3549J9595p9914L0785Q5979q0426
4397C75552l5400K3240l2886l8846N7192K5129j07082N5535k6243O3310l3520
4386C25981n7090J20624m6923o8007K7156K5819M4635m6973j3869J22620q1477
$$ y = [679807, 565758, 710933, 677450, 636593, 571310, 592635, 478989, 439047, 530336, 530255, 543284, 556344, 528056, 614820, 516926, 536269, 519470, 428780, 522753, 444921, 481860, 438135, 422226, 471823, 464934, 402386, 429969, 514529, 457474, 418628, 399252, 351477, 416716, 307489, 408659, 365036, 464936, 394337, 371261, 365843, 439057, 346133, 396672, 464528, 424311, 435568, 340728, 347205, 289631, 368616, 419352, 462638, 370158, 429799, 370696, 425350, 361963, 356263, 243688, 360683, 374685, 437505, 389955, 325984, 399533, 419128, 339214, 369999, 455978, 375552, 340152, 363392, 330506, 291660, 348852, 373981, 266899, 322434, 296191, 359501, 325981, 268891, 389515, 342592, 274585, 301741, 327560, 372195, 325222, 311353, 433973, 352496]
4375C52496l8269M02r8375m3227K34139k943O0641j5516r4461Q8076l2287o7064
4363C43612J61819l4118p3645p2233m0418j2437m645M9985M2368m4017Q8975r6371
4351C08875K8455k7733k7736j14363Q8648J28837K8039j00976R041k9249m992
4340B86846K1704M2742o5347J4800P1198J1406m9772r2621N2535L841m2157n9031
4328A96144P8510J22333m2447Q9928q443R987N8360o1491J61465j15528k1530
4317D67288M8670o049j24684j8389j42896K98l7583Q5320P4422N7519p4272P6351
4305D05995L8883o1085m0665j6660o7274l1474J26226m6417J9154k0429M7327
4294C53581J34162O3672j19434r3658P2577l3439o5666K4156J7035J7972N3313
$$ y = [352496, 314227, 314629, 216254, 173027, 407166, 404223, 464864, 449348, 354887, 442963, 410676, 343612, 505431, 471313, 397668, 325435, 285017, 272580, 267935, 317920, 360288, 316271, 405246, 308875, 337330, 309597, 281861, 167498, 256146, 384983, 413022, 312046, 321087, 291838, 286846, 308550, 351292, 285945, 300745, 371943, 383349, 333577, 240956, 293491, 297332, 255175, 196144, 274654, 396987, 354540, 444468, 436025, 446012, 504372, 442881, 604346, 488818, 467288, 515958, 509909, 385225, 366836, 223940, 224238, 186655, 271975, 346397, 403916, 329644, 405995, 444878, 383793, 343128, 326468, 259194, 227720, 353946, 307529, 326683, 306254, 353581, 487743, 551415, 431981, 338323, 410900, 377461, 311795, 335951, 352986, 370958, 424271]
4283D24271l1192p3865l8856M1207l3209r518N0456J33940K0222Q08Q828k9618
4271D63474q8923Q1688j13368n4939R2054L048O8009j5182j46929J16118Q4133
4260D89183q3788K8036N8861j08485J30127J05026j8230q788j18776O8227J6649
4249E58042J177j574L0711j8847L4425K4921n1021J50N9363Q258R7505P1920m7551
4236G67479k0719j6127R3918J2234m8243Q7511j9266p0155o7841n9834L5170J14497
4224H08624O9321L816j09114k0343Q2823K6688L222J60740n3829o1454m5636J30573
4212I95431L4345j01686J40491R8432P8555P666p3213N590J47795O614M8184J7534
4200A405738k985N3349O6334J74035J18941k6400O8548J18923Q2175R8545K6566
$$ y = [424271, 393079, 319214, 280358, 321565, 288356, 278838, 329294, 463234, 483456, 484264, 493092, 463474, 374551, 456239, 342871, 287932, 379986, 383034, 451043, 435861, 288932, 405050, 489183, 405395, 433431, 492292, 383807, 513934, 618960, 600730, 591942, 473166, 541393, 558042, 559219, 557645, 588356, 569509, 603934, 628855, 577834, 577984, 637347, 645605, 743110, 815030, 767479, 746760, 730633, 824551, 836785, 788542, 876053, 856787, 786632, 718791, 658957, 694127, 808624, 877945, 881761, 772647, 752304, 835127, 861815, 865037, 1025777, 971948, 910494, 864858, 995431, 1029776, 928090, 1068581, 1167013, 1245568, 1253234, 1180021, 1185611, 1333406, 1340020, 1388204, 1405738, 1402753, 1456102, 1522436, 1696471, 1815412, 1789012, 1857560, 1976483, 2058658, 2157203, 2183769]
4189B183769Q1742N5367M8182P6983L4738O0772P7724Q4391J78804m0016P6413
4178B918869N4657J55270K74006J04504J08202K35419J92758K65337L83302L57704
4168E050028r8632O1145J50022J9724l410K8279J77975K72018K96364K42537L75289
4157F571339M23884M55979P18015O34275N11746M53866J06492j31772O2456R0252
4147I896532M06826L81679N30262Q47043R53229J038818J353471J602360J840128
4138A8850348K193902K626551L444618M227410N566151O992816P029026K053733
4130E2984555m220831p005854o933408n820062m524703l279124k385068j712310
4122A7103195j399972j230069q79312r28241r08407o42605o75941m56887m13956
$$ y = [2183769, 2265511, 2320878, 2369060, 2446043, 2480781, 2541553, 2619277, 2703668, 2882472, 2842456, 2918869, 2973526, 3128796, 3402802, 3507306, 3615508, 3850927, 4043685, 4309022, 4692324, 5050028, 4951396, 5012541, 5162563, 5182287, 5178877, 5207156, 5385131, 5657149, 5953513, 6196050, 6571339, 6995223, 7451202, 8169217, 8803492, 9315238, 9769104, 9875596, 9743824, 9806280, 9896532, 10303358, 10685037, 11215299, 12062342, 13015571, 14054389, 15407860, 17010220, 18850348, 21044250, 23670801, 27115419, 31342829, 36908980, 43901796, 50930822, 52984555, 48763724, 41757870, 34824462, 29004400, 24479697, 21200573, 18815505, 17103195, 15703223, 14473154, 13593842, 12665601, 11757194, 11114589, 10438648, 9981761, 9567805]
4113I567805o63743l02085j63054j18188o4072j20189k01916r3360P2602K32468
4103H146268J49348J03058K11044K00386L39605L91637N16853N25482P83057J013246
4093A2379984J313859J491699J517390J980658K487529L167595M306451N845882
4085C4491047Q038438P131406j527602o831787p595722o669564m808386l568337
4077A8659493k484388j792611j357228j216160j125445q80567q21674o94405n11535
4068G775480o49676n52538n31384k97365l80501j98309l42923k74894j58026j35297
4058D254567l22528j10645j51164j31197j75492j39512o7886k58835k54967r7654
4048B544687n6156j52211J4751k047j87538l2036j39573j23621j8352N0142j11556
$$ y = [9567805, 8904062, 8601977, 8438923, 8320735, 8256663, 8136474, 7934558, 7841198, 7913800, 8146268, 8295616, 8398674, 8609718, 8810104, 9149709, 9541346, 10058199, 10583681, 11366738, 12379984, 13693843, 15185542, 16702932, 18683590, 21171119, 24338714, 28645165, 34491047, 42529485, 49660891, 48133289, 41301502, 33705780, 27036216, 22227830, 18659493, 16175105, 14382494, 13025266, 11809106, 10683661, 9803094, 8981420, 8287015, 7775480, 7125804, 6573266, 6041882, 5744517, 5364016, 5165707, 4822784, 4547890, 4389864, 4254567, 3932039, 3821394, 3670230, 3539033, 3363541, 3224029, 3156143, 2897308, 2642341, 2544687, 2488531, 2336320, 2351071, 2349024, 2161486, 2129450, 1989877, 1866256, 1847904, 1898046, 1786490]
4037A786490j14631k2229M8882M773j80161K5019l3396n8325N4251j09622O553
4026A407604P7045k2470j77764j51343J22758p4809q2901j5002j2683J1143n6087
4015A025491J4199p5149r828k6907l2006k1315J6797p4009j6004N6228l1092m3533
4003G82872O324M5682l2439J3130p8515K5863M476J8908J06342k18192o3603K2671
3991F33519J11375j15495j04136J60473j7564m9439r3229Q779R6355l2549J00748
3980F98837j22641n5191k557k596p5229n528J09737k708L8402K5170L983N7616
3968F67295Q388j68720k6083O022m1882J8915j54555M2792P5425M759j22849N6132
3956C65639J04322n8966O968k8888k7431j6219J63066o3672M831L685n0358R4376
$$ y = [1786490, 1671859, 1649630, 1698512, 1703285, 1523124, 1548143, 1514747, 1456422, 1510673, 1401051, 1407604, 1484649, 1462179, 1284415, 1133072, 1255830, 1181021, 1098120, 1083118, 1070435, 1081578, 1025491, 1039690, 964541, 954713, 927806, 895800, 874485, 891282, 817273, 801269, 857497, 826405, 782872, 789196, 834878, 802439, 815569, 737054, 762917, 767393, 786301, 892643, 674451, 610848, 633519, 744894, 629399, 525263, 685736, 668172, 618733, 525504, 534283, 630638, 598089, 698837, 576196, 521005, 518448, 515852, 440623, 435095, 544832, 542124, 580526, 605696, 609679, 667295, 675683, 506963, 480880, 486902, 445020, 463935, 309380, 352172, 427597, 432356, 309507, 365639, 469961, 410995, 417963, 389075, 361644, 345425, 508491, 444819, 449650, 453335, 402977, 497353]
3944D97353N390J5707j2875q5625O662o9567M4825n0627O7548k0812N1737o0322
3932C89394N3527k4605R347l6596P2681j64308o861P4098N1939k9352k7054Q1368
3920D43578K6204J3597j850K6814r4018j6557K9082m2475n7460l23N9891k853
3908C83630k7801J55368p3527m0069K5756J05548r1174m2095J12744O1381q2843
3897D86918N9004L5053P4374K2716j14259L2465j9943n5706O3480J04581j51335
3886E37348q6364M1996j77970J40098P6604p4091K2492n6613l4383O3284o3616
3875C88785K5637k8309k9831o913m2026J94138k5421o4394o0029N6074K4928k1322
3863D11317m4749r1771R9242k0104m9432O2062p4295O7672j7537J38270k7344
$$ y = [497353, 502743, 518450, 505575, 419950, 426612, 357045, 401870, 351243, 418791, 397979, 449716, 389394, 442921, 418316, 427663, 391067, 463748, 299440, 292579, 366677, 418616, 389264, 362210, 443578, 469782, 483379, 481529, 508343, 414325, 397768, 426850, 384375, 326915, 326592, 386483, 383630, 355829, 511197, 437670, 397601, 423357, 528905, 437731, 395636, 508380, 569761, 486918, 545922, 580975, 655349, 678065, 563806, 596271, 576328, 520622, 584102, 688683, 537348, 450984, 492980, 315010, 455108, 531712, 457621, 480113, 423500, 389117, 452401, 388785, 414422, 386113, 356282, 349369, 307343, 501481, 476060, 411666, 351637, 407711, 432639, 411317, 366568, 274797, 374039, 353935, 304503, 366565, 292270, 359942, 342405, 480675, 453331]
3852D53331j58448J32002M1779J9602k4174M5417o104K8783m0578q0371l3250
3841C77989L7016L6886j538r2443K1183M5511m3690m3160J33132M9771n4871o8183
3829C97603N903n3449j52118R8881o424N6389o489j35754J51017N0423m0666n126
3817C60190P8865L689l2818J8499P497k7795O1516q9079J1671J00339o8778q010
3805D15786K9717r5003M8256K9515k9670M1111p1586M1086N1810K5563m113m6242
3793D36230j06621O859p2215Q4R3874l0690M268Q1809o4532k852J34440p5437
3781D05217j03082J77944l8906n1367Q2440J9276j24422p1436R7046k4264K1633
3770C90079J9986o1402Q696J4986j01086r6673J29471M9634l2774o1125K3353
$$ y = [453331, 294883, 426885, 468664, 488266, 464092, 509509, 503405, 532188, 491610, 411239, 377989, 415005, 451891, 450353, 357910, 379093, 424604, 380914, 337754, 470886, 520657, 465786, 397603, 403506, 350057, 197939, 296820, 290396, 346785, 340296, 204542, 355559, 405982, 365316, 360190, 439055, 442744, 409926, 428425, 435922, 408127, 469643, 380564, 392235, 492574, 423796, 415786, 445503, 350500, 398756, 428271, 398601, 439712, 368126, 409212, 461022, 486585, 482472, 436230, 329609, 336468, 264253, 264337, 358211, 327521, 331789, 413598, 349066, 346214, 480654, 405217, 302135, 480079, 441173, 389806, 472246, 491522, 367100, 295664, 392710, 368446, 390079, 410065, 348663, 357359, 372345, 271259, 174586, 304057, 353691, 320917, 259792, 283145]
3759B83145K5910J4392Q0433P293j40518R679J16441n2457j6310K4553L4382p747
3747C79196O8578p2505l7474n3909r625J45739o2686M5790P2895j12662k6283
3736C37054N8275N9913P2723j43811N476Q094o3799M8284M0316n7649J21207j067
3724D85016r2853L6752L1707M523o7123L1517N0182L8167J9051k2703j01253l3835
3712C79148R0725n0606n8718J17334J15952k1691P8857M6608o6775o1062r7352
3701D72420J87100k6856M7066j29254j18488J2383M9423P2676O1359J1271j810
3690F37290n1551l3202m8883R7693N5260J05847n8775j21682O2530n1553n336
3679E87638J0000J6155L8130P5951K2883K6366j16217n7343Q8714K3465r8327
$$ y = [283145, 309055, 323447, 403880, 411173, 270655, 280334, 396775, 344318, 328008, 352561, 386943, 379196, 447774, 375269, 337795, 283886, 274261, 420000, 357314, 403104, 475999, 363337, 337054, 395329, 455242, 527965, 384154, 389630, 397724, 333925, 382209, 422525, 364876, 486083, 485016, 392163, 428915, 460622, 465145, 398022, 429539, 479721, 517888, 536939, 514236, 412983, 379148, 469873, 419267, 360549, 477883, 593835, 572144, 651001, 697609, 630834, 569772, 472420, 659520, 632664, 679730, 550476, 431988, 444371, 493794, 566470, 627829, 639100, 637290, 585739, 552537, 503654, 601347, 656607, 762454, 703679, 581997, 644527, 592974, 587638, 597638, 613793, 651923, 727874, 750757, 777123, 660906, 603563, 692277, 715742, 617415]
3668F17415K5413J37572L6570O5412k3694Q747J63418K3266K6614J13713J53825
3657A348271J91452p864j99156j80806j42567l4729r5799o397m9123N09J0729
3646H34520j20021n4677j2158K7523M5080l4339J10697j49708N945j14412k8870
3635E09580l4814O7057R0770k0235m2209j63325R9804P0679K221j3698m8621N5729
3623E72938o7509m521R2474n8104N6310o1364q0660q395L8561L96l0911N5612
3611E04827J9190R8944k3794Q3892l7107q7810k2083K0933N6499p1456J32185
3600F74220M3309p8055L2109j10609r0576J05230N8330P7640O6137O0516R6288
3589I34539k1402M4059L0994j18666j00963m7547L0514n3656Q4276l1229l8558
$$ y = [617415, 642828, 780400, 816970, 882382, 858688, 867435, 1030853, 1054119, 1080733, 1194446, 1348271, 1539723, 1531859, 1332703, 1151897, 1009330, 974601, 878802, 872405, 823282, 823791, 834520, 714499, 659822, 647664, 675187, 720267, 685928, 796625, 646917, 652862, 538450, 509580, 474766, 541823, 632593, 612358, 570149, 406824, 506628, 577307, 579528, 565830, 517209, 572938, 505429, 500908, 593382, 535278, 591588, 530224, 449564, 441169, 479730, 480126, 449215, 504827, 524017, 622961, 599167, 683059, 645952, 558142, 536059, 556992, 613491, 542035, 674220, 717529, 639474, 671583, 560974, 470398, 575628, 633958, 711598, 777735, 838251, 934539, 913137, 957196, 988190, 869524, 768561, 721014, 751528, 697872, 782148, 750919, 712361]
3578G12361j23372k47M640N2783K5071M2844j1026J31176p2242o2140M1640l4040
3566G07448K8808R068n4322q719J45170j1750J1465J09058k0522m3426L5354K0957
3554I28589r7787k3963M7953m752M5072K8425o787L9665j3300j25356K9202J64973
3542A011934M8449p0019Q1829j6201J0078M179k3196M3979N1790N5980j16502
3531A082300M3293M5221K0946L5111l5553J07232j03149R8775O2953k7874p333
3520A321922P665Q5825l6447Q1901M3517R6316n716O3490K4571k3335o0402L027
3508A602334P6235m410n264Q0419n302N3931m4932m0420P9587j36098J8224J79737
3496A854041L2752j07512J7565O8553L4591J39960l0305N0766L5776p197K1398
$$ y = [712361, 588989, 588742, 593382, 646165, 671236, 714080, 703054, 834230, 761988, 699848, 741488, 707448, 736256, 745324, 691002, 682283, 827453, 815703, 827168, 936226, 915704, 872278, 907632, 928589, 830802, 806839, 854792, 850040, 895112, 923537, 916750, 956415, 943115, 817759, 846961, 1011934, 1060383, 990364, 1072193, 1055992, 1066070, 1070249, 1047053, 1091032, 1142822, 1198802, 1082300, 1125593, 1170814, 1191760, 1226871, 1191318, 1298550, 1195401, 1294176, 1357129, 1329255, 1321922, 1329587, 1415412, 1378965, 1460866, 1504383, 1600699, 1594983, 1658473, 1683044, 1659709, 1599307, 1602334, 1678569, 1674159, 1668895, 1749314, 1744012, 1797943, 1753011, 1712591, 1792178, 1656080, 1674304, 1854041, 1886793, 1779281, 1796846, 1865399, 1899990, 2039950, 2009645, 2060411, 2096187, 2088990, 2110388]
3485B110388k1974M4309r4157J55585J14919q1520L1774J5821L3971J01311j3595
3474B396832L0082J51527m2163j05458J17982j2267M8843r4110Q2694Q0917N385
3463B660264P9133j7244M636N4968M9659m8060J41787p2330j07860K10846l9426
3452B916373m7632L0467J59286J8536j00215j1590Q2228J05551l5953N6600J3533
3441C187184K8122L4513O5134K3245o9763l5724j2124J09447R4528j2720j389
3430C410453M5038J9214N3717O649m9641j573k2224K5983P5525O354L5069j12796
3418C491768R6212l7336O4512J53888J7737J1844j6969j995J6686r1367P2681
3407C777661M5278l3605J03564j881j1169P4271k380j3080O9172K3527N1094J57476
$$ y = [2110388, 2088414, 2132723, 2038566, 2194151, 2309070, 2227550, 2259324, 2275145, 2309116, 2410427, 2396832, 2426914, 2578441, 2536278, 2430820, 2548802, 2536535, 2585378, 2491268, 2573962, 2654879, 2660264, 2739397, 2722153, 2726789, 2781757, 2831416, 2783356, 2925143, 2852813, 2744953, 2955799, 2916373, 2868741, 2899208, 3058494, 3077030, 2976815, 2965225, 3047453, 3153004, 3117051, 3173651, 3187184, 3215306, 3249819, 3314953, 3338198, 3268435, 3232711, 3220587, 3330034, 3424562, 3411842, 3410453, 3455491, 3474705, 3528422, 3535071, 3485430, 3483857, 3461633, 3487616, 3563141, 3569495, 3604564, 3491768, 3587980, 3550644, 3615156, 3769044, 3786781, 3798625, 3781656, 3779661, 3796347, 3704980, 3777661, 3822939, 3789334, 3892898, 3891017, 3879848, 3954119, 3951739, 3938659, 4007831, 4031358, 4082452, 4239928]
3395D239928l4330l3163l012k8282J40339J11305L3164o5510o7424K8654K06269
3384D527938j1102j22814R6646K2805P709J00173m5820J28075O2399J9104Q0767
3373D865880j1383q691L2966l6722K3501J45930J26245l8221L9768m9869J37712
3362E227116K19868r8811l2533N7495J11180N3377j8653Q5565O5297J13871N7806
3351E841578J31128P1858q3367J23212J62696K7358Q4320R5884J11030o0786M2370
3340F547281R8434R2216N109J06468J2462J79275N3943J54201J94816l2718N1787
3329G463274M223J03170J93380J62072o1815J1934K57142J57069K8569J97617
3319H516635P0372Q3791J44027K05888P4903L5524J62422J75535J28322J5523
$$ y = [4239928, 4205598, 4172435, 4169423, 4141141, 4281480, 4392785, 4425949, 4360439, 4293015, 4321669, 4527938, 4516836, 4394022, 4490668, 4513473, 4521182, 4621355, 4575535, 4703610, 4766009, 4785113, 4865880, 4854497, 4845806, 4878772, 4842050, 4865551, 5011481, 5137726, 5099505, 5139273, 5089404, 5227116, 5446984, 5348173, 5315640, 5373135, 5484315, 5537692, 5519039, 5604604, 5669901, 5783772, 5841578, 5972706, 6044564, 5961197, 6084409, 6247105, 6274463, 6358783, 6454667, 6565697, 6504911, 6547281, 6645715, 6737931, 6743040, 6849508, 6861970, 7041245, 7095188, 7249389, 7444205, 7411487, 7463274, 7467497, 7570667, 7764047, 7926119, 7864304, 7876238, 8133380, 8290449, 8319018, 8516635, 8587007, 8670798, 8814825, 9020713, 9095616, 9131140, 9293562, 9469097, 9597419, 9612942]
3309I612942K9087R2563L28065L5646l9428J38653J24899J21716J24672J05844
3299A0674659J46255P7415j4279J15021J79187J46357R3955Q9191P8689J37012
3289A1723462K6332R7824Q979J93305J26832L6712J27474M2845j1241M3392N5069
3278A2470985Q1013j204K46340R9136l8849R9212R7884J43007P5527K7452L6110
3267A3336613J68568J30949Q7359J13701L1563J16967K52303K9120J06373O0416
3257A4433932J20952K43274P5479P9593L9894M2240J80951J4982J71947J47631
3247A5550875J2572K3081Q7099N4393k6662O1678j59854q2680J4184m4836q4044
3236A5405806l7142m6348k467j14801m1715J9145n5977q2538n3337l2031j26307
$$ y = [9612942, 9642029, 9734592, 10062657, 10098303, 10058875, 10197528, 10322427, 10444143, 10568815, 10674659, 10820914, 10898329, 10884050, 10999071, 11178258, 11324615, 11418570, 11507761, 11586450, 11723462, 11749794, 11847618, 11856597, 12049902, 12176734, 12213446, 12340920, 12383765, 12372524, 12415916, 12470985, 12551998, 12550794, 12797134, 12896270, 12857421, 12956633, 13054517, 13197524, 13273051, 13300503, 13336613, 13505181, 13636130, 13723489, 13837190, 13868753, 13985720, 14238023, 14267143, 14373516, 14433932, 14554884, 14798158, 14873637, 14953230, 14993124, 15035364, 15216315, 15231297, 15403244, 15550875, 15563447, 15586528, 15673627, 15728020, 15701358, 15763036, 15603182, 15520502, 15534686, 15489850, 15405806, 15368664, 15322316, 15319849, 15205048, 15163333, 15182478, 15126501, 15043963, 14990626, 14958595, 14832288]
3225A4832288l5643k99212K9090m9056K0827l4745r8293J30087R795p384o5596
3214A4432158k9118O2003R6721k2115j06920K0390J51871j5725Q6362o6272j7285
3203A4592070J45546q1756J3666P3768L8897j7310r4588O7718N4565L8540N7139
3192A4888255J51223n5909Q0268J28512J68235N8849R2703J37281P4863L4996
3182A5759276J11691K3421J66267Q9366J4099n9574K26871m6438O3704J64399
3172A6513082m4963J27474o4138O0632L0888P6223J08171Q8436l716R3341J30724
3161A7116154J65805m5740J22792J77062J24633N5237j0047q475P290L1926k1063
3150A7715574n700p5031N6649O9490L5357O9002J39089R9342k972M2426J3390
$$ y = [14832288, 14796645, 14497433, 14526523, 14477467, 14498294, 14463549, 14365256, 14495343, 14505138, 14497754, 14432158, 14403040, 14465043, 14561764, 14539649, 14432729, 14453119, 14604990, 14589265, 14675627, 14609355, 14592070, 14737616, 14655860, 14669526, 14743294, 14782191, 14764881, 14670293, 14738011, 14792576, 14831116, 14888255, 15039478, 14983569, 15063837, 15192349, 15360584, 15419433, 15512136, 15649417, 15724280, 15759276, 15870967, 15894388, 16060655, 16150021, 16164120, 16104546, 16331417, 16284979, 16348683, 16513082, 16468119, 16595593, 16531455, 16592087, 16622975, 16699198, 16807369, 16895805, 16892089, 16985430, 17116154, 17281959, 17236219, 17359011, 17536073, 17660706, 17715943, 17705896, 17697421, 17704711, 17736637, 17715574, 17709874, 17634843, 17691492, 17760982, 17796339, 17865341, 18004430, 18103772, 18100800, 18143226, 18156616]
3139A8156616Q6942J33067J07547K6703J53081J7485J78901O2114r3371J27943
3129A8957028m1432P3645J04727J11570K0810Q7824K48943J00698p3662J38106
3119A9728257J48886J60328M4730l6804J02793J7418J71433O4768K80549J19708
3109B0802066l573J86880J75254J7648J30839J87264K1762J48141L81571J62005
3099B2209857J74155L27780K03102L67543K59624K05138K34328J92935J85976
3090B4360438K71438L21106J59815K76477K51695K55499L66855L20986M04487
3081B6988796L27856K86886L64721N27381L43998M31245M51524L74607O10266
3072C0707280M72052N24932M60727J84033M35987L68511L58681N88682M68079
$$ y = [18156616, 18243558, 18376625, 18484172, 18510875, 18663956, 18681441, 18860342, 18922456, 18829085, 18957028, 18915596, 18989241, 19093968, 19205538, 19226348, 19314172, 19563115, 19663813, 19590151, 19728257, 19877143, 20037471, 20082201, 20045397, 20148190, 20165608, 20337041, 20401809, 20682358, 20802066, 20798493, 20985373, 21160627, 21178275, 21309114, 21496378, 21518140, 21666281, 22047852, 22209857, 22384012, 22711792, 22914894, 23282437, 23542061, 23747199, 23981527, 24174462, 24360438, 24631876, 24952982, 25112797, 25389274, 25640969, 25896468, 26263323, 26584309, 26988796, 27316652, 27603538, 27968259, 28495640, 28839638, 29270883, 29722407, 30097014, 30707280, 31179332, 31704264, 32164991, 32349024, 32785011, 33153522, 33512203, 34100885, 34568964]
3063C4568964M59516N18515M89113O44438O09049N52283O33214O57808O27282
3054C9760182O56408R65472O36379R09619P45746Q20192J041046R53220R18695
3045D7406959R04454Q81677R80605J029101J103358R95372R29112J083553J104433
3036E6418624R89946J055226J191717J151749J301722J233388J393039J409331
3028F6144742J440581J546562J575416J646370J772226J940220J878730K030021
3020G9974868K067112J995490K116995K298154K059811J952776K052878K081502
3012I6599586K225163K289546K456198K550623K743613K804863L089045L327800
3004A18086437L449554L658160L947675M203369M801060N150156N495088O103197
$$ y = [34568964, 35028480, 35546995, 36036108, 36680546, 37289595, 37841878, 38475092, 39132900, 39760182, 40416590, 41382062, 42018441, 42928060, 43673806, 44493998, 45535044, 46488264, 47406959, 48311413, 49193090, 50173695, 51202796, 52306154, 53301526, 54230638, 55314191, 56418624, 57408570, 58463796, 59655513, 60807262, 62108984, 63342372, 64735411, 66144742, 67585323, 69131885, 70707301, 72353671, 74125897, 76066117, 77944847, 79974868, 82041980, 84037470, 86154465, 88452619, 90512430, 92465206, 94518084, 96599586, 98824749, 101114295, 103570493, 106121116, 108864729, 111669592, 114758637, 118086437, 121535991, 125194151, 129141826, 133345195, 138146255, 143296411, 148791499, 154894696]
2996A54894696O618653P410093Q280622R221794J0125902J1222899J2358386J3395035
2988B33528080J4467930J5494046J6393218J6820894J6632484J5373643J2285952
2981C40996247P164535N5834p883746j4159702j7097119j7196126j5645437j3920883
2973B62313603j2067968j0411882r007381q254267p605591o871930o424271n956733
2965A95713580n688369n133203m822408m421565m250012m083507m006675l874776
2957A59433065l967964l987306m025987l949052m061749l959034l994554m024238
2949A27463181l753005l863881l649317l440276l277815l217573k809324k572744
2941A00879246k545384k409484k326273k047876k170968j868493j917291j898009
$$ y = [154894696, 161513349, 168923442, 177204064, 186425858, 196551760, 207774659, 220133045, 233528080, 247996010, 263490056, 279883274, 296704168, 313336652, 328710295, 340996247, 348160782, 348216616, 340332870, 326173168, 309076049, 291879923, 276234486, 262313603, 250245635, 239833753, 230826372, 222572105, 214966514, 208094584, 201670313, 195713580, 190025211, 184892008, 180069600, 175648035, 171398023, 167314516, 163307841, 159433065, 155465101, 151477795, 147451808, 143502756, 139441007, 135481973, 131487419, 127463181, 123710176, 119846295, 116196978, 112756702, 109478887, 106261314, 103451990, 100879246, 98333862, 95924378, 93598105, 91550229, 89379261, 87510768, 85593477, 83695468]
2933H3695468j593246j584244j584658j567455j582460j439760j303740j334330
2925G1705575j281233j011396j041857j124945j034200r50008r35456q66507r78716
2916F2481257q61014q97300q58396o39566q03822o84068p05760q15067n57137
2907E5659127o67330n67906p07637p40737n96583n84802n53720n64610o28924
2898E0046878n79780m96000n49314n91796m05120m77199m35971m70520m95333
2889D5545845m73305n08194m76284l46356l23580k64422l54464m18027m07234
2880D1973979l51763l14191l42325k18103k76552j55451l01277k78567k08377
2871C9527373k89465k63361k75735k24254q6268l39690p3416k85672k14978k91747
$$ y = [83695468, 82102222, 80517978, 78933320, 77365865, 75783405, 74343645, 73039905, 71705575, 70424342, 69412946, 68371089, 67246144, 66211944, 65261936, 64326480, 63459973, 62481257, 61620243, 60722943, 59864547, 59224981, 58421159, 57737091, 57031331, 56216264, 55659127, 54991797, 54423891, 53716254, 52975517, 52378934, 51794132, 51240412, 50675802, 50046878, 49467098, 48971098, 48421784, 47829988, 47424868, 46947669, 46511698, 46041178, 45545845, 45072540, 44564346, 44088062, 43741706, 43418126, 43153704, 42799240, 42381213, 41973979, 41622216, 41308025, 40965700, 40747597, 40471045, 40315594, 40014317, 39735750, 39527373, 39237908, 38974547, 38698812, 38474558, 38388290, 38048600, 37975184, 37689512, 37474534, 37182787]
2861C7182787n2985l47169k55111r4029k36671k03080k85546k97195k34815l66094
2851C4810092l33433k81287k19128l37473l34295k88334l76114l78713l22824
2842C1938491k71520j41835k24789l00067k05767j97417k73368j57579j53496
2833C0012653l90493k28106k30562l08657l42510k67734l55474j52629k80004
2824B7456484l79595k52833l18514p7136k11421j74273k61599k10524M0750q4119
2814B5527220n6848J6794j93754k0227R3454N4840P2455q6704n8163O3868M7887
2803B5460822J19572M4076j6276J69460J5160J38038J81016K13228L09803K44937
2793B6879836J85738J85657L37027K34308L52373L30671K60703M03339K84917
$$ y = [37182787, 37129802, 36782633, 36527522, 36433493, 36196822, 35993742, 35708196, 35411001, 35176186, 34810092, 34476659, 34195372, 33976244, 33638771, 33304476, 33016142, 32640028, 32261315, 31938491, 31666971, 31525136, 31300347, 31000280, 30794513, 30597096, 30323728, 30166149, 30012653, 29622160, 29394054, 29163492, 28854835, 28512325, 28244591, 27889117, 27736488, 27456484, 27076889, 26824056, 26505542, 26428406, 26216985, 26042712, 25781113, 25570589, 25611339, 25527220, 25470372, 25487166, 25293412, 25273185, 25366639, 25421479, 25493934, 25407230, 25349067, 25412935, 25460822, 25580394, 25624470, 25608194, 25777654, 25792814, 25930852, 26111868, 26325096, 26634899, 26879836, 27065574, 27251231, 27588258, 27822566, 28174939, 28505610, 28766313, 29169652, 29454569]
2784B9454569L86057M93354M66254M88787L58695L99556M29073L49903K26969
2775C3053217N84144L40977N07441M95395M42107O81387N43601O61592O66996
2766C7976857P66991O79540Q71347R72505R96515J111401J215609J211343J394649
2757D7196757J362061J468742J577931J734078J862314J847383K043590K037576
2749F1130432K146165K138416K078196J965421J713938J436773J370347J177056
2741G5156744J276322J296988J485445J742220J836233K266593K514835K884446
2733I0459826L105270L616362L853514M123886M543660M758128M906457M774439
2725A24141542M100695K763161O73910j440007l219049l920944l511844k484440
$$ y = [29454569, 29840626, 30333980, 30800234, 31289021, 31647716, 32047272, 32476345, 32826248, 33053217, 33637361, 33978338, 34485779, 34981174, 35423281, 36104668, 36648269, 37309861, 37976857, 38743848, 39423388, 40294735, 41267240, 42263755, 43375156, 44590765, 45802108, 47196757, 48558818, 50027560, 51605491, 53339569, 55201883, 57049266, 59092856, 61130432, 63276597, 65415013, 67493209, 69458630, 71172568, 72609341, 73979688, 75156744, 76433066, 77730054, 79215499, 80957719, 82793952, 85060545, 87575380, 90459826, 93565096, 97181458, 101034972, 105158858, 109702518, 114460646, 119367103, 124141542, 128242237, 131005398, 131679308, 130239301, 127020252, 123099308, 119587464, 117103024]
2717A17103024j223935j52277Q62931J315482J917940K510569K573447K779918
2709A27687099K586837K743195K452154K039154J214260J87663j297775k309634
2701A35302953l092535l448479m160770m747527m638520l756414l057814k315214
2693A06085680j683849j082014o52429m12481n45074p81132j037822j809161k293129
2684I5788589k665957l442909m085727m383234m343773m050358l644724l189735
2676F5982172k950116k708752k523736k156602k049889j834867j608826j561309
2668D8588075j425548j388520j416478j208618j371017j383219j456909j417344
2660C7520422j291669j354396j217317j185750r87426r83701q70433q14064p52158
$$ y = [117103024, 115879089, 115726812, 116589743, 117905225, 119823165, 122333734, 124907181, 127687099, 130273936, 133017131, 135469285, 137508439, 138722699, 138910362, 137612587, 135302953, 132210418, 128761939, 124601169, 119853642, 115215122, 111458708, 108400894, 106085680, 104401831, 103319817, 102667388, 102254907, 101709833, 100928701, 99890879, 98081718, 95788589, 93122632, 89679723, 85593996, 81210762, 76866989, 72816631, 69171907, 65982172, 63032056, 60323304, 57799568, 55642966, 53593077, 51758210, 50149384, 48588075, 47162527, 45774007, 44357529, 43148911, 41777894, 40394675, 38937766, 37520422, 36228753, 34874357, 33657040, 32471290, 31483864, 30500163, 29629730, 28815666, 28063508]
2651B8063508p79552p89466p24064o44461o14830n99890m40211m90269n22614
2642B2458151m36561l02129n00912k91809m12756n31372l77748j92667m56335
2633A8955862m66272n06751l85254m62163m30095m32696l60353m10953k99046
2624A5202279l90454k12583j45655k75261k78106j30445k04010k92987l05261
2615A2967517j39849k15344j98921l84873l27954k24274k50464j98708l09859
2606A0717271j28424k02170k91296q6041k14059j14481l01311k48886j66231j03592
2596H860780k71199q5422j2627k15156j55456q6744j16668j92354r0593j90511
2586G444050r3713o0254k58608k33715M9921j07285j97759n8229m4902k8392o3759
$$ y = [28063508, 27283956, 26494490, 25770426, 25125965, 24511135, 23911245, 23471034, 22980765, 22458151, 22021590, 21719461, 21218549, 20926740, 20513984, 19982612, 19604864, 19412197, 18955862, 18489590, 17982839, 17597585, 17135422, 16705327, 16272631, 15912278, 15501325, 15202279, 14811825, 14599242, 14453587, 14178326, 13900220, 13769775, 13565765, 13272778, 12967517, 12827668, 12612324, 12413403, 12028530, 11700576, 11476302, 11225838, 11027130, 10717271, 10588847, 10386677, 10095381, 10009340, 9795281, 9680800, 9379489, 9130603, 8964372, 8860780, 8589581, 8504159, 8491532, 8276376, 8120920, 8034176, 7917508, 7725154, 7634561, 7444050, 7350337, 7290083, 7031475, 6797760, 6847681, 6740396, 6542637, 6484408, 6439506, 6411114, 6347355]
2575F347355j35184k8030k01370k7983r5510n0450l0005o2651p3225p2624j7960
2564E552363L1058j20541l9572j45423p2886j29235p107j7012j23265J3378j77411
2553D764347J01209O5115o8060j84099r5716l281k5168m7349k9740n3050n4116
2542D370092M205k2032k182j02150N1945N1600o6857l9237n5864j57471L2668
2531D064717o6119j00084j8004L4684J18162n5822m4165j06795O139n6103Q180
2520C784790o928J0873Q6400m5279L7614o9370q9790Q8439L8317o2204l1298k204
2508C739360j6768j23503j25081N8089k8529o6597j6963M1611j9777o8132N115
2497C378825P1079J71125j47123q8686P2338J7862j68699J27186p2265j39213
$$ y = [6347355, 6212171, 6184141, 5982771, 5954788, 5859278, 5808828, 5778823, 5716172, 5642947, 5570323, 5552363, 5583421, 5462880, 5423308, 5277885, 5204999, 5075764, 5068657, 5051645, 4928380, 4941758, 4764347, 4865556, 4930671, 4862611, 4678512, 4582796, 4579515, 4554347, 4506998, 4477258, 4424208, 4370092, 4374297, 4352265, 4350083, 4247933, 4299878, 4351478, 4284621, 4245384, 4189520, 4032049, 4064717, 3998598, 3898514, 3880510, 3915194, 4033356, 3977534, 3933369, 3826574, 3832713, 3776610, 3784790, 3777862, 3788735, 3875135, 3829856, 3867470, 3798100, 3708310, 3796749, 3835066, 3772862, 3741564, 3739360, 3722592, 3599089, 3474008, 3532097, 3503568, 3436971, 3420008, 3461619, 3441842, 3373710, 3378825, 3449904, 3621029, 3473906, 3385220, 3457558, 3475420, 3306721, 3433907, 3361642, 3222429]
2487C222429m4000j09359P977L1349j47854j1642Q1763p0402K4865j19323L9436
2476B905239M4837o0322M0529j12878j37p6236J4586p3620j6637K2815j29157
2465B559019o533j14328j4775n2048j23073N9932l2321J25626k2427p1916n7909
2454B249247J33647p1875r5116p183P756m0297r095k9948q4653P8762n1162K7091
2442B107174o6023j24397J42593p0036o5837R2846p2578n189r803n9649P957K7117
2430A904175J20387n0851j00359p8858k0700R4840j16770o2773l8485O9276Q1689
2419A801571n7852k2069n9502j43247J13747l0395q0322N3270m1592N9787n8722
2408A534674J7219J00705j10120k4303Q187p1011R61J30036p9677J1376J4558
$$ y = [3222429, 3178429, 3069070, 3077047, 3108396, 2960542, 2948900, 3030663, 2960261, 2985126, 2865803, 2905239, 2950076, 2889754, 2930283, 2817405, 2817268, 2741032, 2755618, 2681998, 2665361, 2688176, 2559019, 2552486, 2438158, 2423383, 2371335, 2248262, 2308194, 2275873, 2401499, 2379072, 2307156, 2249247, 2382894, 2311019, 2215903, 2208720, 2216476, 2176179, 2167084, 2137136, 2052483, 2131245, 2080083, 2107174, 2041151, 1916754, 2059347, 1989311, 1923474, 2016320, 1943742, 1938553, 1928750, 1869101, 1877058, 1904175, 2024562, 1973711, 1873352, 1794494, 1773794, 1868634, 1751864, 1689091, 1650606, 1719882, 1801571, 1743719, 1721650, 1662148, 1518901, 1632648, 1602253, 1521931, 1575201, 1533609, 1593396, 1534674, 1551893, 1652598, 1542478, 1518175, 1526362, 1455351, 1456312, 1586348, 1506671, 1518047, 1532605]
2397A532605M5406m2417j09229k8032M2302j8598k8732o7509J5514n3739J75238
2386A462809k08959N2715J58977q8248o4488m7814J2610o6643j063j43483L7284
2375A103697Q5732m2817j02510O061M5531j34198m4536l3619M0840Q3107r1654
2364I15634n0840l216m0342J39648j2301m5508k3318J07788l214j11629Q948O9165
2352I50815j42937o8789J72595j73345K7928J8362N8971l1186j11265P2913N667
2341G79729o3002L7694N363j6144k5452J8643J4732m4106r6180L3495L9642J8594
2329G03008J6839k3486P3321P306j164m4576j4936j67067J18042M3406j33930
2318E76763J4342j35616J23720O4796j7809j9535k4874J8084m9339M7805r2154
$$ y = [1532605, 1578011, 1535594, 1426365, 1398333, 1440635, 1422037, 1393305, 1325796, 1341310, 1287571, 1462809, 1253850, 1306565, 1465542, 1377294, 1312806, 1264992, 1277602, 1210959, 1209896, 1066413, 1103697, 1189429, 1146612, 1044102, 1050163, 1095694, 961496, 916960, 883341, 924181, 1007288, 915634, 864794, 861578, 821236, 960884, 948583, 903075, 879757, 987545, 984331, 872702, 881650, 950815, 807878, 739089, 911684, 738339, 766267, 784629, 843600, 812414, 701149, 774062, 779729, 716727, 754421, 759784, 743640, 718188, 736831, 751563, 707457, 611277, 644772, 684414, 703008, 719847, 696361, 769682, 776988, 775824, 731248, 716312, 549245, 667287, 710693, 576763, 591105, 455489, 579209, 644005, 626196, 606661, 581787, 599871, 550532, 598337, 506183]
2307E06183j9593l1543J36828j6024n7389j0810N696l5423N1860J2947n5507L0165
2295E17390k2369J03167j46711K1456j9310O7506O005M277j19707K8339J34834
2284E74877l3908l1515k1901k2258j3460j6877M644l0367r2912J36565n4830j06307
2272B91751J9183J64760o8391r7819P3760K5571J2757o4946J8611J72000p1571
2261D75666p047j5776r575L6754n3724l2996n692N5627o0006p902J40947p8547
2249D37729J3646L0275k9729k0766p0404J9839j44060Q898P8077N0153J2107Q2903
2237D68668j9137k7188j20108j9374J68871o1609j21199J68087l5568L537j6426
2226C88554O6040m9915j4855j3667J2411J4717q8125o7287P8326L9245J9975P4445
$$ y = [506183, 486590, 455047, 591875, 575851, 518462, 507652, 513348, 477925, 529785, 542732, 487225, 517390, 495021, 598188, 451477, 472933, 453623, 521129, 527134, 531411, 411704, 440043, 574877, 540969, 509454, 487553, 465295, 451835, 434958, 439602, 409235, 316323, 452888, 398058, 291751, 310934, 475694, 407303, 309484, 383244, 408815, 421572, 356626, 375237, 547237, 475666, 468619, 452843, 443268, 480022, 426298, 393302, 387610, 443237, 383231, 375329, 516276, 437729, 451375, 481650, 451921, 431155, 360751, 380590, 236530, 245428, 323505, 373658, 385765, 468668, 449531, 422343, 302235, 282861, 451732, 390123, 268924, 437011, 401443, 404980, 388554, 454594, 404679, 389824, 376157, 388568, 403285, 315160, 247873, 326199, 365444, 385419, 459864]
2214D59864p4830N4247j0026k2617O6908j7795m4581N9294L6145j10285Q8364
2203D84688k2424n1490J05065M6282n8820L1364j2627m1705P7129m3740n1948
2192D61774P3302L2256K1148O6761J8756o5194N3541P804o9139P7375L0373M2867
2180G51624j6579l496o6886N5217j01031r198K94136j49009n7328J65432Q573
2169H71455o1878l8449Q4824R9715j21288O4861J49889K6749j8099R6874L9170
2158A193823M8646O5959j3710O823j1535M8889L502J35391J06018P8120J34676
2147A796602J05761M7948J10595J50284K11558K06824J93439J33403L65274M29443
2137C751131M13262M06300L61313O32351N33664Q33306R52247J218222J676069
$$ y = [459864, 385034, 439281, 429255, 406638, 473546, 455751, 411170, 470464, 506609, 396324, 484688, 462264, 410774, 515839, 562121, 503301, 534665, 522038, 480333, 557462, 513722, 461774, 535076, 567332, 588480, 655241, 673997, 608803, 662344, 670148, 601009, 678384, 708757, 751624, 735045, 731549, 664663, 719880, 618849, 609651, 903787, 754778, 697450, 862882, 871455, 809577, 771128, 855952, 955667, 834379, 899240, 1049129, 1075878, 1057779, 1154653, 1193823, 1242469, 1308428, 1294718, 1301541, 1290006, 1338895, 1342397, 1477788, 1583806, 1661926, 1796602, 1902363, 1950311, 2060906, 2211190, 2422748, 2629572, 2823011, 2956414, 3321688, 3751131, 4164393, 4570693, 4932006, 5564357, 6098021, 6931327, 7883574, 9101796, 10777865]
2128A0777865K156726L092382M246549K298645l598730m455774l074866k107915
2120I334882j539118j288081o55543n12729j69250k26684l79857k79153l75366
2111C909101l81069l18582k56800k16019k14119j17457j55622k09658o3676m3854
2101A932245j89048j06383j02415q5450J3451m4286l3660m2225m37q5050j33060
2090A123682m6746k2853m8238k86k2865j05359O2527M1817j44944p6754L5109
2079G95090j30757l537L7567M2679J1506j97471j00490J20582j2174K1981j7454
2068E67522m5693L5816k9252K9322o9405K3298J8980L6333j01760j2419O194p0774
2056C88162J8935R681r4458m1264N0782j0808j4186R2127n173l0758J9898R900
$$ y = [10777865, 12934591, 16026973, 20273522, 22572167, 18973437, 14517663, 11442797, 9334882, 7795764, 6507683, 5852140, 5339411, 5170161, 4943477, 4563620, 4284467, 3909101, 3528032, 3209450, 2952650, 2736631, 2522512, 2405055, 2249433, 2039775, 1976099, 1932245, 1743197, 1636814, 1534399, 1448949, 1462400, 1418114, 1384454, 1342229, 1341792, 1256742, 1123682, 1076936, 1054083, 1005845, 1005559, 982694, 877335, 939862, 981679, 836735, 759981, 795090, 664333, 660796, 698363, 741042, 752548, 555077, 454587, 575169, 562995, 584976, 567522, 521829, 557645, 528393, 557715, 488310, 511608, 530588, 566921, 465161, 452742, 458936, 388162, 407097, 416778, 322320, 281056, 331838, 321030, 306844, 398971, 393798, 363040, 382938, 392838]
2044C92838j02205j6061P429K9200R0405o0740r171K1187J7803m4092Q5586j78705
2032B33474J4989J08406l2740N5865m5743j9395K8902r106Q772k16511K0268P4332
2020B21513o054J5558K2603N0054o599J9660p8744n6333P0480N5253j40703Q3933
2008B50621J09618k02740P3291O6032l6160l4285J67850j34064m4n1790k7464
1997A80865N8208J2494p0433o3408K1399R582R4253J2294M3104m5119k7174k1284
1985B04781r0687j8180j24331J17133J829j0666P0046j0542l6122L3118P306j06608
1973C7077K3689M0170O8253O7713o4899k5889L9269j8122N4778n8907M8443m3925
1961A67650K068K955L2923j43417O6726R274J06187n3185q2334O8895K2206n4189
$$ y = [392838, 290633, 274572, 282001, 311201, 401606, 340866, 331695, 352882, 370685, 326593, 412179, 233474, 248463, 356869, 324129, 379994, 334251, 314856, 343758, 334652, 343424, 126913, 147181, 221513, 215459, 231017, 253620, 303674, 297075, 316735, 237991, 181658, 252138, 307391, 166688, 250621, 360239, 157499, 230790, 296822, 260662, 226377, 394227, 260163, 260119, 208329, 180865, 239073, 251567, 181134, 117726, 139125, 148707, 242960, 255254, 298358, 253239, 226065, 204781, 114094, 95914, -28417, 88716, 90545, 79879, 149925, 139383, 103261, 136379, 143685, 37077, 60766, 100936, 169189, 236902, 172003, 146114, 185383, 167261, 222039, 163132, 211575, 167650, 169718, 172673, 205596, 62179, 128905, 138179, 244366, 191181, 108847, 177742, 199948, 145759]
1949A45759o2631K5455K1832L39J8513l8147q2058N9043j3724L5547p3596J00211
1937A36543K6019m4378R0365O8694r3662K7904P293j52374M9494O0144o8216J39923
1925B47749q0726j1099l3888J30393p9038k1812J05775j36915L105n2308m7809
1914B3427O1858R239P264O8724K7282J3416j59110J05131Q4554k5012J2402l0081
1902A99094l2663j499q1418j9737k2688N6161m5247K4106K4529j2395K5494n0449
1890F3288K1211K1363j24190Q4564k1960J8948J5779j21829J89535l3480K1004
1879A34233M2211o6677M3003l1752Q5889k1761j11181Q4204N505p1980M0698p3218
1867E9174J6748o521K617K1053K1850j56862O471O5936j6989Q9095Q326j12662
$$ y = [145759, 83128, 108583, 130415, 130754, 149267, 111120, 29062, 88105, 74381, 109928, 36332, 136543, 162562, 118184, 208549, 277243, 183581, 211485, 218778, 66404, 115898, 176042, 107826, 247749, 167023, 155924, 122036, 252429, 173391, 151579, 257354, 120439, 123544, 71236, 23427, 85285, 94524, 101788, 170512, 197794, 211210, 52100, 157231, 241785, 216773, 229175, 199094, 166431, 164932, 83514, 63777, 41089, 97250, 52003, 76109, 100638, 88243, 113737, 63288, 84499, 105862, -18328, 66236, 44276, 63224, 79003, -42826, 146709, 113229, 134233, 176444, 109767, 152770, 121018, 206907, 185146, 73965, 158169, 163674, 91694, 132392, 59174, 75922, 69401, 72018, 93071, 114921, -41941, -35470, 30466, 13477, 102572, 110898, -1764]
1855a764k3369K00265k1169m8590l8021P2809j3599q1043o971R6912N9211m4985
1843A49686j2240p8737L6211j73453j472J14154M1204o2278k0398n4668J25014
1832F3023O3742O8415J0997o4124Q4743n849m501q9246J54073p9240o5353n766
1820A30914p4885L3809M6869m7462l8265O2379P4014K8126j65241J7584J16727
1809A84569j15736L9283Q0118n4135r92J8960j49785J41702J024j25993P1161
1798I0176k0691L1040N6375j7645j08187J5957L5393r6626N4224P7734o120m5659
1786F5971R636l0694K0304r7670O7086P1802j2937Q294N9210m1751l5410J82561
1774B66402j98564l9387O2199O147R514L2757n8865J71128j15690q0738Q3451
$$ y = [-1764, -25133, 175132, 153963, 105373, 67352, 140161, 126562, 45519, 38548, 135460, 194671, 149686, 137446, 58709, 94920, -78533, -80005, 34149, 75353, 13075, -7323, -61991, 63023, 126765, 195180, 206177, 142053, 226796, 220947, 216446, 127200, 281273, 202033, 136680, 130914, 56029, 89838, 136707, 89245, 50980, 113359, 187373, 215499, 50258, 67842, 184569, 68833, 108116, 188234, 134099, 133107, 152067, 2282, 143984, 145008, 19015, 90176, 69485, 100525, 156900, 139255, 31068, 47025, 82418, -14208, 40016, 117750, 111630, 65971, 75607, 44913, 65217, -32453, 34633, 106435, 93498, 101792, 161002, 119251, 83841, 266402, 67838, 28451, 90650, 96797, 106311, 139068, 80203, 251331, 135641, 54903, 138354]
1763A38354o0749M9554n3665L5609r0139p8808J7490R3113O5090l7402Q40l4872
1751D4415N4326n8725K109j0723L2000J2976K015P3208j53324M3730l4153n2833
1739d4979R2217l0964r7621J62758J0892k3879n3313M6227L4360j78404O4155
1728a8551P992J80967k0190j74918R4641J5615o4687o8550J19102m2820J06319
1717A34920j00932J0555L8568o1292J01373n6431p0665J9079k1683M6615M1724
1706H1831j7321o332l6398K7875L795J1414K1496o0984m0053P5582N4072J0970
1694A25947j59795L9070J27681O4627n9810r8605j07065P0337K1183M2856k0339
1683D6087N479n3793J12597Q815l8468j36010o6560J42433N1224J0949o5063O0343
$$ y = [138354, 77605, 127159, 73494, 109103, 18964, -59844, -42354, 50759, 115849, 78447, 79287, 44415, 98741, 40016, 42125, 31402, 63402, 76378, 78393, 151601, -1723, 42007, 7854, -44979, 47238, 16274, -81347, 81411, 92303, 68424, 15111, 61338, 95698, -82706, -18551, -10559, 170408, 150218, -24700, 69941, 85556, 20869, -47681, 71421, 28601, 134920, 33988, 44543, 83111, 21819, 123192, 66761, -3904, 15175, -6508, 40107, 81831, 64510, 58178, 21780, 49655, 53450, 64864, 86360, 25376, -14677, 60905, 114977, 125947, -33848, 5222, 132903, 197530, 137720, 39115, -67950, 2387, 23570, 66426, 46087, 51566, -2227, 110370, 119185, 80717, -55293, -121853, 20580, 71804, 82753, 17690, 78033]
1671G8033n9432N0751J4280l438l8901p1470l3127O1181M4024K0803r579M2257
1659I5382n5459n6866n8779N0417J14400P8645j30362Q935J18942p290j28418
1648B9547P9510j00948K0715p7042R1909k6856j27658K38694P0904k0508l6093
1637A42174n7202R870k1637j64605L9239k9765L2778K6976o83Q4609m656j42592
1625h5494j505P8755j4978p4954O9785Q8887P891j5386n0189j17843J08664J10477
1613A04110q0852j6278N0629l115K136n9317M1260L5826J3936j229k78L8372J8152
1600A43352r7469K0172R2851j56972j05726R8156J0383J9920k9553L9546M0324
1589G4984r3785n0531J2714j7286Q7818j8593N7780K1517j9296j7880M222M57
$$ y = [78033, 18601, 69352, 83632, 80194, 41293, -30177, -63304, -2123, 41901, 62704, 53125, 95382, 39923, -16943, -75722, -25305, 89095, 167740, 37378, 46313, 165255, 157965, 29547, 109057, 8109, 28824, -48218, 43691, 16835, -110823, 127871, 198775, 178267, 142174, 84972, 94842, 73205, -91400, -52161, -81926, -49148, -22172, -22855, 61754, 57098, -85494, -86999, -8244, -23222, -98176, -28391, 60496, 68387, 53001, 2812, -115031, -6367, 104110, 23258, 6980, 57609, 54494, 56630, -2687, 38573, 74399, 88335, 87106, 86828, 125200, 143352, 45883, 66055, 158906, 1934, -103792, -5636, 4747, 24667, -4886, 34660, 74984, -18801, -69332, -56618, -73904, 13914, -4679, 53101, 74618, 55322, 37442, 41664, 42121]
1577D2121k0099k1934j00506N8950K2996O2202M2690j02736N5046K0424r8117
1566c8963j37293Q1806J04524N1708L9130o8703j9649Q8628k6618N2745K084r4900
1554C4499l3119j3170Q0932j39K2669j3390k718m3310L5617K9719l5349n2136
1542A0105L6243j6004q8740K1855K6466M7647o5147j1996Q0032J7790p9179K2133
1530A205O6785o2094J5483L2543l4141J7327l2039J35261j5628j41183Q1315j8481
1518D6353n4658K9930K4814k8034M3425M3442n1890l0646M3798j40193M8922J06234
1506H1497L5143M7032q6875o4792n64j1664k04N9368p5629M9014L7786Q0138J04778
1493B55028p7072l7116l6012k9796l1671L6632k9398o1672J5972q9369N7643M3882
$$ y = [42121, 22022, 88, -100418, -41468, -18472, 43730, 86420, -16316, 38730, 59154, -38963, -176256, -94450, 10074, 61782, 100912, 32209, 12560, 101188, 74570, 127315, 129399, 34499, 1380, -11790, 69142, 69003, 91672, 78282, 75564, 32254, 67871, 97590, 62241, 10105, 46348, 30344, -58396, -36541, -10075, 37572, -27575, -39571, 40461, 58251, -20928, 1205, 67990, 5896, 21379, 53922, 19781, 37108, 5069, 140330, 124702, -16481, 64834, 46353, -8305, 21625, 46439, 18405, 61830, 105272, 53382, 22736, 66534, -73659, -24737, 81497, 116640, 163672, 76797, 12005, 11441, -223, -427, 58941, -16688, 32326, 70112, 150250, 255028, 177956, 140840, 104828, 75032, 43361, 79993, 50595, -11077, 4895, -84474, -26831, 17051]
1481A7051o6871J4227j7996o5665P6510J6669J02330J09174q745L6907j39330
1470G4261k2391k6573n1457p2121N8619P2749m237L7295l8986k6231Q4177P6287
1458A61392q2633j32911O4933k4640J05888r913p2233o9282J43233K6308l4457
1447G5685J3771M54j02587n8094L2285J39618q3846q5021M7253O7211J9972Q8477
1435A55178r8289k5705q483o3701R2834j0566K4631n4345j0512J15266J32290
1424B48598j00732k02603J09484k7261L27R5301R791k4961o9824m8207P5055l511
1412F1457K8660j15689M5087O6539j49381N0939L432M4651j3930j007j30564J26403
1400A6597j180j4969l7635J54540k0989p3168K5574R014l607r495j6039o141K3299
$$ y = [17051, -49820, -35593, -53589, -119254, -42744, -26075, 76255, 185429, 176684, 213591, 74261, 51870, 25297, -26160, -98281, -39662, 33087, 28850, 66145, 27159, 928, 85105, 161392, 78759, -54152, 10781, -13859, 92029, 82116, 9883, -59399, 83834, 110142, 75685, 89456, 89910, -12677, -70771, -38486, 101132, 17286, -67735, -20482, 46729, 66701, 155178, 56889, 31184, 22701, -41000, 51834, 41268, 65899, 11554, 1042, 116308, 248598, 147866, -54737, 54747, 27486, 27813, 123114, 132905, 107944, 38120, -10087, 64968, 61457, 90117, -25572, 19515, 86054, -63327, -12388, -8956, 35695, 21765, 20758, -109806, 16597, 15417, 448, -37187, 117353, 96364, 23196, 48770, 57784, 54177, 44682, 28643, 22502, 45801]
1387D5801j00674L1480J14779N4835j49749K0871j1793R047M4947j49813J44197
1376E3928n2740k3312O344M4688j5968l1932o9882J74637J56166p9845l5905Q137
1364A34316J8178m6181l9783p5993L8704q0626n7808J38419n6394k1296r689j982
1352f0135L7934n5035O4837J7322l2854R5346o2295p3774k2886m6390k8898J62643
1340d185J29564o5963n802n2969K7089N8549k486P533j23141O414N3776M5906
1328G4285L0177j13081O4208j6394o8927N5008r0037O1933P2428L3575j23685
1317b0510j12588O4802J46708O637k1614m6142p6472M0074p3060O8441J09105
1306H5381j02203k5082j9529n4120Q8454Q6745l8051o145k9012O1570O6510l1173
$$ y = [45801, -54873, -23393, 91386, 146221, -3528, 17343, 5550, 14597, 59544, -90269, 53928, 1188, -22124, -15780, 28908, 12940, -18992, -88874, 85763, 241929, 162084, 126179, 134316, 152494, 106313, 66530, -9463, 29241, -51385, -109193, 29226, -27168, -48464, -58153, -60135, -22201, -77236, -12399, 4923, -27931, 67415, 5120, -68654, -91540, -137930, -166828, -4185, 125379, 59416, 53614, 645, 27734, 86283, 83797, 91330, -31811, -25397, 28379, 74285, 104462, -8619, 55589, 39195, -29732, 25276, -64761, -2828, 69600, 103175, -20510, -133098, -68296, 78412, 85049, 63435, 17293, -59179, -19105, -92165, -23724, 85381, -16822, -41904, -61433, -115553, -27099, 59646, 21595, 15450, -13562, 48008, 114518, 83345]
1294H3345j60001L6174M940o9647l5986J40638M3481k1795n7180M6379K7404k7849
1282I903J19936O265j11350K5229P1335j96065N4767q3832M8169J5217n650J28066
1270H1990o1263o1213K0244j24027L3908Q9967O6138j1651q7105k520K1752j06248
1258a40028K6193R0484O079K0924N361p0168j3001P091k2635j7677J4060p6496
1246a69813J86267m387K4948n950q7403Q9946M144k1084R621R9113l7728j06856
1234a9182O6088m3795l2425p6270P4267L040l1633k2458K6726L0674O212o4331
1222h3087Q9143j27524M2413j7984O6745K3140K5587l1266p636J7368P4993Q8597
1210A60489l1683j19198o6537L7296L9227m5496o8720J14847m8629L7553j2576
$$ y = [83345, -76656, -40482, -35542, -105189, -141175, -537, 42944, 21149, -36031, 10348, 37752, 9903, 129839, 136104, 24754, 49983, 121318, -74747, -19980, -103812, -55643, -40426, -46076, 81990, 20727, -40486, -20242, -144269, -110361, -20394, 45744, 34093, -53012, -55532, -33780, -140028, -113835, -23351, -17272, 3652, 9013, -61155, -74156, -67065, -89700, -107377, -93317, -169813, 16454, 12067, 37015, 31065, -56338, 33608, 37752, 16668, 26289, 125402, 87674, -19182, 46906, 3111, -29314, -105584, -31317, -28277, -59910, -82368, -55642, -24968, -18756, -83087, 6056, -121468, -79055, -97039, -30294, -7154, 18433, -12833, -20469, -3101, 71892, 160489, 128806, 9608, -56929, -19633, 19594, -25902, -94622, 20225, -28404, 9149, -3427]
1199c427O5159l6789n3117j5073L9917n3862M8412m0666O4543R526q1271Q6583
1187B9935M9112j9010N7151o1555r6901K4224n3328o9338J32550m3809j34852
1176a85821K1004P2435Q4297j7988q510J54306j35664J9762k571L1266Q2659n5390
1164E9785j63187P1353o9161K59082j765r8793Q961p9369N4912o707N8176q234
1152H5053o018p754l0245M519p2897J4198K9425J568N3024q0841N7549O3988r3759
1139A7810j1051j7345m3510M4495k5213K0801L4774J52568j46963k3061L2703
1128C6008o0388o8112Q4902Q9589m4631O8598j58742L1070j8595m497K993m062
1116d5867O9901N24L0447p1508j9464l4422j43770J36805M7893k096K8018q6203
$$ y = [-3427, 61732, 24943, -28174, -43247, -3330, -57192, -8780, -49446, 15097, 24623, -56648, 29935, 79047, 60037, 117188, 55633, -41268, -17044, -70372, -139710, -7160, -50969, -185821, -164817, -92382, -8085, -26073, -34583, 119723, -15941, 3821, 1250, 32516, 115175, 59785, -103402, -32049, -101210, 157872, 156107, 57314, 66275, -13094, 41818, 35111, 93287, 85053, 79035, 71281, 41036, 45555, -27342, -13144, 16281, 17849, 70873, -9968, 47581, 111569, 17810, 6759, -10586, -54096, -9601, -34814, -14013, 20761, 173329, 26366, 3305, 36008, -24380, -92492, -7590, 81999, 37368, 105966, -52776, -21706, -40301, -44798, -41805, -45867, 24034, 24558, 55005, -16503, -35967, -70389, -214159, -77354, -29461, -31557, -3539, -89742]
1104h9742J10334N3857O611o2547j10965M8684N3355K4490P8953q9431N4654p4376
1092C877o3351K9808J817M2191n8349Q44R4455n527o8679J0324l6858M4406l1405
1079c6447L8018q3394J31204j30276o4168P8993L4780J01679p9828L1579j03394
1068h1254k6693j0437q9217R9468R5172j37849J61557O8063M6495o273m2380M465
1056H1117r0435O7728j08890m4819Q3535O9654K1982o1034n1319R6610O4604l3070
1044I5663n0850j03864j9512o7547P1345M4367O2997n9268N017k1397p152P517
1032d2684p4515P656J25328k2449k8343Q3406j02036o1275Q6989o7985L431J16376
1020B3899K5617p1947m798O2065m0412O695K0076n2913j931M6551O7091o1842
$$ y = [-89742, 20592, 74449, 81060, 18513, -92452, -43768, 9587, 34077, 113030, 23599, 78253, 3877, -59474, -29666, -27849, 14342, -44007, -43163, 51292, 45765, -22914, -12590, -49448, -5042, -36447, 1571, -81823, 49381, -80895, -145063, -66070, -31290, 70389, -9439, 22140, -81254, -107947, -118384, -207601, -108133, -12961, -150810, 10747, 78810, 125305, 119032, 76652, 81117, -9318, 58410, -50480, -95299, -11764, 57890, 79872, 18838, -32481, 64129, 128733, 95663, 44813, -59051, -78563, -146110, -74765, -30398, 32599, -26669, -21652, -43049, -50201, -42684, -117199, -109543, 15785, -6664, -35007, 48399, -53637, -114912, -27923, -95908, -92477, 23899, 49516, -22431, -27229, 34836, -5576, 1119, 21195, -31718, -33649, 12902, 79993, 18151]
1008A8151m1433O95R0831j74214J43243J07679n9814r1874m0741J19818j15131
997d2790R8527m2444m2225O7406J9370J4880M0398j8044j19949Q115n923p051
985b9730J8253K7583O3333l7721R4281p7878q0311M5959l8728k7974L5012K3051
973A5130j8842l2826M1659p0999P3515J22844o7100j53080m3834J25400M6680
962C8547n6953M6834r5401N6481R3834n7905R3184o8874j12901P4386P5257j81657
950i5168J12629R2979j25366J07865r7688l609m6025M1931o8516Q3753L1626l5968
938a557r268o3558J38293n6905J9952L8267l8088o7372n5651Q8669k4511k6486
926e8215K4783p7699J01688N3946k2041J8751K1095r2815L6970O3021m6808J2794
$$ y = [18151, -23282, -22587, 68244, -105970, 37273, 144952, 85138, -6736, -47477, 72341, -42790, 55737, 13293, -28932, 38474, 57844, 72724, 113122, 95078, -24871, -16756, -22679, -29730, -11477, 16106, 79439, 41718, 135999, 58121, -22190, 23769, -14959, -42933, -7921, 15130, -3712, -36538, 5121, -65878, 7637, 130481, 63381, -89699, -133533, -8133, 38547, -18406, 28428, -66973, -10492, 83342, 25437, 118621, 49747, -63154, 11232, 86489, -95168, 17461, 110440, -14926, 92939, -4749, -8358, -54383, -12452, -80968, 2785, 34411, -1557, -10825, -74383, 63910, 7005, 26957, 65224, 27136, -40236, -95887, -7218, -31729, -58215, -33432, -111131, -9443, 44503, 22462, 41213, 62308, -30507, 6463, 69484, 22676, 35470]
914C5470J9837l9816k5614J3589K6681p0371n6116R934L9064M5468j7043j12298
902a31215J35858R2172j33792p1997J04677j4345k2214J46718j30454n5037j3952
891i3581P3110P1358k7592M1576j01995J8030J6866p1920K2341L7897j6098p7661
879a07669K5543O1292o2759j3789P0328K1506j6630k7349J35846J23398p0760
868A38957o8186m7833m8724N9397j34652J5301R8210k9376k4382J9860n0479O4069
856g838N6157k7472n3484j54986P3427M3835Q8576o5670K6401M4590r556M5343
844E9323l9362J2859m3469n4120Q7641M9183q3626Q857J5252n568K5922J19047
832A51939o6732N0608m7731p0134r2825P2044P4322l3117J378r8562J26540j29051
$$ y = [35470, 55307, 15491, -10123, 3466, 30147, -40224, -96340, -86406, -47342, -1874, -18917, -131215, 4643, 96815, -36977, -108974, -4297, -18642, -40856, 105862, -24592, -79629, -93581, -20471, 50887, 23295, 64871, -37124, -19094, -2228, -74148, -51807, -13910, -30008, -107669, -82126, -20834, -83593, -97382, -27054, -5548, -22178, -49527, 86319, 209717, 138957, 70771, 22938, -25786, 33611, -101041, -85740, 12470, -16906, -41288, -21428, -71907, -7838, 48319, 20847, -32637, -187623, -114196, -70361, 18215, -47455, -21054, 23536, 13980, 59323, 19961, 32820, -10649, -64769, 22872, 72055, -11571, -2714, 12538, 6970, 32892, 151939, 85207, 135815, 88084, 17950, -74875, -2831, 71491, 38374, 39752, -58810, 67730, -61321]
820f1321l5718J06859K2918o8317M7474M695j34155J5543K0306j5677K3676m009
808g7726o0213J65611l474n7308K9623K1741m9304l9956K0630O3219m1043K8497
796B97N0925n4896J0962m5513O3751j4119n1900l6067O4271o202L2996k4192J9707
783A0020L0709l0329m6983R9244j7515j15074R9860Q650q1256l7349p2889R8186
771e4726N4838p7658k007O3843L2569j9561P2287p8241o436p8486m8942J69698
759B7178m8955P2379l0617j15033M4341J19527q180n7246L3862l3612k4244j0144
747c0744p1988o2132R9144J00751k1573P650J9216o4790M5160p6227n6032J4258
735i7307P379L1683N0446K5612j67085M2162Q9554m3132N30J8288Q9088p4903
$$ y = [-61321, -97039, 9820, 32738, -35579, 11895, 16590, -117565, -102022, -81716, -97393, -73717, -77726, -137939, 27672, 24198, -33110, -3487, 18254, -31050, -71006, -50376, 12843, -28200, 297, 51222, -3674, 7288, -38225, 25526, 11407, -40493, -76560, -12289, -18491, 14505, -9687, 10020, 40729, 10400, -36583, 62661, 45146, -69928, 29932, 38582, -42674, -80023, -152912, -54726, 112, -77546, -79553, -15710, 16859, -2702, 69585, -8656, -15092, -93578, -142520, 27178, -21777, 50602, 19985, -95048, -50707, 68820, 60640, 3394, 37256, 3644, -20600, -30744, -102732, -164864, -65720, 35031, 13458, 21108, 40324, -24466, 20694, -55533, -111565, -97307, -89928, -58245, -7799, 17813, -149272, -107110, -17556, -60688, -60158, -41870, 47218, -27685]
723b7685L26j5293k7626N9532p4028J5543J21211M3297o4398K4173J2763j10497
711d2682L9700O6548K9210r5003j09867J28822M8712m8001o772L4090j8257q3491
699e6991Q7715l6625j61045K2634O3071q2130L8594O4434J19362j03842k8664
688g3487J9054L3203O8517o9316L1869l6762j5907K1607K3444N3288p7100Q7040
676F5450l5782j15516L1920j09383n329K1982P5313M2571p5367l7498R5297p89
664d7131J34172q7321r610J33327P517r2536n3678j01553J6488M3887O2135q4019
652g8322j7078N0920L463M538N1231Q038n7342L643l4000k7231M2246Q7539L963
639D1608k0253N6730L2841j60088N9814N9826l0558K6498j27542K346J1797k9600
$$ y = [-27685, -27359, -42652, -70278, -10746, -84774, -69231, 51980, 95277, 30879, 55052, 67815, -42682, -2982, 63566, 92776, -2227, -112094, 16728, 65440, 17439, 10667, 44757, 26500, -56991, 30724, -5901, -166946, -144312, -81241, -163371, -124777, -60343, 59019, -44823, -73487, -54433, -21230, 47287, -22029, 9840, -26922, -42829, -21222, 2222, 55510, -21590, 65450, 29668, -85848, -53928, -163311, -168640, -146658, -71345, -28774, -104141, -141639, -46342, -47131, 87041, -280, -9890, 123437, 130954, 38418, -15260, -116813, -100325, -56438, 5697, -78322, -95400, -44480, -41017, -36479, 14752, 22790, -34552, -30909, -64909, -92140, -49894, 37645, 41608, 21355, 78085, 110926, -49162, 10652, 70478, 39920, 66418, -61124, -58778, -46981, -76581]
627g6581k9751J4202Q6034L662O0660j11545k5904n7625J27459N5563k9638j6571
615c5k6601M5453j0844j37082J81984j7128l8892N8479L2171P0296j6338j58815
603a7352J48602q8494p0825L634J3728J3303N5252l0520p5607p4243j04752M9164
591a78110J57658Q183J3994l3382j05674Q4353m8596J71633q1608n5563R5833
580B8721M9687r6523P4802j28042p4119J02165O3222r6547K658J6750R083M6656
568a487N4796r8488N6454J967K1914P9207J19099j12310o5667j58945k4840O7953
556f0347j6593O534J299Q3208l8451N1132q2468m1650J80406r9027o8052J47640
544F3631r8940L929J646m0715J15778r5539m7871N1280Q4287j33228j2897j0669
$$ y = [-76581, -106332, -92130, -6096, -2434, 58226, -53319, -79223, -136848, -9389, 46174, 16536, -35, -26636, 18817, 7973, -129109, 52875, 35747, -3145, 55334, 87505, 157801, 141463, -17352, 131250, 42756, -28069, -24435, -10707, 2596, 57848, 27328, -48279, -122522, -227274, -178110, -20452, -12269, 1725, -31657, -137331, -52978, -101574, 70059, -11549, -67112, 28721, 78408, -18115, 56687, -71355, -145474, -43309, 19913, -76634, -73976, -57226, -48143, -1487, 53309, -45179, 11275, 13242, 35156, 114363, 233462, 121152, 55485, -103460, -128300, -60347, -76940, -70406, -69107, 14101, -24350, 26782, -55686, -97336, 83070, -15957, -84009, 63631, -35309, -31380, -29734, -70449, 45329, -50210, -98081, -46801, 37486, -95742, -108639, -119308]
532a19308m2502K25072j45972J917M2455j0889j37888k097J40101J0483j44862
521a83490Q0922J32577M6837k5800R198p0369n7157n4078L2663k2556M5923J48017
509H2687R51q5474j4369o5546j32389J90671P359k6481L3619q8473K8945n6004
497a24504O0169J13362l6582n7958j18435O9422o2473l302N6734J10266J08211
486A14910o3152l9879m9476n1764N8302J21892j9697q367m95o2692k7624M9343
474B1301j06667J56070J7247m9057m0278p0643K4730K6731j2435r8259k4429M6018
462a09671q001J1401L2179L2370M2276j36121K2177J3224k9886R0274K5080o4694
450g9392N8097N4752r3633K1260p018N4050r9132k3511m8135Q8095J28203j25715
$$ y = [-119308, -161810, 63262, -82710, -80793, -38338, -49227, -187115, -189212, -49111, -38628, -183490, -102568, 30009, 76846, 51046, 60244, -10125, -67282, -121360, -88697, -111253, -65330, 82687, 83638, -1836, -16205, -81751, -214140, -23469, -16110, -42591, -8972, -97445, -68500, -124504, -64335, 49027, 12445, -45513, -163948, -94526, -156999, -160301, -103567, 6699, 114910, 51758, 11879, -37597, -89361, -31059, 90833, 71136, 62769, 62274, -418, -28042, 21301, -85366, 70704, 87951, 38894, -1384, -72027, -47297, -20566, -33001, -131260, -155689, -109671, -117672, -106271, -74092, -41722, 554, -135567, -113390, -100166, -130052, -39778, -14698, -79392, -21295, 33457, -60176, -38916, -45934, 8116, -91016, -114527, -162662, -74567, 53636, -72079]
438g2079L4011R7608l9307p7230Q322K8422k5280j22304J03738n901R825k7943
426h8118J28561k9926l238q0671l4094J69299o5084K4400q7640n0683Q3162Q4652
414E0620j95998K720J54267l8367L5706o3185P0309k4816l996n6011Q7532r0625
402g1844k3048L6589m9316K4180M6058j4716N1735k0315o0619k5J6226K21780
390A56685k7055j77668K528K3792J10140p2841K7410n2689p7933J53914K0447
379H6730j37269n7917Q2107M7610l6567j0139Q8029M1155o6410j40127j408p5247
367a79453J25319j9658J19408K5523q6445k9816J5320o5212o4816N0794L6380
356g2656J7170L5574J4159K3751K767Q6713r8263q946N968l6931M9712m8176K0302
$$ y = [-72079, -38068, 59540, 20233, -56997, -48675, -20253, -45533, -167837, -64099, -70000, -60175, -88118, 40443, 10517, 7279, -73392, -107486, 61813, -3271, 21129, -66511, -117194, -34032, 50620, -145378, -142658, 11609, -26758, 8948, -54237, 16072, -8744, -12740, -68751, 18781, -71844, -94892, -58303, -107619, -83439, -37381, -52097, -362, -20677, -81296, -81321, -65095, 156685, 129630, -48038, -45510, -21718, 88422, 15581, 42991, -9698, -87631, 66283, 86730, -50539, -108456, -26349, 21261, -15306, -25445, 62584, 103739, 37329, -102798, -104206, -179453, -54134, -73792, 45616, 71139, -15306, -45122, -29802, -95014, -159830, -109036, -72656, -55486, -19912, -5753, 17998, 20765, 107478, 9215, 269, 6237, -30694, 19018, -29158, -8856]
343h856l5282O5064p866m5043r02r3297N1072R0829O5531j09328j01190R4784
331c4484r5289M2316M1683j2331M4195m6040l482k3566J53323J2694j25375n7384
319a03740N1380L7359k4709l3658L3210j24976J20569j0291J02347L799j37928
308h6638P6261j2690l8765q0153J45908l8600K5255j23857n8434J14919n7701
297a34495N7376l874n8062J05399r6402Q1423j05052Q3124M5799P2146J2468p9740
285a9890P5586K395m7688q247J2892n502m238L7874n0282o2156R7596N0636j33214
272e4238O3822O3407k9879L987j3063n1733n7371N3522p6462Q8268J9688p8235
260f8287o6574O8305M2109L2253m5208J11833j28596J40M0807o2860L5323m1448
$$ y = [-8856, -44138, 20926, 13060, -31983, -32885, -126182, -75110, 15719, 81250, -28078, -129268, -34484, -129773, -87457, -45774, -58105, -13910, -59950, -63432, -86998, 66325, 79019, -46356, -103740, -52360, -15001, -39710, -73368, -40158, -165134, -44565, -54856, 47491, 51290, -86638, -10377, -23067, -61832, -141985, 3923, -34677, -9422, -133279, -191713, -76794, -134495, -77119, -80993, -139055, -33656, -130058, -48635, -153687, -70563, -24764, 47382, 59850, -19890, 55696, 58091, 10403, 2156, 15048, 9546, 5308, 43182, -7100, -69256, 28340, 78976, -54238, 9584, 72991, 43112, 47099, 34036, -17697, -75068, -21546, -98008, -9740, 9948, -68287, -134861, -66556, -24447, 7806, -37402, 74431, -54165, -54025, -13218, -76078, -40755, -82203]
248h2203L6647P0984n6331J4031R8492N3252j29528l0015q0613j7154M8905J19102
236D5569J00158j96238p8955l2901L8003j5421J27888k7205N8592j30887J15309
225C912M0977j40241J1093l1639J33482q5502j48629N3267M7075L8063K4256M1108
213a2778j5037p1562N4295m3336L8450J2215m0363L9903J8935N7949J163r1293
201e1459j0337O7031K3322m4415J5984K8467p9877N0087n230P5517l8262k8467
189B361O114n6829j2023n0237m363L5727m5649K3567J00294K1387Q337m8631K0985
176A040o5r6339l3734J6345N9866L7659o6516J7037P9212q6092J23580j542k6011
163B4440r9040L4238J4414k7052J7609j9054R8516j78070R4391J14444j08102
$$ y = [-82203, -45556, 25428, -30903, -16872, 81620, 134872, 5344, -24671, -105284, -122438, -73533, 45569, 145727, -50511, -129466, -162367, -124364, -139785, -11897, -39102, 19490, -111397, 3912, 44889, -95352, -84259, -115898, 17584, -67918, -216547, -163280, -116205, -78142, -53886, -12778, -27815, -99377, -45082, -88418, -49968, -37753, -78116, -38213, -19278, 38671, 39834, -51459, -61796, 5235, 28557, -15858, 126, 28593, -51284, -1197, -6427, 69090, 30828, 2361, 8475, -48354, -60377, -110614, -114977, -79250, -124899, -101332, -1038, 20349, 28686, -19945, 1040, 975, -95364, -129098, -112753, -52887, -15228, -81744, -64707, 14505, -71587, 51993, 50451, 24440, -74600, -40362, -25948, -53000, -35391, -54445, 44071, -133999, -39608, 74836, -33266]
152c3266o5743j6298J11662j13208k2861N1598j0619O8616J4008L6846m9355K7711
140i09q1515K3637j5097K7206J2662n9913K8660J03771j06938j42443M1826J05248
128f3805L806M4776O5566n460j02253K4860q2124R5421j0527K6460j786p7417
116h2483L8117P4202j06491O1265l164l0119p195J842J5475L1373m2949J07525
104E7398r004r7113n9362J2213M5478o4492R4938K0621L3997m6569J7697K4711
92C0513q7817q7345j2248J7350P3135k5028J07242k9006O324n1392J4302p6108
80a20078K4671L1278R3756m7644m2878m6528N3050K6802j1959r3905Q5379N7216
68I160k9625m7647j6041R6610k6989k5407K55k1233P0189j4882l0516m2372J9033
$$ y = [-33266, -99009, -115307, -3645, -116853, -139714, -88116, -98735, -30119, -16111, 20735, -28620, -909, -82424, -58787, -73884, -46678, -34016, -93929, -65269, 38502, -68436, -210879, -169053, -63805, -59999, -15223, 50343, 44883, -57370, -32510, -114634, -19213, -29740, -3280, -5066, -82483, -44366, 29836, -76655, -15390, -18554, -48673, -55868, -54026, -38551, -7178, -50127, 57398, 48394, -48719, -108081, -95868, -50390, -114882, -19944, 677, 34674, -11895, 5802, 30513, -57304, -144649, -156897, -139547, -66412, -91440, 15802, -13204, -6880, -58272, -43970, -120078, -95407, -64129, 29627, -18017, -60895, -107423, -54373, -27571, -39530, -133435, -48056, 9160, -20465, -68112, -84153, 12457, -14532, -39939, -39684, -60917, 9272, -5610, -36126, -78498, -59465]
55e9465L4359p7829M1966n5880O0253K8182l7245j1653J4058L7724o5358K4915
43f5973L7514K475M8744m0198n8469m914L5797p3825j3775Q5944l6505R2676J9118
30B8609m6932n100l1109l725k8562M2512L3044l6041n0474k2664L0284P1010L2450
17A3302L515l1662k3553l2234M0779J8852j2960J258o2176o3508R0836R642J5094
4c2815K5139j9421p2576n591
0a05264
$$ y = [-59465, -25106, -102935, -60969, -116849, -56596, -28414, -65659, -77312, -63254, -25530, -90888, -65973, -28459, -25984, 22760, -17438, -75907, -80821, -45024, -118849, -132624, -46680, -83185, 9491, 28609, -18323, -23423, -54532, -58257, -86819, -44307, -11263, -47304, -97778, -120442, -90158, -19148, 13302, 16817, -14845, -38398, -70632, -29853, -11001, -23961, -22703, -84879, -148387, -57551, -47909, -32815, -7676, -27097, -99673, -105264]
$$ Imaginary data points
##PAGE= N=2
##DATA TABLE= (X++(I..I)), XYDATA
16383a836042o187j5678P9313M1387m5736M7186M708O2306Q323L2252m3446O4742
16371a606872K3343J0436N5810J3845n2422M4659J39612k5371J10872o7870K5903
16360a328055R5917L2287m7325N431r670q031R9067O2426K9588J11007l57r6177
16348a053892M6805K5823j3854K0164J03872R480k2255j7305L0104M6379Q5960
16337g38719l7256j9528J47973m5969O2156J23318P426k1659n2595r466P5344
16326e08975P0769L4530M1453l7442M3177K2782O6239o526q7206k7275L401M0702
16314c44371M6499O4822L2817k9199O4058R09N3248O1761M1204R5642m3004r1274
16302d6888L5764O5075k6117O2110L3627N3869L9900n0724k7843N9451P7254m8326
$$ y = [-1836042, -1842229, -1857907, -1778594, -1737207, -1782943, -1735757, -1731049, -1668743, -1660420, -1628168, -1671614, -1606872, -1583529, -1573093, -1517283, -1503438, -1555860, -1511201, -1371589, -1396960, -1286088, -1353958, -1328055, -1232138, -1199851, -1247176, -1241745, -1251415, -1259446, -1160379, -1097953, -1068365, -957358, -957715, -1053892, -1007087, -981264, -995118, -974954, -871082, -861602, -883857, -901162, -871058, -824679, -738719, -775975, -795503, -647530, -693499, -631343, -508025, -500599, -522258, -574853, -584319, -508975, -438206, -403676, -362223, -399665, -356488, -333706, -267467, -273993, -361199, -388474, -385073, -344371, -297872, -233050, -200233, -229432, -165374, -164465, -111217, -49456, -8252, 87390, 44386, -46888, -11124, 53951, 27834, 89944, 123571, 177440, 217340, 166616, 138773, 198224, 275478, 227152]
16290B27152L2788M5673K2367j4111L1746O7298l2155l762l0703L6287Q0238M3790
16278E06608K0610L6787n1225O5628M082J3697l7610j4779J40628Q7344p0605
16267G01165L3993N0260n3903L603l9637K5702J02283M2181K9137M4283p0715
16256H68352o3689P2822R7508p824m5374Q3228J0934l3021k2284k4147R904L9148
16244I85557L8858P5560M3561o2809n9858J10144l100J9996M5149k179M2241l554
16232A229566l1582m7164M6406L8183O5146j3413J10996l5547N4100J21416j21756
16221A416351P243M4197p6760M2787q900m3627K6494Q1367K0573K3424j22899
16210A410250J53921m7726q184J8487r0398J49693q9932J9474j7260J91532j35283
$$ y = [227152, 259940, 305613, 327980, 313869, 345615, 412913, 380758, 376996, 346293, 382580, 462818, 506608, 527218, 564005, 512780, 578408, 582490, 596187, 558577, 543798, 684426, 771770, 701165, 735158, 785418, 731515, 735118, 695481, 721183, 823466, 865647, 894784, 939067, 868352, 804663, 877485, 974993, 967169, 921795, 1005023, 1015957, 982936, 960652, 936505, 946409, 985557, 1024415, 1099975, 1143536, 1080727, 1020869, 1131013, 1127913, 1147909, 1193058, 1190879, 1233120, 1229566, 1197984, 1150820, 1197226, 1235409, 1300555, 1287142, 1398138, 1362591, 1416691, 1538107, 1416351, 1423594, 1467791, 1391031, 1433818, 1424918, 1381291, 1407785, 1489152, 1509725, 1533149, 1410250, 1564171, 1516445, 1508261, 1526748, 1436350, 1586043, 1496111, 1515585, 1498325, 1689857, 1554574]
16199A554574P6314m7849l79J2489K330K1448l3623k4904l0466J49220R6103j0356
16187A764901L4464m1827j18558J49517o7569k0055k8773N2223m4044K7985P5231
16176A783495o6241L6096m5686L4167N9763k020p2195J00218o4748q625n9415
16165A694809J14392L2470Q68J10739j84845J16730K2448R837m403j3887n761
$$ y = [1554574, 1630888, 1583039, 1582660, 1595149, 1597479, 1618927, 1585304, 1560400, 1529934, 1679154, 1775257, 1764901, 1799365, 1757538, 1638980, 1788497, 1720928, 1700873, 1672100, 1724323, 1680279, 1708264, 1783495, 1717254, 1753350, 1707664, 1741831, 1801594, 1799574, 1727379, 1827597, 1762849, 1754224, 1694809, 1809201, 1841671, 1842539, 1953278, 1768433, 1885163, 1907611, 1917448, 1913045, 1899158, 1893397]
$$ [...]
##END NTUPLES=NMR SPECTRUM
##END=
