##TITLE=1H_CG-1221-A
 200.13MHz, CDCl3,
 8 sc
 
 11.2.2025
##JCAMPDX= 6.0         $$ Bruker NMR JCAMP-DX V2.0
##DATA TYPE= NMR SPECTRUM
##DATA CLASS= NTUPLES
##ORIGIN= UXNMR, Bruker Analytische Messtechnik GmbH
##OWNER= pz
$$ XWIN-NMR		Version 3.5
$$ Tue Feb 11 14:36:18 2025 Russian Standard Time (UT+4h)  she@DPX200
##.OBSERVE FREQUENCY= 200.1313
##.OBSERVE NUCLEUS= ^1H
##.ACQUISITION MODE= SIMULTANEOUS
##.ACQUISITION SCHEME= undefined
##.AVERAGES= 8
##.DIGITISER RES= 18
##SPECTROMETER/DATA SYSTEM= spect
##.PULSE SEQUENCE= zg30
##.SOLVENT NAME= CDCl3
##.SHIFT REFERENCE= (INTERNAL, CDCl3, 0, 15.542)
##AUDIT TRAIL= $$ (NUMBER, WHEN, WHO, WHERE, WHAT)
$$ ##TITLE= Audit trail, XWIN-NMR		Version 3.5
$$ ##JCAMPDX= 5.01
$$ ##ORIGIN= Bruker BioSpin GmbH
$$ ##OWNER= she
$$ F:/spectra/data/she/nmr/H-C/1/pdata/1/auditp.txt
$$ ##AUDIT TRAIL=  $$ (NUMBER, WHEN, WHO, WHERE, WHAT)
(   1,<2025-02-11 14:13:32.89 +0400>,<she>,<DPX200>,
      <created by zg, POWCHK disabled, PULCHK disabled
       configuration hash MD5:
       00 E9 B6 7A A2 85 ED C7 34 08 36 98 17 FE 4E 26
       data hash MD5: 16K
       2C AE FD 43 1D 3E 28 00 3E 05 66 48 30 A1 02 15>)
(   2,<2025-02-11 14:17:32.79 +0400>,<she>,<DPX200>,
      <Start of raw data processing
       efp BC_mod = 2 LB = 0.25 FT_mod = 6 PKNL = 1 PHC0 = -474.6209 PHC1 = 18.59221 SI = 16K 
       data hash MD5: 16K
       A5 D5 6A 6E 5F 67 63 C0 AE 7F F8 5B A3 AA 2D 31>)
(   3,<2025-02-11 14:21:54.89 +0400>,<she>,<DPX200>,
      <pk PHC0 = 12.08314 PHC1 = -14.2 
       data hash MD5: 16K
       2C 9F 82 3D 7A 2F E2 34 63 BA 95 2B 55 8A FF 1F>)
(   4,<2025-02-11 14:22:42.43 +0400>,<she>,<DPX200>,
      <abs ABSG = 5 
       data hash MD5: 16K
       95 D3 AD FD 85 51 32 DC 6A 70 B6 B5 61 6E 95 F1>)
$$ ##END=
$$ 
$$ hash MD5
$$ 36 A9 01 4D 52 1C AE BD B7 44 5D B4 71 1C F5 71
##$RELAX= 
##$RELAX= 
##$RELAX= 
##$RELAX= 
##$RELAX= 
##$RELAX= 
$$ Bruker specific parameters
$$ --------------------------
##$DU= <F:/spectra>
##$EXPNO= 1
##$NAME= <H-C>
##$PROCNO= 1
##$TYPE= <nmr>
##$USER= <she>
##$AMP= (0..31)
100 100 100 100 100 100 100 100 100 100 100 100 100 100 100 100 100 100 
100 100 100 100 100 100 100 100 100 100 100 100 100 100 
##$AQSEQ= 0
##$AQ_mod= 1
##$AUNM= <au_zg>
##$AUTOPOS= <>
##$BF1= 200.13
##$BF2= 200.13
##$BF3= 200.13
##$BF4= 200.13
##$BF5= 200.13
##$BF6= 200.13
##$BF7= 200.13
##$BF8= 200.13
##$BYTORDA= 1
##$CFDGTYP= 0
##$CFRGTYP= 5
##$CHEMSTR= <none>
##$CNST= (0..31)
1 1 145 1 1 1 1 1 1 1 1 1 1 1 1 1 1 1 1 1 1 1 1 1 1 1 1 1 1 1 1 1 
##$CPDPRG= <>
##$CPDPRG1= <>
##$CPDPRG2= <>
##$CPDPRG3= <>
##$CPDPRG4= <mlev>
##$CPDPRG5= <mlev>
##$CPDPRG6= <mlev>
##$CPDPRG7= <mlev>
##$CPDPRG8= <mlev>
##$CPDPRGB= <>
##$CPDPRGT= <>
##$D= (0..31)
0 0.7 0 0 0 0 0 0 0 0 0 0.03 0 0 0 0 0 0 0 0 0 0 0 0 0 0 0 0 0 0 0 0 
##$DATE= 1739268812
##$DBL= (0..7)
120 120 120 120 120 120 120 120 
##$DBP= (0..7)
150 150 150 150 150 150 150 150 
##$DBP07= 0
##$DBPNAM0= <>
##$DBPNAM1= <>
##$DBPNAM2= <>
##$DBPNAM3= <>
##$DBPNAM4= <>
$$ [...]
##$SUBNAM3= <"">
##$SUBNAM4= <"">
##$SUBNAM5= <"">
##$SUBNAM6= <"">
##$SUBNAM7= <"">
##$SUBNAM8= <"">
##$SUBNAM9= <"">
##$SW= 18.0517328524113
##$SWIBOX= (0..15)
0 0 2 0 0 0 0 0 0 0 0 0 0 0 0 0 
##$SW_h= 3612.71676300578
##$TD= 16384
##$TD0= 1
##$TE= 0
##$TE2= 300
##$TE3= 300
##$TEG= 300
##$TL= (0..7)
0 120 120 120 120 120 120 120 
##$TP= (0..7)
150 150 150 150 150 150 150 150 
##$TP07= 0
##$TPNAME0= <>
##$TPNAME1= <>
##$TPNAME2= <>
##$TPNAME3= <>
##$TPNAME4= <>
##$TPNAME5= <>
##$TPNAME6= <>
##$TPNAME7= <>
##$TPOAL= (0..7)
0.5 0.5 0.5 0.5 0.5 0.5 0.5 0.5 
##$TPOFFS= (0..7)
0 0 0 0 0 0 0 0 
##$TUNHIN= 0
##$TUNHOUT= 0
##$TUNXOUT= 0
##$USERA1= <user>
##$USERA2= <user>
##$USERA3= <user>
##$USERA4= <user>
##$USERA5= <user>
##$V9= 5
##$VALIST= <valist>
##$VCLIST= <CCCCCCCCCCCCCCC>
##$VD= 0
##$VDLIST= <DDDDDDDDDDDDDDD>
##$VPLIST= <PPPPPPPPPPPPPPP>
##$VTLIST= <TTTTTTTTTTTTTTT>
##$WBST= 1024
##$WBSW= 4
##$XGAIN= (0..3)
0 0 0 0 
##$XL= 0
##$YL= 0
##$YMAX_a= 777487
##$YMIN_a= -960629
##$ZGOPTNS= <>
##$ZL1= 120
##$ZL2= 120
##$ZL3= 120
##$ZL4= 120
##$ABSF1= 15.55958
##$ABSF2= -2.492271
##$ABSG= 5
##$ABSL= 3
##$ALPHA= 0
##$AQORDER= 0
##$ASSFAC= 0
##$ASSFACI= 0
##$ASSFACX= 0
##$ASSWID= 0
##$AUNMP= <proc_1d>
##$AZFE= 0.1
##$AZFW= 0.1
##$BCFW= 0
##$BC_mod= 2
##$BYTORDP= 0
##$COROFFS= 0
##$CY= -3
##$DATMOD= 1
##$DC= 0
##$DFILT= <>
##$DTYPP= 0
##$F1P= 0
##$F2P= 0
##$FCOR= 1
##$FTSIZE= 16384
##$FT_mod= 6
##$GAMMA= 0
##$GB= 0
##$INTBC= 1
##$INTSCL= 3.241238e-09
##$ISEN= 128
##$LB= 0.25
##$LEV0= 0
##$LPBIN= 0
##$MAXI= 10000
##$MC2= 0
##$MEAN= 0
##$ME_mod= 0
##$MI= 1.114404
##$NCOEF= 0
##$NC_proc= -5
##$NLEV= 6
##$NOISF1= 3.799351
##$NOISF2= 2.8
##$NSP= 0
##$NTH_PI= 0
##$NZP= 0
##$OFFSET= 15.54196
##$PC= 1
##$PHC0= -462.5378
##$PHC1= 4.392211
##$PH_mod= 1
##$PKNL= yes
##$PPARMOD= 0
##$PSCAL= 0
##$PSIGN= 0
##$REVERSE= no
##$SF= 200.129995946015
##$SI= 16384
##$SIGF1= 3
##$SIGF2= 2
##$SINO= 0.751879
##$SIOLD= 32768
##$SREGLST= <19F.Aceton>
##$SSB= 0
##$STSI= 16384
##$STSR= 0
##$SW_p= 3612.71676300578
##$SYMM= 0
##$S_DEV= 0
##$TDeff= 16384
##$TDoff= 0
##$TI= <>
##$TILT= no
##$TM1= 0
##$TM2= 0
##$TOPLEV= 0
##$USERP1= <user>
##$USERP2= <user>
##$USERP3= <user>
##$USERP4= <user>
##$USERP5= <user>
##$WDW= 1
##$XDIM= 16384
##$YMAX_p= 530681166
##$YMIN_p= -345595
$$ End of Bruker specific parameters
$$ ---------------------------------
##NTUPLES= NMR SPECTRUM
##VAR_NAME=  FREQUENCY,     SPECTRUM/REAL,   SPECTRUM/IMAG
##SYMBOL=    X,             R,               I
##VAR_TYPE=  INDEPENDENT,   DEPENDENT,       DEPENDENT
##VAR_FORM=  AFFN,          ASDF,            ASDF
##VAR_DIM=   16384,         16384,           16384
##UNITS=     HZ,            ARBITRARY UNITS, ARBITRARY UNITS
##FACTOR=    0.220516191357247, 1,           1
##FIRST=     3110.41234427691, 0,            0
##LAST=      -502.304418728869, 0,           0
##MIN=       -502.304418728869, -345595,     0
##MAX=       3110.41234427691, 530681166,    0
$$ Real data points
##PAGE= N=1
##DATA TABLE= (X++(R..R)), XYDATA
$$ [...]
8171a26584Q436O2777K1030k4665n6542J4836k4105J2591k2197O3394J3539J0549
8159d6941l0849k6417N5967L603l9753J1149j338Q33N3356K8372n7739L1773Q7129
8146F9145n8931m3273o9545L2577K5716p63q120K586j3043J9198j3817l6532l33
8133i5135p723J0175R6497K8476o8757l7041m5393P2939j7416n13J8006k7978
8121g3863m62r980j0585Q7434K668o7825r690j9410R638J1442L291N3668m168
8108b7842N918N0448l2930l7251m9696O6227L0033p5067M5723N5727o3782o2903
8096i5395K8986k774L1237o3152m0957N9921K2124m7778N8163k1449o4876R5770
8084d0180M6704K0547n0621o7466q847j6014k0013L9800R2715L6947r9604k6481
$$ plain form
8171 -126584 -118148 -55371 -34341 -59006 -115548 -100712 -124817 -112226 -134423 -71029 -57490 -46941
8159 -46941 -77790 -104207 -48240 -44637 -84390 -73241 -74579 -73746 -20390 7982 -49757 -17984 69145
8146 69145 10214 -33059 -102604 -70027 -44311 -45074 -53194 -50608 -63651 -44453 -58270 -94802 -95135
8133 -95135 -102858 -92683 3814 32290 -36467 -73508 -118901 -45962 -63378 -63891 -45885 -73863
8121 -73863 -74325 -84305 -94890 -7456 -4788 -72613 -82303 -101713 -92075 -80633 -77342 -23674 -27842
8108 -27842 -21924 28524 -4406 -41657 -91353 -25126 4907 -70160 -24437 31290 -32492 -95395
8096 -95395 -66409 -69183 -37946 -101098 -142055 -82134 -60010 -107788 -49625 -71074 -135950 -40180
8084 -40180 6524 27071 -23550 -91016 -99863 -115877 -135890 -96090 -3375 33572 -66032 -92513
8072i2513J5499O664l9617O6254m0022J3692J0362k3879J4348l6661l2459J0800
8060a27532P8242k3507m6634n9953J632J16356K3312k9196K8069m8316J5507j991
8048g4011n585J3615Q4595N9925m8151l6739k381q209O509j8116n0449Q0490j2487
8035a0994r8286m1471K9348J5660L9577j4081L1732j0520l2448J8614K6263k0019
8023f6625n5349L1121L5095k2444M9404k3602L8601L61p6962Q7556l2833n0016
8011h5693M45P2001j2619o9184J409L4917M6360n1601L1815J800o4016q022L3326
7998f9062j9712k5560M0038J6334K907M0738K1955l502m5853p6091r065k6246
7986a53119N9260K4535j9952J9045O885k0531Q99J00322J6024L8425j1346j16520
$$ plain form
8072 -92513 -77014 -70350 -109967 -43713 -83735 -70043 -59681 -83560 -69212 -105873 -138332 -127532
8060 -127532 -49290 -72797 -119431 -179384 -177752 -61396 -38084 -67280 -39211 -87527 -72020 -74011
8048 -74011 -79596 -65981 18614 78539 30388 -6351 -8732 -16941 -10432 -28548 -78997 1493 -10994
8035 -10994 -109280 -150751 -121403 -105743 -66166 -80247 -48515 -59035 -91483 -72869 -46606 -66625
8023 -66625 -121974 -90853 -55758 -78202 -28798 -52400 -13799 -13438 -90400 -2844 -35677 -85693
8011 -85693 -85248 -13247 -25866 -95050 -93641 -58724 -12364 -63965 -32150 -30350 -94366 -102388 -69062
7998 -69062 -88774 -114334 -74296 -57962 -55055 -14317 7638 4136 -41717 -117808 -126873 -153119
7986 -153119 -93859 -69324 -89276 -70231 -63346 -83877 -82978 17344 33368 71793 60447 -56073
7974e6073m6838N2314k0508K6762l7727k9828O0305j132K0378l608o1082l523
7962a00560j7420L5425L8102J6700J9771p5098P8296j8403L7384j8410j4359j2748
7950c1320K3343p551o9004k3451J2495K584M5560o969q3069M4901J6858M3390
7938c2233k8497j017q932m2452M0724J2059N244N3265L337k6154l7080L702R0030
7925C1996l1194j00202O3117L474J3184J7048m4956M6200l9294O748q252J2061
7913c0070M3935K4969k8322p6727J5466j1814j4926M5443O985O8054j8079q6872
7901f1958m9298j5219P6215m0903j2223Q6587L325J6772n2141M5498k8927n6159
7889h8431l0195J8484l0537K1351P1830p398R9242n4461q8485N349N5902L4705
$$ plain form
7974 -56073 -102911 -50597 -71105 -44343 -82070 -111898 -51593 -52725 -32347 -35955 -97037 -100560
7962 -100560 -117980 -82555 -44453 -27753 -7982 -83080 -4784 -23187 14197 -4213 -18572 -31320
7950 -31320 -7977 -15528 -84532 -107983 -95488 -92904 -47344 -54313 -137382 -92481 -75623 -32233
7938 -32233 -60730 -61747 -70679 -113131 -72407 -60348 -55104 -1839 1498 -24656 -61736 -58034 31996
7925 31996 802 -99400 -36283 -32809 -19625 -2577 -47533 -1333 -40627 -33879 -42131 -30070
7913 -30070 13865 38834 10512 -66215 -50749 -62563 -77489 -32046 -25061 42993 24914 -61958
7901 -61958 -111256 -126475 -50260 -91163 -103386 -16799 -13474 3298 -48843 -3345 -32272 -88431
7889 -88431 -118626 -100142 -130679 -109328 -37498 -44896 54346 -115 -88600 -83251 -27349 7356
7877G356j20870m0761o360K2094L9326J1964m606l5713Q1061j7086K5662j7680
7865e5613K0937N7062L428J026l5584l955M8915j09709l2441J7912q837L2749
7853f4110k519k8562J6682N4457J7965R243j7638l8953m9958M6409k1850m3520
7841a22354J7447J25632J5520q8512J5720K1777l1625o2840j154J0919Q5336M6766
7829C2632k6738m0195p534k4798p5002M0098K1056K5974J5115o519k1305j0521
7817g7737J6606M485k0267O6952K163j18603N3466n821m6743L6742O7559L85m3034
7804f3847n164N243L7092l4206l9126K0770j557k5839J592P8708M5088m6945n307
7791c3498m0053p709j0863n305K9004j5182N2284l5775j9607L2312K5292j3824
$$ plain form
7877 7356 -113514 -154275 -160635 -138541 -99215 -87251 -91857 -127570 -46509 -63595 -37933 -55613
7865 -55613 -34676 22386 25814 26840 -8744 -12699 36216 -73493 -105934 -88022 -96859 -64110
7853 -64110 -66629 -95191 -78509 -24052 -6087 3156 -14482 -53435 -103393 -56984 -78834 -122354
7841 -122354 -104907 20725 36245 -52267 -36547 -14770 -46395 -109235 -110389 -99470 -14134 32632
7829 32632 5894 -34301 -41835 -66633 -141635 -101537 -80481 -54507 -39392 -45911 -67216 -77737
7817 -77737 -61131 -56646 -76913 -9961 -7798 -126401 -72935 -78756 -125499 -88757 -21198 -20813 -63847
7804 -63847 -69011 -63768 -26676 -60882 -100008 -79238 -80795 -106634 -105042 -26334 18754 -28191 -33498
7791 -33498 -73551 -81260 -92123 -97428 -68424 -83606 -31322 -67097 -86704 -54392 -29100 -42924
7779d2924m4383J1647R7356p954l7145r802k5674n2074M7086L6421J5872q2813
7767i4387j9740M4266l4218p263O1121P4017k0277p4001N2898j1943o3790K3730
7755f9587M3191j0252j5008p82O5592k6830r3332L2385L7761l8144N0092O0110
7743C5196k739l2007p4591M2239O324l359m3772N2417K292J8386R680J2926n6891
7730c3899M898k2577n8839K4373L1298N1039n1970p6791P1890L9180R866l5183
7718d6715l2824K033K3484K6907j2984N1477k0205o5142p423j2089l047K8206
7706f8322k1773L0890L3512J388r046L415M0348L3840k0999p3415K2672M5898
7694A8408o5083r2741R6570L0152k5255J815n002J864j0173O0092l3224q0379
$$ plain form
7779 -42924 -87307 -75660 21696 13742 -23403 -33205 -58879 -110953 -63867 -27446 -11574 -94387
7767 -94387 -114127 -69861 -104079 -111342 -50221 23796 3519 -70482 -17584 -29527 -93317 -69587
7755 -69587 -26396 -36648 -51656 -52438 13154 -13676 -107008 -74623 -36862 -75006 -24914 35196
7743 35196 32457 450 -74141 -31902 -25578 -28937 -72709 -20292 -18000 386 10066 22992 -33899
7730 -33899 -29001 -51578 -110417 -86044 -54746 -3707 -55677 -132468 -60578 -21398 -11532 -46715
7718 -46715 -79539 -77506 -54022 -27115 -40099 11378 -8827 -73969 -81392 -93481 -96528 -68322
7706 -68322 -90095 -59205 -25693 -24305 -33351 -29936 10412 44252 23253 -50162 -27490 18408
7694 18408 -46675 -139416 -42846 -12694 -37949 -36134 -41136 -39272 -49445 10647 -22577 -102956
7682a02956O132L122K3910N480m6415L1749j2267N2233O2102k8696j8955j6363
7670d0924J7560K2672k6017o5690K0427K4362J182m5414M9436L2937J0819q9342
7658h7992l2986J07108K1164Q694j663J5059K967k4466o0107k3343N7001l7575
7646e6139P982M5626N377m3314K1007k8358l9782m166j4374L6814r302N1024K7789
7633A84j6671l0131N0501J5186j7885L4257j2677K423J2901k0910n3217L491J7293
7620a5255n6146N6201L699L3947n6961k2843L9608k8578L3168n5205k3677O4825
7608b7217k7032N8860k0722k6848J0178J9762m5897M0094l0814k0821K4304K5147
7596b1006J3400l5524M0306j725K2184j3328k7173Q068K3616l597j7820j7309
$$ plain form
7682 -102956 -96824 -93702 -69792 -64312 -110727 -78978 -91245 -39012 23090 -5606 -24561 -40924
7670 -40924 -23364 -692 -26709 -92399 -71972 -47610 -46428 -91842 -42406 -9469 1350 -87992
7658 -87992 -120978 -13870 7294 15988 14325 29384 32351 7885 -52222 -75565 -18564 -56139
7646 -56139 -48157 -2531 2846 -40468 -19461 -47819 -87601 -91767 -106141 -69327 -78629 -27605 184
7633 184 -16487 -46618 3883 19069 1184 35441 22764 25187 38088 17178 -36039 -32548 -15255
7620 -15255 -71401 -15200 -11501 22446 -34515 -57358 -17750 -46328 -13160 -68365 -92042 -27217
7608 -27217 -54249 4611 -16111 -42959 -32781 -13019 -58916 -18822 -49636 -70457 -46153 -21006
7596 -21006 -7606 -43130 -2824 -4549 17635 4307 -22866 -14798 8818 5221 -12599 -29908
7584b9908j0658L2062N6373n2097j3873K0443L105j8152o020P9176j6349l5529
7572H573K024k4314J8977n6304L844N724L7749k5765J8949q94m4061K4479p260
7559c8279q9448K8084L8019j8763J3872M403J674J5650N4043l4522J3740M2787
7547C1260l3878p144k7424p4098J9511O6764O804j8915J3982j9125k087K0985
7535b3365K637j2445r429l522j7912n2453O8664J6860J375j1893k394L3995K376
7522g506l1831M3994J6316l5547k201j1014m0874j711J8710k5572l1619P9255
7510b9600O3874M811j2481q962r87K5486j09817m5386R6116K6746m552k7049m9512
7497g1313N2866J39394j015k2349o4840J6151m2156L477j960l0304P3760j1647
$$ plain form
7584 -29908 -40566 -8504 47869 -4228 -18101 2342 5447 -12705 -18725 60451 44102 8573
7572 8573 10597 -13717 5260 -51044 -47200 -41476 -3727 -29492 -10543 -11437 -55498 -31019 -38279
7559 -38279 -127727 -99643 -61624 -80387 -66515 -62112 -60438 -44788 9255 -25267 -11527 31260
7547 31260 -2618 -9762 -37186 -111284 -91773 -25009 -18205 -37120 -23138 -42263 -44350 -23365
7535 -23365 -20728 -33173 -42602 -46124 -64036 -116489 -47825 -30965 -29590 -41483 -43877 -9882 -7506
7522 -7506 -39337 4657 20973 -14574 -16775 -27789 -68663 -70374 -51664 -77236 -108855 -29600
7510 -29600 34274 39085 26604 17642 16655 42141 -67676 -113062 -16946 9800 5248 -21801 -71313
7497 -71313 -18447 120947 119932 97583 32743 48894 6738 10215 8255 -22049 51711 40064
7485D0064k3850J4060p5560L8812K8173P302m6110K8483j4586K0515L7130l2417
7473B2016K8697N07l9225m060n571m1939L1475k9474m1303M8824O4141l9197N6405
7460E1296n1851k2900J4363o1555L7323L0349o4069M5442K3073J9264L1884q853
7448D3766n5113j9920M6629n7336m5579j2652O5256J7022k4745M6590j0760p1514
7436g8356O2537k4525L624M608k4482Q897N663L0399K4665m6272J0038l6665K6495
7423c3374P0770J7670m8398l1874L7914l6605L0920o3333n0820N9197j1957k3396
7411h3286m3641O9804Q3447J7443o7185L7674l8574J1129j753n6033P00P446L2345
7398c0484k2086K2988O0149p196p5427K895j0596J1403l0190l465j6479M6095
$$ plain form
7485 40064 16214 30274 -45286 -6474 21699 29001 -17109 11374 -3212 17303 54433 22016
7473 22016 50713 51220 11995 7935 2364 -39575 -8100 -37574 -78877 -30053 34088 -5109 51296
7460 51296 -555 -23455 -9092 -70647 -33324 -2975 -67044 -21602 1471 20735 52619 43766
7448 43766 -11347 -31267 15362 -41974 -87553 -100205 -34949 -17927 -42672 3918 -6842 -78356
7436 -78356 -15819 -40344 -36720 -32112 -56594 -47697 -42034 -11635 13030 -33242 -23204 -59869 -33374
7423 -33374 37396 55066 6668 -25206 12708 -23897 7023 -56310 -107130 -47933 -59890 -83286
7411 -83286 -126927 -57123 26324 43767 -23418 14256 -24318 -13189 -14942 -70975 -70275 -62829 -30484
7398 -30484 -52570 -29582 30567 23371 -52056 -49161 -59757 -48354 -78544 -82009 -98488 -52393
7386e2393O4318j9243r2937M491P4475j5821k2321n0511K6200P4019k3801K1270
7374a2254r35j7013N9415j9352q9228L1192J2912l4936L9936j0020L914K7800
7362h569q501j5273l931j373J8129J6339J9241o6599n6407M7671n7427M0241M366
7349g2093L0665J5065m6992j6062q125o6602P9249m117J7445L2848n9643P4934
7337b3428L0118k9914k9031n133l3021m7203O7292K5930K9321k9241j2463l3720
7325i0493K5610m6556l5647K3886K3031K3214j2639J0910P480P0873m2885l4304
7313g7520N691J9166k34k2602J7147K0066J8812m445j730M3195p5990k107O8368
7300G817j9893L148l7325l1412N5969r337k5886N770k1627j2362P342O8748k9178
$$ plain form
7386 -52393 11925 -7318 -100255 -95764 -21289 -37110 -59431 -109942 -83742 -9723 -33524 -12254
7374 -12254 -13189 -30202 29213 9861 -79367 -48175 -35263 -70199 -30263 -40283 -36369 -8569
7362 -8569 -17070 -32343 -36274 -37647 -19518 -3179 16062 -50537 -106944 -59273 -116700 -76459 -72093
7349 -72093 -41428 -26363 -73355 -89417 -97542 -164144 -84895 -89012 -71567 -38719 -98362 -23428
7337 -23428 6690 -23224 -52255 -57388 -90409 -137612 -70320 -44390 -15069 -44310 -56773 -90493
7325 -90493 -64883 -111439 -147086 -123200 -100169 -76955 -89594 -78684 -71204 -331 -43216 -77520
7313 -77520 -71829 -52663 -52897 -75499 -58352 -38286 -19474 -23919 -25649 17546 -58444 -60551 7817
7300 7817 -12076 -8928 -46253 -77665 -21696 -31033 -56919 -51149 -72776 -85138 -77796 -9048 -38226
7287c8226p8569K519R6280M5962m221m3401O88K5257j0697M649j5946n1841p12
7274f8258O6127k1277N9059l3147Q803O171r0853L0338M8690O656L9288P42o6506
7261a4167J3078O727m3573k6607j4320M5148J8347j3136p178J1038j5168K5048
7249a4763j9166P121L1487L6468q8049L9899J3276L077J2926k5076K4451R651
7237C1302k2152R8380q5488j8944l6090j6242J564o576O7179j1094k7790j8356
7225d4307J0791K2128n531L0155o6465j395P5900k9439L092J2892J8159l9209
7213a3229K2089o586j3798O222M2759l4151J6197K0118p0270l4068L5505J629
7201b7583k0864k3471R3547j2183K7418j0872q6578J757K4706M6943J0756m2289
$$ plain form
7287 -38226 -116795 -114276 -17996 27966 23745 -19656 -18968 6289 -4408 241 -15705 -67546 -68258
7274 -68258 -2131 -23408 35651 2504 11307 17478 -73375 -43037 5653 12309 51597 52339 -14167
7261 -14167 -1089 5638 -37935 -64542 -78862 -33714 -15367 -28503 -35681 -24643 -39811 -14763
7249 -14763 -33929 -26808 4679 41147 -46902 -7003 6273 9350 22276 -2800 21651 31302
7237 31302 9150 107530 22042 3098 -32992 -49234 -47670 -54246 12933 1839 -25951 -44307
7225 -44307 -33516 -11388 -16919 13236 -53229 -54624 21276 -8163 -5071 7821 25980 -13229
7213 -13229 8860 2274 -11524 -5302 37457 3306 19503 39621 -30649 -64717 -29212 -27583
7201 -27583 -48447 -71918 21629 9446 36864 25992 -60586 -58829 -34123 12820 23576 -18713
7189a8713N4078N7252N567j06043n4956q508L2684O8370o1667N5372j6502k1944
7177a5010j0751p659N9678P694N4271j5771o3115l8921M6401k4581m106O6058
7165E4188k2730k2675K1325R1245K8656n0541l6793K4539L0777J3466J6671q5820
7153F2308m05J8821p5672Q3481K0134p250M8132j0664l585j3080K3422K6195K5168
7140A97005l6565k8975j2810N5793j2956k19j1699O8976N8554j8791l3290m4405
7128A80618K0845L5939l000L0020L0983J2466L3808k0989M6069J7006M8054O553
7116D38372m4582P5047m5121P531M283k1151M9133L0719l5532J7482l617k1214
7104D51350M9513P2870l9005L444K3943j3792o1419R167K4944k1600L1501p703
$$ plain form
7189 -18713 35365 92617 98184 -7859 -62815 -71323 -38639 29731 -31936 23436 6934 -15010
7177 -15010 -25761 -33420 26258 33952 88223 72452 9337 -29584 16817 -7764 -11870 54188
7165 54188 31458 8783 30108 121353 150009 99468 62675 87214 117991 131457 148128 62308
7153 62308 61903 80724 5052 88533 108667 101417 149549 138885 135300 122220 145642 171837 197005
7140 197005 160440 131465 118655 174448 161492 161273 149574 218550 277104 258313 225023 180618
7128 180618 201463 237402 234402 264422 295405 307871 341679 320690 366759 383765 431819 438372
7116 438372 393790 468837 423716 431247 435530 414379 463512 494231 458699 476181 472564 451350
7104 451350 500863 573733 534728 538172 562115 548323 486904 496071 521015 499415 530916 523213
7092E23213R255J7990O3062r6693j9789P213J164J3169J7882l3971j3085J7644
7080E07054O158k78j263m1534k0683n6990R204m2078k6532K083L5242j1185r2601
7067B66597L2439k3977P6791M3281q0725J8772K3981p0537N380m9466l1340R0386
7055C01582j327m7421L6689l7503r2140M3102K000J327O1591p4588j9207Q7232
7043B61337p2394M2316p3030J6678M7179j02299p2599l664P5216l6906j2486M5847
7031A15195m2045k0410k3367r157J3356O3141l5434M144M9376K475q7233L3587
7019F3628R1968k7366j331n9951k5263K3399J6773M995J2678o6797q011N9332
7007H4054m4112O708L0507J2500R7903o7598k3851K0369j04416l4471L74M2599
$$ plain form
7092 523213 532468 550458 613520 516827 497038 504251 505415 518584 536466 502495 489410 507054
7080 507054 513212 512934 511671 470137 449454 392464 401668 359590 333058 335141 370383 359198 266597
7067 266597 299036 275059 351850 395131 314406 333178 357159 286622 292002 242536 211196 301582
7055 301582 300255 252834 289523 252020 159880 202982 204982 206309 267900 193312 174105 261337
7043 261337 188943 231259 158229 174907 222086 119787 47188 43524 118740 81834 69348 115195
7031 115195 73150 52740 29373 20216 33572 96713 61279 65423 114799 117274 30041 63628
7019 63628 155596 128230 126899 66948 41685 65084 81857 86852 99530 32733 24722 84054
7007 84054 39942 46650 77157 89657 187560 119962 96111 116480 12064 -22407 -22033 20566
6995B0566M3973Q683l4272j4064L0427k8K0155p8186k4578J09700k5650J4519
6983G1245j3116m9006P6491o7142m5271k4559J7270O7125N140l0357o306o462
6971d948O8764J8919q2423m9907N0666l8753o577L113K7077K8994l3908P0925
6959E1942p3526J9813q515L4064K0684r5110K2584J4872k1064m0840J6532l5874
6947i4438K8689k9362K9910L2625j9469J964Q3429L323j42864j9969P6526j9246
6935f8882O2364J9232p4587n1898j7530K5543K4424N7722l4439m4275L6279O5324
6923g23k9725q95N6o9560J8269K9246j6866L6076J3312K5209k565j00028N4624
6910d3570J5416J14K6594J8761l6890m3593K4125N323L099J8942M0499M3870l910
$$ plain form
6995 20566 64539 73222 38950 24886 55313 55285 75440 -2746 -27324 82376 56726 71245
6983 71245 58129 9123 85614 18472 -26799 -51358 -34088 33037 38177 7820 1514 -4948
6971 -4948 63816 82735 312 -49595 1071 -37682 -44259 -41146 -14069 14925 -18983 51942
6959 51942 -21584 -1771 -10286 23778 44462 -50648 -28064 -13192 -34256 -75096 -58564 -94438
6947 -94438 -65749 -95111 -65201 -32576 -52045 -50081 33348 36671 -106193 -126162 -49636 -68882
6935 -68882 -6518 12714 -61873 -113771 -131301 -105758 -81334 -23612 -58051 -102326 -66047 -723
6923 -723 -30448 -31343 -31287 -100847 -82578 -53332 -70198 -34122 -20810 4399 1834 -98194 -43570
6910 -43570 -28154 -28040 -1446 17315 -19575 -63168 -39043 -33720 -30621 -11679 28820 72690 68780
6897F8780n2631L8460j0844n3654m6843J06205o8488j9930m6615k4891Q2095J9425
6885h931p703M9371L0681k6288J0040n5711m3213O235L2610M214n002k7363Q3381
6872D2321n5924l2263K5332n005L2822p1188L5898J0816l3108K5757L25n2736
6860g6953L9866K9158O456K9245L548n4881l492M8736j9791K7915j250l2457K913
6847i87J0859j2856q050l711M7171l8137o2412J8862M1595j7577J9664J7045j0976
6834D90K5474K4687j8487l9423n3331K0591j6818j4299J8206j118N7206o6515
6822f3337L3678j3243j9144L2080j0053n361N3208J3457j0789l2745k1358L0686
6810a2921p5900K2042K9229q4511O0392n180r468J2856K7936J4942r760J112O8357
$$ plain form
6897 68780 16149 54609 43765 -9889 -56732 49473 -19015 -38945 -85560 -110451 -28356 -8931
6885 -8931 -16634 32737 63418 37130 47170 -8541 -51754 -45519 -12909 -8695 -13697 -41060 42321
6872 42321 -13603 -45866 -20534 -25539 7283 -63905 -28007 -17191 -50299 -24542 -24217 -76953
6860 -76953 -37087 -7929 -1473 27772 31320 -23561 -27053 21683 1892 29807 28557 -3900 -987
6847 -987 9872 -2984 -11034 -14745 32426 -5711 -68123 -49261 -7666 -25243 -5579 11466 490
6834 490 25964 50651 32164 -7259 -60590 -39999 -56817 -71116 -52910 -54028 3178 -63337
6822 -63337 -29659 -42902 -62046 -29966 -40019 -45380 7828 21285 10496 -22249 -43607 -12921
6810 -12921 -88821 -66779 -37550 -122061 -61669 -66849 -76317 -63461 -35525 -20583 -30343 -29231 39126
6797C9126J7190l5564m2929m5328k3578N7574O5875q077j4548n3756O712K5126
6785a2177J7742m0276L4431J9738m7008j2095P6933K2221l4786j1607l2610j4109
6773c3603N0876p605K349k4565O6785m5599k8768R255l7198P675O0810K0688P93
6760D1893k0563l7100Q9632m7981J9968q598n4278O6630m9408O9932K2122K3598
6748A15847J3996m7300P55K128j6080j8699L1031L179o9449p627j6325r68N016
6735d496L4394j3400r437M9455P690j4134l6982j4270k1086K9120l0241N4029
6723C0642m2258L1777l4365K0854P2o6609J06658K1790j6836n315J0588m4633
6711A2365J1873K1260L2411K7642j7951O498k2262k4010k5986m8015P2847O3914
$$ plain form
6797 39126 56316 20752 -22177 -67505 -91083 -33509 32366 24289 9741 -44015 -37303 -12177
6785 -12177 5565 -34711 -280 19458 -27550 -39645 37288 59509 24723 13116 -19494 -33603
6773 -33603 17273 9668 12017 -12548 54237 8638 -20130 -10875 -48073 -40398 20412 41100 41893
6760 41893 21330 -15770 73862 25881 45849 37251 -17027 49603 195 70127 92249 115847
6748 115847 129843 82543 83298 85426 69346 50647 81678 84857 15408 7781 -8544 -9512 -4496
6735 -4496 29898 16498 7061 56516 64206 50072 13090 -1180 -22266 6854 -23387 30642
6723 30642 -11616 20161 -14204 6650 6722 -59887 46771 68561 51725 46410 56998 12365
6711 12365 24238 45498 77909 105551 87600 94098 71836 47826 21840 -26175 46672 110586
6699A10586m8170j1590j0804P3424l496l4579j4799K442J9351P963n3940M4525
6687H0913K5122o2587n1400M4895K2991n5383N8543L8651m2018l2957o4240j92
6675c7662j393Q1473R22O0963o7314k9112J47276j22l9438N6238K5534n5625R535
6662A51275M1082n9324m5753K4177L3098K0013k6588K1843l2102L5982l8144n468
6650A20091k1482O1582J4650k5357J3551k3472M9482K7562p2714L7135L2791k22
6638B13597M6727J2227l6183k8313L4141l0270J5361M9307l031M6673M930N2354
6626C77520j5662O7822N3095l1131M5465N2653P645K4230k0335J31401L3247K1191
6614G47141P7701O4547k2838N3716r2545j9175P3929j05006j7251L6648J05827
$$ plain form
6699 110586 62416 50826 40022 113446 109950 75371 60572 63014 82365 90328 36388 80913
6687 80913 106035 43448 -7952 36943 59934 4551 63094 101745 59727 26770 -37470 -37662
6675 -37662 -39055 42418 43340 104303 36989 7877 155153 155031 115593 171831 197365 141740 151275
6662 151275 192357 133033 87280 111457 144555 164568 137980 159823 127721 163703 125559 120091
6650 120091 98609 160191 174841 149484 163035 139563 189045 216607 143893 181028 213819 213597
6638 213597 260324 272551 236368 208055 242196 211926 227287 276594 273563 320236 325166 377520
6626 377520 361858 429680 482775 451644 497109 549762 557407 581637 561302 692703 725950 747141
6614 747141 824842 889389 866551 920267 827722 808547 882476 777470 760219 796867 902694
6603I02694L1674k4672N0465J5229J7234l8071k1210N6783K8329O6296Q958o8820
6591A024889o8387K4482m218r058r627N2731j9900L995p2079k2074p2559l0326
6579G97869L5145j7495k1785P171K0966J772K4231j3516n7936m3221q9970q791
6567F34440M456n1923j18401k8100l289J1677l1877l1736K2676l2249m7819K1288
6555C49143K1728K9859r436k5412P899l176Q566J4839m0307m9240J4249l0166
6543B88546J5995L0427m4511j5821M2270m2634K8004j2157J1376N8546o8713K3435
6531C14763l2064m245Q1779J7359j1227j1403j6771q0470M2895k0790K3797P8165
6519C81788k3522L0957O056p508J9323j3702J2563q0493n0523Q7035K4753K8884
$$ plain form
6603 902694 934368 909696 960161 975390 992624 954553 933343 990126 1018455 1084751 1093709 1024889
6591 1024889 956502 980984 976766 967708 958081 1010812 990912 994907 922828 900754 828195 797869
6579 797869 833014 815519 793734 800905 821871 823643 847874 834358 776422 733201 643231 634440
6567 634440 638896 586973 468572 440472 437183 448860 416983 385247 407923 375674 327855 349143
6555 349143 370871 400730 391294 365882 373781 370605 379171 394010 353703 304463 318712 288546
6543 288546 304541 334968 290457 274636 316906 274272 302276 290119 301495 360041 291328 314763
6531 314763 282699 278454 360233 377592 366365 354962 338191 257721 300616 279826 303623 381788
6519 381788 358266 389223 395279 387771 407094 393392 405955 325462 274939 361974 386727 415611
6507D15611o4153J2611L2954n028M3829L4053l3590k1205p807M2798O3949k8637
6495D85385K0780L0002N884l5001K9189J8973k6678O1791J9633L8493l8M0626
6483F89039K65j2196N2384J0225P1962k4015J5624N0632K1552l7468J7332o8272
6471G87064k8416Q7482q390j2174L0749m9566N483K0432K2366o956j02065m430
6459G41579K3934Q8067n9579l3036L5917k1328Q4614P426n1469n1036l1496j0079
6447G23514N3953J4391l8149J207N5729O4167m0850p2488O6605K6217J5810o513
6435H63593k5536k3185k4291m8926J2281o905O028M0374J8688O4370m53K1963
6423H98001m0390N5879j4387L5180L1629q447K0662j0111K0032L7323L7292P2471
$$ plain form
6507 415611 351458 364069 397023 391995 435824 469877 436287 415082 407275 450073 514022 485385
6495 485385 506165 536167 542051 507050 536239 555212 528534 590325 609958 648451 648413 689039
6483 689039 689304 677108 729492 739717 811679 787664 803288 853920 875472 838004 855336 787064
6471 787064 758648 846130 837740 825566 856315 806749 812232 832664 855030 848074 746009 741579
6459 741579 765513 853580 794001 760965 796882 775554 860168 867594 816125 765089 733593 723514
6447 723514 777467 791858 753709 754916 810645 874812 833962 761474 828079 854296 870106 863593
6435 863593 838057 814872 790581 741655 753936 747031 753059 793433 812121 876491 876038 898001
6423 898001 857611 913490 899103 934283 965912 957465 978127 968016 988048 1025371 1062663 1135134
6411A135134k0064R199J04112M5029l3400J349N9599k7708J2124N1039O0684L3283
6399A430380l287o340O0151L7405O3021K046N5737M5049j5144J5826M0823L997
6387A729664J01069M7899n8822K7822O9606K3332K2723L0717k9686J18699M4153
6376B127176k6696O6020L1210Q0886L099j8858P6860Q9431J12341M3072J1687
6365B596228K6269Q6926M5416M4483R4368K8520L7023P4643M5454M0785J21259
6354C241374J26752R6605J05900O9732p1978k3164R941o5863o7827k8299N5512
6343C448685L534l2160P7933O1922N5243J09382J20493J60843O1830J38506J41440
6332D347651J30800J71902J57928K04333J67253K56141K83116K32081K10304K63473
$$ plain form
6411 1135134 1115070 1124269 1228381 1273410 1240010 1241359 1300958 1273250 1285374 1336413 1397097 1430380
6399 1430380 1427093 1420753 1480904 1518309 1581330 1583376 1639113 1684162 1669018 1684844 1725667 1729664
6387 1729664 1830733 1878632 1819810 1847632 1917238 1940570 1963293 1994010 1964324 2083023 2127176
6376 2127176 2100480 2166500 2197710 2278596 2281695 2262837 2339697 2429128 2541469 2584541 2596228
6365 2596228 2622497 2709423 2754839 2799322 2893690 2922210 2959233 3033876 3079330 3120115 3241374
6354 3241374 3368126 3464731 3570631 3640363 3568385 3545221 3555162 3489299 3421472 3393173 3448685
6343 3448685 3452219 3420059 3497992 3559914 3615157 3724539 3845032 4005875 4067705 4206211 4347651
6332 4347651 4478451 4650353 4808281 5012614 5179867 5436008 5719124 5951205 6161509 6424982
6322F424982L11461K69034L71756L44856M54648M09457M70629M87055N40803O95983
6312A0780664P30808P59013P44273P82289P53862P24996N93250N86472Q19407
6303A7275034R67138R99813J099372J317861J497881J631147J795296J851962
6295B8435504K074412K344773K470873K720792K665019K541960K457957K390381
6287D8101671K529376K768526L021291L588950M354590N268215O553861Q143299
6279H4329779R330752R987196R039857N130446O08162j847456k863982l121106
6271A10593648k802711k214195j207327N78252K444617L997988M779964L543064
6263A19713300J605930J024895J618355K773053M210705M698904L354052L76154
$$ plain form
6322 6424982 6736443 7005477 7377233 7722089 8176737 8586194 9056823 9543878 10084681 10780664
6312 10780664 11511472 12270485 13014758 13797047 14550909 15275905 15869155 16455627 17275034
6303 17275034 18242172 19241985 20341357 21659218 23157099 24788246 26583542 28435504
6295 28435504 30509916 32854689 35325562 38046354 40711373 43253333 45711290 48101671
6287 48101671 50631047 53399573 56420864 60009814 64364404 69632619 76186480 84329779
6279 84329779 93660531 103647727 112687584 117818030 118426192 116578736 113714754 110593648
6271 110593648 107790937 105576742 104369415 104947667 107392284 111390272 116170236 119713300
6263 119713300 121319230 122344125 123962480 126735533 130946238 135645142 138999194 139375348
6255A39375348k624374m324855m622753l957667k801253j855792p98395p81107
6247A17609152k652359m380811m667458m421958l497948k034439m63894J696732
6239I7187017L949446N432936N333701J531547m102744p594236r142576r621121
6231H2973970r362273q790839q232356o978187n446571m499876l647307l019098
6223C2997463k527901k209110j937197j660259j478683j311047j156899j045399
6215A9670968r25401q25757q46599o69784o56416o90220o22045n70535n67533
6206A3296678n75449m76955m79639m24411m03844l11942l06031l04017k67380
6197I747010k84134l05090l34519k30184k92555l10775k66144k44105j97675k97834
$$ plain form
6255 139375348 136750974 132426119 127803366 123845699 121044446 119188654 118390259 117609152
6247 117609152 114956793 110575982 105908524 101486566 97988618 95954179 95490285 97187017
6239 97187017 101136463 106569399 111903100 113434647 109331903 101737667 92595091 82973970
6231 82973970 73611697 64820858 56588502 49610315 44163744 39663868 36016561 32997463
6223 32997463 30469562 28260452 26323255 24662996 23184313 21873266 20716367 19670968
6215 19670968 18745567 17919810 17073211 16403427 15747011 15056791 14434746 13864211 13296678
6206 13296678 12721229 12244274 11764635 11340224 10936380 10624438 10318407 10014390 9747010
6197 9747010 9462876 9157786 8823267 8593083 8300528 7989753 7723609 7479504 7281829 6983995
6187F983995k60724j71148j73576k67443j21227j73596j84720j08485j63466j34251
6177E225359j25843o1542j26571j13501j18376j10229r1345j36336p5510j43788
6167D122318j48689j31119p6361j17785q6768q2012p8532p9640l7332q1767j9303
6156C183010k5734l2288k2222m0113P3043M028j07781j22159m9455j14990r5524
6145B649815j08876o550o1826r9560m9659k947r1087j2882P437l9796r2308p4766
6133B016995J6759l2564r1738L898j0685n5445L0799j06m9176l307m1851L6812
6121A820391K6391J3599o7302o2369n8144P276L1474r2742J3394L9184L3725k003
6109A702874j07245J0608K9386j7187M839r349N3701J4374O179L4003l7673j3255
$$ plain form
6187 6983995 6723271 6552123 6378547 6111104 5989877 5816281 5631561 5523076 5359610 5225359
6177 5225359 5099516 5037974 4911403 4797902 4679526 4569297 4477952 4341616 4266106 4122318
6167 4122318 3973629 3842510 3766149 3648364 3561596 3479584 3401052 3321412 3284080 3202313 3183010
6156 3183010 3157276 3124988 3102766 3062653 3135696 3139724 3031943 2909784 2860329 2745339 2649815
6145 2649815 2540939 2534389 2472563 2373003 2323344 2320397 2229310 2216428 2223865 2184069 2091761 2016995
6133 2016995 2033754 2001190 1909452 1913350 1902665 1847220 1878019 1877913 1828737 1825430 1783579 1820391
6121 1820391 1846782 1860381 1793079 1730710 1672566 1679842 1711316 1618574 1631968 1671152 1704877 1702874
6109 1702874 1595629 1606237 1635623 1618436 1623275 1613926 1667627 1682001 1688180 1722183 1684510 1671255
6097A671255k505k588l308p784J9199l8125m1558o945j5099k928L5853j5955m165
6084A585347j7360n0963K7702m7103K2390M9745K7206K773l6222l7337m5532K3966
6072A504612L1865j1198n5658O2959L4380k4405M1272N5731O6827M5011N4655
6061A806051o489m633M0155O2547K5634N1073M7440m9958q0630n7650L0653o3410
6049A800783n6261N6918p917M8226O3222m804o1155m0664M3869L6030j7930K7654
6037A887971m34J2935M2081l661J7343m0244n7600l3327J1396J6400N1655p5740
6025A828775l9792o290o936m2321l6631L4550R7500J217o2160J0330P8570q5212
6013A771600j0904m4642r535J8673j13939p318O0150n4754l5295Q2192K9379j9443
$$ plain form
6097 1671255 1668750 1666162 1662854 1655070 1674269 1636144 1594586 1587641 1572542 1569614 1605467 1589512 1585347
6084 1585347 1567987 1517024 1544726 1497623 1520013 1569758 1596964 1599737 1563515 1526178 1480646 1504612
6072 1504612 1536477 1525279 1469621 1532580 1566960 1542555 1583827 1639558 1706385 1751396 1806051
6061 1806051 1799562 1794929 1835084 1897631 1923265 1974338 2021778 1971820 1891190 1833540 1864193 1800783
6049 1800783 1744522 1801440 1793523 1841749 1904971 1900167 1839012 1798348 1842217 1878247 1860317 1887971
6037 1887971 1887537 1900472 1942553 1938892 1956235 1915991 1858391 1825064 1836460 1852860 1904515 1828775
6025 1828775 1788983 1782693 1775757 1733436 1696805 1731355 1828855 1830072 1767912 1778242 1856812 1771600
6013 1771600 1760696 1716054 1706519 1725192 1611253 1603935 1664085 1609331 1574036 1656228 1685607 1666164
6001A666164n467k8870K3555M9500O6847N756m405O8025M1237N33j6407m013K1111
5988A883566Q5229J33896K8800j1895Q16k5449K4035N9201m4891m3053k6360n403
5976B058492L0510R2689O9227J7555J7602L0748K4770N0459R2748L6505o633M9278
5964B563950R4783l2960j0991l3641P4388j2754M976m8331k5795O2110j1015Q391
5952B633111Q4610M6594L5497o645l3431k2182l415k934P295k7126Q8974J22123
5940B922471l1816k4410L7388L2529J8966l7561j6457Q7515K2069o0476M9674
5929B999892P671l9040k0767r6648l6302K5719L6226n5391m477Q223j7764J4568
5917B821910K2565O8880L924k886n9736K2760l3534J9949l2729p5774j0601L9536
$$ plain form
6001 1666164 1660697 1631827 1655382 1704882 1771729 1777485 1773080 1841105 1882342 1882875 1866468 1862455 1883566
5988 1883566 1968795 2102691 2131491 2119596 2120412 2094963 2118998 2178199 2133308 2090255 2063895 2058492
5976 2058492 2089002 2181691 2250918 2268473 2286075 2316823 2341593 2392052 2484800 2521305 2514672 2563950
5964 2563950 2658733 2625773 2614782 2581141 2655529 2642775 2647751 2599420 2573625 2635735 2624720 2633111
5952 2633111 2717721 2764315 2799812 2793167 2759736 2737554 2734139 2731205 2738500 2711374 2800348 2922471
5940 2922471 2890655 2866245 2903633 2936162 2955128 2917567 2901110 2988625 3010694 2950218 2999892
5929 2999892 3007563 2968523 2947756 2851108 2814806 2840525 2876751 2821360 2816883 2825106 2807342 2821910
5917 2821910 2844475 2913355 2917279 2914393 2854657 2877417 2843883 2863832 2831103 2755329 2744728 2784264
5905B784264N4967n0173m1194M0452N2690q186K9704l1264l1201J04196n616l6383
5893B862256L1119m7140l0031j8663n2000l4969j0284m1192m1575k3498N6366
5882B650389k4488P324K2998K7863k2911O1330j99l0114N9965J5458k8426J14349
5870B853538N3962l719M5103J01517Q6480N947K7708J07590O0893L8096N0321
5859C427436q015Q5259L5223J6461N8449M1012K9650l9432j1891N4758R049Q6634
5847C784593l262P9839M2158R8259L1247J1294M0038M0892N9476K3047R4488K7881
5835D329950J30636j8508L7857J61894J00239M9038K779L8919Q598J01225M0140
5824D982767P4758O3713J23169Q6467J3195O8502J7366P8588j6190j7806K4045
$$ plain form
5905 2784264 2839231 2789058 2747864 2788316 2841006 2832820 2862524 2831260 2800059 2904255 2898639 2862256
5893 2862256 2893375 2846235 2816204 2797541 2745541 2710572 2700288 2659096 2617521 2594023 2650389
5882 2650389 2625901 2633225 2656223 2684086 2661175 2722505 2722306 2692192 2752157 2767615 2739189 2853538
5870 2853538 2907500 2903781 2948884 3050401 3136881 3142828 3170536 3278126 3339019 3377115 3427436
5859 3427436 3419421 3504680 3539903 3556364 3614813 3655825 3685475 3646043 3634152 3688910 3697959 3784593
5847 3784593 3781331 3861170 3903328 4001587 4032834 4044128 4084166 4125058 4184534 4207581 4302069 4329950
5835 4329950 4460586 4442078 4479935 4641829 4742068 4791106 4793885 4832804 4841402 4942627 4982767
5824 4982767 5057525 5121238 5244407 5330874 5344069 5412571 5429937 5508525 5492335 5474529 5498574
5813E498574O2798M2462R2460P5510Q9171J00550M9244J5343j4568J20618J33223
5802F265385P4436N2664R1728J22749J64997J72515J76809J72427J22221K17535
5792G633466J78125K33548K29265K44566K33877K95442L05316K75701L40922L48003
5782A0318231L84606L73562M87057M84710N45666O34081M91098N60076O47797
5773A4926884O08552P87174R05684R18028R98080R50076R04737R18521Q49186
5764B2766922Q10224R49123J180532J244410J428256J658690J757108J895748
5756C3691013J981056K120088K185395K415507K815232L104575L624079M113240
5748E6050185M725606N294061N705058N491878M554830L738962L600749M189867
$$ plain form
5813 5498574 5561372 5603834 5696294 5771804 5860975 5961525 6010769 6026112 6011544 6132162 6265385
5802 6265385 6339821 6392485 6484213 6606962 6771959 6944474 7121283 7293710 7415931 7633466
5792 7633466 7811591 8045139 8274404 8518970 8752847 9048289 9353605 9629306 9970228 10318231
5782 10318231 10702837 11076399 11563456 12048166 12593832 13227913 13719011 14279087 14926884
5773 14926884 15535436 16322610 17228294 18146322 19144402 20094478 20999215 21917736 22766922
5764 22766922 23577146 24526269 25706801 26951211 28379467 30038157 31795265 33691013
5756 33691013 35672069 37792157 39977552 42393059 45208291 48312866 51936945 56050185
5748 56050185 60775791 66069852 71774910 77266788 81821618 85560580 89161329 93351196
5740I3351196N308559O769867Q214022R419151Q933534N423482J354445j245589
5732A37528667k757294l158379k922229j993019j34621K142418M116577N184761
5724A38006881M064307J521744m6910j66079N45357J823882L204369M293614M138367
5715A57385532K165174p42007k777635l409898l074944k186970j130373l28248
5707A45900631j145565k235649k688239l475904l850975l680516k944040j505056
5699A24374687K24181J932551L266587L334567P97495k860652m939214n808069
5691A20322133o183703o241475n917227n143134m105120l017116k348204j716240
5683H5649914j127840o83592l57659k21538l7027J36048M41211P80222J052274
$$ plain form
5740 93351196 98659755 105429622 113643644 123062795 131996329 137419811 138774256 137528667
5732 137528667 134771373 131612994 128690765 126697746 126563125 128705543 132822120 138006881
5724 138006881 142071188 143592932 143546022 143379943 143925300 145749182 148953551 153247165 157385532
5715 157385532 159550706 158808699 156031064 152621166 149546222 147359252 146228879 145900631
5707 145900631 144755066 142519417 139831178 136355274 132504299 128823783 125879743 124374687
5699 124374687 124598868 126531419 129798006 133132573 133930068 131069416 126130202 120322133
5691 120322133 114138430 107896955 101979728 96836594 92731474 89714358 87366154 85649914
5683 85649914 84522074 83838482 83480823 83259285 83222258 83358306 83799517 84579739 85632013
5674H5632013J464269J837650K397099L183081M252826N339901O180697P036380
5666A17323916P154237N726610L444939R31701r68868j506661j214504n29966
5658A30361404O46507J837765L475413M853087N106656M061214K523882J370895
5650A54236823J501436K726682M554638O410805P700230P542156N404963K571614
5642A92649347j45471k242147l192291k952718k683572k666500j813445J48790
5634A77101993K427176L309640J668675p02779k481530l153908k539963j793201
5626A73836103j619563j558386o16297O97346J854056J746003q53305n031595
5618A68454362q065644r061182q700024p605955o136376m333137k262947P0467
$$ plain form
5674 85632013 87096282 88933932 91331031 94514112 98766938 104106839 110287536 117323916
5666 117323916 124478153 130204763 133649702 134581403 133612535 132105874 130891370 130361404
5658 130361404 131007911 132845676 136321089 141174176 146280832 150342046 152865928 154236823
5650 154236823 155738259 158464941 163019579 169430384 177130614 184672770 190077733 192649347
5642 192649347 192503876 190261729 187069438 184116720 181433148 178766648 176953203 177101993
5634 177101993 179529169 182838809 184507484 183804705 181323175 178169267 175629304 173836103
5626 173836103 172216540 170658154 170041857 170739203 172593259 174339262 173485957 168454362
5618 168454362 160388718 151327536 142627512 135021557 128885181 124552044 122289097 122359564
5610A22359564J928973K365807K35594l324219o300395p464455p615807p274151
5602I4910911o819562n954904m719929l603016k764916k317328k210975j824017
5594F4696264j503808j345229j426137j629355j659580j575598j298312j009094
5586E3249151o81446m51410k30022k57879m96619n06082o14486o81593o61993
5577D8667621n99823l54105k08345K5231J64261J43569R0074j69964o60922j106722
5567D5990875j273775j207735j043327r02132q45577p33491p16112r69563j087747
5558C7211416j115710j065345j021764r88809r59118r88544q60348p31476o22094
5549B8858208n33946l52236j37035j4460K4268j55691k94858m61067p63235j017689
$$ plain form
5610 122359564 124288537 126654344 126889938 123565719 117265324 109800869 102185062 94910911
5602 94910911 88091349 82136445 77416516 73813500 71048584 68731256 66520281 64696264
5594 64696264 63192456 61847227 60421090 58791735 57132155 55556557 54258245 53249151
5586 53249151 52567705 52116295 51886273 51628394 51131775 50625693 50011207 49329614 48667621
5577 48667621 48067798 47713693 47505348 47530579 47694840 47838409 47928483 47758519 47097597 45990875
5567 45990875 44717100 43509365 42466038 41563906 40718329 39984838 39268726 38299163 37211416
5558 37211416 36095706 35030361 34008597 33019788 32060670 31072126 30211778 29480302 28858208
5549 28858208 28324262 27972026 27834991 27820531 27844799 27689108 27394250 26933183 26169948 25152259
5539B5152259j090509j129902j171885r86834q98667p48878o78464n84361n89654
5530A7273105o19051n44839m55716k74823k39869k96202k24371k12538k33308
5521A4172388k54316j47964j57591j90177j60399k24604k85271k56252k12313
5512A2283501k75456k76311k76289k81713j54317k19380j91310k3484j11563j56007
5502A0317671j74945j68375q1281o9631j8764o0901r0351j20432R710j9772n9489
5491I463440Q5211O583n1450J7021j9069L1928k2791n0082k7501n8169l120p0673
5479I301328l2089o2043l7256j4151j2236J5604L8423j2576L0608Q9428N2031
5468I357071L0343k774O3670J24650R9654J44893K25250J31455J54268J88427
$$ plain form
5539 25152259 24061750 22931848 21759963 20773129 19874462 19125584 18447120 17862759 17273105
5530 17273105 16654054 16109215 15653499 15378676 15138807 14842605 14618234 14405696 14172388
5521 14172388 13918072 13770108 13612517 13422340 13261941 13037337 12752066 12495814 12283501
5512 12283501 12008045 11731734 11455445 11173732 11019415 10800035 10608725 10585241 10473678 10317671
5502 10317671 10142726 9974351 9893070 9823439 9804675 9743774 9653423 9532991 9542701 9522929 9463440
5491 9463440 9548651 9555234 9503784 9520805 9501736 9533664 9510873 9460791 9433290 9375121 9372001 9301328
5479 9301328 9269239 9207196 9169940 9155789 9143553 9159157 9197580 9185004 9215612 9305040 9357071
5468 9357071 9387414 9384640 9448310 9572960 9672614 9817507 10042757 10174212 10328480 10516907
5458A0516907K01430K73674K15348K64137J89480L21950L38224L16559L32135
5449A2969844L07007M82272M80783M49759N45090O53519P44429Q71380Q11144
5440A8315227R04246R50742R47400R93469J040746J078260J049694J089576J132134
5431B7501494J149889J178510J236161J380965J531044J621789J763038J966905
5423C9329795K146475K364192K565717K823846L118406L403391L703490L958493
5415F3413805M309425M697725N218520N649621O232766O912204P509423Q032067
5407A11975556Q303829Q195365P791500O857331N751670M536940L137915J392169
5399A57942275m39744k029168l120675l480290l323640k874187j913755p77724
$$ plain form
5458 10516907 10718337 10992011 11207359 11471496 11660976 11982926 12321150 12637709 12969844
5449 12969844 13276851 13759123 14239906 14689665 15234755 15888274 16632703 17504083 18315227
5440 18315227 19219473 20170215 21117615 22111084 23151830 24230090 25279784 26369360 27501494
5431 27501494 28651383 29829893 31066054 32447019 33978063 35599852 37362890 39329795
5423 39329795 41476270 43840462 46406179 49230025 52348431 55751822 59455312 63413805
5415 63413805 67723230 72420955 77639475 83289096 89521862 96434066 103943489 111975556
5407 111975556 120279385 128474750 136266250 143123581 148875251 153412191 156550106 157942275
5399 157942275 157502531 155473363 152352688 148872398 145548758 142674571 140760816 139983092
5391A39983092N73141J987725L268257M441006N466451O105750O396932O376449
5383A74598803N960841N159752L639315J916795j5800j913483l560235n348181
5375A80437807p090253q220698q835550q719008q221650p341075o192051m987679
5367A20829843l686411k465710j400155l77583M44458R93034J039963Q39018K64834
5358A16481291n64549j656483k873153m132626n452546o341536o895219p013976
5350H1551203o723442o266484n742088n030629m425141l894120l477658k950144
5342D3041497k574983k320224j949295j787387j603438j419625j348132j177225
5334B8861188j049870r74477q79811q80088q02006p04347o68356o31568n29511
$$ plain form
5391 139983092 140556233 142543958 145812215 150253221 155719672 161825422 168222354 174598803
5383 174598803 180559644 185719396 189358711 191275506 191259706 189346223 185785988 180437807
5375 180437807 173347554 165126856 156291306 147572298 139350648 132009573 125817522 120829843
5367 120829843 117143432 114677722 113277567 112899984 113344442 114337476 115377439 116216457 116481291
5358 116481291 115916742 114260259 111387106 107254480 101801934 95460398 88565179 81551203
5350 81551203 74827761 68561277 62819189 57788560 53363419 49469299 45991641 43041497
5342 43041497 40466514 38146290 36196995 34409608 32806170 31386545 30038413 28861188
5334 28861188 27811318 26836841 25957030 25076942 24274936 23570589 22902233 22270665 21741154
5325B1741154m23758l84681l75726l02610k65884j59951j71133j44289k0456R0006
5315A9582672Q7151J58148K55921L93148M56417M38683L80336K95226L35060L9926
5305B2422688N368J36509K69372M07343M76237M44230M38032M47360M76973N48806
5295B6072918O62803O85998P53544Q21841P51061J017522J171764J305639J692987
5286C4936077K101350K611913K715451K963901L497392M499458N771306P284600
5278F6381448R319341J1430036J4199569J9313193J5035335j588925j1688892
5271A22401105j3281994j3214547j3158748j1578744r244173p484259o075270
5264D8363370n019241m157285l582038l093173k732166k433464k089629j776708
$$ plain form
5325 21741154 21317396 20932715 20556989 20254379 19988495 19828544 19657411 19513122 19492666 19582672
5315 19582672 19669823 19827971 20083892 20477040 20933457 21372140 21752476 22047702 22382762 22422688
5305 22422688 22428056 22564565 22833937 23241280 23717517 24161747 24599779 25047139 25524112 26072918
5295 26072918 26735721 27421719 28175263 28997104 29748165 30765687 31937451 33243090 34936077
5286 34936077 37037427 39649340 42364791 45328692 48826084 53325542 59096848 66381448
5278 66381448 75700789 87130825 101330394 120643587 135678922 134089997 122401105
5271 122401105 109119111 95904564 82745816 71167072 61922899 54438640 48363370
5264 48363370 43344129 39186844 35604806 32511633 29779467 27346003 25256374 23479666
5256B3479666j426122j278931j180518q87096o26275o07214m56547l95685k85943
5247A6335335j93710k68760j03995j34841L0288K14386K45056M32433P27635Q32787
5237A8116614Q03829N11072J74067k80902n62715o78300q49921q98200r72502
5228A5363042r37254p03456o89031n71489n29420m24910l92805k11364k11487
5219A0691826j83929j88788j19868j32131l3359p826j1106j311J5381J26138J57707
5208A0312734K38294J41836K70013M10094K91548K29939K5706L0984l9271j56775
5198A1755102k43733k08235j83772k02181j86559k12176j70155r7221m819o5417
5188A0180834n2825K9227k9730q3659l7543r276P974o68j5161L7113J26528J38734
$$ plain form
5256 23479666 22053544 20774613 19594095 18706999 18080724 17473510 17016963 16621278 16335335
5247 16335335 16141625 15872865 15768870 15634029 15664317 15878703 16123759 16556192 17283827 18116614
5237 18116614 18920443 19431515 19605582 19324680 18761965 18083665 17233744 16335544 15363042
5228 15363042 14425788 13722332 13033301 12461812 11932392 11507482 11114677 10903313 10691826
5219 10691826 10507897 10319109 10199241 10067110 10033751 10025925 10014819 10013508 10028889 10155027 10312734
5208 10312734 10551028 10692864 10962877 11372971 11664519 11894458 11920164 11951148 11911877 11755102
5198 11755102 11511369 11303134 11119362 10917181 10730622 10518446 10348291 10251070 10246251 10180834
5188 10180834 10128009 10157236 10127506 10043847 10006304 9997028 10005002 10004334 9989173 10026286 10152814 10291548
5176A0291548J68521Q7757K33103L50779K62997L44928L63291L84560L22718L33365
5166A3143567K93076L41076K90640L03761K81619J72906K39609J73159J13461
5157A5352874J36815J37645L2419M4445N9239J67490J08034J01251J12554J92125
5147A6444891J76785L18479L86015M28739M36080M96682N88600O34385O35964
5138B0546620O36869P37294Q31897R01896J025096R32634J032330R73807J008318
5129B8626761R50335P84681O88636O95364N61192N51240M69603N66362O55075
5120C4549249O23588O33728P49487R37149J044794J306499J474354J653708J961896
5111D4934452K090699K461441L101396L709868L894280L628971L248185L011417
$$ plain form
5176 10291548 10460069 10547826 10780929 11131708 11394705 11739633 12102924 12487484 12810202 13143567
5166 13143567 13436643 13777719 14068359 14372120 14653739 14826645 15066254 15239413 15352874
5157 15352874 15489689 15627334 15659753 15704198 15763437 15930927 16038961 16140212 16252766 16444891
5147 16444891 16621676 16940155 17326170 17754909 18190989 18687671 19276271 19910656 20546620
5138 20546620 21183489 21920783 22752680 23654576 24679672 25612306 26644636 27618443 28626761
5129 28626761 29577096 30361777 31050413 31745777 32306969 32858209 33327812 33894174 34549249
5120 34549249 35172837 35806565 36556052 37493201 38537995 39844494 41318848 42972556 44934452
5111 44934452 47025151 49486592 52587988 56297856 60192136 63821107 67069292 70080709
5103G0080709K631275J972942J972845K656926L368699M098983M638433M894127
5095I6314939M923882N099190N446304N794748N953060P088441Q483561R665220
5087A48769345J0922891J0473688Q956136R688308J1632441J3283217J5050999
5080B28777025J5097188J4365319J7956857K4367342L4222517M4787423N3519681
5073D33093352O0953815L6633999j1665134m0111741m9275708n1669814n0579772
5066C27378997n0406538m4231925l4760317k7209187k1383276j7014175j3797018
5059A18576561j1637572j0007175q607807p396850o490503n584769m889745m297547
5051E9664593l837197l262964k897482k523134k339477k228324k076218k003140
$$ plain form
5103 70080709 72711984 74684926 76657771 79314697 82683396 86782379 91420812 96314939
5095 96314939 101238821 106338011 111784315 117579063 123532123 130620564 139104125 148769345
5087 148769345 159692236 170165924 179122060 188810368 200442809 213726026 228777025
5080 228777025 243874213 258239532 276196389 300563731 334786248 379573671 433093352
5073 433093352 494047167 530681166 519016032 478904291 429628583 377958769 327378997
5066 327378997 276972459 232740534 197980217 170771030 149387754 132373579 118576561
5059 118576561 106938989 96931814 88324007 80927157 74436654 68851885 63962140 59664593
5051 59664593 55827396 52564432 49666950 47143816 44804339 42576015 40499797 38496657
5043C8496657j956956j832513j763370j642946j507110j370786j205966j092769
5035B6124241r80236q46912q98336q02544p48942p06516n56283n94194n55731
5026A9434547n49606o02124n33220m78063m65327m72901m22455m14096m70290
5017A5026465l56191l67600l45066k34425l64366l04164k74468k97424k45514
5008A2237247k88387l03043l84527m92110l93694l55436m14556l89943k98989
4999H916562k60247k61832j50167j31759j47597j48613j74390j60191j59265r1077
4989G231424j54265o0902p7175j15046j15756j09738j40157j15508k26681j50166
4979E966030j50047j2732r1361r1998p3584o410Q3724K7084j0816N230N6390O2710
$$ plain form
5043 38496657 36539701 34707188 32943818 31300872 29793762 28422976 27217010 26124241
5035 26124241 25144005 24297093 23398757 22596213 21847271 21140755 20584472 19990278 19434547
5026 19434547 18884941 18282817 17749597 17271534 16806207 16333306 15910851 15496755 15026465
5017 15026465 14670274 14302674 13957608 13723183 13358817 13054653 12780185 12482761 12237247
5008 12237247 11948860 11645817 11261290 10769180 10375486 10020050 9605494 9215551 8916562
4999 8916562 8656315 8394483 8244316 8112557 7964960 7816347 7641957 7481766 7322501 7231424
4989 7231424 7077159 7016257 6939082 6824036 6708280 6598542 6458385 6342877 6116196 5966030
4979 5966030 5815983 5803251 5711890 5619892 5546308 5539898 5623622 5650706 5639890 5645120 5701510 5764220
4967E764220J4249M6323K1294M9811L3352k9405l719Q4561N770q6673l6971r4840
4955E767972j06420j34116j82101k40192l13218k32486l00167j92883j84220k44475
4945C637694j84027j05449m958L0929P5567O4306L7601K3996Q6454R4739L2425
4934C789277N1596J6690L408l1986q9458j88p5483m7616m2102j2491j6559K3579
4922C568667m8032o9055L593n6786l7470j7059n5105p130l4287k4025l1168K0832
4910C212975l3862k8643N7368J5717k6768K4576P8624J51568M0291J12172J76516
4899C780534L8686j3334j8371K4627M3893K3734R946l991J22941O9913M0817O0766
4887D180161J30184J48261J27263J73715J39249R2799J30651J7762J9723J11608
$$ plain form
4967 5764220 5778469 5824792 5846086 5895897 5929249 5899844 5896125 5980686 5986456 5899783 5862812 5767972
4955 5767972 5661552 5527436 5345335 5105143 4791925 4559439 4259272 4066389 3882169 3637694
4945 3637694 3453667 3348218 3343260 3374189 3449756 3514062 3551663 3575659 3662113 3756852 3789277
4934 3789277 3840873 3857563 3860971 3828985 3739527 3739339 3663856 3616240 3574138 3561647 3545088 3568667
4922 3568667 3520635 3451580 3455173 3398387 3360917 3343858 3288753 3281623 3247336 3223311 3192143 3212975
4910 3212975 3179113 3150470 3207838 3223555 3196787 3221363 3299987 3451555 3491846 3604018 3780534
4899 3780534 3819220 3805886 3787515 3812142 3856035 3879769 3889715 3885724 4008665 4078578 4119395 4180161
4887 4180161 4310345 4458606 4585869 4759584 4898833 4991632 5122283 5140045 5159768 5271376
4877E271376J46070J86041J58992J94128K23504K68529K77584K81476K85673K48136
4867G541509K76374K50592L80783M49793N38177O97779P66546O99069P06486Q31169
4857A3138277J051412J211919J652999K211914K530812K972016K299114M54305
4849B7522768p89216j282583j756331k176291k445225k442371k213714j806751
4841A2610286j429624j284582j047861q37476n67898n31149n01061l22319k20320
4832E867996k35548k72320k01203j76396j59037j32205n7100j06050n6427J8003
4822D489713j8474p8014P136m7749j6523O7025J46223P6428K9618J34607K33669
4811E023659J76951K18483J68522K41961L52601M89799M96156O40435P93563Q83065
$$ plain form
4877 5271376 5417446 5603487 5762479 5956607 6180111 6448640 6726224 7007700 7293373 7541509
4867 7541509 7817883 8068475 8449258 8899051 9437228 10135007 10901553 11600622 12307108 13138277
4857 13138277 14189689 15401608 17054607 19266521 21797333 24769349 27068463 27522768
4849 27522768 26733552 25450969 23694638 21518347 19073122 16630751 14417037 12610286
4841 12610286 11180662 9896080 8848219 8010743 7442845 6911696 6410635 6088316 5867996
4832 5867996 5632448 5360128 5158925 4982529 4823492 4691287 4634187 4528137 4471710 4489713
4822 4489713 4471239 4393225 4400361 4352612 4336089 4403114 4549337 4625765 4655383 4789990 5023659
4811 5023659 5200610 5419093 5587615 5829576 6182177 6671976 7168132 7808567 8602130 9485195
4801I485195N56776J72659l01294n50035p13689q25287p05474o21490o06330p67458
4791E123573m55495l22359l92148j53835j67076k28581j84468r4925j60257j85252
4781B779177l0297r2782m1869K705o2126n6572K5346M3856K8424k5258L6442J3651
4769B620697Q4066L8468j6914k88Q443k7452N9756k3324M8228N9476J95363K38870
4757C285389J53430L15346K62685k6762k18026k32592k43949k82436k51518l06288
4747B455279k21795j82526j01220j25467m1538n7888n0617p1755j59041k4816
4737A418616q1388J0403j2479l8291m4215l5149L0105k6944q0222J6313k446J4678
4725A168981M3940o3268l0858N243p2669q134j941m1788J800L747J0508L5897
$$ plain form
4801 9485195 10041971 10214630 9913336 9363301 8649612 7824325 7118851 6497361 5891031 5123573
4791 5123573 4668078 4345719 3953571 3799736 3632660 3404079 3219611 3124686 2964429 2779177
4781 2779177 2748880 2656098 2614229 2616934 2554808 2498236 2523582 2567438 2595862 2570604 2607046 2620697
4769 2620697 2704763 2743231 2726317 2726029 2734472 2707020 2766776 2743452 2791680 2851156 3046519 3285389
4757 3285389 3438819 3754165 4016850 3990088 3772062 3539470 3295521 3013085 2761567 2455279
4747 2455279 2233484 2050958 1949738 1824271 1782733 1724845 1674228 1602473 1443432 1418616
4737 1418616 1337228 1347631 1335152 1296861 1252646 1217497 1247602 1220658 1140436 1156749 1154303 1168981
4725 1168981 1212921 1149653 1118795 1124038 1051369 1043235 1041294 999506 1001306 1005053 1015561 1051458
4713A051458j1362k5064r453P6309P2375n3017j21255J8562M497K5721j5691j6211
4701I96869M8099K6284m5960l9672q38r74k989M654j57l0407j811j4646j9270
4688I19182m5429j2134J090L2912N5937J9917J5590N8810j7078k5582L1629K6430
4676A061274l3013q9065o806R060J7133l5503l6260o7258K6143j2895j7926m966
4664H09918J7244k9792o117L8963J1050j5356j8438K2760o441q1141L6909J36425
4652I15984m8716K9722M370p175p1349O8893L0515K6413O9379l0614p8714m9415
4640H59293K4841k5345p131K0831j1472L6890L729J7465k5658k8508P2287O6737
4628A003959m8215l9258O548L3206k3971l4468m1231L0575N3606K2581Q082j864
$$ plain form
4713 1051458 1040096 1015032 1005579 1081888 1154263 1101246 979991 998553 1003050 1028771 1013080 996869
4701 996869 1044968 1071252 1025292 985620 984782 983808 980819 985473 985316 954909 953098 938452 919182
4688 919182 873753 861619 862709 895621 951558 971475 987065 1045875 1028797 1003215 1034844 1061274
4676 1061274 1028261 939196 932390 941450 958583 923080 886820 819562 845705 832810 814884 809918
4664 809918 827162 797370 791253 830216 841266 825910 807472 830232 823791 742650 779559 915984
4652 915984 867268 896990 901360 894185 822836 891729 922244 948657 1018036 987422 908708 859293
4640 859293 884134 858789 851658 872489 861017 897907 901636 919101 893443 864935 937222 1003959
4628 1003959 955744 916486 923034 956240 932269 897801 856570 887145 940751 963332 971414 969550
4616I69550K4673m3251L2318j5652K1640l3787L8647m1207J1950L7026J1271J7178
4604A030356J7198k2989n0981Q3707J9294K7401Q263R406o271k7432n0253N9521
4592A097220L8305N1064N4410l42L2952N557j0193K4960K9859P868R5558R448
4580A436666o807L2723L2863P2671J0415L1768P4819N6646Q37p793P7544J19492
4568A931844P8471M1739N4208J2498M760M5187M4475j5044Q2442R6838L2855N100
4556B415373M926j9660l5169Q3049M4706N3463j4197K7273J14754L8114n198M7473
4544B754907K8382M0698N0942j1717l1540j4606J9974P9971O6065P150p0901n615
4532B913710j6430p2463N9506N014j9088k8264k9323l50l0957j1130l7186j08406
$$ plain form
4616 969550 994223 950972 983290 967638 989278 955491 994138 952931 964881 1001907 1013178 1030356
4604 1030356 1047554 1024565 973584 1057291 1076585 1103986 1112249 1121655 1115384 1087952 1037699 1097220
4592 1097220 1135525 1186589 1240999 1240657 1273609 1279166 1268973 1293933 1323792 1331660 1427218 1436666
4580 1436666 1429859 1462582 1495445 1568116 1578531 1610299 1685118 1741764 1742601 1734808 1812352 1931844
4568 1931844 2010315 2052054 2106262 2118760 2123520 2168707 2213182 2198138 2280580 2377418 2410273 2415373
4556 2415373 2420299 2400639 2365470 2448519 2493225 2546688 2532491 2559764 2674518 2712632 2707434 2754907
4544 2754907 2783289 2823987 2874929 2863212 2831672 2817066 2837040 2917011 2983076 2990226 2919325 2913710
4532 2913710 2897280 2824817 2884323 2889337 2870249 2841985 2812662 2812312 2781355 2770225 2733039 2624633
4520B624633n7269J5970J8041P648l1133J7265q887l6862j07475n5168l9049m9976
4508B297738j9132j03690k1810O4174L5442n1018m5173q9560m6750O2094n3995
4497B028320l1979k4956l2151o2057J4225N109r9033J8130l0479l3526o820o7173
4485A677610k0986J4903q1811L3045n9121O9275M5499q2436n9035J9923M7051
4474A603917l5328p286n4120j8026L031o6542R9092K222n3175L3645M1992n963
4462A543459l2526L3900K4533M7199M3146n7650m1071l101J8439J2410j2385L9838
4450A616191O2458P357N758N5771q61M9796K6093k0066P856Q4680N3839R901R9647
4437B058420j3909r3147N7209R1743R6204O7671O479L6012Q0684J5222M8143j8531
$$ plain form
4520 2624633 2567364 2583334 2601375 2609023 2577890 2595155 2586268 2549406 2441931 2386763 2347714 2297738
4508 2297738 2278606 2174916 2153106 2217280 2252722 2201704 2156531 2066971 2020221 2082315 2028320
4497 2028320 1996341 1971385 1939234 1877177 1891402 1896511 1797478 1815608 1785129 1751603 1744783 1677610
4485 1677610 1656624 1671527 1589716 1622761 1563640 1632915 1678414 1595978 1536943 1556866 1603917
4474 1603917 1568589 1561303 1507183 1489157 1492188 1425646 1524738 1526960 1473785 1507430 1549422 1543459
4462 1543459 1510933 1544833 1569366 1616565 1659711 1602061 1560990 1557889 1576328 1588738 1576353 1616191
4450 1616191 1678649 1686006 1691764 1747535 1746674 1796470 1822563 1802497 1810353 1895033 1948872 1958773 2058420
4437 2058420 2044511 1951364 2008573 2100316 2196520 2264191 2270670 2306682 2387366 2402588 2450731 2432200
4425B432200J5075J24395R6965P8468L1168K9046J5834K0547J17246N2434j8204
4414B995174P5521O8472L1506q43P6234K5095Q8984O8061p1360N1821O5904J018
4402C475587K6024M1371l5216L596O3825L9036L845K1232L2278n1865P057M5420
4390C672190o3365J3793k8905k9948o9157r389P699n8826j4251P903j2806j4226
4378C400712o2048K2251m8148o3227q8751p8476j3456m8756p2342l5480o9588
4367B842691n3735m6880p1692l8374j658o9337j06465l4549l6147j2945o7715
4356B303194l5286j24939n2494j4789o9766p6692l5427j0176o8493j08430o5935
4345A640767M9549l9748q0876k6147p636l5029p4898k5635l9671m3626l4082k0527
$$ plain form
4425 2432200 2447275 2571670 2668635 2747103 2778271 2807317 2823151 2843698 2960944 3013378 2995174
4414 2995174 3070695 3139167 3170673 3169830 3246064 3271159 3360143 3428204 3356844 3408665 3474569 3475587
4402 3475587 3501611 3542982 3507766 3511362 3575187 3614223 3618068 3639300 3671578 3619713 3626770 3672190
4390 3672190 3608825 3622618 3593713 3563765 3494608 3485219 3492918 3434092 3419841 3427744 3414938 3400712
4378 3400712 3338664 3360915 3312767 3249540 3160789 3082313 3068857 3020101 2947759 2912279 2842691
4367 2842691 2788956 2742076 2670384 2632010 2630352 2561015 2454550 2420001 2383854 2370909 2303194
4356 2303194 2267908 2142969 2090475 2075686 2005920 1929228 1893801 1883625 1815132 1706702 1640767
4345 1640767 1690316 1650568 1569692 1543545 1535909 1500880 1425982 1400347 1360676 1317050 1282968 1262441
4333A262441k9496K4380o2703p8668K1364p3139j5497n0467J8985j1692m1264
4322I64244J8409J2186k9758p3452k5709J4847l9189J7667l1363n0813N4564m1845
4310G89788j0666J1590m307m1830j8139J2918N120m2884N1011K8671m7189l7224
4298F96859q311j8748R248k8395r255K908q68J5191L7153p1732k9476K5420j6770
4285F03224K1511N558N6592N746l8181J9066K6679o6037m5957M5236m1540M6208
4273F38105K7680m4751N9306j4422j9723K6463m319M8132O2602N6523o604k9455
4261G99537m5059n916N90O1174l9097J804J3515l3965m0303n5538K3743j9691
4249F60794l4312m715O4258j7230m1964k7180l1892M1071p01j7887p286M2081
$$ plain form
4333 1262441 1232945 1257325 1194622 1115954 1137318 1064179 1048682 998215 1017200 1005508 964244
4322 964244 982653 994839 965081 891629 865920 880767 841578 859245 827882 777069 831633 789788
4310 789788 779122 790712 786405 744575 726436 739354 744474 701590 752601 781272 734083 696859
4298 696859 688548 669800 679048 650653 641398 644306 643438 658629 695782 624050 594574 619994 603224
4285 603224 624735 630293 686885 692631 654450 673516 700195 634158 588201 633437 591897 638105
4273 638105 665785 621034 680340 665918 646195 672658 668339 716471 779073 835596 828992 799537
4261 799537 754478 748562 749152 810326 771229 773033 786548 752583 712280 656742 680485 660794
4249 660794 626482 621767 686025 668795 626831 599651 567759 608830 608129 590242 582956 625037
4237F25037q150k2149l9846K4942K5082N4010K4185q6057n6133Q566Q1211N425
4225F36123J9227r309k3835M2597M0017r4307N7608j9681R4318K9746q8364k3858
4213F60282k8490M8678Q2260L9789J9542k7155n2041R04J0898L8505J9217j1714
4201H00675N3738K0300L9923j3854Q187M7030J8042j7208k7527J06492K7178l3430
4189A029546M4970M2304p415Q1718O5337o5441M5218P2440J9934O7187k679N2643
4177A445762J13768K3211J4070J40897O6246Q9440R8497N9550J09283J15104O5136
4166B340964n4210j2635l1184n6938o9902q4561o94J8322j5529p4207j5225K7851
4154A972052j7353j8686L7829L1841j854N8075j300L4982N3477J00953n9711l8366
$$ plain form
4237 625037 616887 594738 554892 579834 604916 658926 683111 597054 540921 549487 630698 636123
4225 636123 655350 646041 622206 664803 704820 610513 668121 648440 742758 772504 684140 660282
4213 660282 631792 680470 762730 802519 822061 794906 742865 743769 754667 793172 812389 800675
4201 800675 854413 874713 914636 900782 908969 955999 974041 956833 929306 1035798 1062976 1029546
4189 1029546 1074516 1116820 1109405 1191123 1256460 1191019 1236237 1308677 1328611 1395798 1393119 1445762
4177 1445762 1559530 1582741 1596811 1737708 1803954 1893394 1991891 2051441 2160724 2275828 2340964
4166 2340964 2286754 2274119 2242935 2185997 2116095 2031534 2030840 2049162 2033633 1959426 1944201 1972052
4154 1972052 1954699 1936013 1973842 2005683 2003829 2061904 2060604 2095586 2149063 2250016 2190305 2151939
4142B151939N6983O6640J7078P1873N8573j6363N3685k5139j0221L9866Q6837
4131B551751N8783k8203j3166J8782j0806l6368K8620q031r184N0038L0377K1369
4119B653962p0366k2516K6324K2118o5467n0695m8783o0546R519k2550N35n5179
4107B316356j10865j4870l4103k6441o4434l3733O0876l5348o0473n8228m2305
4096A896432m0696r2433L8564l6790m2958l3844o7453j3989n8579j02967J139
4085A446426K7037q9866Q139j8620J2220J1671o3475n0071l2412K2274K541N7183
4073A333047m1432L9812L897R919J73M4379J33186K1692N5732Q3185O0349K2506
4061A766445l7505n2778o9822j97628j38009q8490l2481p3619j59690r4647K8023
$$ plain form
4142 2151939 2208922 2275562 2292640 2364513 2423086 2406723 2460408 2435269 2425048 2464914 2551751
4131 2551751 2610534 2582331 2569165 2587947 2577141 2540773 2569393 2561362 2552178 2602216 2632593 2653962
4119 2653962 2583596 2561080 2587404 2609522 2544055 2493360 2444577 2384031 2393550 2371000 2371535 2316356
4107 2316356 2205491 2190621 2156518 2130077 2065643 2031910 2092786 2057438 1996965 1938737 1896432
4096 1896432 1855736 1763303 1801867 1765077 1722119 1688275 1620822 1606833 1548254 1445287 1446426
4085 1446426 1473463 1383597 1391736 1373116 1385336 1397007 1333532 1283461 1251049 1273323 1275864 1333047
4073 1333047 1291615 1331427 1335324 1345243 1345416 1389795 1522981 1544673 1600405 1683590 1743939 1766445
4061 1766445 1728940 1676162 1606340 1408712 1270703 1182213 1149732 1076113 916423 821776 849799
4050H49799P0160o9255l8844l3923m7708k2419J531l4960Q4670j42445j8960j6005
4038E81641P5586L5463o6874j0769R277L5852m4035k123l8221R144n865J46l8993
4025E40229j9058o7673k5939M621K2768k5641K1216L9354M5312r4049J07425L1849
4013E80414o2317j4368j4162n5571M14K9202J6197o2979j8965o034M818l0653
4001C65996Q618M135J1852R094l1749N2291o765j9341L7930Q691L6068m4827p7869
3988C54124J2167N7278O7093m9018j6763j1870L4848l7339K2557l0701q6330K1827
3976C37873K1202O5686J1883o7571j8627K2775N3293l3581l7172J1038K2951p5752
3964C13998o9618m5202Q0030N4825K9069l5681Q853K8948L5326p0365j9524K1021
$$ plain form
4050 849799 919959 850704 811860 777937 730229 707810 709341 674381 759051 616606 597646 581641
4038 581641 657227 692690 625816 615047 624324 660176 616141 614018 575797 584941 579076 579222 540229
4025 540229 521171 453498 427559 432180 454948 429307 450523 489877 535189 441140 548565 580414
4013 580414 518097 503729 489567 433996 434410 463612 479809 416830 397865 391831 396649 365996
4001 365996 374614 378749 390601 399695 367946 420237 413472 394131 432061 440752 476820 431993 354124
3988 354124 366291 423569 490662 441644 424881 413011 447859 410520 433077 402376 316046 337873
3976 337873 359075 424761 436644 369073 350446 373221 426514 392933 355761 366799 389750 313998
3964 313998 244380 199178 279208 334033 363102 327421 336274 365222 400548 330183 310659 331680
3952C31680N293L4230k4296O9702K2088j3105k6935J0669p8722k3067N5659q844
3940C54352O612L6067k2352j1338m5161Q191M389l7317L2148L4821j7396J9637
3928C62653K3423l5795j5874J6170M9511l0857q307K9121k741l3558k4053L5940
3916C65633o3191l8316J02014O4971J1464p6188l870M7897q1494K9529o054K4290
3904C76685L5791K0219j8550l485o390O0915o9264l683J8892K1116J2048m0916
3892D03378N5149K1785j7653m6456j0766m3281k8022J3924Q5344K3375M3433K5703
3880E25913k5324n9501k0011N893P033K5533J3292j787J173M1023K4033j9939
3868E17331L0453K7987p308r360O6653j1755o3274m9707J2309p1572l999J30159
$$ plain form
3952 331680 336973 371203 346907 416609 438697 425592 398657 409326 330604 307537 363196 354352
3940 354352 360964 397031 374679 363341 318180 326371 330760 293443 325591 360412 343016 362653
3928 362653 386076 350281 334407 350577 400088 369231 360924 390045 387304 353746 329693 365633
3916 365633 302442 264126 366140 431111 442575 366387 362517 410414 328920 358449 352395 376685
3904 376685 412476 432695 414145 410660 404270 465185 395921 392238 411130 432246 444294 403378
3892 403378 458527 480312 462659 416203 405437 362156 334134 348058 433402 456777 500210 525913
3880 525913 500589 441088 421077 426970 434003 459536 472828 471041 472214 513237 537270 517331
3868 517331 547784 575771 568463 559103 625756 614001 550727 501020 513329 441757 437758 567917
3856E67917M5498N2107q567o7894q354n5059P0606N2285q417K3448j8723m5418
3844E99429k3522l4362M8406P4594l2543M871N9747R8921N1436K9501l0184M375
3832H50669j9775Q582l7420j1126J616L3208K575j39402k1692L0099k2423m1901
3820F33010j1788L4647l4460L990n798P003l0999J30927O1341k7487K2403k9203
3808G53586K0671J9860Q0482N5066j7418k7961K5689o5916M142L8904n3754l5124
3796G98227L4360k7849j5645n4886M6139J11478o0015n1914J9717K0077L3215
3785H52904m344q996j9566J37817J1226q813J5411K6979N4993N5080k2970J1029
3773A100750L6452o799r073L2604N1914O485K7114N440n38j09531l5738R178l3538
$$ plain form
3856 567917 613415 665522 656955 589061 580707 525648 596254 648539 640122 663570 644847 599429
3844 599429 575907 541545 589951 664545 632002 636873 696620 795541 846977 876478 846294 850669
3832 850669 830894 839476 802056 790930 792546 825754 828329 688927 667235 697334 674911 633010
3820 633010 621222 655869 621409 625399 619601 626604 595605 726532 787873 760386 782789 753586
3808 753586 774257 794117 874599 929665 912247 884286 909975 844059 848201 887105 833351 798227
3796 798227 832587 804738 789093 734207 780346 891824 831809 779895 799612 819689 852904
3785 852904 848560 839564 819998 957815 969041 960228 975639 1002618 1057611 1112691 1089721 1100750
3773 1100750 1137202 1130403 1121330 1153934 1205848 1212333 1239447 1244887 1244349 1134818 1099080 1108258 1074720
3760A074720J3973N3381J7423m5295P0075M7661l7385q689j095N5211J01503L9543
3748A381026o945K6292k4047O876j7213K6534N9800J6654R9766O1285j0443K7494
3736A647079l8993N1840o4196O897Q098k7703n6357l5966p576J594K8415N1375
3724A564507m9366L0828p369j3885N7052J4101L8186O982M8964J23270J8742j1207
3712A820805K5889j619O2538L7927N176K3068j2029n1592k468m6471k1147J9044
3700A859121j1288J4788L3173j6969r8033J2989j627k1166m7395m5744k6882l7448
3688A613519Q942M516Q255Q4109P184k9259L8745k5578K1490K4798N5768Q6932
3676A899421K8095l5324n535r620j8041R397O8655N112k8826L6447j8645k0494
$$ plain form
3760 1074720 1088693 1142074 1159497 1114202 1184277 1231938 1194553 1185864 1184769 1239980 1341483 1381026
3748 1381026 1374081 1400373 1376326 1383202 1365989 1392523 1452323 1468977 1568743 1630028 1619585 1647079
3736 1647079 1608086 1659926 1595730 1602627 1610725 1583022 1526665 1490699 1483123 1484717 1513132 1564507
3724 1564507 1515141 1545969 1538600 1524715 1581767 1595868 1634054 1641036 1690000 1813270 1832012 1820805
3712 1820805 1846694 1845075 1907613 1945540 1950716 1973784 1961755 1910163 1907695 1861224 1840077 1859121
3700 1859121 1847833 1862621 1895794 1878825 1780792 1793781 1792154 1770988 1723593 1677849 1650967 1613519
3688 1613519 1622461 1626977 1635232 1719341 1726525 1697266 1736011 1710433 1731923 1756721 1812489 1899421
3676 1899421 1927516 1892192 1886657 1877037 1858996 1868393 1937048 1942160 1913334 1949781 1931136 1910642
3664A910642j6825q0077J0894l7169k7701p9342N750N4492l071n8937o1611O4371
3652A681416p6117m9184M2755P689J04244M3712M2857O8379n8451o1241K6123
3641A772182O1097L4747J2523K1316j5736O4017M1848M0365j3759M6948K8204
3630B093752M0954M7519O4176N1879l0634K8367N6816J38656L3253P341J19006
3619B651085J00710O6858J22227J34333J81127J31928R6693J67868K36309J95883
3609D085021Q9126J21704J37189J23085J53471J24901J03954P5783J93667K31250
3599E439151J98135K70918K05168K96693K96351L35194M08925L82651N11941N45311
3589H890438N95859P46136Q03382Q57523Q83456J053806J255846J479199J878356
$$ plain form
3664 1910642 1893817 1813740 1824634 1787465 1759764 1680422 1686172 1740664 1737593 1678656 1617045 1681416
3652 1681416 1605299 1556115 1598870 1606559 1710803 1754515 1797372 1865751 1807300 1746059 1772182
3641 1772182 1833279 1868026 1880549 1901865 1886129 1950146 1991994 2032359 2018600 2065548 2093752
3630 2093752 2134706 2182225 2246401 2298280 2267646 2296013 2352829 2491485 2524738 2532079 2651085
3619 2651085 2751795 2818653 2940880 3075213 3256340 3388268 3484961 3652829 3889138 4085021
3609 4085021 4174147 4295851 4433040 4556125 4709596 4834497 4938451 5014234 5207901 5439151
3599 5439151 5637286 5908204 6113372 6410065 6706416 7041610 7450535 7833186 8345127 8890438
3589 8890438 9486297 10232433 11035815 11893338 12776794 13830600 15086446 16565645 18444001
3580A8444001K202906K236164K272076J609575N46617m16061j212508j650674
3572B4032096j766162j684831j635594j445301j182377q54203o37228l73215k47565
3563A4205620j51935O1789J93941L43206L65014M82881O89583P93697R49205J049567
3553A8982568J242498J412630J607028J932803K374168K980602L651235M159247
3545C8342779M274584L151271J099897j174339k587530l421059l886902l719701
3537C2079000l585961l321976k774112k222492j742913j344588j122234q72445
3529A5092279o75840n44864l78878k30807r4966l0020J04643K01094K41707L49619
3519A4033967M65415N66091O81802R05508J169979J381783J579934J693780J376720
$$ plain form
3580 18444001 20646907 22883071 25155147 26764722 27311339 26895278 25682770 24032096
3572 24032096 22265934 20581103 18945509 17500208 16317831 15463628 14826400 14453185 14205620
3563 14205620 14053685 14115474 14309415 14652621 15017635 15500516 16190099 16983796 17933001 18982568
3553 18982568 20225066 21637696 23244724 25177527 27551695 30532297 34183532 38342779
3545 38342779 42617363 45768634 46868531 45694192 43106662 39685603 35798701 32079000
3537 32079000 28493039 25171063 22396951 20174459 18431546 17086958 15964724 15092279
3529 15092279 14416439 13871575 13492697 13261890 13166924 13136904 13241547 13442641 13684348 14033967
3519 14033967 14499382 15065473 15747275 16652783 17822762 19204545 20784479 22478259 23854979
3510B3854979N53012m19363j170152j645903j911593j924895j816847j639562
3502A3879676j529274j219804j026065q39247o45580n50142m85029m02879l35999
3493F845657k83126k65863j30856j01070j32916j80323j32096k29756n5758m5656
3483E288237j37650r1391r6582p5511n6597j13745j57053n6125j21745q0541r9891
3472D201406J088p1333l9111q3786M1754M279l8283o7463k4819L3667M9716j2333
3460C994782k3579O079N2151L6786J9371J33050J02473R3688Q4030J22753J61533
3449D783117R7620J70086R7563Q5098p568M4825p010L5950Q8255N222N2370M7987
3437E493515Q5939J79278K66873J48886J21609J64774K38740J95432J97211J95746
$$ plain form
3510 23854979 24407991 23988628 22818476 21172573 19260980 17336085 15519238 13879676
3502 13879676 12350402 11130598 10104533 9265286 8619706 8069564 7584535 7181656 6845657
3493 6845657 6562531 6296668 6165812 6064742 5931826 5751503 5619407 5389651 5333893 5288237
3483 5288237 5150587 5059196 4962614 4887103 4830506 4716761 4559708 4503583 4381838 4301297 4201406
3472 4201406 4202494 4131161 4092050 4008264 4050018 4054297 4016014 3948551 3923732 3957399 4007115 3994782
3460 3994782 3971203 3977282 4029433 4066219 4085590 4218640 4321113 4414801 4498831 4621584 4783117
3449 4783117 4880737 5050823 5148386 5233484 5225916 5270741 5263731 5299681 5387936 5393158 5445528 5493515
3437 5493515 5579454 5758732 6025605 6174491 6296100 6460874 6699614 6895046 7092257 7288003
3427G288003J75414K65691L62859L96293M69888N64658N24935N37966P71396Q83820
3417A2240923R66572J064973J120295J133648J036047P61567J72096k74383m90536
3408A7731202o28779o95557r12624j001883r06504p06248m69193m54905m21954
3399A1533555k72586j34323j38666J4252N6201J48366K68029L35053N16253N66717
3389A2892851O24790P15167Q15690J093891J263850J483140J934572K100516K240158
3380B5164625J880818Q97920p5397o83410j079436j292473j537344j691316j564051
3371B0019936j338620j090400p93431n00541l17378j70093L9812O4719Q4613K56026
3361A6254643L83353N94212R32471J072418J268336J123826M76400M2140M7987
$$ plain form
3427 7288003 7463417 7729108 8091967 8488260 8958148 9522806 10047741 10585707 11357103 12240923
3417 12240923 13207495 14272468 15392763 16526411 17562458 18324025 18496121 18221738 17731202
3408 17731202 17102423 16406866 15494242 14492359 13585855 12879607 12410414 11955509 11533555
3399 11533555 11260969 11126646 10987980 11002232 11058433 11206799 11474828 11809881 12326134 12892851
3389 12892851 13517641 14232808 15048498 16142389 17406239 18889379 20823951 22924467 25164625
3380 25164625 27045443 27943363 27867966 27184556 26105120 24812647 23275303 21583987 20019936
3371 20019936 18681316 17590916 16797485 16296944 15979566 15809473 15849285 15914004 15998617 16254643
3361 16254643 16637996 17232208 18164679 19237097 20505433 21629259 22105659 22147799 22195786
3352B2195786N5995J69313M41003O24181P67015P73771O89503M97868M93480M98604
3342B7206519k47372j163370j619681j600052j492874j366088j357303j087827
3334A7271952p39724n04017r6865J48228M35547N19870J90329l00578o59038q40114
3324A5425590p78527o45463m56527k39959n4410P7762M28997O64308R21481P60975
3314A6104227j19664q87193j150753j348959j206387j161771j143110r97868q25704
3305G262818o26128n67372m40741l74388l50973l09381k41755k17032k28366j24037
3295C782645j13375j55406j21541p0652j3252p0995p9344j14948n0377r2805j65007
3284B734943j09347m0115o6347r7597p3566j9220j0284m2294r5405M013r3595
$$ plain form
3352 22195786 22251781 22421094 22862097 23486278 24253293 25027064 25716567 26214435 26707915 27206519
3342 27206519 26959147 25795777 24176096 22576044 21083170 19717082 18359779 17271952
3334 17271952 16532228 16028211 15931346 16079574 16515121 17034991 17225320 16924742 16265704 15425590
3324 15425590 14647063 14001600 13545073 13305114 13250704 13328466 13757463 14421771 15343252 16104227
3314 16104227 15984563 15097370 13946617 12597658 11391271 10229500 9086390 8088522 7262818
3305 7262818 6636690 6069318 5628577 5254189 4903216 4593835 4352080 4135048 3906682 3782645
3295 3782645 3669270 3513864 3392323 3321671 3308419 3237424 3158080 3043132 2992755 2899950 2734943
3284 2734943 2625596 2585481 2519134 2421537 2347971 2328751 2318467 2276173 2180768 2184781 2091186
3273B091186q8618r8069j14875M991p2710Q210m0268n2253N347n3745K1789m5546
3261A565439r2268p143L6735L5190o3195p975k093p0777J4831l927j3653n8821
3249A332343J0586N325o2961p1783n70O7712m1838r8490o5497n3199m6280J7197
3237I92545m8961O2716K4200l9922J5391k0533l5636n9107K9356r633m7505m1303
3225H21608N9326K9811k883K6323m6918L0362N4268j7568L5927K575o3670k8146
3213I01015o913O1284J3940m7037l8281N1495L1539l1367j680K4749j5443J3312
3201I56613k4396M5820R1330j8743k035k447n3159P3974Q0141m297J03626k830
3189A243597k8471J050R3162j221l8923J19327K6746K4123j3577J05334J06827
$$ plain form
3273 2091186 2002568 1904499 1789624 1794615 1721905 1730115 1689847 1637594 1642941 1589196 1610985 1565439
3261 1565439 1473171 1466028 1502763 1537953 1474758 1466783 1464690 1393913 1408744 1404817 1391164 1332343
3249 1332343 1342929 1348254 1285293 1213510 1212940 1280652 1238814 1140324 1074827 1021628 975348 992545
3237 992545 943584 1006300 1030500 990578 1005969 985436 949800 890693 920049 910416 862911 821608
3225 821608 880934 910745 907862 934185 887267 917629 971897 954329 990256 992831 929161 901015
3213 901015 894102 955386 969326 922289 884008 935503 967042 935675 933995 958744 943301 956613
3201 956613 932217 978037 1069367 1050624 1048589 1046142 992983 1066957 1147098 1142801 1246427 1243597
3189 1243597 1215126 1216176 1309338 1308117 1269194 1388521 1415267 1439390 1425813 1531147 1637974
3178A637974O8399N5942J828Q2670N2595J40697J22674O8760J11278J59413J68024
3167B670254J84426N3257Q6725M0437J1557k4431n4122j0423k1977J5143O3708
3156C014554l3680l369o4906k4523n6648j47435k1314j53514M2388k9925Q7127
3145B608755P5490M8811L7700O4623O7256R6696J08665J27384K08298K32524K34020
3134C910222K52463J56929K1223o2751q9732l5857o2848j62860k5756j31962K2007
3123C791078M0845j09820j54457j88178j63432k13558j65665j31736l3445j33647
3113B537985o2256n8077n1472l0390P393p0033j773o6330j8931J13395M8873J13440
3101B461824N4164n9847j4723k3727j1295p4050k7464L0638n3729o7299J9645
$$ plain form
3178 1637974 1706373 1762315 1764143 1846813 1899408 2040105 2162779 2231539 2342817 2502230 2670254
3167 2670254 2854680 2907937 2994662 3035099 3046656 3022225 2968103 2957680 2935703 2950846 3014554
3156 3014554 2980874 2977505 2912599 2888076 2831428 2683993 2662679 2509165 2551553 2521628 2608755
3145 2608755 2684245 2733056 2770756 2835379 2902635 2999331 3107996 3235380 3443678 3676202 3910222
3134 3910222 4162685 4319614 4340837 4278086 4188354 4152497 4089649 3926789 3901033 3769071 3791078
3123 3791078 3831923 3722103 3567646 3379468 3216036 3002478 2836813 2705077 2671632 2537985
3113 2537985 2475729 2417652 2366180 2335790 2343183 2273150 2271377 2205047 2186116 2299511 2348384 2461824
3101 2461824 2515988 2456141 2441418 2417691 2406396 2332346 2304882 2335520 2281791 2214492 2234137
3090B234137n3219l1018n3527l1512n5930j80898j90241q190m0658j42877K9772
3079A475839K4681j2948j00777n7635q4042n0233r289o70j8659k2457p1572R819
3067A082057n8214m5486p421K8062K5930o7702L1088o4839K0147J5864M9441n2549
3055I56378k423N0100m1774p896j3294j5781m169q5753M4910o6103j3178K187
3043H03204M14j6801n0211j0660O944k3746o8104L5742J4037r1886n1121J1881
3031E59693J5850p028j9821k2328k291K3228n2468r616R552k994q0319l2119j0909
3018C68430m6145m0457j1630K4742J5428j9688P3248l7134j2311P934K933P112
3006C32462k5855M969l1584k7049m3804M1218l4788O0560J2663n5317l9718l7025
$$ plain form
3090 2234137 2180918 2149900 2096373 2064861 2008931 1828033 1637792 1629602 1588944 1446067 1475839
3079 1475839 1500520 1487572 1386795 1329160 1245118 1194885 1185596 1184926 1166267 1143810 1072238 1082057
3067 1082057 1023843 978357 970936 998998 1024928 957226 988314 923475 943622 959486 1008927 956378
3055 956378 953955 1004055 962281 954385 941091 925310 921141 835388 880298 814195 801017 803204
3043 803204 803618 786817 736606 725946 732890 709144 641040 676782 690819 598933 547812 559693
3031 559693 575543 568515 548694 526366 524075 547303 494835 485219 494771 491777 411458 379339 368430
3018 368430 322285 281828 270198 294940 310368 290680 363928 326794 314483 322417 325350 332462
3006 332462 306607 311576 279992 252943 209139 250357 215569 276129 288792 233475 193757 156732
2994A56732J6463p317P4340j4096n1867N0221Q302q265N437M928q540n8377l551
2981A64410o2784K5934P2661l8505j1839K5949j5263r411j7426N1428N0391q518
2969B27027q7024k7295m8303J850J8196J036j7482J2945k541N5060J6641l4747
2957A15363k8585P513J2722j4904J876l018p344L2740L3368Q146n5892l7092M3093
2944A07986m626k4059k256j4513l8623o4057J7580k8386L9938k460N7706J6715
2932F0945K0956j3511l5298J4513O814j6519j1361K1991O608l0726l8512J9798
2920E698J2626J5443N6519K3182n7235m894j9099L6081m0523O9588L0602k5437
2908A02551n0495O8053j6324m6079m3723K7557J6604m0699m4010J31J3740O9405
$$ plain form
2994 156732 173195 165878 240218 226122 174255 224476 232778 224513 229950 234878 226338 167961 164410
2981 164410 101626 127560 200221 161716 149877 175826 160563 151152 133726 185154 235545 227027
2969 227027 140003 112708 64405 66255 84451 85487 68005 80950 78409 133469 150110 115363
2957 115363 86778 94291 107013 92109 93985 90967 83623 116363 149731 157877 101985 64893 107986
2944 107986 103360 79301 77045 62532 23909 -40148 -22568 -50954 -11016 -13476 44230 60945
2932 60945 81901 68390 33092 47605 54419 37900 26539 48530 55138 24412 -14100 5698
2920 5698 18324 33767 90286 113468 56233 51339 32240 68321 27798 97386 127988 102551
2908 102551 52056 120109 103785 57706 13983 41540 58144 17445 -26565 -26434 -12694 56711
2896E6711K771l7364P2456k5107o3981j2961K1654M3010K5156n2294m1983J3749
2884A817M472P4608R10p33k5728m8396J1210j9317M1640M741o2687o6563Q652
2871g5374Q1884J9226j7295k0120O6745q9498Q834K7622L206m503j2547Q8784
2859G6964n9904j6228J7757J1869J0706m302j8558N156l540N8909m789p3886r116
2846h962o9376J6551O8291P285j8395j3746m6238L7197K7839N3n848J3749j6179
2833g779L1551j6110p750m0154L0540O0503j6622m0115J2670J5770J9497n7429
2821a5428k8624M7898l0333O8388m0130k5530M7625R774M86K634l7617K952M527
2808F622k0520K9575M2412Q932j2347K92j2776j4809J1149p6146O847L7265m1276
$$ plain form
2896 56711 59482 22118 94574 69467 5486 -7475 14179 57189 82345 30051 -11932 1817
2884 1817 6289 80897 81807 81074 55346 6950 18160 -1157 40483 45224 -17463 -84026 -75374
2871 -75374 6510 25736 8441 -11679 55066 -34432 -25598 2024 5230 727 -11820 76964
2859 76964 17060 832 18589 30458 41164 36862 18304 23460 19920 78829 74040 154 -8962
2846 -8962 -78338 -61787 6504 13789 -4606 -18352 -64590 -27393 446 499 -5349 8400 -7779
2833 -7779 23772 7662 -88 -40242 -9702 50801 34179 -5936 6734 22504 42001 -15428
2821 -15428 -44052 3846 -26487 41901 1771 -23759 23866 33640 34126 36760 -857 2095 6622
2808 6622 -13898 15677 58089 67021 54674 54966 42190 27381 38530 -37616 -30769 6496 -34780
2795c4780n6861J37230l0904o742l8031J6799K9155K3884l0981L5292p087j1164
2783B5810O479k9203l8214J7353J3999K0975N975l5548K6419L3530O1310o4899
2771D3986j6369J3061N61j5060j5401M962L3017j9689j3243J2197j2266n1437
2759c5681R896L950q1826K0158l5811K8820J08859N415j02835q005Q494P9909
2747A343Q4597n3239p2100J3101Q2559J5111m7098k4394n527n2122l7982P6105
2735a9646O4177j1456k9270o031N0000r164J6842j13952M0563L9735m0987J5772
2723c417K8865k4158L114K2351l3889J8610k6337j1948J940j5795k7549L8633
2711b9580M2845k7573k1285J1773M2229p1128o012P8361q175m9132q831L2383
$$ plain form
2795 -34780 -91641 45589 14685 7943 -30088 -13289 15866 39750 8769 44061 36974 25810
2783 25810 32289 3086 -35128 -17775 -3776 17199 23174 -12374 14045 47575 108885 43986
2771 43986 27617 40678 41239 26179 10778 15740 48757 29068 15825 28022 15756 -35681
2759 -35681 -25785 -21835 -103661 -83503 -119314 -90494 18365 23780 -79055 -87060 -78566 1343
2747 1343 85940 32701 -39399 -26298 56261 71372 24274 -120 -5647 -57769 -95751 -19646
2735 -19646 44531 33075 3805 -2226 47774 38610 55452 -58500 -17937 21798 -19189 -3417
2723 -3417 25448 1290 4404 26755 -7134 11476 -14861 -26809 -24869 -40664 -68213 -29580
2711 -29580 13265 -14308 -35593 -23820 18409 -52719 -58731 19630 11455 -37677 -46508 -14125
2699a4125N6529k3546m2026N611L8824n3630o9181O3933k9206K3120J4156J7475
2687a2066L5003l8836O96K5613J4965m5355M1377j4547K642j4716M192j2407L6925
2674B3486l9081k476n3706O4319M0874j4319l5911q5130J8118M3955K7839n5905
2662f7937J404l036K5090N0366J9131O012l5753R288P2827j11941j15221R0151
2650e9619L2462J2589Q2772r1128l2481K7408k1752J3508j22n2327j7429Q5647
2638b0472k2174l8639J3055K2480N5459m2089n525O7379p2544M0804K5096m3426
2626b0596J2495m2543l7742J9915K2719j950J2564J0672L8663k5435J3696k4797
2614b2339j3501q583J2022l3519j0111K2093l1855K1853K7654k6521M0341O1164
$$ plain form
2699 -14125 42404 18858 -23168 -17557 21267 -32363 -101544 -37611 -66817 -43697 -29541 -12066
2687 -12066 22937 -15899 -15203 10410 25375 -19980 21397 6850 9492 -5224 -1032 -13439 23486
2674 23486 -15595 -18071 -71777 -7458 33416 19097 -16814 -101944 -83826 -39871 -12032 -67937
2662 -67937 -66533 -69569 -44479 5887 25018 31030 -4723 4565 77392 -34549 -149770 -59619
2650 -59619 -27157 -14568 68204 -22924 -55405 -27997 -49749 -36241 -36363 -88690 -106119 -20472
2638 -20472 -42646 -81285 -68230 -45750 9709 -32380 -37905 29474 -43070 -2266 22830 -20596
2626 -20596 -8101 -50644 -88386 -68471 -45752 -47702 -35138 -24466 14197 -11238 2458 -22339
2614 -22339 -35840 -44423 -32401 -65920 -76031 -53938 -85793 -63940 -36286 -62807 -22466 38698
2602C8698K7616L4957l2800m5455k6248m8351M0306m8521K4320J4138j9041J5012
2590b5369L6900m602%L8594J8759n5488p3224p905N5882l7094j8325k0725J8373
2577g4224N6379l8565J8104q524j3024l1762k0063J02678L247k7379J6143K2550
2565E560P198j5301M5822p0575m4276M0048J5702O4333J6219o717l7820K69K5379
2552D5841j8556J0028l344Q3763O803j8272n2389L7886J3007l4002l7581J8597
2540E1781K0072n2532j8528l2785O9042j720J779K4367p028n5374o9888K5713
2528d5101j1677o596M1671N1508J4640n1287J0973q4342J8568L2492R779L6721
2516A7349K3682N9269O567j6764l8941o091r1566M8897J7691j6659q3535l3090
$$ plain form
2602 38698 66314 101271 68471 23016 -3232 -51583 -11277 -59798 -35478 -21340 -40381 -25369
2590 -25369 11531 6929 6929 45523 64282 8794 -64430 -72335 -16453 -53547 -71872 -92597 -74224
2577 -74224 -17845 -56410 -38306 -46830 -59854 -91616 -111679 -9001 -5754 -33133 -16990 5560
2565 5560 12758 -2543 43279 -27296 -71572 -31524 -15822 48511 64730 58013 20193 20462 45841
2552 45841 27285 37313 33969 117732 124535 106263 53874 91760 104767 70765 33184 51781
2540 51781 71853 19321 793 -31992 37050 35330 37109 61476 54448 -926 -70814 -45101
2528 -45101 -56778 -63374 -21703 29805 44445 -6842 4131 -80211 -61643 -29151 -19372 17349
2516 17349 41031 100300 106867 90103 51162 45071 -46495 2402 20093 3434 -80101 -113191
2504a13191K3019J5935Q249l8998K6645O4735N6389J287m4859L0240J0603J1726
2492E1780l9245l999o3280J6464j2501j3204M9910j5519L8447j9590R652M5953
2480D4868j3776p4929k1366O13J07672k668j14740N3965N2139n325J2329j7341
2468B1441l0416O2401M569p333K0410l9224K6278J277q811N380J2252o5532p678
2455d986N007r028N3145j3374n278l7383M300M1452k8643K7865Q457l5741l3566
2442b7773M5999j9836J0110K7520Q786l8772j2377L0798K5319q3804M7748J1048
2430B4766m0657L9904m6564R579N2899l7719n8649L0679N9129m4788q221M5759
2418B6117m8354O5678J9818j6214J9859N9770n8883k4693n5432K9476N9072j8574
$$ plain form
2504 -113191 -90172 -74237 -65988 -104986 -78341 -13606 42783 44070 -789 29451 40054 51780
2492 51780 12535 8536 -54744 -38280 -50781 -63985 -14075 -29594 8853 -10737 -1085 44868
2480 44868 31092 -43837 -65203 -64590 43082 40414 -74326 -20361 31778 26453 38782 21441
2468 21441 -8975 53426 57995 50662 71072 31848 58126 59403 50592 55972 68224 2692 -4986
2455 -4986 21 -9007 44138 30764 25486 -11897 -7597 33855 5212 33077 41534 5793 -27773
2442 -27773 18226 -1610 8500 36020 44806 6034 -6343 24455 49774 -34030 13718 24766
2430 24766 -15891 24013 -22551 -12972 39927 2208 -56441 -25762 33367 -11421 -19642 26117
2418 26117 -22237 43441 63259 47045 66904 126674 67791 43098 -12334 17142 76214 57640
2406E7640j6857l5073L4520J227J5513j1046J1995K4306N264J6917J8843K0162
2394A43411k5529r8265n8422O8653N6088L6824k1560k0556J2364m927n1093M1546
2382G8534l1793K2395K7263k4547j5560L9464r105l0885j7707j7954M3125k007
2370F1223M1157L715n3784q7797L0801J1341O7579j6007R099J6471j3365L0688
2358A01121K4434Q276l0274m543o0998O0827N207l8290J14719m9740r520R105
2346A30324L3472M602m9492L7708K379J1085l7583l2755M2718K2693M6641L9848
2334B51640m7434K1681N232L5519l2164M8313M1180M2945j3175j8026Q4200N1328
2322D71239p799K8041O4816L7118N7151N4498L4811O4693J57878J22796P1917
$$ plain form
2406 57640 40783 5710 40230 41457 56970 45924 57919 82225 87489 104406 123249 143411
2394 143411 117882 19617 -38805 29848 85936 122760 101200 80644 93008 88081 36988 78534
2382 78534 46741 69136 96399 71852 56292 95756 86651 55766 38059 20105 63230 61223
2370 61223 102380 106095 52311 -35486 -4685 6656 74235 58228 67327 83798 70433 101121
2358 101121 125555 133831 103557 99014 38016 98843 104050 65760 180479 130739 121219 130324
2346 130324 163796 168398 118906 156614 158993 170078 132495 99740 142458 165151 211792 251640
2334 251640 204206 225887 231119 266638 234474 282787 323967 366912 353737 335711 419911 471239
2322 471239 463440 491481 556297 593415 650566 705064 739875 804568 962446 1085242 1157159
2311A157159M368O7806J9586L0568J8857M3464l1939K7337L2090J39111P3409
2300A581816J35640J55996K03581J54793J46995K25326J92153K06637K07268K13855
2290C424060J99519K78902L36506L75860M67112N78596O67492Q05200J101075
2281H234322J429339J641414J857810O20880q97714j316397j464122j329609j302482
2272G473441j337140j031226p75433n83564n16561l39874k14196k46893j45107
2263B283447j93146j77960j66362k18601j31089j80427q1417o640j06616j26743
2253H94446L4369l0573r1376j01535p8091o9300q1187J9553n650p6447k2221l401
2241C88587m5065j1081Q6861n697p1147J3759L5067k1020j8297o8026q3241k4604
$$ plain form
2311 1157159 1161527 1229333 1248919 1279487 1298344 1341808 1309869 1337206 1369296 1508407 1581816
2300 1581816 1717456 1873452 2077033 2231826 2378821 2604147 2796300 3002937 3210205 3424060
2290 3424060 3623579 3902481 4238987 4614847 5081959 5660555 6328047 7133247 8234322
2281 8234322 9663661 11305075 13162885 13783765 12886051 11569654 10105532 8775923 7473441
2272 7473441 6136301 5105075 4329642 3746078 3229517 2889643 2675447 2428554 2283447
2263 2283447 2090301 1912341 1745979 1527378 1396289 1215862 1134445 1127805 1021189 894446
2253 894446 928815 898242 806866 705331 627240 557940 476753 496306 490656 414209 391988 388587
2241 388587 343522 332441 419302 413605 342458 356217 391284 370264 351967 283941 200700 176096
2229A76096O4702P3891l7224o4887l051N14N4806k4104r1783J9237Q761j507K0171
2216A95622l5393K5509J9730p869J420k0907k6361l0756m7158J1729p4618j9928
2204h980K0388N4295l2180j1850L8187l7378J1824k1121L7026L3424J8972j8111
2192H4496j7452L9484K6n6277k7217K2921l2754k0591N9775l7817j0073l2356
2180b7835K5390K4374J5804p829J5120j6372q081N046k4484j7545N837N3907j0345
2167C2987n1595O9015k1247J861j6078q8115J6615N1150n354L56m6603K4327J0043
2154b2638j4469K6979M3162l2017n1546q825L1998L7177l6864J3134K4868N3246
2142F4205K5505o7684L663k666L8301L9471n4220L4531n9274k8444J9467j9947
$$ plain form
2229 176096 240798 314689 277465 212578 209527 210041 264847 240743 148960 168197 176958 175451 195622
2216 195622 160229 185738 205468 197599 199019 178112 151751 120995 73837 85566 10948 -8980
2204 -8980 11408 65703 33523 21673 59860 22482 34306 13185 50211 83635 102607 84496
2192 84496 67044 106528 106554 50277 23060 45981 13227 -7364 52411 14594 4521 -27835
2180 -27835 -2445 21929 37733 29904 45024 28652 20571 25617 1133 -16412 -10575 43332 32987
2167 32987 -18608 50407 29160 31021 14943 -73172 -56557 -5407 -10761 -10405 -57008 -32681 -22638
2154 -22638 -37107 -10128 33034 1017 -50529 -59354 -27356 9821 -27043 -13909 10959 64205
2142 64205 89710 22026 25689 23023 61324 100795 46575 81106 21832 -6612 12855 -7092
2130g092j2527k0952r923M5894L634p0869j3490P0350L7559J1968m7904O973J694
2117d685K9888o540Q263l8701o0014N3353J4846j4986p3753M6366L1256n7189
2105g1896M3289k9440J9663N6397m3415m8171m905P0013k3234j9889N3824M069
2093F305n5555n677J882K8805L2654K7827L727j9806j0336k4812L4706q357j08259
2080i6896K3806K356M1822L1984P447q6825J2274M1623n95j9495m602P0824l6688
2067a2965k7731o6547K0805K7817m4633l8833P9914K6176o264j4214P0935L3284
2055D7744l5138J528o3909l302j6453P623L9135l6755K0012K2762K6399K2554
2043C2200n237j354K5023n9376J02434p4260j19116J25649M8511l4007J2907k0680
$$ plain form
2130 -7092 -19619 -40571 -50494 -4600 -966 -71835 -85325 -14975 22584 34552 -13352 -6379 -4685
2117 -4685 25203 18663 26926 -11775 -71789 -18436 -3590 -18576 -92329 -45963 -14707 -71896
2105 -71896 -28607 -58047 -38384 18013 -25402 -73573 -78478 -8465 -31699 -51588 2236 6305
2093 6305 -49250 -54927 -53045 -24240 8414 36241 39968 20162 9826 -14986 19720 11363 -96896
2080 -96896 -73090 -70734 -28912 3072 10519 -76306 -64032 -22409 -23004 -42499 -47101 23723 -12965
2067 -12965 -40696 -107243 -86438 -58621 -103254 -142087 -62173 -35997 -42261 -56475 14460 47744
2055 47744 12606 14134 -49775 -53077 -69530 -61907 -22772 -59527 -39515 -16753 9646 32200
2043 32200 26963 25609 50632 -8744 93690 19430 -99686 25963 74474 40467 53374 32694
2031C2694k6722k7247j4949J9184j2959M7384n5784l0143N9025L0080j8102k34
2019B227J7307o5146J3334j9220L5365J7250J569L6232P626J89j0281R3012n2069
2006G7395l0660q481n4776R382L3583J0160k326r3256l0170K3781J2389j484n092
1993e9555l422M6249K9940m0367k5348j0630k7936k192N920M6752l5156k4811
1981a00556M4857m187P423N6820K366m9922M0827K0823k583q1418J7413J030l4163
1968h1270K6353N1029j3222J8868N059m1189P546J0296n295j2292M3853n5295
1956d5559p447L913j229K3254P091k9084L9863j9932N3880k3421r5660P5600n9651
1943g8382j528N6812J7729r5719K9477N7188m8296L0869N2594K639l4065k307
$$ plain form
2031 32694 5972 -21275 -36224 -17040 -29999 17385 -38399 -68542 -9517 20563 2461 2227
2019 2227 19534 -45612 -32278 -51498 -16133 1117 2686 38918 46544 46733 36452 129464 77395
2006 77395 46735 38254 -16522 -7140 26443 36603 34277 -58979 -89149 -65368 -52979 -54463 -59555
1993 -59555 -62977 -16728 13212 -27155 -52503 -63133 -91069 -93261 -87341 -40589 -75745 -100556
1981 -100556 -55699 -59886 -52463 4357 6723 -43199 -2372 18451 15868 -65550 -48137 -47107 -81270
1968 -81270 -54917 -3888 -17110 1758 6817 -34372 -26826 -16530 -21825 -34117 9736 -45559
1956 -45559 -53006 -49093 -50322 -27068 -19977 -49061 -9198 -29130 24750 1329 -94331 -18731 -78382
1943 -78382 -79910 -23098 -5369 -101088 -71611 -14423 -62719 -31850 20744 23383 -10682 -12989
1931a2989l035k3031J053P94n0364L4300N3840m1520k5400K9225M3585n1526l5435
1918h0503J4404L0655j4147j9645L8111K9447m1684o6281L7919K5861k844L9560
1906i147J0027n1968j422K7577j9476j2528N4098j4840m1787p430K7785Q0453
1894D1342m6311n5150j8978M4201N2215L0668p890j00521L2688R278j7796j4496
1882e0750L0032m3208n390j2762P6849J313o9368P039r053k6290k2377N8130M7179
1869a8656k4209l0816P731j4925j7112J88L0491L7714K6758N6377l9938n5654
1857d2051J1810j9304o5219k3092Q4844j8280r946Q6818n1730j8940K1474L5422
1845h194P877r4159J2582K6695m6952J9917R4077j7948j911O1684l7418m8506
$$ plain form
1931 -12989 -16024 -39055 -38002 -37208 -87572 -53272 568 -40952 -66352 -37127 6458 -45068 -80503
1918 -80503 -66099 -35444 -49591 -69236 -31125 -1678 -43362 -109643 -71724 -45863 -48707 -9147
1906 -9147 880 -51088 -52510 -24933 -44409 -56937 -2839 -17679 -59466 -66896 -39111 41342
1894 41342 -4969 -60119 -79097 -34896 17319 47987 40097 -60424 -27736 -18458 -36254 -50750
1882 -50750 -20718 -63926 -69316 -82078 -5229 -3916 -73284 -66245 -75298 -101588 -123965 -65835 -18656
1869 -18656 -42865 -73681 -65950 -80875 -97987 -97799 -67308 -29594 -2836 53541 13603 -42051
1857 -42051 -30241 -49545 -114764 -137856 -53012 -71292 -81238 5580 -46150 -65090 -43616 -8194
1845 -8194 -317 -94476 -81894 -55199 -102151 -82234 11843 -6105 -8016 53668 16250 -32256
1833c2256J2854J8987K7174q4525N291N3841J9406l0930l9370m5690L3503P303
$$ plain form
1833 -32256 -19402 -415 26759 -57766 -52475 1366 20772 -10158 -49528 -95218 -61715 -54412
$$ [...]
##END NTUPLES=NMR SPECTRUM
##END=
