##TITLE=1H_CG-1210
 CDcl3
 8 sc, 
 7.8.2024
##JCAMPDX= 6.0         $$ Bruker NMR JCAMP-DX V2.0
##DATA TYPE= NMR SPECTRUM
##DATA CLASS= NTUPLES
##ORIGIN= UXNMR, Bruker Analytische Messtechnik GmbH
##OWNER= root
$$ XWIN-NMR		Version 3.5
$$ Wed Aug  7 13:54:25 2024 Russian Standard Time (UT+4h)  she@DPX200
##.OBSERVE FREQUENCY= 200.1313
##.OBSERVE NUCLEUS= ^1H
##.ACQUISITION MODE= SIMULTANEOUS
##.ACQUISITION SCHEME= undefined
##.AVERAGES= 8
##.DIGITISER RES= 18
##SPECTROMETER/DATA SYSTEM= spect
##.PULSE SEQUENCE= zg30
##.SOLVENT NAME= Acetone
##.SHIFT REFERENCE= (INTERNAL, Acetone, 0, 21.4939)
##AUDIT TRAIL= $$ (NUMBER, WHEN, WHO, WHERE, WHAT)
$$ ##TITLE= Audit trail, XWIN-NMR		Version 3.5
$$ ##JCAMPDX= 5.01
$$ ##ORIGIN= Bruker BioSpin GmbH
$$ ##OWNER= she
$$ F:/spectra/data/she/nmr/H-F/1/pdata/1/auditp.txt
$$ ##AUDIT TRAIL=  $$ (NUMBER, WHEN, WHO, WHERE, WHAT)
(   1,<2024-08-07 13:53:04.84 +0400>,<she>,<DPX200>,
      <created by zg, POWCHK disabled, PULCHK disabled
       configuration hash MD5:
       00 E9 B6 7A A2 85 ED C7 34 08 36 98 17 FE 4E 26
       data hash MD5: 16K
       FF 9E 9E 4E F5 EB 10 65 CC AB 93 AB 64 92 C8 70>)
(   2,<2024-08-07 13:53:07.34 +0400>,<she>,<DPX200>,
      <Start of raw data processing
       efp BC_mod = 2 LB = 0.24 FT_mod = 6 PKNL = 1 PHC0 = -25631.27 PHC1 = 7.18749 SI = 16K 
       data hash MD5: 16K
       8A 68 6B 02 50 C1 86 9E 1F ED DF 2D B7 E0 52 80>)
(   3,<2024-08-07 13:53:27.93 +0400>,<she>,<DPX200>,
      <pk PHC0 = 0.8643899 PHC1 = -0.3999998 
       data hash MD5: 16K
       95 9C 73 C2 E9 ED 61 41 30 61 A6 AE 8D F7 2F 77>)
(   4,<2024-08-07 13:53:31.37 +0400>,<she>,<DPX200>,
      <abs ABSG = 5 
       data hash MD5: 16K
       29 EB 48 79 91 0D A5 22 82 FA 22 59 E5 9C 65 7E>)
$$ ##END=
$$ 
$$ hash MD5
$$ 93 76 56 60 97 F1 DB 6F 8F A0 38 77 70 A4 FE 12
##$RELAX= 
##$RELAX= 
##$RELAX= 
##$RELAX= 
##$RELAX= 
##$RELAX= 
$$ Bruker specific parameters
$$ --------------------------
##$DU= <F:/spectra>
##$EXPNO= 1
##$NAME= <H-F>
##$PROCNO= 1
##$TYPE= <nmr>
##$USER= <she>
##$AMP= (0..31)
100 100 100 100 100 100 100 100 100 100 100 100 100 100 100 100 100 100 
100 100 100 100 100 100 100 100 100 100 100 100 100 100 
##$AQSEQ= 0
##$AQ_mod= 1
##$AUNM= <au_zg>
##$AUTOPOS= <>
##$BF1= 200.13
##$BF2= 200.13
##$BF3= 200.13
##$BF4= 200.13
##$BF5= 200.13
##$BF6= 200.13
##$BF7= 200.13
##$BF8= 200.13
##$BYTORDA= 1
##$CFDGTYP= 0
##$CFRGTYP= 5
##$CHEMSTR= <none>
##$CNST= (0..31)
1 1 145 1 1 1 1 1 1 1 1 1 1 1 1 1 1 1 1 1 1 1 1 1 1 1 1 1 1 1 1 1 
##$CPDPRG= <>
##$CPDPRG1= <>
##$CPDPRG2= <>
##$CPDPRG3= <>
##$CPDPRG4= <mlev>
##$CPDPRG5= <mlev>
##$CPDPRG6= <mlev>
##$CPDPRG7= <mlev>
##$CPDPRG8= <mlev>
##$CPDPRGB= <>
##$CPDPRGT= <>
##$D= (0..31)
0 1.2 0 0 0 0 0 0 0 0.06 0 0.03 0 0 0 0 0.0002 0 0 0 0 0 0 0 0 0 0 0 0 
0 0 0 
##$DATE= 1723024384
##$DBL= (0..7)
120 120 120 120 120 120 120 120 
##$DBP= (0..7)
150 150 150 150 150 150 150 150 
##$DBP07= 0
##$DBPNAM0= <>
##$DBPNAM1= <>
##$DBPNAM2= <>
##$DBPNAM3= <>
##$DBPNAM4= <>
$$ [...]
##$SUBNAM3= <"">
##$SUBNAM4= <"">
##$SUBNAM5= <"">
##$SUBNAM6= <"">
##$SUBNAM7= <"">
##$SUBNAM8= <"">
##$SUBNAM9= <"">
##$SW= 24.0689771365484
##$SWIBOX= (0..15)
0 0 2 0 0 0 0 0 0 0 0 0 0 0 0 0 
##$SW_h= 4816.95568400771
##$TD= 16384
##$TD0= 1
##$TE= 0
##$TE2= 300
##$TE3= 300
##$TEG= 300
##$TL= (0..7)
0 120 120 120 120 120 120 120 
##$TP= (0..7)
150 150 150 150 150 150 150 150 
##$TP07= 0
##$TPNAME0= <>
##$TPNAME1= <>
##$TPNAME2= <>
##$TPNAME3= <>
##$TPNAME4= <>
##$TPNAME5= <>
##$TPNAME6= <>
##$TPNAME7= <>
##$TPOAL= (0..7)
0.5 0.5 0.5 0.5 0.5 0.5 0.5 0.5 
##$TPOFFS= (0..7)
0 0 0 0 0 0 0 0 
##$TUNHIN= 0
##$TUNHOUT= 0
##$TUNXOUT= 0
##$USERA1= <user>
##$USERA2= <user>
##$USERA3= <user>
##$USERA4= <user>
##$USERA5= <user>
##$V9= 5
##$VALIST= <valist>
##$VCLIST= <CCCCCCCCCCCCCCC>
##$VD= 0
##$VDLIST= <DDDDDDDDDDDDDDD>
##$VPLIST= <PPPPPPPPPPPPPPP>
##$VTLIST= <TTTTTTTTTTTTTTT>
##$WBST= 1024
##$WBSW= 4
##$XGAIN= (0..3)
0 0 0 0 
##$XL= 0
##$YL= 0
##$YMAX_a= 924240
##$YMIN_a= -745790
##$ZGOPTNS= <>
##$ZL1= 120
##$ZL2= 120
##$ZL3= 120
##$ZL4= 120
##$ABSF1= 21.05908
##$ABSF2= -3.010115
##$ABSG= 5
##$ABSL= 3
##$ALPHA= 0
##$AQORDER= 0
##$ASSFAC= 0
##$ASSFACI= 0
##$ASSFACX= 0
##$ASSWID= 0
##$AUNMP= <proc_1d>
##$AZFE= 0.1
##$AZFW= 0.1
##$BCFW= 0
##$BC_mod= 2
##$BYTORDP= 0
##$COROFFS= 0
##$CY= -3
##$DATMOD= 1
##$DC= 0
##$DFILT= <>
##$DTYPP= 0
##$F1P= 0
##$F2P= 0
##$FCOR= 1
##$FTSIZE= 16384
##$FT_mod= 6
##$GAMMA= 0
##$GB= 0
##$INTBC= 1
##$INTSCL= 3.70164e-10
##$ISEN= 128
##$LB= 0.24
##$LEV0= 0
##$LPBIN= 0
##$MAXI= 10000
##$MC2= 0
##$MEAN= 0
##$ME_mod= 0
##$MI= 1.114404
##$NCOEF= 0
##$NC_proc= -5
##$NLEV= 6
##$NOISF1= 3.799351
##$NOISF2= 2.8
##$NSP= 0
##$NTH_PI= 0
##$NZP= 0
##$OFFSET= 21.49393
##$PC= 1
##$PHC0= -25630.4
##$PHC1= 6.78749
##$PH_mod= 1
##$PKNL= yes
##$PPARMOD= 0
##$PSCAL= 0
##$PSIGN= 0
##$REVERSE= no
##$SF= 200.129406910865
##$SI= 16384
##$SIGF1= 3
##$SIGF2= 2
##$SINO= 5.538805
##$SIOLD= 16384
##$SREGLST= <1H.CDCl3>
##$SSB= 0
##$STSI= 16384
##$STSR= 0
##$SW_p= 4816.95568400771
##$SYMM= 0
##$S_DEV= 0
##$TDeff= 16384
##$TDoff= 0
##$TI= <>
##$TILT= no
##$TM1= 0
##$TM2= 0
##$TOPLEV= 0
##$USERP1= <user>
##$USERP2= <user>
##$USERP3= <user>
##$USERP4= <user>
##$USERP5= <user>
##$WDW= 1
##$XDIM= 16384
##$YMAX_p= 411915235
##$YMIN_p= -418093
$$ End of Bruker specific parameters
$$ ---------------------------------
##NTUPLES= NMR SPECTRUM
##VAR_NAME=  FREQUENCY,     SPECTRUM/REAL,   SPECTRUM/IMAG
##SYMBOL=    X,             R,               I
##VAR_TYPE=  INDEPENDENT,   DEPENDENT,       DEPENDENT
##VAR_FORM=  AFFN,          ASDF,            ASDF
##VAR_DIM=   16384,         16384,           16384
##UNITS=     HZ,            ARBITRARY UNITS, ARBITRARY UNITS
##FACTOR=    0.29402158847633, 1,            1
##FIRST=     4301.56762651941, 0,            0
##LAST=      -515.388057488303, 0,           0
##MIN=       -515.388057488303, -418093,     0
##MAX=       4301.56762651941, 411915235,    0
$$ Real data points
##PAGE= N=1
##DATA TABLE= (X++(R..R)), XYDATA
$$ [...]
5233e6594K6692k5027r3924o387J07028j742r0597l322k6765N4094j4077J2366
5221a18255M4114Q265j0663p5187k0879P7969k1871L8225J0918L5714Q5768n1723
5209B395r5889p5090N1023N4879l138j2144Q585M7300m7412k3569l1480q686P3050
5196f0176L3319n9748l8729K9000P8480m1725p404m0542j9360N7077j8152J6650
5184g1310J0426p0709P688K4273J09145m363l0782q0424O5066n542m004P8160
5172B7624N2950q0305n3439m5814P0565M4777k0049l4501L6201k2875j5282J3550
5160b6598j8953Q799L4371L0598l6159o4758K4332J08242m3735k038l8193O7389
5148D3297J3216n0244J5533J8012j9647L8074o0183L2767J6754q2012J0330j0608
$$ y = [-56594, -29902, -54929, -148853, -155240, -48212, -49954, -140551, -143873, -170638, -116544, -130621, -118255, -74141, -65876, -76539, -151726, -172605, -94636, -116507, -78282, -67364, -31650, 54118, 2395, -93494, -168584, -117561, -62682, -65820, -77964, -69379, -22079, -69491, -93060, -124540, -133226, -60176, -26857, -86605, -125334, -96334, -17854, -59579, -66983, -107525, -126885, -69808, -87960, -71310, -60884, -131593, -123905, -99632, 9513, 5150, -25632, -106056, -40990, -46532, -50536, 27624, 80574, 269, -53170, -98984, -28419, 16358, -3691, -38192, -1991, -24866, -40148, -26598, -45551, -36752, -2381, 28217, -7942, -72700, -48368, 59874, 16139, 14101, -24092, 43297, 56513, 6269, 21802, 39814, 20167, 58241, -1942, 30825, 47579, -34433, -24103, -34711]
5136c4711N7143N3011l9840J8568p9167j8189J03559k086K5637k3728J3867j102
5124G2962p1985O5839K6192l9362j0898o5902M5851L4031J2639J114k8633l4428
5112G420L2101P4281O342j1300K4169K8058q326K47J8876l5405n2633J3153J2588
5099A09571q8312q682J10678L1625P627K031q4223r241L2664K9527k6636J158
5087A07787L4127N3670k2040l2439L3447l7487J7845j180R509l3763N0291o1734
5075A18033K8995J20423o3040M7588Q0367n6712l2197J0571n4602l5633K4270
5064A88063j0095L1793k0708J6038O1268l153r4502R2083m763k9246P3309j3650
5052B86437n743N1459l3829m9862J02329L1153r807j00575k237L3410n589K5993
$$ y = [-34711, 22432, 75443, 35603, 54171, -24996, -43185, 60374, 58288, 83925, 60197, 74064, 72962, 977, 66816, 93008, 53646, 42748, -23154, 22697, 56728, 69367, 70481, 41848, 7420, 39521, 113802, 120144, 108844, 133013, 161071, 152745, 152992, 171868, 136463, 83830, 96983, 109571, 21259, 12577, 123255, 154880, 162507, 164538, 80315, 71074, 103738, 133265, 106629, 107787, 141914, 195584, 173544, 141105, 174552, 137065, 154910, 153730, 163239, 129476, 179767, 118033, 147028, 267451, 204411, 251999, 332366, 275654, 243457, 254028, 199426, 163793, 188063, 177968, 209761, 189053, 205091, 266359, 263206, 168704, 260787, 256024, 226778, 300087, 286437, 280694, 332153, 298324, 248462, 350791, 381944, 372137, 271562, 269325, 302735, 297146, 323139]
5040C23139M2772N6475L7097m5942K1321l4400j3254O4625M0342k8813J0098K1315
5028D94775o1270k8043K079J5164m3148J01808k2752P810O2894j365l5418J3115
5016E05649M8167r102P0264J1949p6400M9054k1808j6252L2384l8027J30870q2871
5004F03877k6686J1581k4601m2435J4248L0361p140J00644K4341m3891l8732N4975
4992F56542M1246l8601p6821K7664M924L4340L1753R270m40K5128L7791R587j15239
4979F47144p217M80Q3600L1135J5515n6253p9261K6716Q4429n4276R5146R1818
4967H78976l4708K2798k7950M449L1880M6693l9797M7432L1999L3366j0062k2798
4955I62278o261o164Q2840N4431K4130k6507k629P8555n8416O3054N6752j5760
$$ y = [323139, 365911, 422386, 459483, 413541, 434862, 400462, 387208, 451833, 492175, 463362, 473460, 494775, 433505, 405462, 407541, 422705, 379557, 481365, 458613, 466423, 529317, 527952, 492534, 505649, 553816, 544714, 614978, 626927, 550527, 599581, 577773, 561521, 593905, 555878, 686748, 603877, 577191, 588772, 564171, 521736, 535984, 566345, 559205, 659849, 684190, 640299, 601567, 656542, 697788, 659187, 582366, 610030, 614954, 649294, 681047, 690317, 689877, 715005, 752796, 762383, 647144, 639927, 640407, 724007, 755142, 770657, 714404, 635143, 661859, 746288, 692012, 787158, 878976, 844268, 867066, 839116, 843565, 875445, 922138, 882341, 929773, 961772, 995138, 985076, 962278, 956017, 949853, 1032693, 1087124, 1111254, 1084747, 1082118, 1160673, 1102257, 1165311, 1222063, 1206303]
4943A206303j2527M0047m988O569J9083P3650J00972m8938p269N2789J2965m831
4931A433825L2610J7657N6149K7354j4945L1577J8407R2971M5907m607o2039J10472
4919A785338P3713k6603n2788l9191J15955O8341j2297j2407K1736M0321M9801
4908B011919k5402J00499J2362M2186n2882K8169Q5958k453M6267r148P2670p1628
4896B238517R8984L473o7788n888L1099M5057J2530M5391L2637J959M9274l9765
4884B445480j6693R6832o631O1733P390N706M3243L9073K044l21Q3436P729m291
4871B764730O6424L8503j1625l041j7949J45491M7857L01M518Q2396Q0195K7920
4859C225720Q6222K6595K0483J2167O5772R3304Q0092R698J7914J19734M6441
$$ y = [1206303, 1193776, 1233823, 1228835, 1235404, 1254487, 1328137, 1429109, 1380171, 1372902, 1425691, 1438656, 1433825, 1466435, 1484092, 1540241, 1567595, 1552650, 1584227, 1602634, 1695605, 1741512, 1736905, 1674866, 1785338, 1859051, 1832448, 1779660, 1740469, 1856424, 1924765, 1912468, 1900061, 1921797, 1962118, 2011919, 1986517, 2087016, 2099378, 2141564, 2088682, 2116851, 2202809, 2200356, 2246623, 2237475, 2310145, 2238517, 2337501, 2340974, 2273186, 2267298, 2298397, 2343454, 2355984, 2401375, 2434012, 2435971, 2485245, 2445480, 2428787, 2525619, 2518988, 2580721, 2588111, 2593817, 2637060, 2676133, 2678177, 2677856, 2761292, 2769021, 2764730, 2831154, 2869657, 2858032, 2854991, 2837042, 2982533, 3030390, 3030691, 3035209, 3117605, 3197800, 3225720, 3311942, 3338537, 3359020, 3371187, 3436959, 3530263, 3610355, 3620053, 3637967, 3757701, 3804142]
4848C804142M4865J14049R2228N3971K8274J36274M4250J77519J30234J16171
4838D741977J17603M8181J58281J36012J89072J15264K08065K79712J85357J79093
4828F358617K21947K52204L14890L05302K81756J26175K65721L41502K20686L29786
4818I018586L67085K96694M56084M39561M96321O14969O14872Q09715Q95317R82076
4808A4991280J126666J171204J342076J560191J644839J781245J654270J522895
4800B6794666Q75207j78775j067939j391084j342704r33059n16651n4757M02564
4791B2587468Q03702J166212J411306J674935K229460K642143K858161K976226
4783C8349613K701287J709488j83774k531809m125536m434507l976916l026632
$$ y = [3804142, 3849007, 3963056, 4055284, 4109255, 4137529, 4273803, 4318053, 4495572, 4625806, 4741977, 4859580, 4907761, 5066042, 5202054, 5391126, 5506390, 5714455, 5994167, 6179524, 6358617, 6580564, 6832768, 7147658, 7452960, 7734716, 7860891, 8126612, 8468114, 8688800, 9018586, 9385671, 9682365, 10138449, 10578010, 11074331, 11689300, 12304172, 13113887, 14009204, 14991280, 16117946, 17289150, 18631226, 20191417, 21836256, 23617501, 25271771, 26794666, 27669873, 27491098, 26423159, 25032075, 23689371, 22756312, 22239661, 22184904, 22587468, 23391170, 24557382, 25968688, 27643623, 29873083, 32515226, 35373387, 38349613, 41050900, 42760388, 42576614, 40044805, 35919269, 31484762, 27507846, 24481214]
4775B4481214k244325j554592r92112m87896k17239J91382M98899O85246Q98436
4766B1259013J237256J026002P13484n7879j194610k272089k720345k576119k083920
4757A3330793j586433j354938j164598q76699o47072o67922n70349m93631l26889
4748E642262k77028k64749k60985j34407j84944l8831j47303j49215n1995q510
4738D124295n7323j06968R560m7253j16654j23354j59624l7443r2928k1464p9650
4727C291194k5015l1910l4212L9936N0261L1078L2109J00143J43667K6450K2973
4716C646674J14804k8898j15188q6815j44980j20844j29582p3884p9764J6004
4706B997527R786J20765P5163N5699J11845J17637J08026J00865J26536J22628
$$ y = [24481214, 22236889, 20682297, 19690185, 19202289, 18985050, 19176432, 19675331, 20360577, 21259013, 22496269, 23522271, 24235755, 24177876, 22983266, 20711177, 17990832, 15414713, 13330793, 11744360, 10389422, 9224824, 8348125, 7701053, 7033131, 6462782, 5969151, 5642262, 5365234, 5100485, 4839500, 4705093, 4520149, 4481318, 4334015, 4184800, 4132805, 4124295, 4066972, 3960004, 3969564, 3922311, 3805657, 3682303, 3522679, 3485236, 3392308, 3370844, 3291194, 3266179, 3234269, 3200057, 3239993, 3290254, 3321332, 3353441, 3453584, 3597251, 3623701, 3646674, 3761478, 3732580, 3617392, 3530577, 3385597, 3264753, 3135171, 3061287, 2981523, 2997527, 3007313, 3128078, 3203241, 3258940, 3370785, 3488422, 3596448, 3697313, 3823849, 3946477]
4696C946477K40603J54421J44537M5269L5563P2692J39813p0599j87007j36970
4686D384799j62064j57916j71198l6806M730K3205Q6081J84307J72737K41347
4676D569222K75669J86919K65873L13324L84466K55463O2206n3430l70171o33195
4666E256346n69835n17097l28383k76181j86370j64036n5889k9832k2003Q3473
4656C190193Q9968Q2757Q7409R1537Q2013N0342P5534k13176k21081m24079l05894
4645B585523k82766l13216j41780j65730q0391j48105r1535j6851n4662p2093
4635A218394l0655p190j9005o8774l0650j6454K1927n3443r83O8078r1240j1584
4623I78421J2794j51858J0665l389K8425j606M3205j6788O9426n5448l3709J27587
$$ y = [3946477, 4187080, 4341501, 4486038, 4531307, 4566870, 4639562, 4779375, 4708776, 4521769, 4384799, 4222735, 4064819, 3893621, 3856815, 3861545, 3884750, 3970831, 4155138, 4327875, 4569222, 4844891, 5031810, 5297683, 5611007, 5995473, 6250936, 6313142, 6259712, 5889541, 5256346, 4686511, 4169414, 3841031, 3564850, 3378480, 3214444, 3158555, 3128723, 3106720, 3190193, 3280161, 3362918, 3450327, 3541864, 3623877, 3674219, 3749753, 3536577, 3315496, 2891417, 2585523, 2302757, 1989541, 1847761, 1682031, 1601640, 1453535, 1362000, 1345149, 1290487, 1218394, 1187739, 1180549, 1161544, 1092770, 1062120, 1045666, 1067593, 1014150, 1013167, 1081245, 990005, 978421, 991215, 839357, 850022, 846633, 875058, 873452, 916657, 899869, 969295, 913847, 880138, 1007725]
4611A007725o4288L0576m8657j0190K0671r417K79j1789L3001K7141J804j9202
4599I57654O7383Q3681p5148j6266P201L1471j9293K2309k5336n4985j9910j2815
4587I45946N9526j5975k7669L51Q2690J20083m6294k5411K3914N3883O1527l3789
4575A198782p003N7786l4295p7671r0379Q9948L7592l5213m826P7701k5507j9165
4563A167750k5042k9262K8394l5503q223P950j569N6541J6195m458N1499P595
4551A231867j8133L3027l725j6828j140J3808k5623m9890j3696o0092L6369M4655
4539A170599j6462J3000j3146J0413R2053j6299J03848q7365L6544L3195K6475
4528A352855l8881M0902r062k0215R0325j9910n4429J2752P0483l3147k0780k0790
$$ y = [1007725, 943437, 974013, 925356, 915166, 935837, 926420, 926699, 914910, 947911, 975052, 976856, 957654, 1025037, 1108718, 1033570, 1017304, 1024505, 1055976, 1036683, 1058992, 1033656, 978671, 958761, 945946, 1005472, 989497, 961828, 962179, 1044869, 1164952, 1118658, 1093247, 1117161, 1171044, 1232571, 1198782, 1191779, 1249565, 1215270, 1137599, 1047220, 1137168, 1174760, 1139547, 1134721, 1212422, 1186915, 1167750, 1142708, 1113446, 1141840, 1106337, 1098114, 1106064, 1104495, 1161036, 1177231, 1172773, 1224272, 1231867, 1213734, 1246761, 1243036, 1226208, 1225068, 1238876, 1213253, 1163363, 1149667, 1089575, 1125944, 1170599, 1154137, 1167137, 1153991, 1164404, 1256457, 1240158, 1344006, 1256641, 1293185, 1326380, 1352855, 1313974, 1354876, 1345814, 1325599, 1415924, 1396014, 1341585, 1354337, 1424820, 1391673, 1370893, 1350103]
4516A350103m9995K3546L1092Q9739L8495m3593P1676k7620l226J16529k6894
4505A569852J1645R019M627N0681L2266k6315j5602N3177L1528n002J42694M0639
4493A899209L0081K6660K8613k485j6904Q7007O8410j7817R4372O1350n8413O4363
4481B264446K0537N9223Q4547k1812K2860J9621J10809j7159N9464M7932n9857
4470B590611l0886N7393L9377j0664Q643n3288J37896p3212J02695J02966q1719
4459B789812Q097J0980p4642K5371k4726N3659N135O8580o905L9956L5531J3808
4447B944656m5678L106J07394R082q667j2749N2445p000j7509L0048R0273J15492
4435C260893K222m3422P9395P9081K2934j9244k4741Q1635P8689J01881n0000
$$ y = [1350103, 1300108, 1323654, 1354746, 1444485, 1482980, 1439387, 1511063, 1483443, 1480217, 1596746, 1569852, 1581497, 1590516, 1595143, 1645824, 1678090, 1651775, 1636173, 1689350, 1720878, 1715876, 1858570, 1899209, 1929290, 1955950, 1984563, 1982078, 1965174, 2052181, 2120591, 2102774, 2197146, 2258496, 2200083, 2264446, 2284983, 2344206, 2428753, 2406941, 2429801, 2449422, 2560231, 2543072, 2602536, 2650468, 2590611, 2559725, 2617118, 2656495, 2645831, 2654474, 2601186, 2739082, 2665870, 2768565, 2871531, 2789812, 2797909, 2808889, 2734247, 2759618, 2734892, 2788551, 2793686, 2862266, 2855361, 2895317, 2930848, 2944656, 2898978, 2902084, 3009478, 3018560, 3009893, 2997144, 3049589, 3042589, 3025080, 3055128, 3145401, 3260893, 3263115, 3219693, 3299088, 3378169, 3401103, 3381859, 3357118, 3438753, 3517442, 3619323, 3569323]
4424C569323L470J62869K8630k3575O4818K4393N1387L8844P2481Q5283L0921
4413D108844N7843N920J15337O6816O1995O3163N6334J0617R8572J74718O3820
4402D883979J10263J45850Q7669J81468J79426R4202J38697J62650J76175J53702
4392F314081J03658K47576J84475K31688J99962J35596J69199J95681J84485K57878
4382H224279K55800L11682L09683K33743K59015L48456M08039M46881M43425M65497
4372A1706500N11676O34714O99279O73267P82263Q15694R58389J014729J179350
4363A8975861J310255J590103J971683K122190K062509J673606J161093l1977
4355C0835323j319679j819890j780639j443647p39014l29664J79509N79343Q60021
$$ y = [3569323, 3572793, 3735662, 3764292, 3740717, 3805535, 3829928, 3881315, 3920159, 3992640, 4077923, 4108844, 4166687, 4172607, 4287944, 4354760, 4416755, 4479918, 4536252, 4546869, 4645441, 4820159, 4883979, 4994242, 5140092, 5227761, 5409229, 5588655, 5682857, 5821554, 5984204, 6160379, 6314081, 6417739, 6665315, 6849790, 7081478, 7281440, 7417036, 7586235, 7781916, 7966401, 8224279, 8480079, 8791761, 9101444, 9335187, 9594202, 9942658, 10350697, 10797578, 11241003, 11706500, 12218176, 12852890, 13552169, 14225436, 15007699, 15823393, 16781782, 17796511, 18975861, 20286116, 21876219, 23847902, 25970092, 28032601, 29706207, 30867300, 30835323, 29515644, 27695754, 25915115, 24471468, 23732454, 23402790, 23582299, 24161642, 25021663]
4346B5021663J089824J556535K086208K628405L116667L211401K866457J984447
4338D3561607K5287k705699m380142m903844m202577l255173k335240j646052
4330B0158167j059519o04451k83528r9184K73949M76827Q01523J002009R29058
4321B1594851O89965L7947j045401j948304k397970k296332j967561j529282j140092
4312I997821q59468p49839o23256m39035m17377m14912k45131k63881l28886k43698
4302E412338j46230j63231j14008r9362j19749j03883p2528J6035K6701M2999
4292D679082j3420L7402M4016O5289L6854J36596N72M5773J13735j5219P1586
4281E202266k2186j14084p4230l711Q8341M7729J72271N2619K2307J63517K15566
$$ y = [25021663, 26111487, 27668022, 29754230, 32382635, 35499302, 38710703, 41577160, 43561607, 43586894, 40881195, 36501053, 31597209, 27394632, 24139459, 21804219, 20158167, 19098648, 18494197, 18210669, 18111485, 18385434, 18862261, 19663784, 20665793, 21594851, 22284816, 22322763, 21277362, 19329058, 16931088, 14634756, 12667195, 11137913, 9997821, 9138353, 8388514, 7765258, 7326223, 6908846, 6493934, 6248803, 5984922, 5656036, 5412338, 5266108, 5102877, 4988869, 4889507, 4769758, 4665875, 4593347, 4609382, 4636083, 4679082, 4665662, 4703064, 4747080, 4812369, 4849223, 4985819, 4986391, 5032164, 5145899, 5130680, 5202266, 5180080, 5065996, 4991766, 4988055, 5076396, 5124125, 5296396, 5349015, 5371322, 5534839, 5750405]
4270E750405K06194J53632J44354K38539K00583J37072K35599K41199K85308J95571
4260G788456J66152k1582l5932k86700k39733k19680j34504m0815q7528j5334
4250F872800Q4430L3379L7385K33446J13551K03439L21136L55698L53932N14641
4240I123837K78831j57588m14201n49603p00062n42037m71215l37059l10312j09455
4230E811136j44210j10422r5001Q7130L3487M0294L4876O7876J63013P6898k0051
4219E945026j56607k03713k74801l28272k22909k47645j67359j36494o8348j60226
4209C978652j10344o3284j3265n147n8232n372j03363j0307m3827P5419k473J6296
4197C654753j0920M4777p8557M592J8860L4866L2572J0430j3691J5524l6044L6780
$$ y = [5750405, 5956599, 6110231, 6254585, 6493124, 6693707, 6830779, 7066378, 7307577, 7592885, 7788456, 7954608, 7933026, 7897094, 7610394, 7370661, 7150981, 7016477, 6975662, 6888134, 6872800, 6957230, 6990609, 7027994, 7261440, 7374991, 7578430, 7899566, 8255264, 8609196, 9123837, 9402668, 9245080, 8830879, 8281276, 7581214, 7039177, 6567962, 6230903, 5920591, 5811136, 5666926, 5556504, 5461503, 5548633, 5582120, 5622414, 5657290, 5725166, 5888179, 5965077, 5945026, 5788419, 5584706, 5309905, 4981633, 4758724, 4511079, 4343720, 4207226, 4138878, 3978652, 3868308, 3805024, 3791759, 3786612, 3728380, 3723008, 3619645, 3609338, 3565511, 3640930, 3638457, 3654753, 3643833, 3688610, 3610053, 3614645, 3633505, 3668371, 3700943, 3711373, 3697682, 3713206, 3677162, 3713942]
4185C713942M4745L2513r986P4955J6524k869M2670L6840P1979O2707M8479R5682
4173D228181J11171k6245N9511N8997P54K5352O0812J4398M4504O2474J03041
4162D742950K4338R9527P5101J15158O991R8386J30760J13510K02953J11339J65364
4151E886377P9427J83686K21603J71908J69875J85136K17044J49017L06167K29949
4141G800189K39591L35286K33409K51563K79992K83133L59640K76691M15110M07026
4131A0881630N18666O15496N90621O33727P33619Q35437R39665R79168J147776
4122A7875805J365512J548202J732549J897386J806854J608656J139814K37959
4114B9212737o85464j196566r68104p21135j70303R2520L74210N91865Q81496
$$ y = [3713942, 3758687, 3791200, 3781214, 3856169, 3872693, 3869824, 3912494, 3949334, 4021313, 4084020, 4132499, 4228181, 4339352, 4313107, 4372618, 4431615, 4432369, 4457721, 4518533, 4532931, 4577435, 4639909, 4742950, 4767288, 4866815, 4941916, 5057074, 5064065, 5162451, 5293211, 5406721, 5609674, 5721013, 5886377, 5965804, 6149490, 6371093, 6543001, 6712876, 6898012, 7115056, 7264073, 7570240, 7800189, 8039780, 8375066, 8608475, 8860038, 9140030, 9423163, 9782803, 10059494, 10474604, 10881630, 11400296, 12015792, 12606413, 13240140, 13973759, 14809196, 15748861, 16728029, 17875805, 19241317, 20789519, 22522068, 24419454, 26226308, 27834964, 28974778, 29212737, 28527273, 27330707, 26362603, 25641468, 25471165, 25563685, 25937895, 26529760, 27411256]
4105B7411256J279731J632385J971259K110842J886111J234430K93362o06161
4097C7213215j418368k003646k155814k517570k498037j904440j448639q27362
4089B2439339m46652j47537J04060J96998N12158O94625N74153L63343l66974
4080B3923513j419101k268071k627783k544764k090357j729682j358518j094074
4072H791163q29912o75662n66399m96214l86525m26931l91427k72645l04500k52525
4062D188423j90955k09915j73949j71190j30073p3857n8283j47128r9924n7967
4052B875182m9800j00706p4661q1186K7406j14878m7654K7376J1953k7077r3779
4041B352176j0419m2341m0053M301k1695n373n3448Q4238p0053o6920M1925k6208
$$ y = [27411256, 28690987, 30323372, 32294631, 34405473, 36291584, 37526014, 37819376, 37213215, 35794847, 33791201, 31635387, 29117817, 26619780, 24715340, 23266701, 22439339, 21992687, 21845150, 21949210, 22146208, 22658366, 23352991, 23927144, 24290487, 23923513, 22504412, 20236341, 17608558, 15063794, 12973437, 11243755, 9885237, 8791163, 7961251, 7285589, 6719190, 6222976, 5836451, 5409520, 5018093, 4745448, 4440948, 4188423, 3997468, 3787553, 3613604, 3442414, 3312341, 3238484, 3180201, 3033073, 2933149, 2875182, 2825382, 2724676, 2650015, 2568829, 2596235, 2481357, 2433703, 2461079, 2473032, 2445955, 2352176, 2341757, 2299416, 2259363, 2263664, 2241969, 2236596, 2183148, 2267386, 2197333, 2130413, 2172338, 2146130]
4029B146130M5168K4129k9010N9796O6108l6857j531k6930K7556j7968J06439
4018B363030l3829k5516q8126O8434l3814M0154l3433J4473J07563K3341K6063
4007B428340r937j90620r0998j32911j05513k0730l7210q7969r8904L8999l0829
3996A661718q4187n2669j8377n1881o3588m2020r9569Q8730j2132K9638k1104
3985A334559K6595J6212j9976P665j1371J0048K2996R5767J40804K0266O731P2758
3973A723054k2994r8890j19854k01570l1269r3275p8958n4453o2584M8664k2229
3962I85642l9728N9262L7934K6086Q026J593Q6156J0426n2651J17702J64988L5635
3950A441071Q1132j3111r9841j33145r8759j25023m037r8217q5979j4222m8J7393
$$ y = [2146130, 2191298, 2215427, 2186417, 2246213, 2312321, 2275464, 2273933, 2247003, 2274559, 2256591, 2363030, 2329201, 2303685, 2215559, 2283993, 2250179, 2290333, 2256900, 2271373, 2378936, 2402277, 2428340, 2418403, 2227783, 2136785, 2003874, 1898361, 1877631, 1840421, 1752452, 1653548, 1692547, 1661718, 1577531, 1524862, 1506485, 1454604, 1391016, 1348996, 1249427, 1338157, 1326025, 1355663, 1334559, 1361154, 1377366, 1357390, 1365055, 1353684, 1363732, 1386728, 1482495, 1623299, 1643565, 1650296, 1723054, 1700060, 1601170, 1481316, 1279746, 1248477, 1155202, 1076244, 1021791, 959207, 1007871, 985642, 945914, 1005176, 1043110, 1069196, 1077222, 1078815, 1164971, 1175397, 1122746, 1240448, 1405436, 1441071, 1522203, 1509092, 1409251, 1276106, 1177347, 1052324, 1048287, 950070, 864091, 849869, 849821, 867214]
3938H67214K1037m9913k7901K0657m4561r263Q0292j6301j511j2611P6903P0473
3926I74515K0768k1695j9618Q260m7337m3034L5122m6390k3203l5797r846M175
3914G95920q2610l348L2087R0354p1181l2261j9672j9719k5164J3957Q6818R622
3902G74803j8174j2058L4813j931K5851K8473k5446M3623N8180l5963p2637L7921
3890H37455m9190L2343P0129l5847k2885N8038j7602o0336j861O3052Q8265j14919
3878H46642J04895j7147M6908Q5859P6877L1747K7846j3418R1318l1498p938j1409
3866A230682M2992J5623n4672K6566O830r2721M372N7666p4764M1930L4185n4043
3854A184646m4407O2285L3588M846L7947Q6254K2657N3462K9310J05902M6533
$$ y = [867214, 888251, 838338, 810437, 831094, 786533, 777270, 857562, 841261, 839750, 827139, 904042, 974515, 995283, 973588, 953970, 962230, 914893, 871859, 906981, 860591, 837388, 801591, 791745, 795920, 713310, 709962, 742049, 832403, 761222, 728961, 709289, 689570, 664406, 678363, 765181, 774803, 756629, 744571, 779384, 777453, 803304, 831777, 806331, 849954, 908134, 872171, 799534, 837455, 788265, 820608, 890737, 854890, 832005, 890043, 872441, 812105, 810244, 873296, 961561, 846642, 951537, 934390, 981298, 1067157, 1144034, 1175781, 1203627, 1190209, 1281527, 1250029, 1242091, 1230682, 1273674, 1289297, 1234625, 1261191, 1268021, 1175300, 1179672, 1237338, 1162574, 1204504, 1238689, 1184646, 1140239, 1202524, 1236112, 1240958, 1278905, 1365159, 1387816, 1441278, 1470588, 1576490, 1623023]
3843A623023m7900k8009n7092q7085n0352j09207j50101j1240k6134o2698n007
3832I88198N3858q694r2919J9574n340j451N9593N3817p188N778j6279j8669L8086
3819A068364k2627M816o26m0872o2763P416n799j35400j83L8251m5656o8216q832
3806G27873q443j467M4881N0538L2896j32819m6151L6080p962J0959P7377m4554
3794G39208j6303l0165l0499m32K1640K5668m7449K6690P2377Q1850m8922l4953
3782G58710j2579J8564L9698r656L6088o0923J8945J3498j9528p53j7620J0943
3770G75387M883M9461p4658K0987m1295N4471J06604K7597R691K9590k5943q334
3758I28441J7958K7491M3105k7266O3688M6962j4616j838o085l241q727K8740
$$ y = [1623023, 1575123, 1547114, 1490022, 1402937, 1352585, 1243378, 1093277, 1082037, 1055903, 993205, 988198, 1042056, 1033362, 940443, 960017, 954677, 953226, 1012819, 1066636, 1059448, 1065226, 1048947, 1030278, 1068364, 1045737, 1050553, 1049927, 1009055, 946292, 953708, 947909, 812509, 812326, 850577, 804921, 736705, 727873, 719430, 717963, 762844, 813382, 846278, 713459, 667308, 703388, 695426, 706385, 783762, 739208, 722905, 692740, 662241, 661809, 683449, 709117, 661668, 688358, 760735, 842585, 793663, 758710, 746131, 764695, 804393, 794737, 830825, 769902, 788847, 802345, 782817, 782064, 764444, 775387, 780270, 829731, 755073, 776060, 734765, 789236, 895840, 923437, 933128, 962718, 936775, 928441, 946399, 973890, 1016995, 989729, 1053417, 1100379, 1085763, 1083925, 1077840, 1074599, 1065872, 1094612]
3746A094612p5029j9668k2174N3515p7505p476j5718P0439L813l2495Q5309P1194
3734A128817o3593j6749J5805P732M5928O652P756m6907J57P696L7239p49j7471
3721A112313l6404L0055j9100n2154J9642J04387J9905K2109L443L3526L552k1868
3709A219406l3111k077P165o53P9469K1482L2322L5841j4811L1940P161k0036
3697A364098J6181l6159p069J1801L6536K2345k1039J2410L4419Q0480M9649n8111
3685A505541M0066J4544K8103L5837K5969K4441p3252J8539j8393N073K2526P2205
3673A701199K3608l0226J34926l0927Q1606O4095n7080P7552O2001L1243l0897
3662B027100Q5683M7213M3499O5937J42506M5173J30750J75560J87394K14723
$$ y = [1094612, 1019583, 999915, 977741, 1031256, 953751, 946275, 930557, 1000996, 1004809, 972314, 1057623, 1128817, 1065224, 1048475, 1064280, 1072012, 1117940, 1124592, 1132348, 1085441, 1085598, 1093294, 1130533, 1129784, 1112313, 1075909, 1105964, 1086864, 1034710, 1054352, 1158739, 1178644, 1200753, 1204196, 1237722, 1241274, 1219406, 1186295, 1184218, 1191383, 1190730, 1270199, 1291681, 1324003, 1359844, 1345033, 1376973, 1384134, 1364098, 1380279, 1344120, 1337051, 1348852, 1385388, 1407733, 1386694, 1399104, 1433523, 1514003, 1563652, 1505541, 1545607, 1560151, 1588254, 1624091, 1650060, 1674501, 1601249, 1619788, 1601395, 1606468, 1628994, 1701199, 1724807, 1694581, 1829507, 1798580, 1880186, 1944281, 1887201, 1964753, 2026754, 2057997, 2027100, 2112783, 2159996, 2203495, 2269432, 2411938, 2457111, 2587861, 2763421, 2950815, 3165538]
3652C165538J82470K63677J20028k13887l58725l69519k87081k09553K63o8832
3642B224379j17225j03437n1466r282J3667M5665K5416m4647n3227l894N1172
3631A977121K4881l3715L6599P9349M3281j09478j4853L7645K006P8390M268M1097
3619B166591Q4715k6697o2283J7729N9249k0315N1017N4746L9607J11542k4009
3608B451892L4247L7988Q125K1974r842J9589L5669M1396l297M125L4916O3463
3596B740245M5340K8835L9314R2490n1111k1601O054O7951K1830j4625O5032P4339
3584C094093j0355L2513P3914j2409P5281M6376j1711k0547P1018J3098K2439
3573C373710J04291J2482P71l35M2530M0808P2060K7624j5908P8938N8571J21304
$$ y = [3165538, 3348008, 3611685, 3731713, 3517826, 3159101, 2789582, 2502501, 2292948, 2293211, 2224379, 2107154, 2003717, 1952251, 1942969, 1956636, 2002301, 2027717, 1983070, 1929843, 1925949, 1977121, 2002002, 1968287, 2004886, 2084235, 2127516, 2018038, 2003185, 2040830, 2042836, 2121226, 2125494, 2166591, 2251306, 2224609, 2162326, 2180055, 2239304, 2218989, 2270006, 2324752, 2364359, 2475901, 2451892, 2486139, 2524127, 2532252, 2554226, 2544384, 2563973, 2599642, 2641038, 2637741, 2641866, 2676782, 2740245, 2785585, 2814420, 2853734, 2946224, 2895113, 2873512, 2879566, 2947517, 2969347, 2954722, 3019754, 3094093, 3083738, 3116251, 3190165, 3177756, 3253037, 3299413, 3287702, 3267155, 3338173, 3351271, 3373710, 3478001, 3490483, 3491254, 3490919, 3533449, 3574257, 3646317, 3673941, 3658033, 3736971, 3795542, 3916846]
3561C916846n5276R719R0078N2501R1601K6428J11436j8916J7830N0575J31015
3550D423837J47080J39797P1201O6856J88930J38378J16324J34320O7788P6663
3540E571174q187l9778N0905K510K4912O8553J05050P3496Q4173P7992K3201O3769
3528F097770Q3844J37737J16074J10839k596j92152M4083O7610J02634L4343m6076
3517F554110Q6266M1699J34028Q5619J71889J60068J52216R6060J05381J39267
3507G726603N8788J33147J16070K07524K24027J23197K03254K58438K77532K05991
3497I534571K97760L31100L24678L68638N20691N21715N22554N78711O76570Q69932
3487A4546920Q16596J042251J059138J146549J372687J601229J749659J958220
$$ y = [3916846, 3861570, 3871289, 3961367, 4013868, 4105469, 4131897, 4243333, 4224417, 4242247, 4292822, 4423837, 4570917, 4710714, 4781915, 4848771, 5037701, 5176079, 5292403, 5426723, 5494511, 5571174, 5562987, 5523209, 5574114, 5576624, 5601536, 5670089, 5775139, 5848635, 5932808, 6010800, 6034001, 6097770, 6181614, 6319351, 6435425, 6546264, 6543668, 6351516, 6395599, 6463209, 6565843, 6600186, 6554110, 6640376, 6682075, 6816103, 6901722, 7073611, 7233679, 7385895, 7481955, 7587336, 7726603, 7785391, 7918538, 8034608, 8242132, 8466159, 8589356, 8792610, 9051048, 9328580, 9534571, 9832331, 10163431, 10488109, 10856747, 11377438, 11899153, 12421707, 13000418, 13676988, 14546920, 15363516, 16405767, 17464905, 18611454, 19984141, 21585370, 23335029, 25293249]
3479B5293249J960747J735803J174308J76914p62683j263425j261836q81956l39581
3470B5831540K0103K58457M85753P10733J152705J398629J688955J997297J701688
3461C5245860J173166O62614k15213j117994j904716k536136k635002k514247
3453B6158332j955214j417506r21029n12403k04202q5711Q2528M44528N46484
3444B2135807N39643L52566j61000j026571j933455k300476k295829j922693j532201
3435A1855791j180781j075180q47520o94122n46289m14153k95826l79100k29614
3426F193206k52733k27938j60382j96067k1692m9765q1668n7384j29663q5697
3416D930217j07973j59703j33352k04893j00396j74342p8966k5480p0960j07081
$$ y = [25293249, 27253996, 28989799, 30164107, 30341021, 29578338, 28314913, 27053077, 26171121, 25831540, 25851643, 26110100, 26595853, 27306586, 28459291, 29857920, 31546875, 33544172, 35245860, 36419026, 37081640, 36866427, 35748433, 33843717, 31307581, 28672579, 26158332, 24203118, 22785612, 21864583, 21352180, 21147978, 21062267, 21144795, 21589323, 22135807, 22675450, 23028016, 22867016, 21840445, 19906990, 17606514, 15310685, 13387992, 11855791, 10675010, 9599830, 8752310, 8058188, 7511899, 7097746, 6801920, 6422820, 6193206, 5940473, 5712535, 5552153, 5356086, 5334394, 5284629, 5202961, 5145577, 5015914, 4930217, 4822244, 4662541, 4529189, 4324296, 4223900, 4049558, 3970592, 3945112, 3874152, 3767071]
3406C767071j04668N4924n4059p2233o5506l6778O0763p1215k5246N632P700n8390
3394C407995J0897o6894J4587j7478o8554n2297k1055p9424m5935m9170j7519
3383C015153m0482j10O993P66P493o9063p4013J1587O986n3553J8077M9608L4054
3370B913496q9761P607n893L7191J3916q5471K5753M5969k272j2886J6589j09988
3358B754250O2026P4114J6230J9213L6799l4082O2432M9265k2998L3939P7117
3347C128305j0332j5063j6693k076M065j0729j731Q9172O7451k2385j2748M6134
3335C243370N5473J3175m1548l6806N8345j5988P6833L8925k5968R754K2259K2941
3323C420765m1149J03300M0639j3454K6702J7363j5207N9924J9770m2004O1504
$$ y = [3767071, 3662403, 3717327, 3663268, 3591035, 3525529, 3488751, 3549514, 3478299, 3453053, 3458685, 3466385, 3407995, 3418892, 3351998, 3366585, 3349107, 3280553, 3228256, 3207201, 3127777, 3081842, 3032672, 3015153, 2974671, 2974561, 2981554, 2982320, 2989813, 2920750, 2846737, 2858324, 2865310, 2811757, 2829834, 2879442, 2913496, 2823735, 2831342, 2825449, 2862640, 2876556, 2791085, 2816838, 2862807, 2860535, 2847649, 2864238, 2754250, 2816276, 2890390, 2906620, 2925833, 2962632, 2928550, 2990982, 3040247, 3017249, 3051188, 3128305, 3117973, 3102910, 3086217, 3084141, 3088206, 3077477, 3075746, 3164918, 3232369, 3209984, 3197236, 3243370, 3298843, 3312018, 3270470, 3233664, 3292009, 3276021, 3352854, 3391779, 3365811, 3375565, 3397824, 3420765, 3379616, 3482916, 3523555, 3510101, 3536803, 3554166, 3538959, 3598883, 3618653, 3576649, 3638153]
3312C638153P0434j5827j2185J08034J12506k3908j40022L0242N5584k5078P443
3301C805376J19062J7260M7626j7297O1566O5672O7774j3426j8812K0581J549
3290D156931R1709P4065k7229M9430J17824Q0406J6500J1316j6486j3175O0155
3279D601446j3731K8429L4582j2642n113l2814M5032J11860M5576K6709N6355
3268D885689K4741R0302M7894P5372l1780R3479P8510N9405k356R9245N7451R5496
3256E573448J8669L1687M1173P8177K8901L7871Q6749O2829J07369N0276O7280
3245F184429k6508R0027J07784N1726L8464J41189J31412M4218J47597J61248
3235G071586J62621P9344Q3183Q9724J24299J31011J85759J80870J29736K33410
$$ y = [3638153, 3708587, 3692760, 3680575, 3788609, 3901115, 3877207, 3737185, 3767427, 3823011, 3797933, 3805376, 3924438, 3941698, 3989324, 3972027, 4033593, 4099265, 4167039, 4153613, 4134801, 4155382, 4156931, 4248640, 4322705, 4295476, 4344906, 4462730, 4543136, 4559636, 4570952, 4554466, 4541291, 4601446, 4587715, 4616144, 4650726, 4638084, 4632971, 4600157, 4645189, 4757049, 4802625, 4829334, 4885689, 4910430, 5000732, 5048626, 5123998, 5092218, 5185697, 5264207, 5323612, 5321256, 5420501, 5477952, 5573448, 5592117, 5623804, 5664977, 5743154, 5772055, 5809926, 5896675, 5959504, 6066873, 6117149, 6184429, 6157921, 6247948, 6355732, 6407458, 6445922, 6587111, 6718523, 6762741, 6910338, 7071586, 7234207, 7313551, 7396734, 7486458, 7610757, 7741768, 7927527, 8108397, 8238133, 8471543]
3225H471543J48241J81820J79155K12339J76246L46442L14107L06723L29041L08806
3215A0974463M32549M06661M19167M47686L41322K88371M01982M86470N69343
3206A4768014O96969P36185P78758O31614N03189L35824M64580L33688M55669
3197A9704490P90955Q99363J061934J176506J068069O58888J12335k41667m49191
3188B4781682k27864m8626L69135P98448J004343J117566O47234O6117o99397
3179B7808638j280317j525128j222474o45580k97948J33611L66061M47813O9201
3170B3853877n38536j096978j537482j584045j232302q72353n39889k82931K3308
3161A6192669J6339j53315l99201p40277o28045q35001n89567k30448j84156o7236
$$ y = [8471543, 8619784, 8801604, 8980759, 9193098, 9369344, 9715786, 10029893, 10336616, 10665657, 10974463, 11407012, 11813673, 12232840, 12680526, 13021848, 13310219, 13712201, 14198671, 14768014, 15464983, 16201168, 16979926, 17611540, 18114729, 18450553, 18915133, 19248821, 19704490, 20495445, 21394808, 22456742, 23633248, 24701317, 25360205, 25472540, 25230873, 24781682, 24553818, 24505192, 24874327, 25672775, 26677118, 27794684, 28441918, 28508035, 27808638, 26528321, 25003193, 23780719, 23135139, 22837191, 22970802, 23336863, 23784676, 23853877, 23315341, 22218363, 20680881, 19096836, 17864534, 16992181, 16452292, 16169361, 16192669, 16209008, 16055693, 15656492, 14916215, 14288170, 13453169, 12863602, 12633154, 12448998, 12381762]
3151A2381762N743L2621J18089J8221K8221Q8438J36613K57595L37040L67834
3141A3772177L85647L25178K25160J58531J69927K68468L78755N54716O44213
3132A6882772P67052O88763O05216M14252j0273k00062l03145k05643J05616K90778
3122A9035326M68735O13376N64706K61690j36939n22549q62836r67298p47691
3113A7706520m36590k38033o2826M5413M6958j83462n33430q55661r78132r08061
3103A3602696q62766o28911m92785k84437k58440k25254k92831m21877n69246
3094I566149n66615m67240m74522l55812k71924k21164q2599k41813k19738k08469
3084F456253j16567j70849k09495j84883p7488j05891j40505k89l2561j196m2471
$$ y = [12381762, 12387505, 12420126, 12538215, 12556436, 12584657, 12673095, 12809708, 13067303, 13404343, 13772177, 14157824, 14483002, 14708162, 14866693, 15036620, 15305088, 15683843, 16238559, 16882772, 17649824, 18338587, 18943803, 19358055, 19347782, 19147720, 18844575, 18638932, 18744548, 19035326, 19504061, 20117437, 20682143, 20943833, 20806894, 20284345, 19421509, 18454211, 17706520, 17269930, 17031897, 16969071, 17014484, 17061442, 16877980, 16344550, 15488889, 14510757, 13602696, 12739930, 12111019, 11618234, 11333797, 11075357, 10850103, 10557272, 10135395, 9566149, 8999534, 8532294, 8057772, 7701960, 7430036, 7208872, 7126273, 6884460, 6664722, 6456253, 6339686, 6168837, 5959342, 5774459, 5696971, 5591080, 5450575, 5450286, 5417725, 5416529, 5374058]
3073E374058k3000k9504O097j42273r159N415J3152k383k5139L446r5482j5495
3061E059733J875j8060L3108N6129J0171p5907K3326p6270l6029M9223N5085k9869
3049E052515L8250k3973L45J9306L1152l5879N8984p816n3145k2527O0196P7404
3037E194812j4371l6323R0752O4501p0699L1027l1575j1164O3330O0872n2552
3026E288610p579J43532N4670p0426j758J17782J57J272M7027m9357Q9768O4730
3014E678428M7791L6881Q3249L8827N7199Q8466n836K6831p0707P7497Q3272j6600
3002F125298J2555L6338k1346M3938M5079P915M0668K470m3117N1569j9788k9761
2990F251818L6597m44L4334L3977l9838R495J6301J1889N4664M5859l1893R355
$$ y = [5374058, 5351058, 5321554, 5327651, 5185378, 5176219, 5181634, 5194786, 5192403, 5167264, 5170710, 5075228, 5059733, 5061608, 5043548, 5076656, 5132785, 5142956, 5067049, 5090375, 5014105, 4978076, 5027299, 5082384, 5052515, 5090765, 5066792, 5067137, 5086443, 5117595, 5081716, 5140700, 5132884, 5079739, 5057212, 5117408, 5194812, 5180441, 5144118, 5234870, 5299371, 5228672, 5259699, 5228124, 5216960, 5280290, 5341162, 5288610, 5281031, 5424563, 5479233, 5408807, 5407049, 5524831, 5524988, 5526260, 5573287, 5523930, 5613698, 5678428, 5726219, 5763100, 5846349, 5885176, 5942375, 6030841, 6025005, 6051836, 5981129, 6058626, 6141898, 6125298, 6137853, 6174191, 6152845, 6196783, 6241862, 6249777, 6290445, 6292915, 6249798, 6301367, 6281579, 6251818, 6288415, 6287971, 6322305, 6356282, 6316444, 6325939, 6342240, 6354129, 6408793, 6454652, 6422759, 6432114]
2978F432114R2888N2770n263K6594K4091k4113P9868J07827R8073p5082J7103
2967F826870M0634n260O9861K9497m670K8263O7028K2376J10918L2839K7742L6689
2955G282787l6270L9579O3548O7178j8525Q1221M9415L7681N0162J04099N1138
2944G772013K2671q591L2856M9970K1296O6312M4082K4753Q6167L6115Q9124O4337
2932H301105P4277N578O4393J74128M3368o605O0009Q4071P7319N0174O5551L0568
2920I023936M4553R9399L3216j1229J17220M5845J04225p213N6140J34050K0251
2909I660393O0143l2825O312P4345Q5289n6616K7746J46624L8483K5790N4757
2898A0090441J06587R4635K7443P6448O6029J0738R0285L5512J27325J42786J12039
$$ y = [6432114, 6525002, 6577772, 6572509, 6599103, 6623194, 6599081, 6678949, 6786776, 6884849, 6809767, 6826870, 6867504, 6862244, 6932105, 6961602, 6956932, 6985195, 7052223, 7074599, 7185517, 7218356, 7246098, 7282787, 7246517, 7286096, 7349644, 7416822, 7398297, 7479518, 7528933, 7566614, 7616776, 7720875, 7772013, 7794684, 7786093, 7818949, 7868919, 7890215, 7956527, 8000609, 8025362, 8111529, 8147644, 8236768, 8301105, 8375382, 8380960, 8445353, 8619481, 8662849, 8656244, 8716253, 8800324, 8877643, 8927817, 8993368, 9023936, 9068489, 9167888, 9201104, 9189875, 9307095, 9352940, 9457165, 9449952, 9506092, 9640142, 9660393, 9720536, 9687711, 9694023, 9768368, 9853657, 9797041, 9824787, 9971411, 10009894, 10035684, 10090441, 10197028, 10291663, 10319106, 10395554, 10461583, 10472321, 10562606, 10598118, 10725443, 10868229, 10980268]
2887A0980268M0809Q0424L6700J31388L3191N0949J60604N2598J78203J05336
2877A1850470O6988J15347J27373J62231M3562J17800N3033Q9789J42118L7150
2867A2805861J11501R8011L5797J08858J11052Q186J21356M2004Q4185M1309J05744
2856A3673864R1377J11747J11308P0255M1021P4681J71826J81223N7285J12897
2846A4697484P2076J47785J78169J14253J30286J18094R9594J71002P3894J15463
2836A5918100K52590J32991J22062J52971J30746K29868J46326J43325K11234
2827A7440213J62120J64781J00273K1951J22856J68770Q1435P4918J50175J17244
2817A8604736J09319J10625J49083R9213L7458N4097O4733J04219J19717Q6403
$$ y = [10980268, 11021077, 11101501, 11138201, 11269589, 11302780, 11353729, 11514333, 11566931, 11745134, 11850470, 11917458, 12032805, 12160178, 12322409, 12365971, 12483771, 12536804, 12626593, 12768711, 12805861, 12917362, 13015373, 13051170, 13160028, 13271080, 13279266, 13400622, 13442626, 13526811, 13568120, 13673864, 13765241, 13876988, 13988296, 14058551, 14099572, 14174253, 14346079, 14527302, 14584587, 14697484, 14769560, 14917345, 15095514, 15209767, 15340053, 15458147, 15557741, 15728743, 15802637, 15918100, 16170690, 16303681, 16425743, 16578714, 16709460, 16939328, 17085654, 17228979, 17440213, 17602333, 17767114, 17867387, 17889338, 18012194, 18180964, 18262399, 18337317, 18487492, 18604736, 18714055, 18824680, 18973763, 19072976, 19110434, 19164531, 19229264, 19333483, 19453200, 19539603]
2807A9539603J54928M6377J49836J08897J51874J56779J84404J85010J08541K36068
2797B1022317J81292J74531K77238K29190K14594J68174K49324K38911K00725
2788B2956296K72630K79374L38551K88404K87567L46198L05656L01092K51691
2779B5627459K10473J76884K16620J77550J10874J98475K03679K46790K25802
2770B7394606K94273K45378J65611J45054K93437K07237K09931J90460J77065
2761B9323052K59598K41854K36951L38581L07815M13255L96978K95749L85736
2752C2199569M49828M93000L81460M53233N48119M07368M91042M52595N31931
2743C6408145N58640N81259O54585N50319O28312O85570O91684O79034O15372
$$ y = [19539603, 19694531, 19740908, 19890744, 19999641, 20151515, 20308294, 20492698, 20677708, 20786249, 21022317, 21203609, 21378140, 21655378, 21884568, 22099162, 22267336, 22516660, 22755571, 22956296, 23228926, 23508300, 23846851, 24135255, 24422822, 24769020, 25074676, 25375768, 25627459, 25837932, 26014816, 26231436, 26408986, 26519860, 26718335, 26922014, 27168804, 27394606, 27688879, 27934257, 28099868, 28244922, 28538359, 28745596, 28955527, 29145987, 29323052, 29582650, 29824504, 30061455, 30400036, 30707851, 31121106, 31518084, 31813833, 32199569, 32649397, 33142397, 33523857, 33977090, 34525209, 34932577, 35423619, 35876214, 36408145, 36966785, 37548044, 38202629, 38752948, 39381260, 40066830, 40758514, 41437548, 42052920]
2734D2052920P47634Q65752Q16426Q82048Q80232R15219J002677R70723J121547
2725E0255178J197515J284849J418112J517527J691761J848541J998599K290276
2717F3502358K603927K919812L242715L736123M286946M728398M865584M799329
2709I4685192M273748L528683K385828J211049K39496o98326j053253r36496m78584
2700A03157337j34215J41192J06313k98973j145025k074711k918628l849080m417342
2691H8566868m651590m343265l793366l213864k467330j864421j462225j078816
2683F5691991o69449n37125j81901j13633m2269J57448J87289L56076L58060M15632
2673F5622119N79808O02581N37200O72382N87570O27051P32203P44374P44928
$$ y = [42052920, 42800554, 43666306, 44482732, 45364780, 46245012, 47160231, 48162908, 49133631, 50255178, 51452693, 52737542, 54155654, 55673181, 57364942, 59213483, 61212082, 63502358, 66106285, 69026097, 72268812, 76004935, 80291881, 85020279, 89885863, 94685192, 98958940, 102487623, 104873451, 106084500, 106323996, 105625670, 104572417, 103635921, 103157337, 103023122, 103164314, 103270627, 102971654, 101826629, 99751918, 96833290, 92984210, 88566868, 83915278, 79572013, 75778647, 72564783, 70097453, 68233032, 66770807, 65691991, 65022542, 64485417, 64303516, 64189883, 64147614, 64305062, 64492351, 64848427, 65206487, 65622119, 66201927, 66804508, 67341708, 68014090, 68601660, 69228711, 69960914, 70705288, 71450216]
2664G1450216P92707Q01954Q02196P95586Q25765Q93920P82672Q25458P93876
2655G8764350P47026O91530P38677O22646N77094N64169O85529O60182O05952
2646H4657155O14006O62705P16586N88947P23583P07021P53646Q01331Q62085
2637I1087065R55238J016520J103685J234422J228785J462863J641127J697607
2629A01427312J976256K311771K684753K964458L359696L763726M290256M782710
2621A27560938N404946O404046P351542Q482473R386673R909912R452150Q021350
2613A91974030O222880L959102J542356o46864k020189k483367k170625j535847
2605A94841476j259451j519749k303726l498479m950010o524232p987728q908908
$$ y = [71450216, 72242923, 73044877, 73847073, 74642659, 75468424, 76362344, 77145016, 77970474, 78764350, 79511376, 80202906, 80941583, 81564229, 82141323, 82705492, 83391021, 84051203, 84657155, 85271161, 85933866, 86650452, 87239399, 87962982, 88670003, 89423649, 90224980, 91087065, 92042303, 93058823, 94162508, 95396930, 96625715, 98088578, 99729705, 101427312, 103403568, 105715339, 108400092, 111364550, 114724246, 118487972, 122778228, 127560938, 132965884, 139369930, 146721472, 155203945, 164590618, 174500530, 183952680, 191974030, 198196910, 202156012, 203698368, 203051504, 201031315, 198547948, 196377323, 194841476, 193582025, 192062276, 189758550, 186260071, 181310061, 174785829, 166798101, 157889193]
2597A57889193r209555q695611p904917o744915n536187m548751l340615k370796
2589A09537846j351694o27178j21264N52589J154412J557561K083500K665061
2581A15450833L201405L817700M659151N475073O460377P498787Q766853R913569
2573A65243748J0787906J1336059J1158347J0312974Q700709P005085M983895
2566B29528723K550013k28168k626874l991350m367026l941048l322721l027841
2558B10573708l188846l607133m520291n638717p221129q600399r636225j0349553
2550A57811415j0510672j0224009r727483q792199p816760o676076n455274m443452
2542I4165490l580476k702665j726517q17452j6682N94618J159109J482488J483465
$$ y = [157889193, 148679638, 139984027, 132079110, 125334195, 119798008, 115249257, 111908642, 109537846, 108186152, 107558974, 107437710, 107990299, 109144711, 110702272, 112785772, 115450833, 118652238, 122469938, 127129089, 132604162, 139064539, 146563326, 155330179, 165243748, 176031654, 187367713, 198526060, 208839034, 217539743, 224544828, 229528723, 232078736, 231850568, 229223694, 225232344, 220865318, 216924270, 213601549, 210573708, 207384862, 203777729, 199257438, 193618721, 186397592, 177797193, 168160968, 157811415, 147300743, 137076734, 127349251, 118557052, 110740292, 104064216, 98608942, 94165490, 90585014, 87882349, 86155832, 85338380, 85321698, 85916316, 87075425, 88557913, 90041378]
2533I0041378J305595J081525O38358J60990j40468l35705m33813l92029k44299
2524I1681532k02816k22116m78223j006223j200045j429586j699499j925643k132256
2515H1385125k303608k345600k429380k384997k167435k136986j946460j887498
2507F3783161j694646j329108r15858n97459k75358Q7689M09021P43424J037655
2498F1248521J379950J730366K259902K697508L336640L868846M154278M476311
2490H5152322M382485M214486L637496L061061K700830J936050R09795l88493
2482A05606032j490190k431979l231834m160360m948678n518509n679331n633786
2474G2511365n372323m838043m223493l442624k870693k218906j666422j357590
$$ y = [90041378, 91346973, 92428498, 93066856, 93227846, 93087378, 92751673, 92317860, 91925831, 91681532, 91478716, 91256600, 90778377, 89772154, 88572109, 87142523, 85443024, 83517381, 81385125, 79081517, 76735917, 74306537, 71921540, 69754105, 67617119, 65670659, 63783161, 62088515, 60759407, 59843549, 59246090, 58970732, 59058421, 59467442, 60210866, 61248521, 62628471, 64358837, 66618739, 69316247, 72652887, 76521733, 80676011, 85152322, 89534807, 93749293, 97386789, 100447850, 103148680, 105084730, 105994525, 105606032, 104115842, 101683863, 98452029, 94291669, 89342991, 83824482, 78145151, 72511365, 67139042, 62300999, 58077506, 54634882, 51764189, 49545283, 47878861, 46521271]
2466D6521271q99484n70532k74137j30617J15048K28471L78242N94888P07945
2457D6671095Q76048J175730J212606J245403J366882J357929J265587J149729
2449E6321009J132283J119884J162487R80664N47558J05803k10698l01455l01991
2440F0555544m34799m63231o06000o05309l44110o7310K90673N54867Q30247J012728
2430F0723300J111534J024953Q00741N24381R788k71490o20505q45866j041098
2421F1415738j063366j021709j066235j313449j405411j400572j285852j282233
2413E1576911j201889j095319r83063r66754p51106o92114m69781k04499k8280
2404D5184106J31746J65450L54624M07541M48341N05115N86964P14047Q01724
$$ y = [46521271, 45621787, 45051255, 44777118, 44646501, 44761549, 44990020, 45368262, 45963150, 46671095, 47547143, 48722873, 49935479, 51180882, 52547764, 53905693, 55171280, 56321009, 57453292, 58573176, 59735663, 60716327, 61263885, 61369688, 61158990, 60857535, 60555544, 60120745, 59657514, 59051514, 58446205, 58102095, 58034785, 58325458, 58880325, 59710572, 60723300, 61834834, 62859787, 63660528, 64184909, 64194697, 63923207, 63302702, 62456836, 61415738, 60352372, 59330663, 58264428, 56950979, 55545568, 54144996, 52859144, 51576911, 50375022, 49279703, 48296640, 47329886, 46578780, 45886666, 45416885, 45212386, 45184106, 45315852, 45481302, 45835926, 46243467, 46691808, 47196923, 47783887, 48497934, 49299658]
2395D9299658R39828R93541J247662J478290J540844J729338J909427K103481
2387F1242069K107680K370769K451236K636814K567420K624798K452049K188396
2379H0641231J694158J272899N11690l061n26689j264884k033015k590638k876669
2370G4825022k800084k700519k218034j817785j363670q39439l96720J55377N52379
2361F3396527Q97660J158885J355607J616296J805155K204284K459683K682832
2353G7576929K958566L114393L251755L244986L116399K965939K751719K507779
2345A01488465J974881J263459O32087J90592P6311k17805l61481l27796k25686
2336A04493027J09089N56572J126847J399077J681669J695923K345197L138984
$$ y = [49299658, 50239486, 51233027, 52480689, 53958979, 55499823, 57229161, 59138588, 61242069, 63349749, 65720518, 68171754, 70808568, 73375988, 76000786, 78452835, 80641231, 82335389, 83608288, 84119978, 84116917, 83590228, 82325344, 80292329, 77701691, 74825022, 72024938, 69324419, 67106385, 65288600, 63924930, 63085491, 62688771, 62844148, 63396527, 64294187, 65453072, 66808679, 68424975, 70230130, 72434414, 74894097, 77576929, 80535495, 83649888, 86901643, 90146629, 93263028, 96228967, 98980686, 101488465, 103463346, 104726805, 105358892, 105549484, 105625795, 105407990, 105046509, 104718713, 104493027, 104602116, 105158688, 106285535, 107684612, 109366281, 111062204, 113407401, 116546385]
2328A16546385L937655N104400O688342Q694235J0328178J0868953J0543740J0707555
2320A83419443J2297743J6825334K4150111L2298323L8355955M3151320M0270996
2313C90769225K1146010k2666370n9609495o3278383m9974313l5488325k4767631
2306A56130718j7147205j2669499j0151115q739049p266597n849177m712705l805225
2298H5790146k984307k285609j860425j363260q92136o21510k82231P1890L45142
2289G5917700N45736J089887J765951K388056L188114M139919N055358N911321
2281A00002042O375051O891332P767075R488322J2118372J5439485J8387906K0430118
2273A96899703K0450649J5424722K157735j7312619l0385597l1695958k7045497
$$ y = [116546385, 120484040, 125588440, 132276782, 140971017, 151299195, 162168148, 172711888, 183419443, 195717186, 212542520, 236692631, 268990954, 307346909, 350498229, 390769225, 411915235, 389248865, 329639370, 266360987, 216386674, 180898349, 156130718, 138983513, 126314014, 116162899, 107423850, 100157253, 94308076, 89595371, 85790146, 82805839, 80520230, 78659805, 77296545, 76404409, 75782899, 75500668, 75572558, 75917700, 76463436, 77553323, 79319274, 81707330, 84895444, 89035363, 94090721, 100002042, 106377093, 113268425, 121035500, 130523822, 142642194, 158081679, 176469585, 196899703, 217350352, 232775074, 234932809, 217620190, 187234593, 155538635, 128493138]
2266A28493138k1177325j6110555j2271078r680998p949358o607742n566085m603146
2258D4526851l844295l160418k820418k365190k098844j847235j555522j561455
2250B5273474j337549j177027j118488j049989j011564q13423p35484p82609o33277
2241A6614064o86480n43892m97562n03482m75836l91951m03682l48664l72714
2232A2389801k88403k60415l26021l51138l03295k89414k94806k20407k69309
2223I786593k61783j61618k70978p3410k23655k98918j09736j00757k04044j14578
2213G967116j51013j07385j87467j00856j94605k13122j00280k6142j39490m0745
2203F706011j56511j96165q4804k8273j74076j33414n7853n0399j28338j25418
$$ y = [128493138, 107315813, 91205258, 78934180, 69253182, 61303824, 54696082, 49129997, 44526851, 40682556, 37522138, 34701720, 32336530, 30237686, 28390451, 26834929, 25273474, 23935925, 22758898, 21640410, 20590421, 19578857, 18765434, 18029950, 17247341, 16614064, 15927584, 15383692, 14886130, 14382648, 13906812, 13514861, 13111179, 12762515, 12389801, 12101398, 11840983, 11514962, 11163824, 10860529, 10571115, 10276309, 10055902, 9786593, 9524810, 9363192, 9092214, 9018804, 8795149, 8496231, 8386495, 8285738, 8081694, 7967116, 7816103, 7708718, 7521251, 7420395, 7225790, 7012668, 6912388, 6886246, 6746756, 6706011, 6549500, 6353335, 6268531, 6240258, 6066182, 5932768, 5874915, 5824516, 5696178, 5570760]
2193E570760j10915j01610m7719m6193j01127o1921l2391r5612k6788q7989n117
2182D853378r1604q1963j00648j27675n6117M4644k9492q1272k1013p8716j918
2171D227604r5158j2320o5751q0441q3462R020J7893k6186K697J7212Q0532m4579
2159C947061j12523k9429q0728p6467K1651o5296k1770r7905p8022o5833M9888
2148C390627J1459j1762j3602q7129R592L7673l6842n9885l7636k783o2351K4340
2136C161701J7095O893o7352J4754q2202K2564J3610k036l3395l1760o6503p0944
2124B882425L0445K8012p5803J295M2194N6795N900M1566j00841K417K7456k4677
2112B917184l1897M1860J42811N4116L2337K7027J25210R7817Q8604K19944K54662
$$ y = [5570760, 5459845, 5358235, 5310516, 5264323, 5163196, 5101275, 5068884, 4973272, 4946484, 4858495, 4853378, 4761774, 4679811, 4579163, 4451488, 4395371, 4440015, 4410523, 4329251, 4308238, 4229522, 4227604, 4132446, 4120126, 4054375, 3973934, 3890472, 3899492, 3917385, 3891199, 3893896, 3911108, 3991640, 3947061, 3834538, 3805109, 3724381, 3647914, 3669565, 3604269, 3582499, 3484594, 3406572, 3340739, 3390627, 3402086, 3390324, 3376722, 3289593, 3299185, 3336858, 3300016, 3240131, 3202495, 3199712, 3137361, 3161701, 3178796, 3185689, 3118337, 3133091, 3050889, 3073453, 3087063, 3085027, 3051632, 3019872, 2953369, 2882425, 2912870, 2940882, 2865079, 2866374, 2908568, 2965363, 2971263, 3012829, 2911988, 2914405, 2941861, 2917184, 2885287, 2927147, 3069958, 3124074, 3156411, 3183438, 3308648, 3406465, 3495069, 3715013, 3969675]
2101C969675J51982l2346l47610l16092l02978j73047j78841j32253j6023j90633
2091B431834n1364m4377j1450l6078r0312q1653l5787o5648K7912L0427m4458
2080B029046K3315m3838l5334M6907l0947l5213j2329o549J5866O9441k2850O0896
2068B058411n959l2974N6841M3048P0780Q7289Q9059O1842N8714J2819q1143j04663
2056B314064j17949j84442k36282r4638l5897j07669k5457l9772o135n6630J1120
2045A420313q1005m8644m6339q158Q2728n8549J0023q7808K5525O9844j14273
2034A163657K5935j8746j33p1287k8351P7029p311n7981L5486k1621n284j192
2022A090201j3745l2131j7275P8341m1925o3333J5217m3525m4006p235P8025k9037
$$ y = [3969675, 4121657, 4089311, 3741701, 3425609, 3122631, 2949584, 2770743, 2638490, 2622467, 2431834, 2380470, 2336093, 2324643, 2288565, 2198253, 2116600, 2080813, 2015165, 2043077, 2073504, 2029046, 2052361, 2008523, 1973189, 2020096, 1989149, 1953936, 1941607, 1935058, 1950924, 2020365, 1997515, 2058411, 2052452, 2019478, 2076319, 2119367, 2190147, 2277436, 2366495, 2428337, 2487051, 2499870, 2418727, 2314064, 2196115, 2011673, 1775391, 1680753, 1644856, 1537187, 1511730, 1471958, 1465823, 1409193, 1420313, 1339308, 1290664, 1244325, 1236167, 1318895, 1260346, 1270369, 1182561, 1208086, 1277930, 1163657, 1189592, 1170846, 1170713, 1099426, 1071075, 1148104, 1140793, 1082812, 1118298, 1096677, 1091393, 1090201, 1076456, 1044325, 1027050, 1105391, 1063466, 1000133, 1015350, 971825, 927819, 920584, 998609, 969572]
2010I69572q884J7949L5915p4968J0390J2562r003l031n445p9654m4707K9469
1998H50165L9613o5274n330L4214L1301n3230K2500L8734q896J2018q1707J9416
1986H33524K6437k8809j9667N991r1325k3991N7403n4902M5338J4921M3524o915
1974H01529j03617N0821l7573O6649q925m4529n6540L177M1884k7854j0937J5939
1962F90024O9146N874N718O139k4301l0685J7334K4690J934L1383p2815p781k1729
1949F94931J4047N3591M7530j7877n4215r33o3112p2613R1948K6259m781l4467
1937F80308P0748r454j7743j2833N1557q0516q8703M1669K0272n6860K8421J0818
1925F37684k8114J8318Q921O6719l1193K2152k1690o4160m2638N6078O177k1440
$$ y = [969572, 960688, 978637, 1014552, 939584, 949974, 962536, 953533, 950502, 945057, 865403, 820696, 850165, 889778, 824504, 819174, 853388, 884689, 831459, 853959, 892693, 883797, 895815, 814108, 833524, 859961, 831152, 811485, 817476, 726151, 702160, 759563, 704661, 749999, 764920, 808444, 801529, 697912, 748733, 711160, 777809, 768884, 724355, 667815, 670992, 712876, 685022, 674085, 690024, 759170, 765044, 770762, 776901, 752600, 721915, 739249, 763939, 765873, 797256, 724441, 716660, 694931, 708978, 762569, 810099, 792222, 738007, 737074, 673962, 601349, 693297, 719556, 714775, 680308, 751056, 741602, 723859, 711026, 762583, 682067, 593364, 635033, 655305, 598445, 626866, 637684, 609570, 627888, 636809, 703528, 672335, 694487, 672797, 608637, 565999, 622077, 628254, 606814]
1913F06814K4217j1230j1547K3578j2769N5604j04768l9760r260K707J9183L3636
1901E76405L147O082P5657o9460k2227Q3901J0156P067r3095N3306K2593O662
1889F60194L5045j3522m4204K5561j07769n3637J02600K8864J1596l5660n672
1878F03396L299j1987L2882M4981p8647J1231p1208R3022q724P030N6220n6621
1866F24874j1533n0549Q5030p999o3662M4725L487L4509o424l8295m8942r614
1854E55607M8854Q377J4871Q157o8518R77K4884K4689L1670o604q0514Q7827J5627
1841F65904K6515m0947o7547O3681M1170j7118m8540r6842J17206K6335m2641
1830F27176l0243N4953L8055k2118n884k6085n2992K9765L8778q137j5246j0005
$$ y = [606814, 631031, 619801, 608254, 631832, 619063, 674667, 569899, 530139, 520879, 523586, 542769, 576405, 579552, 585634, 661291, 591831, 569604, 653505, 663661, 670728, 577633, 630939, 653532, 660194, 695239, 681717, 637513, 663074, 555305, 501668, 604268, 633132, 644728, 609068, 603396, 606695, 594708, 627590, 672571, 593924, 605155, 533947, 626969, 618245, 625275, 681495, 624874, 613341, 562792, 647822, 639823, 576161, 620886, 624373, 658882, 652458, 614163, 565221, 555607, 604461, 612838, 627709, 635866, 567348, 568325, 593209, 617898, 649568, 642964, 562450, 650277, 665904, 692419, 651472, 583925, 647606, 688776, 671658, 623118, 526276, 643482, 669817, 627176, 596933, 651886, 689941, 667823, 661939, 635854, 582862, 612627, 651405, 643268, 628022, 618017]
1818F18017O9151r6892N2433j9744J00715k2368K7754o5314L4208l2067K5866
1807F91759Q9631l4447N0970l6457j0834L2948N1262j0017m0136Q6690K5228j403
1795H95194M4854M2350K1391R8219L3432j9416j8928M1329P3639K674O2839N6438
1783A334015N5779l1887J00778O4890Q1136J46537K9103O1339J24612J1101J39440
1772B116843M7773N0207J01099R7110K20974J95144L24677K64629J86722K08022
1762C813200K43319K77427M34915O03534J016409Q72570J324939J522867J662874
1753A1772054j97686k662308k234345j551954j058142p54850n29153m27704k51239
1744B104673j82167j43752j43133j45840k00676j02458j22919o8314o0776l332
$$ y = [618017, 687168, 590276, 642709, 622965, 723680, 701312, 729066, 663752, 697960, 665893, 691759, 781390, 746943, 797913, 761456, 750622, 783570, 834832, 824815, 784679, 871369, 896597, 895194, 940048, 982398, 1003789, 1102008, 1135440, 1116024, 1097096, 1138425, 1212064, 1214738, 1277577, 1334015, 1389794, 1357907, 1458685, 1523575, 1604711, 1751248, 1780351, 1841690, 1966302, 1977403, 2116843, 2164616, 2214823, 2315922, 2413032, 2634006, 2829150, 3153827, 3418456, 3605178, 3813200, 4056519, 4333946, 4768861, 5372395, 6388804, 7261374, 8586313, 10109180, 11772054, 11574368, 8912060, 6677715, 5125761, 4067619, 3312769, 2783616, 2355912, 2104673, 1922506, 1778754, 1635621, 1489781, 1289105, 1186647, 1063728, 995414, 934638, 931306]
1734I31306o1181o7143j48861R802l3531j17418M3797J5202J8863K6580j60353
1723D57063j9876J984p3149N4342n0794R259L2225l5812N7407j13827P5517o1462
1711C32877j4365j896l7323K0607p1752N2325j0792N0992N37J2611r375m9703
1699B74743o2366P3533n1822j5455L5049j4915n7318l9823l7527Q3227J53k6740
1687A60739K7961L3127J3883o070m9318k6502L2126J873J2877J2143j2196l7661
1675A62982L905k896J4469J7402l1889o9107Q60k0254P5002j1638m1178p41k3146
1662G3771R8565N3283o7017Q502l937N7838p9290n5760K6624K5981L746m1972
1650A00334r296l8455R8475L3376l8288R558l4496m2455l8728J7694M6379m1102
$$ y = [931306, 870125, 802982, 654121, 663923, 630392, 512974, 556771, 571973, 590836, 617416, 457063, 437187, 439171, 366022, 420364, 369570, 378829, 411054, 375242, 432649, 318822, 394339, 332877, 318512, 316616, 279293, 299900, 228148, 280473, 269681, 320673, 321210, 333821, 324446, 274743, 212377, 285910, 234088, 218633, 253682, 238767, 181449, 141626, 104099, 187326, 187479, 160739, 188700, 221827, 235710, 229640, 180322, 153820, 185946, 187819, 200696, 212839, 200643, 162982, 166887, 163991, 178460, 195862, 163973, 94866, 95726, 75472, 150474, 138836, 97658, 96917, 73771, 172336, 225619, 158602, 167104, 163167, 221005, 141715, 85955, 112579, 138560, 142306, 100334, 91038, 52583, 151058, 184434, 146146, 155704, 121208, 78753, 40025, 57719, 104098, 62996]
1638F2996p3602N6612j5270j7859P9801l21R625l4776q614p987Q0867n0477J1896
1625I2891R246p361r286m3581m0412O351n288Q0752J807K4094k362o116l0641
1612G0094n725m1696J8561L6487j5539n5343L3542L692k5131R880m237J0797N9788
1599I5170j6834k2261M5982j3804M524j2199J5669n9723J4564j7101l690O5388
1587I5685k4073j0358p0673K3900K9955K4225j4197J3892n7167M509K8905J3219
1575E7822P5775j0939n4225j1930o0737j3151L8158q5222K8572K2928l242R0782
1563G4591K0579l9196M81q5676M9565N4858p4m7516j1556N1607J6971q259L0986
1550A07361l6428K5932n2416m4694N5278j2288j00810J8977M0042M1019j0869
$$ y = [62996, -10606, 46006, 30736, 12877, 92678, 92357, 101982, 67206, 58592, 50605, 131472, 80995, 92891, 102137, 94776, 85490, 41909, 1497, 7848, 2560, 83312, 85119, 109213, 106851, 100735, 70094, 64369, 22673, 41234, 77721, 62182, 6839, 40381, 44073, 18942, 28822, 24585, 35382, 95170, 78336, 56075, 102057, 88253, 92777, 80578, 96247, 36524, 51088, 33987, 30297, 95685, 71612, 61254, -9419, 14481, 44436, 68661, 54464, 68356, 11189, 15698, 44603, 57822, 133597, 122658, 68433, 56503, -4234, -17385, 20773, -64449, -35877, -12949, -16191, 74591, 95170, 55974, 56455, -29221, 20344, 75202, 75128, 27612, 16056, 67663, 84634, 76375, 107361, 70933, 96865, 44449, -245, 55033, 42745, -58065, -39088, 954, 41973, 31104]
1539C1104R476p7196J9265N0842p0936N1928M9049p0592p879J6204N165n0516
1527d4086K4529o5288K1O7072K4780r6564K2676N6389J6918N431O251N3948j9946
1514E2131o3710O301Q4870l5075m7016j6246J4497j3409n6075J29429j05291O183
1502d3411K2744k5298k7997J8223N2248l1297M2959N015k3211j2770K8695l0602
1490b4702L8585L6261q2116L2392M0495q7812J3858P7187k6164j5675J2572m4276
1478b9395j0105L7756p9565Q092J6699m0848J29452k8273M2877k8599n2744o808
1466d1461J495L1845p09l7071n2507k6645O8664k2310P717L3259k5317k7266o8985
1453a59291J40595K6919m7220J6223L193l7494l2159M598M7629k1084j6019l372
$$ y = [31104, 40580, -36616, -17351, 33491, -37445, 14483, 63532, -7060, -14939, 1265, 6430, -44086, -19557, -84845, -84824, -17752, 7028, -89536, -66860, -10471, 6447, 11878, 18129, 72077, 52131, -11579, -5278, 79592, 44517, -2499, -18745, -4248, -17657, -73732, 55697, -49594, -43411, -20667, -45965, -73962, -55739, -3491, -34788, 8171, 13186, -10025, -22795, 5900, -24702, 13883, 50144, -31972, 420, 40915, -46897, -33039, 44148, 17984, 2309, 14881, -29395, -39500, -1744, -81309, -73217, -56518, -97366, 32086, 3813, 46690, 18091, -34653, -41461, -39966, -8121, -8830, -45901, -98408, -125053, -56389, -78699, -70982, -37723, -63040, -90306, -159291, -18696, 8223, -38997, -22774, -19581, -57075, -89234, -84636, -37007, -58091, -74110, -77482]
1441g7482k1009O2209l2900L9557p946L8812m5809J5141n131K1759l0201o3960
1429a06960l9140Q0490q719m3414n450m1282J10729N7782o6787L2451l2871o470
1417f9641j2623K3978l8112J10791j1781j05270l5252K7999O8242j5191l0475
1406h7335k9000J9980K5299o0435J6230P629p371J5766l1981L5310L4535j6734
1394g8107j1493J4370m374N9502q9109j7863O260K9731P475K5121O271o2957j788
1381a16961L5900k4750N5007L6149l9508M1597J4480l0282j3180P97j8627K45
1369e9133k0635k379n1360j7879m869K8864Q0429p7073j169P2017m8065L5122
1357f6130l320k0334k7809l3342N2628N5406K1123l3587M3189M7116m6936j11818
$$ y = [-77482, -98491, -36282, -69182, -29625, -37571, 1241, -44568, -29427, -34558, -12799, -43000, -106960, -146100, -65610, -74329, -117743, -123193, -164475, -53746, 4036, -62751, -30300, -63171, -69641, -82264, -58286, -96398, 14393, 2612, -102658, -137910, -109911, -41669, -56860, -87335, -116335, -96355, -71056, -131491, -115261, -107632, -115003, -99237, -131218, -95908, -61373, -78107, -89600, -75230, -79604, -20102, -109211, -127074, -120814, -91083, -83608, -58487, -52216, -115173, -116961, -81061, -105811, -50804, -14655, -54163, -12566, 1914, -28368, -41548, -40751, -59378, -59133, -79768, -82147, -133507, -151386, -156255, -127391, -46962, -124035, -125204, -53187, -101252, -66130, -69450, -89784, -117593, -150935, -98307, -42901, -21778, -55365, -12176, 34940, -11996, -123814]
1345a23814L2912K7030l8932k2217J0641k5145M2155J0821J1140j9886J5809m157
1333h3643P749M0410n007j1131r2168N6698j417k9998N7657j0334L2142N573l0702
1320f4171J14605j35134k2390J0546n0065K5316K5325M5923l7170P6538K3360
1309A2683j32460k4258R3353n1704P4339M5520m4129m1114j2917J0513J9122k658
1297e3710j8618J0422l0400m8362J9127Q0930k2117K0853n4404L2494m809k8766
1285i7360l181K6955M0618n2727k7883M9716L6932o3607N9896m2797M5918m1233
1273f8753O4525Q660j79368L1547N2097P949k5883R9594L319o9489l4203j4156
1261a24161K9797m0493N9403m7358Q3468n8648O9544j4449Q023j5198j1875K1565
$$ y = [-123814, -90902, -63872, -102804, -125021, -114380, -139525, -97370, -86549, -75409, -95295, -79486, -83643, -75894, -35484, -40491, -51622, -143790, -87092, -88509, -118507, -60850, -71184, -39042, -33469, -64171, 50434, -84700, -107090, -96544, -146609, -121293, -95968, -50045, -87215, -10677, 12683, -119777, -144035, -50682, -102386, -28047, 17473, -26656, -67770, -80687, -70174, -51052, -53710, -72328, -61906, -92306, -140668, -121541, -40611, -62728, -41875, -96279, -63785, -68594, -97360, -100541, -73586, -32968, -85695, -113578, -63862, -26930, -90537, -30641, -73438, -27520, -68753, -4228, 4432, -174936, -143389, -91292, -83343, -109226, -9632, -6313, -75802, -110005, -124161, -94364, -134857, -75454, -122812, -39344, -97992, -28448, -42897, -34874, -50072, -61947, -40382]
1249d0382K5397m4425j3087K7913P101n2473k6071J9986n5094K2985K9312o4224
1237a63062L4600M4060L360K2294R578J2289p2694K7326L3471n562j10822M3640
1225a21522M3336J1723O1532l3017n894K931m7954K571j3485j06310N5535M5004
1213a05550j1318L6308p4070N6906R0211m9814O716q225r777N2618o1782r8456
1201a76233N5244q653K6042L5165q674M5038p6498n9911K0892M296L3954k3422
1189a32760o6813J00149J1472J819r6329N6572O8921k0446J9162L4734j13131
1178a36650j5875L2812Q4430k2536K1952m3528k8869M897P1387m2004J3400m7108
1166a07692L0181k1562k4176M7869j604J566K6384n0765j164j4532p215K892M2902
$$ y = [-40382, -14985, -59410, -72497, -44584, -37483, -89956, -116027, -96041, -151135, -128150, -98838, -163062, -128462, -84402, -81042, -58748, -49170, -36881, -109575, -82249, -48778, -54340, -165162, -121522, -78186, -66463, -4931, -37948, -43842, -40911, -88865, -86294, -99779, -206089, -150554, -105550, -116868, -80560, -154630, -97724, -7513, -57327, -50611, -58836, -68613, -15995, -77777, -176233, -120989, -129642, -103600, -68435, -77109, -32071, -108569, -168480, -147588, -143292, -109338, -132760, -199573, -99424, -87952, -86133, -182462, -125890, -56969, -77415, -58253, -23519, -136650, -152525, -119713, -35283, -57819, -35867, -79395, -108264, -103367, -31980, -73984, -60584, -107692, -77511, -99073, -123249, -75380, -76984, -75418, -49034, -99799, -100963, -115495, -122710, -119818, -76916]
1153g6916K6021j9849L7241R925o804q569l4555q6838P4918K0102q235j065N668
1140f8956m1777P3069L3813p2806o3273j3932K8492J11279r0766m4990N3270M106
1128i2471k1442K7464L4312n8226l2222P23l335R712Q3568k8580l04n2920j0011
1115a43732Q2740O8583j7868m3517j0585r500N0944o4794N5544j9806l4236m9215
1103a35442O665R6060p7031M0513K5672r1295q477L2391n0123j377q0255N6965
1091a85734J8444j6508L6131K1308o3934K1471O7732j06549J5736J7067O2895
1080a11941K8734K6599q3485O2820R638l9884O996P4191n8668p6398O6766K3501
1068g1131m0671J8475j5635O0138k012k9296j0173k1467K2290K2776J4007l2983
$$ y = [-76916, -50895, -70744, -33503, -23578, -30382, -38951, -73506, -160344, -85426, -65324, -73559, -74624, -68956, -110733, -37664, -3851, -76657, -139930, -153862, -125370, -14091, -104857, -149847, -96577, -92471, -113913, -86449, -52137, -110363, -142585, -141862, -145197, -135485, -51917, -80497, -80801, -133721, -143732, -60992, 7591, -10277, -53794, -64379, -73879, -22935, -87729, -32185, -51991, -86227, -135442, -128777, -32717, -109748, -69235, -43563, -134858, -143335, -110944, -161067, -162444, -242699, -185734, -167290, -183798, -147667, -126359, -190293, -168822, -101090, -207639, -191903, -174836, -111941, -83207, -56608, -140093, -77273, -67635, -107519, -100523, -26332, -85000, -161398, -94632, -71131, -111802, -93327, -108962, -48824, -50836, -80132, -90305, -111772, -89482, -66706, -52699, -85682]
1056h5682k9208n9777M1843O8462q4410L2584J9919M5613q613r5098P3689k7679
1044a08357L0495K974j0091L5405l2986p7703L3100M3329n427j4772o9254M1134
1032a32153k3700P0935L2985n6111j7442O2999R842k5500M4973L8938l2955P399
1020a9790o5929k6072O2243J578n0999n8174J6697J0046j7153N4215j2260O9209
1008c6389n5217J2808N742J3459k0264K350K6936K4628L1991m9158j2955j2407
996f8476N7326l7731n4717q231L8691J8364j3170n9708P626q545M3100k5254l5184
983a45909J01349k0688P36J0858j35463M0483O4275m7366P420M6234J1750l6566
971a02887j4558M7153r5j7892Q143O3062Q116m865r3894n915j5R5516m9571n6565
$$ y = [-85682, -114890, -174667, -132824, -64362, -148772, -116188, -96269, -50656, -59269, -154367, -80678, -108357, -77862, -74888, -84979, -49574, -82560, -160263, -127163, -83834, -89261, -104033, -173287, -132153, -155853, -84918, -51933, -108044, -125486, -62487, -52645, -78145, -33172, 5766, -27189, -19790, -85719, -111791, -49548, -47970, -98969, -157143, -140446, -130400, -147553, -93338, -105598, -36389, -91606, -78798, -73056, -59597, -79861, -77511, -50575, -25947, 6044, -43114, -56069, -68476, -11150, -48881, -103598, -111829, -73138, -54774, -67944, -127652, -120026, -128571, -85471, -110725, -145909, -44560, -65248, -64512, -53654, -189117, -148634, -84359, -131725, -124305, -78071, -66321, -102887, -117445, -70292, -70387, -88279, -80136, -17074, -8958, -13823, -107717, -113632, -113647, -18131, -67702, -124267]
957a24267M8267l3827O957P44n3523Q1191k3690l5377J8344J1679K5001P902j2489
944h3088n587o6697M1966Q3817N335K9229l6933n1069J2724L5823p3200p764j3154
931a28598L977k7428N0003J3402R4931j6920L0483q8532k8055O5101j2773J7905
919b6504q2899K9154n902K4598m2975L2645L2178k8805J4353m3927j25o512N939
906i8782M0018J397L133k4255J1058l9136P2218q1864k2311k2239L3406Q4005
894d3352l5395L4863J5074J8170n3696M562J8377r4080L4616K6507Q2989q8852
882h0217q8511J8331R4984P932n5826m3358K4698o5315Q9799P7696o3681R593
870g3875l58L4830M014q0482K6064L8073J4096m4937k9810p911P1443M7177n8004
$$ y = [-124267, -76000, -109827, -102870, -102126, -155649, -74458, -98148, -133525, -115181, -103502, -78501, -70599, -83088, -88675, -155372, -113406, -29589, -24254, 4975, -31958, -83027, -70303, -34480, -107680, -115444, -128598, -124621, -152049, -102046, -88644, 6287, -10633, 19850, -68682, -96737, -31636, -44409, -26504, -109403, -80249, -86151, -61553, -104528, -71883, -39705, -68510, -54157, -98084, -98209, -104721, -98782, -58764, -57367, -54234, -78489, -67431, -106567, -34349, -116213, -138524, -160763, -127357, -43352, -78747, -43884, -28810, -10640, -64336, -59774, -41397, -135477, -100861, -74354, 8635, -80217, -168728, -150397, -55413, -47481, -103307, -146665, -121967, -187282, -97483, -19787, -83468, -73875, -74233, -39403, -35389, -115871, -89807, -51734, -37638, -82575, -112385, -120296, -48853, -1676, -59680]
857e9680J1333P846L7761o7614K0855n5796M1152q694N7906K6212Q908o2137l5866
844g7814N307m774M1300l559k1670p7473O2114p679r9235J00692P718j7821O053
831h6841k4748j084J2063L8413K9674q6651J6771K1735k3057l0104Q3823m8513
819i8519p1541L0880N2818n0736M623L7604R242j6249l4267J9587J3937J8207
807h4414n069J1493O0138L6520j1141l1670k2985l3213L4443L853O336k8147M9121
794a4735j5355k1661n4659J1077N0728K1628j2460j5612Q288J5139l3468j8331
782g9421M8266Q148J7543K232j8473r6147J0304L6467K694l9411N3763K0251n473
769c9257j2989n906l4006Q5297L0582n9471r188j2724k6177M5451q38j1866n349
$$ y = [-59680, -48347, -40501, -2740, -70354, -49499, -105295, -64143, -72837, -14931, 11281, 20189, -41948, -77814, -72507, -77281, -35981, -39540, -61210, -138683, -76569, -84248, -183483, -82791, -75073, -92894, -86841, -111589, -112673, -100610, -62197, -32523, -119174, -102403, -80668, -103725, -133829, -50006, -98519, -170060, -139180, -86362, -137098, -132475, -94871, -85629, -101878, -136145, -116558, -102621, -84414, -89483, -77990, -17852, 18668, 7527, -24143, -47128, -80341, -45898, -42045, -35709, -63856, -14735, -30090, -51751, -106410, -95333, -44605, -22977, -35437, -51049, -42761, -27622, -61090, -79421, -31155, -23007, -5464, -3232, -21705, -117852, -107548, -71081, -68387, -107798, -54035, -33784, -39257, -52246, -58152, -92158, -6861, 23721, -35750, -44938, -57662, -83839, -38388, -39226, -51092, -56441]
756e6441J0610n2915N1630J1922J2665p392m3163L1550j2167o2913k357k8905
744a47876Q6621l971r8160P2016L7281L960m5944O014J9125l2577K7535L7188
732c8788L0703j3447j455o591k1318k0170k1763P1222j00423K7180M2447M5602
720f801r1859L5732K2265J494l4727j2374J8798l4106Q4205m4513m2891Q5469
708a9308o123o7774L5653P1026n2832M2435M8858m2547M2638l6235m7979n9587
696i1775k5279M499Q216J11596k3039j18776M8254O3348J7746K285L7166l4416
684a75j3174l497j5160L5064j7797n7223N4664o179k2486N1496k5111J770j9574
671c7382O9450M481o5662k0935k0995Q5407q9003L0219J36205q4591j0585K2118
$$ y = [-56441, -45831, -98746, -47116, -35194, -22529, -29921, -73084, -41534, -53701, -116614, -118971, -147876, -61255, -65226, -163386, -91370, -54089, -50129, -96073, -90059, -70934, -103511, -75976, -38788, -8085, -21532, -22987, -29578, -50896, -71066, -92829, -21607, -122030, -94850, -52403, -6801, -98660, -62928, -40663, -39169, -73896, -86270, -67472, -101578, -17373, -61886, -104777, -19308, -25431, -93205, -57552, 13474, -39358, 3077, 51935, 9388, 52026, 15791, -32188, -91775, -117054, -112555, -104339, 7257, -15782, -134558, -86304, -22956, -5210, -2925, 34241, -175, -13349, -16846, -32006, 3058, -14739, -71962, -17298, -23477, -45963, 5533, -19578, -17808, -37382, 32068, 36549, -29113, -50048, -71043, 14364, -74639, -44420, 91785, 7194, -3391, 18727]
659A8727k7223L8634l3852M2351n9573J1202j16313j7891J50820l2740j2799m2132
647h0789L6813K13L2416r886q0681P9430Q567K5705r6743L5549J3853L9135p0421
634f6839p0955K9223O9940L6991r680m3963K1534M5979L8972n0938l5563k3120
622e8419q879P0311j5233K1525j8687M762J09952k1060j3658j1409o5544j6757
610b3096K0719l6255J335M1107k2367K4826n133R2871j22087m0605L5695m5126
598g8116M2559j4371L5628P9679m8834j7172l290J9782l9460J5956l1294N7047
586A8114K1014n9910r5021L3903L9994n2792M2274K407k2156K2153j1709M985
574e6744N5467j6834K7053N256j19044N5867K0698o1734k6178K9770J18955O6483
$$ y = [18727, -8496, 30138, -3714, 38637, -20936, -9734, -126047, -143938, 6882, -25858, -38657, -80789, -43976, -43763, -11347, -21233, -101914, -22484, -13917, 11788, -84955, -49406, -35553, 3582, -66839, -137794, -108571, -38631, -1640, -11320, -55283, -33749, 12230, 51202, 264, -35299, -58419, -67298, 3013, -12220, 9305, -9382, -4620, 105332, 84272, 70614, 59205, -6339, -23096, -2377, -38632, -37297, 3810, -18557, 6269, 1136, 94007, -28080, -68685, -32990, -78116, -35557, -49928, -14300, 65379, 16545, -627, -3917, 15865, -23595, -7639, -38933, 18114, 39128, -20782, -115803, -81900, -41906, -94698, -52424, -50017, -72173, -50020, -61729, -56744, -1277, -18111, 8942, 14198, -104846, -48979, -28281, -90015, -116193, -86423, 32532, 99015]
562I9015p4692N700j9638m7334M1609j9522o0851M2347k0372J1336J2346L102
550b6954L1657k8539o534M497k000L407n491n6m910k626M6428j757O526o17K7237
535D0268j0897j6251l8393L3454q277m8978N5938P033m6042K7951N2615p6739
523b8318k4300Q0881j4540l1587J1115R552K921m9794k0755L6884M0578l709M5116
510E4044k0816q9383J6493K954L111M1347o9953M8741J0964l2051k842M7813j2982
497b560K4172k4330Q1230n4906j9562K9361p2129K8916J3912M7718K2572m7148
485B7246m9896o833J8506M3495k1941L7154O6533o7787n6552N1097K4722m8539
473A7205L208q216k9988Q8420j5937K6770l5569q6049l2735N7708J7253N1708
$$ y = [99015, 24323, 30023, 10385, -36949, 4660, -14862, -75713, -33366, -53738, -42402, -30056, -26954, 4703, -23836, -30370, -25873, -27873, -24466, -29957, -30013, -34923, -37549, 8879, 7122, 13648, 13031, 40268, 29371, 13120, -25273, 8181, -96, -49074, 6864, 13897, -32145, -4194, 48421, -28318, -52618, 28263, 13723, -17864, -6749, 2803, 5724, -44070, -64825, -27941, 12637, 8928, 54044, 33228, -56155, -39662, -36708, -33597, 7750, -62203, -13462, -2498, -34549, -37391, 10422, -2560, 21612, -2718, 78512, 23606, 4044, 33405, -38724, -9808, 4104, 51822, 74394, 27246, -22650, -29483, -10977, 32518, 10577, 47731, 114264, 46477, -10075, 41022, 65744, 17205, 20413, 12197, -17791, 70629, 54692, 81462, 45893, -40156, -72891, -15183, 2070, 53778]
461E3778l0100m4703Q546L0168l8643M8206l1835J6403K938k8760L2443j7544
449H97l2818m0956R0144J9525r477n1276n0248K4418Q3924j6972r385O3769J3868
436H5413n4605R979k0140l555K4570o2607P7293O794m5136j6037J5133j1947M2885
423D8040p053k2141l6900J2830p871p058M5909Q2789o108p5275K1784K7816M1039
410A17801p8981n735M5870k9719J6415n985R463J8189r028J4211m7339k6274M948
397B3836M2538k6617m0260M0572m140j8566J7312L5015j8446M4446P52K4206j24951
384d303J6772J11173l4650j00404k2574L7316P9186k4744M2748J4457o4838J6903
372F7042L9809j07671L4179M072n4740J1289M0217M1876o4818Q6835p8578P991
$$ y = [53778, 23678, -21025, -12479, 17689, -20954, 27252, -4583, 11820, 14758, -14002, 18441, 897, -31921, -72877, 17267, 36792, 27315, -23961, -74209, -49791, 34133, 17161, 7776, 71545, 85413, 30808, 40787, 20647, 17092, 41662, -20945, 56348, 63142, 18006, 1969, 17102, 5155, 48040, 40987, 18846, -18054, -5224, -13095, -20153, 25756, 108545, 102437, 27162, 48946, 76762, 117801, 38820, 33085, 78955, 49236, 65651, 59666, 69129, 87318, 78290, 92501, 45162, 18888, 23836, 66374, 39757, -503, 40069, 35929, 17363, 34675, 69690, 51244, 95690, 96442, 120648, -4303, 12469, 123642, 88992, -11412, -33986, 3330, 82516, 57772, 100520, 114977, 50139, 67042, 106851, -820, 33359, 37431, -17309, -6020, 34197, 76073, 11255, 98090, 19512, 27503]
360B7503L3139O281J0719L9014m3528L3513j14844L7065J0336n9536N595L9431
348B4688k9900O1637l610O1059m9940m0370Q5064m3375j0425M972n6855L1579
336C4524L6437l3656N3772K0853n6496m7115L5731L6921n549o5953K7394m4399
324g536J9196K6444J1632r1118O6312J0239K7138n4200j6870K8034o4752J9878
312b5603N0839K5445K3222j2395K1064N5192q4874J8290M232k4247J79L243L237
299E7824p892J554k829Q938j3222M3261L1174J407o7953K3277j4148l9695R0091
286A11787k0075L2393j6965m8527n9600J7184L2128j1995l4488N4840k8358R853
274C8177K2142j0181M753P39N4627Q124l7178k4721N2419L2512m3149N8356j5477
$$ y = [27503, 60642, 66923, 77642, 116656, 73128, 106641, -8203, 28862, 39198, -20338, -14743, 24688, -5212, 56425, 52815, 113874, 63934, 23564, 108628, 65253, 54828, 59800, 2945, 34524, 70961, 37305, 91077, 111930, 55434, 8319, 44050, 80971, 75422, 9469, 36863, -7536, 11660, 38104, 49736, -41382, 24930, 35169, 62307, 8107, -8763, 19271, -45481, -25603, 25236, 50681, 73903, 61508, 82572, 137764, 52890, 71180, 75412, 51165, 51344, 54587, 57824, 49932, 51486, 48657, 57595, 44373, 87634, 118808, 120215, 52262, 75539, 61391, 21696, 111787, 91712, 124105, 107140, 58613, -987, 16197, 48325, 36330, 1842, 56682, 28324, 38177, 60319, 50138, 54891, 55630, 110257, 118381, 81203, 56482, 108901, 141413, 98264, 156620, 141143]
261A41143r0123L9334L1828n5006K8931j9841R437L1776m1487L1438p9629J9131
249D6932Q709l8438L8078n044J0148Q463j9138P2631O246m6573L0349m5993N0020
236A16390O521k7339k3226Q0656J5768l1127J7099j9433p167L0329l6366j5244
224A06861k3703n478N749j4975K6145m4575J8558m3134K750j4694k11J6010M1531
211G0834j1489j100K2534M8880J1946l7738m8543J6601O6323O880l119q143J2612
198A46478k4968Q341k3000l5045n1723N7431P3643J7215p880l3118m3658j3409
186G0307L0753N46o066k4044L7358l47m792k9122L354L041L9095r069K2980n469
172A28525J8911p345j5026m8265N2631j0419o2535k1319k3290N9144L6660l7062
$$ y = [141143, 51020, 90354, 122182, 67176, 96107, 76266, 85703, 117479, 75992, 107430, 27801, 46932, 55641, 17203, 55281, 50237, 60385, 68848, 49710, 122341, 128587, 82014, 112363, 66370, 116390, 122911, 95572, 72346, 153002, 168770, 137643, 154742, 135309, 128142, 158471, 122105, 106861, 83158, 77680, 83429, 68454, 94599, 50024, 68582, 25448, 28198, 13504, 13293, 29303, 70834, 59345, 58245, 80779, 129659, 141605, 103867, 55324, 71925, 138248, 145128, 142009, 133866, 146478, 121510, 129851, 106851, 71806, 20083, 77514, 151157, 168372, 160492, 127374, 83716, 70307, 101060, 101606, 95540, 71496, 108854, 108507, 103715, 74593, 77947, 80988, 120083, 111014, 133994, 128525, 147436, 140091, 125065, 76800, 129431, 119012, 56477, 35158, 11868, 71012, 107672, 70610]
160G0610P5757M59o9215L3023k7083m314Q834k6264J4248O011K2019J3885o6527
147E1443m33K7360K4101Q873n2191j3987k9342P409M7832j2889O591L6718J5761
134A17246q0033K5347J8013M1532l3288J6987K9308m4255o5384L3521N7639J208
122A17841j04507K6718Q7191k142N123n5189J7400J4857n3678q459K0660l6194
110B9621p746j8527j3504L7868k6528K3645k2856O4770m4410R12L7777N9318p185
97A13155j02876O8737P50j434k4517K4142L9611k0488k8513K3953o5151K2911
85E0280N935P518M1815k3780J3273K0916l0294l8558m514K5134J94k7486J2098
72E2531J8387J8349O77K7105j3381o2193J8592k6505M5840o109j8358k8300l6117
$$ y = [70610, 146367, 146826, 77611, 110634, 83551, 79237, 88071, 61807, 76055, 82066, 104085, 117970, 51443, 51010, 78370, 102471, 111344, 59153, 45166, 15824, 23233, 71065, 58176, 64767, 101485, 117246, 37213, 62560, 80573, 122105, 88817, 105804, 135112, 90857, 25473, 58994, 116633, 117841, 13334, 40052, 127243, 125101, 130224, 75035, 92435, 107292, 53614, 45155, 65815, 29621, 21875, 3348, -10156, 27712, 1184, 24829, 1973, 66743, 22333, 23245, 61022, 120340, 113155, 10279, 79016, 79766, 78332, 53815, 77957, 117568, 97080, 68567, 92520, 27369, 50280, 56215, 63733, 105548, 81768, 95041, 115957, 85663, 47105, 42591, 67725, 67919, 40433, 52531, 70918, 89267, 89944, 117049, 103668, 41475, 60067, 33562, 79402, 73293, 54935, 26635, -9482]
59i482N1203L0994P794r0590J250L6627M3516M51q8726P4756M2743l2828n7241
46A0467j8429L3077J086K8168k5601l7254O7839o167m1170k1775j493k0623m6627
33g8502J9737L8529J2255J6016M6381k8848m2888P0818p203m937k8418n9014R46
20d5128O5813k0370J7068K3687l3146L177J9258J7320K5952k4902k5773j5438
8G518j2304N518l896J9763l2999j4985L1553k0835
0b0667
$$ y = [-9482, 41721, 72715, 80509, -10081, -8831, 27796, 71312, 71763, -16963, 57793, 100536, 67708, 10467, -7962, 25115, 26201, 54369, 28768, -8486, 59353, 53186, 12016, -9759, -11252, -31875, -78502, -58765, -20236, -7981, 8035, 54416, 25568, -17320, 53498, 46295, 41358, 12940, -46074, -45128, 20685, 315, 17383, 41070, 7924, 11101, 30359, 47679, 73631, 48729, 22956, 7518, -4786, 732, -3164, 16599, -16400, -31385, 168, -20667]
$$ Imaginary data points
##PAGE= N=2
##DATA TABLE= (X++(I..I)), XYDATA
16383c281769M7767Q816J5835L1989J08802r668K0154K9304L4997Q3780k4758
16372b934751Q623O9687j9695J1889L5015K1898Q4547J9269j6769R2423K3833
16361b604031o974N5782j5496K0464L2371K279J17993O2811l5164J9474N3496
16350b296995M310Q10O5748R02Q459L1190R1149L4418Q492j7479O608P0442L3251
16337a958695P5989L8404n0J02L3055N1427k3767J4986Q2931l699M7317L8510
16325a603490N4303l5722L2485Q9901l709k0810N7893N319M9740m706L3439K8668
16313a316689J3562J3637Q1569j8475j4769J14295J8381O765j5692O9624L8107
16302a009685L7085J5225L519L2335K2105L1699m96M5739J6421L7132J3031J5111
$$ y = [-3281769, -3234002, -3225186, -3209351, -3177362, -3068560, -3078228, -3058074, -3028770, -2993773, -2909993, -2934751, -2926128, -2856441, -2876136, -2864247, -2829232, -2807334, -2722787, -2703518, -2720287, -2627864, -2604031, -2611005, -2555223, -2570719, -2550255, -2517884, -2515605, -2397612, -2334801, -2369965, -2350491, -2296995, -2292685, -2291875, -2226127, -2225225, -2216766, -2185576, -2094427, -2060009, -2051517, -2068996, -2062388, -1991946, -1958695, -1882706, -1844302, -1844352, -1844250, -1811195, -1759768, -1783535, -1768549, -1685618, -1689317, -1642000, -1603490, -1549187, -1584909, -1552424, -1462523, -1466232, -1487042, -1429149, -1423830, -1374090, -1378796, -1345357, -1316689, -1303127, -1289490, -1207921, -1226396, -1241165, -1126870, -1108489, -1101724, -1117416, -1047792, -1009685, -972600, -957375, -953856, -921521, -899416, -867717, -868213, -822474, -806053, -768921, -755890, -740779]
16290g40779L5352P9J2844Q4828O2220j3388j7391J3726j6879L1942M2278j1729
16278e16897N2649O8514K4596L3883L1765k9689n622O6003L3120M6554o1305M0952
16266b15477L9701L2705m7920O6957J389k4560P4484J0957L6868m6575J2037L1183
16254b8251K0904K2156K0487l3629Q1023J00929J1936r7750n932O2927L9909K2349
16242B17058P084M2100k1620j1842O0830P8909K1284n3194K3226j6875L9172q620
16230C77512M1284L5910J2751P1761K988j6820J8864m1094m119P7665J11698M1204
16218G29604p2758j9723r238n0360N6167Q0900K09k217l1883R0122j8473M1104
16206G93454J7921j266k2186J9306r068N4345j11m2363L1779k003L1161j047N9147
$$ y = [-740779, -705427, -705348, -692504, -607676, -545456, -558844, -576235, -562509, -579388, -547446, -505168, -516897, -464248, -395734, -371138, -337255, -305490, -335179, -340801, -274798, -241678, -195124, -256429, -215477, -175776, -143071, -190991, -124034, -122645, -147205, -72721, -61764, -24896, -71471, -59434, -28251, -7347, 14809, 35296, 1667, 82690, 183619, 195555, 97805, 91873, 154800, 194709, 217058, 224142, 266242, 244622, 232780, 293610, 372519, 393803, 340609, 363835, 346960, 386132, 377512, 418796, 454706, 467457, 539218, 542206, 525386, 544250, 503156, 499037, 576702, 688400, 729604, 656846, 637123, 627885, 577525, 633692, 714592, 714801, 712584, 680701, 770823, 752350, 793454, 811375, 810109, 787923, 807229, 798161, 852506, 852395, 810032, 841811, 839808, 870969, 869922, 929069]
16193I29069l1666m020N7338j086l1310L5091q023O2867k7933K8899P082J4148
16181A030456K3039k6072K1625L70L212m657P8191k1928K449P2961l4251L8943
16169A184338k5669p815J7171p059l365n931p722M8052L8082Q931l9138K7188
16157A227063p777J6459J7273L1638k6364m5917R0403J0433R671l4014l6705J4690
16145A266853K6021N7648r0450K3522J6618O5299L2886p232K3554p63K2847n3875
16133A382928j9336K5926k5803j5979N538N5696J8642j3239J695n9569k3463M1617
16121A374653L503k3059j7672O1193K4706K2360n142P6207r66j6473k5577p753
16109A465980J2270m4128l973K0696n3427r075Q1454l9867N9136j8432L2817k9487
$$ y = [929069, 897403, 893383, 950721, 949635, 918325, 953416, 945393, 1008260, 980327, 1009226, 1016308, 1030456, 1053495, 1027423, 1049048, 1049418, 1052630, 1047973, 1126164, 1104236, 1106685, 1179646, 1145395, 1184338, 1158669, 1150854, 1168025, 1160966, 1157601, 1151670, 1143948, 1192000, 1230082, 1239013, 1199875, 1227063, 1219286, 1235745, 1253018, 1284656, 1258292, 1212375, 1302778, 1313211, 1322882, 1288868, 1252163, 1266853, 1292874, 1350522, 1260072, 1283594, 1300212, 1365511, 1398397, 1391165, 1414719, 1413956, 1436803, 1382928, 1363592, 1389518, 1363715, 1347736, 1353274, 1408970, 1427612, 1414373, 1416068, 1356499, 1333036, 1374653, 1378156, 1355097, 1337425, 1398618, 1423324, 1445684, 1440542, 1516749, 1515783, 1499310, 1473733, 1465980, 1478250, 1434122, 1430149, 1450845, 1397418, 1388343, 1469797, 1429930, 1489066, 1470634, 1503451, 1473964]
16097A473964L3359K9065j0235o870K2836M6849n5178r6648Q1695M3176n6128
16086A505885l2559O5627L343m1880M4662o7265q1492Q8631J6791J6465J9588
16075A537796k2066k741m841M0588K1565o1109j730J9026J8702L505K5444J431
16063A575570J2836m7852N87j5941M7894L1866j2617j9593L674m4882K0048l3264
16051A518326m65P150j8034j2696J5098N3226Q4001j8649K9879l5787j2409P1416
16039A681056n7418M4697p1692O879J6501J8297j45l916k424l0309m2849r78N6605
16026A614304l9207k1994k0675K6533P4849J1738l4764K7166l5866k7145K5139
16015A600078j462m5267N5755k6867j3534N5615n7404N1515k9285j5096k1232
$$ y = [1473964, 1507323, 1536388, 1526153, 1519283, 1542119, 1588968, 1533790, 1437142, 1518837, 1562013, 1505885, 1473326, 1538953, 1542296, 1500416, 1545078, 1477813, 1396321, 1484952, 1501743, 1518208, 1537796, 1515730, 1512989, 1508148, 1548736, 1570301, 1509192, 1507462, 1526488, 1545190, 1548695, 1574139, 1575570, 1588406, 1540554, 1541141, 1525200, 1573094, 1604960, 1592343, 1572750, 1576424, 1531542, 1551590, 1518326, 1517861, 1525011, 1506977, 1494281, 1509379, 1562605, 1646606, 1627957, 1657836, 1622049, 1609640, 1681056, 1623638, 1668335, 1596643, 1603522, 1620023, 1638320, 1638175, 1634259, 1631835, 1601526, 1558677, 1557699, 1614304, 1575097, 1553103, 1532428, 1558961, 1633810, 1645548, 1610784, 1637950, 1602084, 1574939, 1600078, 1598616, 1553349, 1609104, 1582237, 1568703, 1624318, 1566914, 1618429, 1589144, 1574048, 1552816]
16004A552816R6187q275m8295m4504J8030N8016L576l1670k6244P6389q0023J5540
15992A581543P2566R746l0888j0626j16193N187M1150M7098L8280l7477N3835
15981A654221l3732n1428k2558P1148K1397L3370m1555l7092J0479M1126n2955
15970A592421O8893o8703J04633q6330j4442N8640r1252N0400n8199M3894P0206
15959A670161o1387p514L2053J6004m0973k817n3698K5139J02976j5566o4809
15948A599569l8618L9929K6097J1807l7953J3062o8762j2919N1885j8140J10321
15937A676278M3534j06736l894J14092j9461N4516k4873o8604j3007o1497O419
15926A596767l368L0363n9885R7927k3522m164k2908o941Q8590K497m5303L7369
$$ y = [1552816, 1649003, 1640728, 1592433, 1547929, 1565959, 1623975, 1627551, 1595881, 1569637, 1646026, 1566003, 1581543, 1654109, 1663855, 1632967, 1622341, 1506148, 1511335, 1552485, 1599583, 1637863, 1600386, 1654221, 1620489, 1569061, 1546503, 1617651, 1639048, 1672418, 1630863, 1593771, 1604250, 1645376, 1592421, 1661314, 1592611, 1697244, 1610914, 1596472, 1655112, 1563860, 1614260, 1556061, 1599955, 1670161, 1608774, 1601260, 1633313, 1649317, 1608344, 1605527, 1551829, 1576968, 1679944, 1664378, 1599569, 1560951, 1600880, 1626977, 1638784, 1600831, 1613893, 1545131, 1532212, 1584097, 1565957, 1676278, 1719812, 1613076, 1609182, 1723274, 1703813, 1758329, 1733456, 1664852, 1651845, 1590348, 1596767, 1593399, 1623762, 1563877, 1661804, 1638282, 1634118, 1611210, 1604269, 1692859, 1695356, 1650053, 1687422]
15914A687422n5219l1793K3043J2385m560j20100O2445L784k3045k439R7234m2572
15902A606585J5069k8593l2891N1178L7907m4598K6099K3464M5586j2011o2517
15891A625278n6547k1334O0186L3857l0680N0429L0231k4656l4605n0529N0493
15880A632123p73m390j0226k242l6588J0150k5214J00526l4214J7518J5895Q5980
15868A748545j21058k6640M1347K8400q3154J3424j2477Q8025o60k0292P8334
15857A733794j937o8153r946K2650p8736j2586L2448L0653j8520k2852n3507P9627
15845A632935M364R8785k7297m9437L5378p2689j1846M4104k4922n3243J3365
15834A589497P8743K3739k5178k5774p592k8075N1291j1067K0010M6833o0054
$$ y = [1687422, 1632203, 1600410, 1623453, 1635838, 1631278, 1511178, 1573623, 1577407, 1554362, 1551923, 1649157, 1606585, 1621654, 1593061, 1560170, 1611348, 1649255, 1604657, 1630756, 1654220, 1699806, 1687795, 1625278, 1568731, 1547397, 1607583, 1641440, 1610760, 1661189, 1691420, 1666764, 1632159, 1581630, 1632123, 1631350, 1626960, 1616734, 1614492, 1577904, 1588054, 1562840, 1663366, 1629152, 1646670, 1662565, 1748545, 1627487, 1600847, 1642194, 1670594, 1587440, 1600864, 1588387, 1676412, 1675752, 1655460, 1733794, 1731857, 1663704, 1653758, 1676408, 1597672, 1585086, 1617534, 1648187, 1629667, 1606815, 1553308, 1632935, 1637299, 1736084, 1708787, 1659350, 1694728, 1622039, 1610193, 1654297, 1629375, 1576132, 1589497, 1668240, 1691979, 1666801, 1641027, 1633435, 1605360, 1656651, 1645584, 1665594, 1712427, 1652373]
15823A652373o4910L3078m1716l6707P3022n4840Q1249N7967n6234p4497J9559
15812A588344M7385M3104m522k2278Q579l329K124M9650L0734o5021Q91J4867
15800A690528j0264q8968O6055q365k3272q804L4229n3799r415P4949n6373r671
15788A596830L7420J22l9234m6856N1456K7392q744J1163k8137L3832N9461j9798
15776A674907m8239l4190L1521K2131J9418o7314P6445K7278k1038l7346k8629
15765A614944L5792p232J7735K8497p6619k4579M7163J2425n2640J14671j5019
15754A695138o5711O4928q6802M6675O7909o8767n4867M4091N5831J4981r4975
15743A618431j7066P8637N5710m7552m1341k6980O8081J5087q4041m2105O5553
$$ y = [1652373, 1587463, 1620541, 1578825, 1542118, 1615140, 1560300, 1641549, 1699516, 1643282, 1568785, 1588344, 1635729, 1678833, 1674311, 1652033, 1660612, 1657283, 1659407, 1709057, 1739791, 1674770, 1675661, 1690528, 1680264, 1591296, 1657351, 1648986, 1625714, 1616910, 1651139, 1597340, 1587925, 1662874, 1606501, 1596830, 1634250, 1634372, 1595138, 1548282, 1599738, 1627130, 1618386, 1629549, 1601412, 1635244, 1694705, 1674907, 1626668, 1592478, 1623999, 1646130, 1665548, 1598234, 1674679, 1701957, 1680919, 1643573, 1614944, 1650736, 1643504, 1661239, 1689736, 1613117, 1588538, 1635701, 1648126, 1595486, 1710157, 1695138, 1629427, 1694355, 1607553, 1654228, 1722137, 1653370, 1598503, 1642594, 1698425, 1713406, 1618431, 1601365, 1680002, 1735712, 1688160, 1646819, 1619839, 1687920, 1703007, 1618966, 1576861, 1642414]
15732A642414L4862l8496j2362k6238K7081M9304n8195L6156j7690N861N928m0848
15720A607777Q41J18464n8652n1097p8241Q2668N3067m047m2590Q6655k2856n0731
15708A641258l4014M3248J1451q1188O0081K2365j02340O2211N9405o4813P3743
15697A691407j4199j9303R0670m2735k9573N904l7366J08551p0164j3383N1631
15686A721440p6177J4606P0294k1711k3580j5449K9997N467j580L8481j049q5986
15674A654753n849n121Q376l4909l9618L5608O7012j8928k4018m3266J2818o533
15662A600325J119k7194O9679Q630R4121m5367N2105n0862K0493M5246p2785J989
15650A697499j9759p3604K4143K8012l7797M5789K6372K4753M0981K0771m9092
$$ y = [1642414, 1677276, 1638780, 1626418, 1600180, 1627261, 1676565, 1618370, 1654526, 1636836, 1642697, 1648625, 1607777, 1608618, 1727082, 1668430, 1617333, 1539092, 1621760, 1674827, 1670780, 1628190, 1714845, 1691989, 1641258, 1607244, 1650492, 1661943, 1580755, 1640836, 1663201, 1560861, 1623072, 1682477, 1617664, 1691407, 1677208, 1657905, 1748575, 1705840, 1676267, 1682171, 1644805, 1753356, 1683192, 1669809, 1721440, 1645263, 1659869, 1730163, 1708452, 1684872, 1669423, 1699420, 1704887, 1703307, 1741788, 1740739, 1654753, 1648904, 1643783, 1652159, 1617250, 1577632, 1613240, 1680252, 1661324, 1637306, 1594040, 1606858, 1600325, 1601444, 1574250, 1643929, 1652559, 1746680, 1701313, 1753418, 1702556, 1723049, 1768295, 1695510, 1697499, 1677740, 1604136, 1628279, 1656291, 1618494, 1664283, 1690655, 1715408, 1756389, 1777160, 1728068]
15639A728068p6249J8504O2623n0970L3695o5464L3132J8982o0098O7712K4659
15628A734594j561l5206n9546m1601O6417J7509N5076R797o1901J3229k6552j5197
15616A655058J5576p3212N8758L1719m6749j8594L7408O4276j426n8877R046J6122
15604A689105n618L9288n4403k5779K2523M7411P7759j16016L920J6352K5068
15593A719610J0368q235o7074k5424J04207R358N30m6714J7036m2793j6203m749
15581A649917L1483n6164L1774k6443N0066R982j8259k0536o796N088N6697J541
15569A708350J0211o5863P6391J1045K5196l5581o2732j7726M5921M9333j3374
15558A731171l6667j4926k2978J4102J8267k000K9052l1293k3113K3554L0962
$$ y = [1728068, 1651819, 1670323, 1732946, 1681976, 1715671, 1650207, 1683339, 1702321, 1642223, 1709935, 1734594, 1733033, 1697827, 1638281, 1596680, 1663097, 1680606, 1735682, 1745479, 1683578, 1696807, 1670255, 1655058, 1670634, 1597422, 1656180, 1687899, 1641150, 1622556, 1659964, 1724240, 1722814, 1663937, 1672983, 1689105, 1683487, 1722775, 1668372, 1642593, 1665116, 1712527, 1790286, 1674270, 1678190, 1694542, 1719610, 1729978, 1721743, 1654669, 1629245, 1733452, 1742810, 1743340, 1696626, 1713662, 1670869, 1654666, 1649917, 1681400, 1625236, 1657010, 1630567, 1680633, 1690615, 1672356, 1651820, 1645024, 1650112, 1706809, 1708350, 1718561, 1652698, 1729089, 1740134, 1765330, 1729749, 1667017, 1649291, 1695212, 1744545, 1731171, 1694504, 1679578, 1656600, 1670702, 1688969, 1686969, 1716021, 1684728, 1661615, 1685169, 1716131]
15547A716131k7399M3603n1368j7589R816k2826m0557k565J03322l3603n720m6426
15535A624819o788J27354K4463n2920J0739k43r553L2604k5395J1954k6701n270
15523A705063n4397J20M236p2639Q2948N402j4130K5688j6062N971K7550Q0087
15511A779837m1404O501L583L5032p5157l0175k9105j9120M9778Q690J9951o9507
15499A638904Q1921K2473q4693p209K7260L2301m9377K3268m8236Q3591R7222
15488A817425m2890j3538o2030k3307K6227O0060p8755l9365J07266j1908K542
15477A741727p1308J4098P7169N6450m8342o6540J1893j7516k1741N0899m1950
15466A684839m2416O2324l4436K4108M2670J19j9111m0293p278J8151M9715J8861
$$ y = [1716131, 1688732, 1732335, 1680967, 1663378, 1673194, 1650368, 1609811, 1607246, 1710568, 1676965, 1671245, 1624819, 1618031, 1745385, 1769848, 1716928, 1727667, 1727424, 1717871, 1750475, 1725080, 1737034, 1710333, 1705063, 1650666, 1650786, 1655022, 1582383, 1665331, 1670733, 1656603, 1682291, 1666229, 1672200, 1699750, 1779837, 1738433, 1744934, 1748517, 1783549, 1708392, 1678217, 1649112, 1629992, 1679770, 1688460, 1708411, 1638904, 1720825, 1743298, 1658605, 1651396, 1678656, 1710957, 1661580, 1684848, 1636612, 1720203, 1817425, 1774535, 1760997, 1698967, 1675660, 1701887, 1761947, 1683192, 1643827, 1751093, 1739185, 1741727, 1670419, 1684517, 1761686, 1818136, 1769794, 1703254, 1715147, 1697631, 1675890, 1726789, 1684839, 1642423, 1704747, 1670311, 1694419, 1737089, 1737208, 1718097, 1677804, 1670526, 1688677, 1738392, 1757253]
15454A757253p0245m5438M956M7766J03141q6327Q236J1178q352L2234J7227r6680
15442A674949P5400L0837q4486K01l5579K4626j7066M4224J2843l0753N4510N690
15430A755396l4862j3756l2280K9173l9862M8559j1754m409K5839M7721o6239
15419A703526n3208M3304P4354j6365l3027k6405L2278l3345m0223M7404k8640
$$ y = [1757253, 1687008, 1641570, 1646526, 1694292, 1797433, 1711106, 1719342, 1730520, 1722168, 1754402, 1771629, 1674949, 1750349, 1781186, 1696700, 1696901, 1661322, 1685948, 1668882, 1713106, 1725949, 1695196, 1749706, 1755396, 1720534, 1706778, 1674498, 1703671, 1663809, 1712368, 1700614, 1696205, 1722044, 1769765, 1703526, 1650318, 1693622, 1767976, 1751611, 1718584, 1692179, 1724457, 1691112, 1650889, 1698293, 1669653]
$$ [...]
##END NTUPLES=NMR SPECTRUM
##END=
