##TITLE=1H_CG-1210-X1
 CDCl3
 8 sc, 
 13.8.2024
##JCAMPDX= 6.0         $$ Bruker NMR JCAMP-DX V2.0
##DATA TYPE= NMR SPECTRUM
##DATA CLASS= NTUPLES
##ORIGIN= UXNMR, Bruker Analytische Messtechnik GmbH
##OWNER= root
$$ XWIN-NMR		Version 3.5
$$ Tue Aug 13 14:09:17 2024 Russian Standard Time (UT+4h)  she@DPX200
##.OBSERVE FREQUENCY= 200.1313
##.OBSERVE NUCLEUS= ^1H
##.ACQUISITION MODE= SIMULTANEOUS
##.ACQUISITION SCHEME= undefined
##.AVERAGES= 8
##.DIGITISER RES= 18
##SPECTROMETER/DATA SYSTEM= spect
##.PULSE SEQUENCE= zg30
##.SOLVENT NAME= DMSO
##.SHIFT REFERENCE= (INTERNAL, DMSO, 0, 21.2383)
##AUDIT TRAIL= $$ (NUMBER, WHEN, WHO, WHERE, WHAT)
$$ ##TITLE= Audit trail, XWIN-NMR		Version 3.5
$$ ##JCAMPDX= 5.01
$$ ##ORIGIN= Bruker BioSpin GmbH
$$ ##OWNER= she
$$ F:/spectra/data/she/nmr/H-F/1/pdata/1/auditp.txt
$$ ##AUDIT TRAIL=  $$ (NUMBER, WHEN, WHO, WHERE, WHAT)
(   1,<2024-08-13 14:07:57.32 +0400>,<she>,<DPX200>,
      <created by zg, POWCHK disabled, PULCHK disabled
       configuration hash MD5:
       00 E9 B6 7A A2 85 ED C7 34 08 36 98 17 FE 4E 26
       data hash MD5: 16K
       E4 BC F0 1F B5 D7 A7 A7 AD 4E ED A5 38 4C D1 B4>)
(   2,<2024-08-13 14:08:02.89 +0400>,<she>,<DPX200>,
      <Start of raw data processing
       efp BC_mod = 2 LB = 0.24 FT_mod = 6 PKNL = 1 PHC0 = -26002.35 PHC1 = 20.98749 SI = 16K 
       data hash MD5: 16K
       7A 48 67 50 C7 B4 06 F7 8D 48 55 EC 8D A7 27 E2>)
(   3,<2024-08-13 14:08:25.21 +0400>,<she>,<DPX200>,
      <pk PHC0 = 5.310688 PHC1 = -7.199999 
       data hash MD5: 16K
       0B 79 F5 AC 10 57 92 99 98 3A A9 BE F0 B0 D4 F3>)
(   4,<2024-08-13 14:08:28.95 +0400>,<she>,<DPX200>,
      <abs ABSG = 5 
       data hash MD5: 16K
       C6 41 40 3D 76 8C 0E 7C B4 88 5D 96 85 67 36 4A>)
$$ ##END=
$$ 
$$ hash MD5
$$ C2 28 60 09 96 E7 52 BB 0A C5 E9 4D 11 42 37 55
##$RELAX= 
##$RELAX= 
##$RELAX= 
##$RELAX= 
##$RELAX= 
##$RELAX= 
$$ Bruker specific parameters
$$ --------------------------
##$DU= <F:/spectra>
##$EXPNO= 1
##$NAME= <H-F>
##$PROCNO= 1
##$TYPE= <nmr>
##$USER= <she>
##$AMP= (0..31)
100 100 100 100 100 100 100 100 100 100 100 100 100 100 100 100 100 100 
100 100 100 100 100 100 100 100 100 100 100 100 100 100 
##$AQSEQ= 0
##$AQ_mod= 1
##$AUNM= <au_zg>
##$AUTOPOS= <>
##$BF1= 200.13
##$BF2= 200.13
##$BF3= 200.13
##$BF4= 200.13
##$BF5= 200.13
##$BF6= 200.13
##$BF7= 200.13
##$BF8= 200.13
##$BYTORDA= 1
##$CFDGTYP= 0
##$CFRGTYP= 5
##$CHEMSTR= <none>
##$CNST= (0..31)
1 1 145 1 1 1 1 1 1 1 1 1 1 1 1 1 1 1 1 1 1 1 1 1 1 1 1 1 1 1 1 1 
##$CPDPRG= <>
##$CPDPRG1= <>
##$CPDPRG2= <>
##$CPDPRG3= <>
##$CPDPRG4= <mlev>
##$CPDPRG5= <mlev>
##$CPDPRG6= <mlev>
##$CPDPRG7= <mlev>
##$CPDPRG8= <mlev>
##$CPDPRGB= <>
##$CPDPRGT= <>
##$D= (0..31)
0 1.2 0 0 0 0 0 0 0 0.06 0 0.03 0 0 0 0 0.0002 0 0 0 0 0 0 0 0 0 0 0 0 
0 0 0 
##$DATE= 1723543676
##$DBL= (0..7)
120 120 120 120 120 120 120 120 
##$DBP= (0..7)
150 150 150 150 150 150 150 150 
##$DBP07= 0
##$DBPNAM0= <>
##$DBPNAM1= <>
##$DBPNAM2= <>
##$DBPNAM3= <>
##$DBPNAM4= <>
$$ [...]
##$SUBNAM3= <"">
##$SUBNAM4= <"">
##$SUBNAM5= <"">
##$SUBNAM6= <"">
##$SUBNAM7= <"">
##$SUBNAM8= <"">
##$SUBNAM9= <"">
##$SW= 24.0689771365484
##$SWIBOX= (0..15)
0 0 2 0 0 0 0 0 0 0 0 0 0 0 0 0 
##$SW_h= 4816.95568400771
##$TD= 16384
##$TD0= 1
##$TE= 0
##$TE2= 300
##$TE3= 300
##$TEG= 300
##$TL= (0..7)
0 120 120 120 120 120 120 120 
##$TP= (0..7)
150 150 150 150 150 150 150 150 
##$TP07= 0
##$TPNAME0= <>
##$TPNAME1= <>
##$TPNAME2= <>
##$TPNAME3= <>
##$TPNAME4= <>
##$TPNAME5= <>
##$TPNAME6= <>
##$TPNAME7= <>
##$TPOAL= (0..7)
0.5 0.5 0.5 0.5 0.5 0.5 0.5 0.5 
##$TPOFFS= (0..7)
0 0 0 0 0 0 0 0 
##$TUNHIN= 0
##$TUNHOUT= 0
##$TUNXOUT= 0
##$USERA1= <user>
##$USERA2= <user>
##$USERA3= <user>
##$USERA4= <user>
##$USERA5= <user>
##$V9= 5
##$VALIST= <valist>
##$VCLIST= <CCCCCCCCCCCCCCC>
##$VD= 0
##$VDLIST= <DDDDDDDDDDDDDDD>
##$VPLIST= <PPPPPPPPPPPPPPP>
##$VTLIST= <TTTTTTTTTTTTTTT>
##$WBST= 1024
##$WBSW= 4
##$XGAIN= (0..3)
0 0 0 0 
##$XL= 0
##$YL= 0
##$YMAX_a= 611127
##$YMIN_a= -483053
##$ZGOPTNS= <>
##$ZL1= 120
##$ZL2= 120
##$ZL3= 120
##$ZL4= 120
##$ABSF1= 21.24859
##$ABSF2= -2.820608
##$ABSG= 5
##$ABSL= 3
##$ALPHA= 0
##$AQORDER= 0
##$ASSFAC= 0
##$ASSFACI= 0
##$ASSFACX= 0
##$ASSWID= 0
##$AUNMP= <proc_1d>
##$AZFE= 0.1
##$AZFW= 0.1
##$BCFW= 0
##$BC_mod= 2
##$BYTORDP= 0
##$COROFFS= 0
##$CY= -3
##$DATMOD= 1
##$DC= 0
##$DFILT= <>
##$DTYPP= 0
##$F1P= 0
##$F2P= 0
##$FCOR= 1
##$FTSIZE= 16384
##$FT_mod= 6
##$GAMMA= 0
##$GB= 0
##$INTBC= 1
##$INTSCL= 3.70164e-10
##$ISEN= 128
##$LB= 0.24
##$LEV0= 0
##$LPBIN= 0
##$MAXI= 10000
##$MC2= 0
##$MEAN= 0
##$ME_mod= 0
##$MI= 1.114404
##$NCOEF= 0
##$NC_proc= -6
##$NLEV= 6
##$NOISF1= 3.799351
##$NOISF2= 2.8
##$NSP= 0
##$NTH_PI= 0
##$NZP= 0
##$OFFSET= 21.23831
##$PC= 1
##$PHC0= -25997.04
##$PHC1= 13.78749
##$PH_mod= 1
##$PKNL= yes
##$PPARMOD= 0
##$PSCAL= 0
##$PSIGN= 0
##$REVERSE= no
##$SF= 200.129458067926
##$SI= 16384
##$SIGF1= 3
##$SIGF2= 2
##$SINO= 5.538805
##$SIOLD= 16384
##$SREGLST= <1H.CDCl3>
##$SSB= 0
##$STSI= 16384
##$STSR= 0
##$SW_p= 4816.95568400771
##$SYMM= 0
##$S_DEV= 0
##$TDeff= 16384
##$TDoff= 0
##$TI= <>
##$TILT= no
##$TM1= 0
##$TM2= 0
##$TOPLEV= 0
##$USERP1= <user>
##$USERP2= <user>
##$USERP3= <user>
##$USERP4= <user>
##$USERP5= <user>
##$WDW= 1
##$XDIM= 16384
##$YMAX_p= 468380063
##$YMIN_p= -2024864
$$ End of Bruker specific parameters
$$ ---------------------------------
##NTUPLES= NMR SPECTRUM
##VAR_NAME=  FREQUENCY,     SPECTRUM/REAL,   SPECTRUM/IMAG
##SYMBOL=    X,             R,               I
##VAR_TYPE=  INDEPENDENT,   DEPENDENT,       DEPENDENT
##VAR_FORM=  AFFN,          ASDF,            ASDF
##VAR_DIM=   16384,         16384,           16384
##UNITS=     HZ,            ARBITRARY UNITS, ARBITRARY UNITS
##FACTOR=    0.29402158847633, 1,            1
##FIRST=     4250.41144260642, 0,            0
##LAST=      -566.544241401292, 0,           0
##MIN=       -566.544241401292, -2024864,    0
##MAX=       4250.41144260642, 468380063,    0
$$ Real data points
##PAGE= N=1
##DATA TABLE= (X++(R..R)), XYDATA
$$ [...]
8568 336636 253104 129065 110573 302814 212633 171885 202265 87567 88827 141708 18541
8557 18541 143246 252411 117106 315485 320572 353196 332884 374633 275288 321105 216453
8546 216453 211350 332576 405353 516208 413750 306635 233307 179636 195945 425462 548002
8535 548002 347772 293105 262957 221026 222434 87295 258895 358190 308943 400573 448300
8524 448300 320858 242329 297838 384585 281838 202380 229401 269461 226700 169291 218492
8513 218492 196041 358396 233984 253009 235642 324064 381349 296566 226718 196640 407923
8502 407923 296875 251873 209823 251132 323025 277919 242006 282283 338254 391580 259158
8491 259158 270151 378336 342198 315496 244416 238133 312339 117086 -138430 177912 199046
8480 199046 193684 239900 326520 280672 225978 244462 242538 374665 301340 176896 293555
8469 293555 360005 250679 271808 310849 272159 140007 284361 186570 309465 234850 263246
8458 263246 303436 330153 266718 416089 339831 72370 149112 338324 170804 339829 348183
8447 348183 332184 393680 374249 176628 171530 229373 183057 218269 261432 260504 283297 301072
8435 301072 330863 290712 131550 169406 369978 477110 468773 382450 403431 232705 298139
8424 298139 320306 344695 276552 306034 382426 333110 241673 411553 526019 512789 579003
8413 579003 406504 380805 371843 373359 440577 446807 410914 526403 388707 445175 507854 557751
8401 557751 378948 443588 363081 332308 295948 417961 352129 431785 346597 313893 279686
8390 279686 365601 388617 479712 397113 369818 370445 481525 503037 409370 473084 488472 508054
8378 508054 486696 386050 376970 389905 410986 621836 451040 427453 391110 319464 455915
8367 455915 543043 395637 475475 485128 555956 519023 360872 560002 388246 392216 396131
8356 396131 393616 443914 525621 454868 358780 325518 323128 594142 493549 331413 335538 404250
8344 404250 383562 371817 421746 403658 338727 485525 532027 538422 514151 404929 457183
8333 457183 619333 540981 586448 639180 564883 519325 469351 558762 508210 594423 512169
8322 512169 516118 523171 634637 541842 601454 503758 453472 443090 508546 570695 499669 570077
8310 570077 520802 463310 312270 530191 524348 697210 572457 604820 543074 580326 581070
8299 581070 618323 652056 496132 714150 633278 510285 507915 566563 651701 668875 696502
8288 696502 685684 711765 493306 512182 626868 442006 688648 656894 546480 702732
8278 702732 746821 763338 690829 784974 720890 690647 671972 709389 670622 713457 815695
8267 815695 795937 800780 825010 782941 819905 783705 700742 657931 688162 783964 783096 848174
8255 848174 882152 959694 912209 817712 748379 818632 896618 1051646 905551 880295 896170
8244 896170 861559 751969 704127 670043 850879 804882 710367 769067 721467 825594 915881
8233 915881 914709 1002100 1080811 938507 918451 943753 1003162 964029 964325 1043834 1122190 1027083
8221 1027083 1033529 1101058 1056579 1013150 1082701 1160949 1062440 973531 940787 1060755 1205196
8210 1205196 1362084 1317291 1103447 1263242 1166946 1045460 1077494 1246322 1293270 1228860
8200 1228860 1171876 1186102 1042471 1292662 1313516 1461083 1317171 1935904 1545846 612691
8190 612691 996853 1093421 1225535 1099984 1130218 1241849 1277530 1156350 1221868 1106513
8180 1106513 1170251 1249817 1269262 1280322 1337381 1216986 1088008 1191105 1349112 1291591 1293234
8169 1293234 1188534 1223038 1270529 1333938 1354609 1401537 1337811 1453631 1491938 1470226 1502526
8158 1502526 1516288 1578529 1327934 1405591 1440066 1425475 1427549 1509620 1444931 1269696 1311725
8147 1311725 1441553 1422201 1389053 1403222 1482661 1582671 1551017 1704203 1534800 1512654 1556425
8136 1556425 1661430 1687178 1706916 1663119 1657197 1650011 1687757 1754567 1689584 1759274 1771217 1664314
8124 1664314 1789746 1875287 1928162 1882907 1783865 1734657 1791782 1712199 1697094 1859884 1873058
8113 1873058 1803694 1789490 2028391 2109016 2099946 1988333 2002205 2015486 1948294 1837952 2012298
8102 2012298 2028792 1973883 2003143 2247725 2164355 2193097 2172736 2265458 2245968 2199495 2066556
8091 2066556 2083274 2349010 2462768 2452515 2434235 2388308 2493713 2498775 2375468 2439040 2509304
8080 2509304 2408342 2389169 2438506 2374861 2423008 2440986 2602692 2640217 2632151 2510408 2534101
8069 2534101 2701867 2759032 2720507 2723625 2701373 2741612 2588776 2454116 2795682 2842615 2719097
8058 2719097 2760373 2926577 2932798 2925054 2784140 2907623 2969018 3089942 3288310 3210847 3209232
8047 3209232 3197526 3284211 3084906 3211386 3268416 3329217 3384153 3413078 3384482 3325087 3304919
8036 3304919 3463311 3402465 3569687 3628457 3484712 3570811 3571328 3675127 3857364 3789237 3807433
8025 3807433 3644912 3773368 3752053 3707551 3757010 3909844 4082586 3933979 4071608 4123168
8015 4123168 4206930 4245362 4167656 4138023 4171754 4290019 4277475 4148093 4273255 4355785 4371511
8004 4371511 4304774 4495415 4647881 4549699 4659540 4623288 4575346 4599834 4712116 4946898
7994 4946898 4938635 5035728 4880943 4914802 5105821 5151534 5140098 5166600 5239658 5316324 5201295
7983 5201295 5305499 5447820 5414549 5423523 5503140 5461959 5501240 5495326 5595114 5757755 5733190
7972 5733190 5717125 5881941 5899225 6045299 6027848 6053807 6073217 6144724 6120924 6056930 6253763
7961 6253763 6394674 6355405 6387916 6577853 6403444 6604658 6707569 6678844 6561452 6794096
7951 6794096 6959103 7141782 7186820 7208442 7332522 7291472 7250098 7182105 7271284 7392652 7543303
7940 7543303 7632196 7661175 7648084 7717464 7813857 7796229 7794565 7889367 7959192 7990707 8019978 8008140
7928 8008140 8016609 8094644 8240640 8272440 8481383 8386208 8463033 8507754 8702843 8673038 8773926
7917 8773926 8830992 8867232 8986901 9160976 9335321 9241510 9239368 9238649 9295505 9494678 9441177
7906 9441177 9438249 9514907 9660224 9592257 9663356 9922974 9799648 9850198 9795851 9889530 9926967
7895 9926967 9922853 9925040 10082299 10090309 10102704 10035879 10032684 10180280 10269513 10236351 10242758 10279975
7883 10279975 10318919 10362604 10556551 10547771 10592701 10681183 10554303 10517063 10663116 10549373 10700383
7872 10700383 10682914 10676574 10673900 10616280 10674464 10720565 10702082 10746674 10811736 10730751 10556272
7861 10556272 10555940 10638684 10729811 10888022 10974779 10870953 10902570 10852159 10806637 10728387 10583756
7850 10583756 10654046 10829244 10873919 10774657 10871182 10775203 10766317 10788987 10817171 10771578 10802762
7839 10802762 10722124 10726130 10701836 10685764 10685470 10773334 10593742 10506876 10605641 10587578 10651788 10399736
7827 10399736 10621645 10691868 10627907 10610494 10552097 10558379 10481568 10378786 10371445 10343408 10223521
7816 10223521 10288164 10251987 10281480 10196502 10179656 10015416 10059401 10122083 10070516 9992873 9910698
7805 9910698 9755800 9832664 9893688 9757518 9672831 9715298 9778893 9630186 9691254 9591293 9657119
7794 9657119 9582134 9468239 9408001 9392035 9382324 9319863 9268190 9117247 9093721 8894974 8897624
7783 8897624 9012977 8932371 8844688 8903547 8715222 8702589 8626982 8554101 8637633 8502228 8495634
7772 8495634 8519411 8416759 8283097 8336233 8306369 8287924 8245368 8331159 8183866 8256468 8230841
7761 8230841 8108456 8168371 8059449 7900885 7925931 7909996 7896405 7810740 7840876 7901255 7780495
7750 7780495 7823438 7806543 7651435 7640047 7640925 7604042 7578765 7598643 7527365 7501668 7448579 7251057
7738 7251057 7284380 7377807 7312167 7208149 7194590 7136197 7140775 7023788 6945883 6915752 7079803
7727 7079803 7048158 7118927 7125706 7032315 6924052 6931827 6898001 6917049 6822113 6847617 6812465 6915763
7715 6915763 6934916 6985927 6697163 6647260 6758772 6690352 6678960 6665654 6705475 6693034 6551022
7704 6551022 6665174 6707986 6534598 6653615 6634489 6671193 6638589 6682358 6596972 6656720 6597099
7693 6597099 6682372 6600141 6680037 6755817 6701999 6770023 6645511 6709134 6786336 6627209 6714358
7682 6714358 6565452 6442509 6647955 6523154 6328841 6311403 6250254 6282169 6449758 6388951
7672 6388951 6415682 6161963 6223394 6316927 6437966 6350541 6394961 6471832 6391701 6478218 6486892
7661 6486892 6514162 6483731 6546093 6496809 6378145 6306558 6353177 6316144 6267865 6184862 6266106
7650 6266106 6043987 6018478 6084524 6006491 5887465 5959195 6001046 5879208 5938618 5894285 5804713
7639 5804713 5862088 5831102 5869417 5928083 5812158 5844120 5927531 5920024 5928813 5842365 5805922 5864200
7627 5864200 5907787 5860033 6022574 6035827 6157743 6209018 6187922 6068044 5892910 5789241
7617 5789241 5681516 5679846 5609985 5477935 5487522 5452056 5507498 5458239 5336491 5417903 5364136
7606 5364136 5292423 5315248 5390790 5299304 5370044 5254295 5253414 5303729 5301115 5309922 5291049 5275836
7594 5275836 5185642 5439161 5358178 5360586 5391974 5275029 5441243 5333100 5457212 5516615 5482271
7583 5482271 5585647 5524169 5507474 5663850 5664128 5606773 5862164 5915512 5853533 5726786 5724867
7572 5724867 5658402 5659712 5571893 5603013 5687196 5904812 5914246 5772077 5707587 5700316 5553789
7561 5553789 5515371 5654352 5787580 5792595 5712446 5755400 5710128 5548007 5406729 5534996 5528093
7550 5528093 5437553 5322076 5625691 5642549 5685736 5706344 5460723 5279207 5169548 5070078
7540 5070078 4881161 4925149 4898392 4946785 4949874 4859960 4963422 4917520 4851667 4664481 4703830
7529 4703830 4635121 4530010 4515455 4622646 4601111 4567055 4595280 4605697 4699884 4610422 4594077
7518 4594077 4633016 4628837 4736613 4569977 4632150 4681780 4509692 4616062 4615048 4633106 4595125
7507 4595125 4664205 4650610 4604841 4657447 4517590 4524003 4617528 4515192 4470232 4651062 4763510
7496 4763510 4711792 4839085 4955688 5100350 4984770 5076315 5202801 5052335 5146074 5172067
7486 5172067 5251020 5358380 5491952 5600583 5579809 5498836 5762385 5822267 5926501 5997212
7476 5997212 6061969 6169900 6162734 6326417 6508316 6788343 6908399 7200526 7487772 7718391
7466 7718391 7997953 8248065 8512234 8936333 9176696 9249345 9730799 9845679 10121492 10400099
7456 10400099 10768934 11136273 11442835 11879274 12212923 12574181 13135385 13498843 14096307
7447 14096307 14621967 15308368 16080030 16886516 17865631 18634868 19676329 20931991 22092655
7438 22092655 23258450 24703151 26543009 28241821 30094081 32052136 34572671 37361988
7430 37361988 40708303 44594023 49034887 53993987 59125525 64648510 70461987 76907036
7422 76907036 83621299 90673397 96847080 101793983 105078690 105485676 102834556 98187636
7414 98187636 92121487 84760862 76931324 70057839 64645604 60735650 57887390 56253156
7406 56253156 55441507 55381697 56484901 58570436 61506349 65348034 69162775 73673326 78494346
7397 78494346 84129363 90413950 97031356 103119318 107754122 110141005 109608513 106265363
7389 106265363 100534873 93075221 83825507 73609694 63813558 55628420 49009322 43567284
7381 43567284 39056275 35563703 32587013 30109954 27989429 26134426 24500000 23364424
7373 23364424 22368886 21496840 20705162 19950327 19179642 18444914 17492300 16571763 15713308
7364 15713308 14727490 13884113 13143692 12586326 11925232 11536431 10928597 10470763 10056787
7355 10056787 9859551 9578143 9261691 8977460 8869801 8592881 8718045 8553631 8325868
7346 8325868 8201361 8246085 8284389 8069653 7831395 7542779 7372021 7296011 7063732 6750326
7336 6750326 6326916 6125128 6163029 5870182 5640721 5392042 5315835 5341318 5182401 5162574
7326 5162574 5194035 4993925 4966836 5006981 4860655 4677736 4592309 4383475 4247459 4278512
7316 4278512 4159697 4164028 4103311 3919350 3857728 3851485 3750617 3716042 3577108 3288354 3515869
7305 3515869 3356910 3392991 3251582 3345658 3165333 3222873 3179310 3215929 3210134 3023681 3081622
7294 3081622 2935491 2884547 2952906 2917464 2760952 2695164 2751283 2704596 2845026 2764361 2633697
7283 2633697 2844604 2700962 2760941 2850830 2746220 2615009 2596603 2680565 2620353 2694051 2550742
7272 2550742 2720481 2822570 2679493 2808489 2704286 2871592 2889388 2736739 2783500 2667689
7262 2667689 2675698 2743982 2843996 2904555 2834656 2706190 2773923 2694766 2666511 2691633 2719665
7251 2719665 2564770 2543183 2537166 2604452 2647728 2734248 2670704 2685304 2734579 2712334 2767892
7240 2767892 2788921 2880289 2830576 2797973 2883059 2929740 2877352 2974098 2997486 2980617 2854526
7229 2854526 2910787 3104435 3247026 3465282 3493494 3567139 3590691 3341137 3206685 3149530
7219 3149530 3199846 3062665 3020454 3075441 3283914 3292537 3266934 3353409 3369877 3239002 3336734
7208 3336734 3461999 3337496 3247615 3446008 3417005 3323955 3269033 3052187 3108692 2972831
7198 2972831 3004273 2999284 3013307 3208554 3353926 3206644 3136840 3100360 3111032 2963173 2956110
7187 2956110 2789163 2685084 2648576 2682464 2853027 2753112 2848659 3010632 2939142 2774486
7177 2774486 3042815 2834310 2916088 2959934 2931948 3059338 3211647 3254480 3305906 3298397 3423663
7166 3423663 3365895 3201746 3274594 3239029 3308756 3318821 3353163 3438953 3392618 3280505 3371923
7155 3371923 3464236 3522276 3602881 3364418 3506466 3454258 3608912 3779460 3736310 3760313 3945625
7144 3945625 3945966 3932817 3942065 3924032 3959448 4033792 4086577 4134258 4128673 4114899 4350554 4376761
7132 4376761 4331786 4312431 4378669 4334781 4346164 4523449 4689521 4574915 4611185 4614107 4625210
7121 4625210 4731592 4855335 4969634 5079740 4961678 4935231 4974338 5060691 5166861 5211102
7111 5211102 5329302 5296395 5225115 5150153 5251988 5231949 5314426 5318799 5348705 5353594 5321913
7100 5321913 5425439 5344689 5359808 5400103 5389211 5519957 5752878 5650879 5609447 5687605 5801681
7089 5801681 5890722 5925270 6061591 6091081 6258430 6421965 6594511 6618983 6779275 7003969
7079 7003969 7251901 7387569 7370020 7543591 7722158 7849466 7965137 8151640 8460392 8694013
7069 8694013 8689242 8993443 9382795 9628032 9952399 10296150 10540466 10964674 11356298 11846571
7059 11846571 12466931 13128311 13748071 14230422 14838679 15599945 16497592 17132882 17975749
7050 17975749 18844947 19720989 20899596 21874411 22962057 24312795 25701469 27399043 29366776
7041 29366776 31267530 33604198 36005974 38287765 40270483 42115873 44173163 46513788
7033 46513788 48727069 50214345 51072955 51384740 50965836 50397543 50211275 50511429 51200412
7024 51200412 52703675 54513590 56884179 59955221 63534417 67755460 72819898 78641275
7016 78641275 85461698 93687701 103873938 115831700 129597689 143232633 155633591
7009 155633591 167120073 177358753 186424067 193571104 196907801 196617315 193466137 186460003
7001 186460003 174215482 158905591 144111328 130980311 120664409 112248034 105160110
6994 105160110 99355740 95216780 92442070 90996204 90976843 92278227 94918165 99115628
6986 99115628 104839865 111263902 115704783 116873912 116277426 115178531 112353481 107223439
6978 107223439 100695298 93890309 87544746 82384620 78755198 75876113 72660172 69146560
6970 69146560 65648480 63045740 60478659 57237037 54085833 51648511 49803681 48198467
6962 48198467 47227848 46823242 47099364 47932847 49882999 52004235 53211983 53295172 52945042
6953 52945042 52621191 51861524 50305552 48787121 47558631 45386879 43046283 41198704
6945 41198704 39951921 38091618 35508900 32769324 30417964 28424514 26851979 25704856
6937 25704856 24475093 23420017 22505039 21725124 21086241 20412530 19800935 19391197 19013071
6928 19013071 18752858 18298556 18245159 17899265 17450120 17207794 16931721 16685743 16707827 16587395
6918 16587395 16414385 16253794 16185152 16212047 16094060 16044783 16040319 16199196 16378826 16465396
6908 16465396 16461840 16666670 17015855 17261910 17619171 18139551 18382588 18998175 19741089 20458807
6898 20458807 21494611 22311037 23479611 24828438 26288024 28119730 30489200 33463029
6890 33463029 36333807 39250251 42641558 45843847 47965618 49150379 49370090 48299150
6882 48299150 46635654 44758369 43058668 41795710 41345434 41748723 42887622 44594850
6874 44594850 47583359 52279588 58512140 66070690 71745863 71367773 66773338 63345512
6866 63345512 61329457 61118050 62787241 66168488 71414032 77564827 83703483 89220147
6858 89220147 93575397 95240906 93281687 89460488 86150586 84249406 83180840 80671417
6850 80671417 76043480 71007659 66530509 63241329 60858606 59648116 59152076 59775925
6842 59775925 60981690 63042803 66019798 70127764 76114672 82799325 88956300 93940517
6834 93940517 97847179 101545183 105020163 106774774 104903974 99350824 92984887 87736854
6826 87736854 84181111 80053440 74102094 67346267 61630993 57078377 53377299 50522074
6818 50522074 48533944 47238421 46425727 46574766 47165088 48270436 50345271 53321637 56014917
6809 56014917 56850329 56243593 54996758 53701052 52348122 50489939 47515368 42932055
6801 42932055 38132168 33866460 30183933 27489689 25184917 23298526 21754084 20466821
6793 20466821 19315176 18248067 17201756 16271195 15516747 14597753 13780278 13023496 12208623
6784 12208623 11645901 11018405 10474877 10052931 9630881 9133686 8744033 8471194 8180261
6775 8180261 8058036 7910733 7617446 7355708 7317040 7016822 6864043 6683388 6408381 6417413
6765 6417413 6224137 5951313 5865944 5709248 5438846 5443931 5428946 5308423 5221744 5060438
6755 5060438 4931359 4840926 4753269 4517272 4281559 3998783 3825376 3788032 3622607 3505741
6745 3505741 3466841 3387853 3288465 3155207 2995952 2874137 2988947 3124186 2965012 3069355
6735 3069355 3186765 2995817 2877530 2772432 2794708 2878635 2857253 2738996 2818805 2690667
6725 2690667 2803861 2662906 2510248 2381202 2395967 2420772 2206914 2134061 1983942 2020191
6715 2020191 1903925 1986252 2000320 2010631 1838811 2025950 1884002 1755812 1790927 1736954
6705 1736954 1670688 1737844 1670173 1659788 1556191 1603793 1564060 1621028 1495836 1445151 1456094
6694 1456094 1428243 1364071 1344181 1369310 1362814 1333207 1338695 1233808 1137195 1080788 973757
6683 973757 1022431 1057099 1034261 1084062 1036804 906084 965946 832869 885793 967709 1026415
6672 1026415 941793 928261 1025613 1163727 970221 909752 961722 994985 891541 900499 805061
6661 805061 927981 925446 865301 842214 779794 738645 818496 773527 896383 962275 861584
6650 861584 876639 748846 868550 755227 774533 773705 826900 954178 899991 922320 766789
6639 766789 800686 844164 872748 790372 889388 835125 936952 909122 788200 907849 980751
6628 980751 1029168 989169 985147 999206 1031528 958644 967992 886964 835169 1068503 1079553 1218707
6616 1218707 1100993 1132762 1184750 1254806 1166150 1279725 1321039 1150083 1215972 1445391 1538626
6605 1538626 1495020 1614960 1647138 1415415 1501556 1556130 1712809 1834892 1873339 2074177
6595 2074177 2281675 2378210 2413082 2653045 2677516 2904697 3031405 3005778 2882384 2969200
6585 2969200 2784325 2812899 2454041 2349986 2431031 2355184 2313097 2254597 2268715 2191017 2161429
6574 2161429 1990885 1974211 2078857 1977406 1978121 2079953 2030652 1884184 1822838 1777473 1753036
6563 1753036 1701313 1657082 1579794 1643705 1601291 1587369 1486510 1275636 1196593 1258647 1382568
6552 1382568 1375798 1324572 1318847 1154749 1157170 1015150 1084333 1151185 1186159 1071147 906817
6541 906817 923581 810872 903513 848077 770129 740971 713089 778450 584483 448941 576493
6530 576493 448862 429106 407956 454122 448139 438918 307794 205755 255879 327139 405068
6519 405068 434391 372948 444965 218285 186833 384730 516007 454498 489158 411165 333940
6508 333940 350845 150179 161179 224632 203188 76336 107740 119979 251365 153267 204067
6497 204067 138325 140946 236818 94906 103036 -46002 -13557 1830 53025 129331 -8161
6486 -8161 97338 165306 16099 -20667 104471 147282 141193 129256 79123 134699 63810 12498
6474 12498 -77561 -94755 38934 55531 -52415 -173754 -54887 -161373 4106 129361
6464 129361 -11598 25077 34722 4042 45403 -59537 -47979 -150718 -7130 19074 -78714
6453 -78714 16094 30510 28002 138424 132521 154437 26395 -18909 -10633 -89058 11475 54582
6441 54582 99872 124059 64138 -18231 -173138 -231605 -89573 -125673 -34129 30409 -76882
6430 -76882 -58383 -117492 -96324 -31403 -22245 118597 89574 44371 1517 28574 59295 -82537
6418 -82537 -58915 -40742 -140035 6805 -59055 78954 -125914 -49314 8191 33103 -106607
6407 -106607 -64578 -122539 -108996 10929 40402 -79294 -189181 -61219 -77082 -237115 -157012
6396 -157012 13207 -70083 -28408 -21311 -90647 38970 70158 72719 -52315 -204491 -105317
6385 -105317 3417 49500 145646 169023 45213 108201 43174 -8454 14025 -52935 -8413
6374 -8413 115832 106677 -6152 -76221 71080 -110778 -52938 84638 99558 68176 240892
6363 240892 43846 -9785 -60797 -84981 -46326 6273 47061 216486 289641 242929 201499
6352 201499 187266 338657 291556 234824 272454 250900 313497 338938 295298 425825 414043
6341 414043 377798 463089 493146 387736 368511 270842 341438 246652 199005 82699 127379
6330 127379 214264 214077 265972 231050 339394 422586 342516 380859 334564 336300 220379 227084
6318 227084 269694 167359 132222 154716 239655 268975 241861 287364 310786 351587 402062
6307 402062 382502 486130 530485 483253 585725 535819 447706 485207 548952 594907 728110
6296 728110 866347 767621 804885 892641 972149 869418 767867 713246 705214 802496 814843
6285 814843 638951 575389 525752 523744 424389 378375 216316 231967 244527 346329 385516
6274 385516 132635 69399 132123 48296 73848 226674 230177 151179 194422 93163 -47715
6263 -47715 99523 163697 121082 184870 374726 291571 207357 240484 120211 117980 71201
6252 71201 -26277 -62680 38061 87025 114176 169608 199532 167636 15203 -192884 58552
6241 58552 95889 127103 102184 -29066 146381 146027 96069 14922 67560 -44840 -3086 -32600
6229 -32600 46297 24021 108365 27257 98483 -85981 -206690 -80432 -76144 -32512 -139392
6218 -139392 -82544 -102704 -14333 31506 -140290 -62908 -57072 -11332 -133531 -214965 -72619
6207 -72619 -36996 -74875 -34386 -19303 -71931 -16678 -58527 -3531 -27322 -69511 12012 -100894
6195 -100894 -72341 -7727 -112787 20737 -67134 -50164 -93809 -197934 -17107 21692 -22550
6184 -22550 50550 45367 158297 171105 184743 108356 -41785 -121291 -175243 -12495 -128957
6173 -128957 -131363 -475 2465 94832 -69276 -90761 -96345 -7925 -1394 63653 11178 157463
6161 157463 209357 18139 -65760 -197461 -99110 -193102 -58127 -21637 83773 -14411 -160049
6150 -160049 -40148 21416 -3585 -44118 -193408 -116110 -79753 16115 -67772 -70693 -141172
6139 -141172 -59945 63629 -31352 108746 19438 -50815 -197990 -142243 -5366 104423 73738
6128 73738 102748 34101 30770 22312 -43143 70296 74211 68840 -16502 -17209 14733 -81125 -47843
6115 -47843 -161725 -126740 -172598 -160576 8160 -35020 58495 168844 166269 180075 122579
6104 122579 151996 71268 136922 291658 350760 297233 266394 336740 230807 299044 389631
6093 389631 472618 469419 495525 486344 362532 388624 380200 428451 488506 489996 715748 760895
6081 760895 644877 644015 610801 752086 615898 647701 714809 572611 534218 668671 554362
6070 554362 470006 621871 653829 778968 1015231 1093577 1039531 1091231 1058572 1085667 1050324
6059 1050324 1197876 1410992 1310711 1371290 1499415 1383634 1416737 1356089 1268433 1193693
6049 1193693 1099105 961926 1023945 1040803 983318 1132296 1365969 1473088 1570435 1581165 1603318
6038 1603318 1758038 1801173 1768594 1723533 1840475 1751674 1737468 1741388 1632586 1376096 1180954
6027 1180954 1126287 1017925 1037212 739490 738703 649250 537378 509246 399032 250005 369394
6016 369394 331283 273866 302868 324253 390497 194710 162855 185219 154229 15197 151798
6005 151798 325813 203933 237229 168801 45308 81455 78730 109121 176634 189893 201334
5994 201334 37200 -80619 -160943 -294871 88825 53663 28265 -3284 25068 86926 10072
5983 10072 -203922 -266316 -108183 -49462 59260 -27152 10800 -119489 -8401 -53769 -79120
5972 -79120 -124219 -142443 -116050 -141084 -140900 -157098 -102477 74874 220521 85957 35202 -74314
5960 -74314 -179904 -68523 -94826 -141047 -50018 -32291 101866 42153 -9685 38241 105873
5949 105873 -23475 93484 84651 23040 142003 106501 -18320 -3429 -18399 -3111 -93850
5938 -93850 -115103 -2516 66873 65961 -65060 46751 -28912 -66682 46645 71626 7421
5927 7421 -58739 -61779 13184 -96147 -3438 202557 12760 -70621 45307 -12396 47525
5916 47525 58352 11515 26555 -44073 65080 -62747 -91651 32984 64194 144428 71657
5905 71657 67822 -38980 -24949 -7090 -42693 69224 71471 9847 -9100 58152 -36537 43837
5893 43837 20443 136501 55006 58395 9935 102453 159914 58546 6326 -69132 -168548 -79827
5881 -79827 4829 -48427 -76302 -58428 -23746 -7168 52451 -2205 -26208 -244347 -155618 -139637
5869 -139637 -42020 29961 -4033 -138160 -135383 -109124 -52024 -125063 -128867 -72322 62029 64460
5857 64460 76364 -100047 -101240 -58710 -17298 -62688 -174099 -29187 51760 100220 10167
5846 10167 -25536 -41613 84349 26440 50168 -59496 -31241 -171898 -84705 -9311 -39098
5835 -39098 49479 605 -76266 -22023 -14052 34956 76398 -169 -13034 -84362 -87494 38728
5823 38728 -7391 -40269 -107223 -27741 26163 39226 8847 -73862 -62364 -89410 48955 -42613
5811 -42613 -44249 76572 38558 30576 86926 10402 9489 78408 122328 77683 240519 190428
5799 190428 45886 53411 71246 10675 -85924 -79079 -9702 118625 81415 12806 3044 -3145
5787 -3145 18809 35239 20408 -88016 -23498 40948 48654 85052 45260 104940 113931 -4682
5775 -4682 84149 79821 -86754 -72109 156884 106351 26859 166040 50469 -130790 8032
5764 8032 28736 -37391 -49318 -24253 67138 -49654 -17875 74221 129462 77241 74154 72043
5752 72043 255 -74629 -40537 131237 91056 -3412 51175 75974 -199933 -42105 -9753
5741 -9753 87679 89478 5940 133640 -34703 -83071 -32103 55297 77728 -61501 -39908 -462
5729 -462 -58093 -166861 -19845 -14481 107810 10012 31593 16666 46067 191989 101738 173965
5717 173965 88842 86127 57901 155747 97423 53852 -12779 -37974 103936 79535 94270 70061
5705 70061 110630 217661 132396 110179 187583 84436 12352 -34925 35627 64842 67959 -44744
5693 -44744 -144285 -64116 -200936 -80558 -74723 -46354 -38418 -50631 -67921 152776 131240 129071
5681 129071 62816 -22998 -18818 -136422 -81411 -6017 -127709 23748 73769 -50802 -122756
5670 -122756 -148540 -92643 -21453 106768 134562 77584 27472 -77084 87772 183876 32684
5659 32684 -131677 -75328 83947 87975 83108 164922 63407 -20417 38217 130087 93848 158299
5647 158299 11716 5740 123212 107260 102103 -14775 23842 -12654 98976 -85202 -84864
5636 -84864 36582 171135 229159 79177 138079 123184 189713 120017 105542 207505 97516
5625 97516 191097 157386 167561 108101 53512 101221 76898 179210 107816 235339 197968
5614 197968 217639 244146 5242 -1885 78168 83934 -103780 -79655 -1031 -38542 -7326 83953
5602 83953 59255 99646 139247 84689 110967 84716 53596 8689 51916 32971 121199 77922
5590 77922 52321 44691 6165 25953 20056 190743 50252 22716 75109 142002 200895 159357
5578 159357 165386 152654 176389 259463 230379 55815 46007 91888 76855 -40938 19106 196281
5566 196281 148292 159570 131792 136448 164237 303776 193783 133627 42122 242401 209749
5555 209749 40241 152729 88413 142056 67253 226332 288564 149480 83898 -43055 68141
5544 68141 101167 1191 22518 10871 155618 114120 132814 146629 207411 192189 96916 176788
5532 176788 173699 147302 85896 186583 133504 22796 86504 99960 93883 107367 46229 130322
5520 130322 51139 27527 -117934 18870 85256 163643 217235 26677 171440 31734 100989
5509 100989 186279 17633 87752 -22448 -12795 -101481 -31422 56562 84199 240785 172468
5498 172468 174340 123021 20199 -41065 -34552 41983 59886 -14263 64228 180362 77446
5487 77446 178352 231257 162772 167570 21978 84929 248493 118501 66810 -68308 52030
5476 52030 100594 -29457 16442 89248 72208 46860 276999 222171 243123 305571 280384
5465 280384 162806 23496 8423 142852 235802 -8951 76989 196518 33487 164671
5455 164671 250104 206892 48681 -53337 41038 167040 248020 163456 227793 231055 237131
5444 237131 127457 122652 219387 315291 271371 40816 282799 247342 248100 177587 125899 88947
5432 88947 189431 215726 199635 263801 288556 218197 315090 168113 230455 349387 337517
5421 337517 379218 392443 403983 382343 470773 596873 626448 460121 334945 370434 302448
5410 302448 275976 365378 115939 58201 167000 88890 32223 161164 220157 189760 161830
5399 161830 215861 187382 241220 212978 238533 297551 151445 197500 180823 138254 127580
5388 127580 216446 260731 180032 190968 247504 171803 162926 217702 193591 103044 122809 133078
5376 133078 46398 106952 113150 265856 295929 225987 247147 200204 116688 19409 81038 134579
5364 134579 172513 93374 57329 77462 139429 214604 268371 326937 289590 111694 165245
5353 165245 286852 193024 71466 130686 118788 148247 227954 286162 234528 16121 -4123
5342 -4123 172225 318127 274408 188897 156151 185400 236787 241165 237586 111886 73304 113727
5330 113727 57859 207630 374738 236508 254227 169404 172736 367266 352032 212157 233616
5319 233616 225496 190290 321344 218247 205678 356261 432869 255805 272051 281250 338461
5308 338461 399666 409599 280037 269871 365524 240882 374284 406753 282961 434995 484189
5297 484189 301100 260219 386259 271537 225307 352745 367598 345084 440083 335797 197169
5286 197169 199797 342562 290203 243300 317244 423229 236772 356324 351473 486169 422505
5275 422505 369220 482442 324578 339041 331709 161542 409209 503257 394074 378203 397708
5264 397708 524141 577203 576567 371292 458052 519088 355897 334762 343242 347402 331711 538879
5252 538879 410002 520648 454567 371016 529002 523742 460193 424591 403668 419995 436478
5241 436478 488213 431640 463026 509767 528261 536045 475811 585604 658004 553376 598597
5230 598597 829018 731604 669751 567694 814395 706321 891923 939438 855497 883778 877592
5219 877592 720124 798779 755605 773299 863559 766829 780925 760395 895258 906554 873125
5208 873125 1016246 988675 951345 881450 938373 1000654 959676 856218 869833 870751 821401 786359
5196 786359 712081 752047 662718 603640 867551 917629 920623 811866 807962 754219 702375 823613
5184 823613 755374 755439 848160 836226 838219 779525 849222 951991 808607 728089 752199 851863
5172 851863 863980 847700 878876 801388 892749 930902 775085 856938 949969 928588 776788
5161 776788 750020 817083 828659 998804 948862 986424 1023405 1000081 1078769 936213 954548
5150 954548 894403 909859 947603 903195 972259 973947 927962 908093 912482 841095 829357 882331
5138 882331 1093172 1134581 1061941 874341 1049194 1043995 1085543 1257615 1163415 1193898 1214442
5127 1214442 1209096 1149357 1207048 1227860 1172572 1153060 1244012 1145626 1116780 1228444 1130992
5116 1130992 1225742 1311097 1339130 1392300 1370664 1432726 1302365 1379145 1463649 1359028 1512111
5105 1512111 1568860 1422538 1528750 1569754 1609294 1613305 1472826 1634154 1641189 1590005 1633029
5094 1633029 1675936 1757241 1767638 1799277 1758935 1733800 1785478 1674277 1673597 1761833 1816841 1968916
5082 1968916 2010751 2029232 1830632 1959389 2036300 2181966 2144931 2127103 2126880 2042683 2203327
5071 2203327 2323684 2371049 2432004 2389339 2500229 2525357 2643902 2673199 2678197 2685338 2633380
5060 2633380 2779522 2806929 2855136 2963837 2946604 2997646 3210488 3265101 3253386 3237255 3288646
5049 3288646 3550677 3612825 3699872 3827759 3780174 3842793 4171805 4233066 4367805 4586681
5039 4586681 4797123 4960047 5025097 5195577 5441138 5689031 5817144 6077123 6386909 6546479
5029 6546479 6820375 7150315 7572106 7921338 8155254 8637826 8992787 9312041 9728334 10071534
5019 10071534 10656880 11182192 11801673 12328207 12907972 13651402 14248813 15125991 15949688
5010 15949688 16820876 17704571 18587790 19841090 21060007 22421728 24014741 25736229 27726635
5001 27726635 29821922 32097001 34545474 37361035 40283206 43038685 45490794 47595124
4993 47595124 48970368 50021182 50699083 50963450 51144836 51526123 51889346 52594077 53774387
4984 53774387 55471393 57486753 60280020 63578732 67213043 70827967 74611831 77673990
4976 77673990 79491738 79768849 78316964 75786300 72455643 68964063 65569520 62526880
4968 62526880 59769968 57303254 55183606 53695818 52755425 52266391 52141011 52326067 52235050
4959 52235050 51994938 51154761 49836026 47802968 45192798 42350378 39388994 36773190
4951 36773190 34229470 32005533 29734516 27741345 25993419 24325353 22970569 21550334
4943 21550334 20180869 19191471 18220618 17280962 16520156 15861317 15191962 14758119 14108326
4934 14108326 13675464 13088500 12303329 11857110 11406021 11118111 10665725 10471094 10300567
4925 10300567 10158316 10091601 10140393 9999611 9524210 9244947 8913251 8443920 8287238 7981358
4915 7981358 7667071 7419722 7339135 7095921 6922242 6800335 6551664 6399528 6397938 6248948
4905 6248948 6207951 6184613 6131890 6242344 6075260 5737192 5786487 5671758 5448308 5416923
4895 5416923 5280790 5196691 5039771 5037658 5039926 4877640 5045079 5134397 5235479 5210534 5183152
4884 5183152 5415921 5551506 5682513 5677130 5449262 5513537 5686391 5758914 5987467 6007253
4874 6007253 6059068 6005833 6259956 6317738 6574191 6684917 6871195 7323252 7713783 7898969
4864 7898969 8260886 8598033 8989827 9503659 10183890 10853057 11590734 12353467 13329642 14254794
4854 14254794 15295576 16211526 16689289 16904733 16640197 16574423 16218642 16006421 15776712
4845 15776712 15607234 15518268 15447206 15651114 16107543 16638375 17387882 18671786 20010978
4836 20010978 21895044 24130995 25920428 26974199 27037861 26453045 25594498 24132119 22523997
4827 22523997 20832767 19259296 17821108 16697910 15873919 15268654 14873262 14636529 14535787
4818 14535787 14793228 15390132 15852850 16616532 16957832 17007933 16668500 16027362 15012176
4809 15012176 13915864 12723411 11783666 10712870 9652429 8761125 8205854 7681393 7020345
4800 7020345 6596838 6270552 5777987 5474383 5358776 5324047 5073370 4712214 4590765 4441863
4790 4441863 4223638 4161665 3949130 3872317 3817233 3749997 3770080 3789254 3790624 3497082 3431804
4779 3431804 3275157 3451348 3421775 3379533 3145454 3202451 3255042 3071963 2978448 3029884 3125461
4768 3125461 3178330 3173248 3018974 2993912 3028410 2934645 3028837 3019769 2963953 3061366 2876150
4757 2876150 2929580 2774243 2870670 2927207 2835072 2860364 2938003 2930406 2876835 2780971 2855728
4746 2855728 3009698 3061348 2954027 2951038 2950173 2917210 2799549 2911449 2808245 2750645 2745992
4735 2745992 2749623 2824441 2809468 2927506 2706595 2751887 2798154 2693947 2733564 2805310 2731427
4724 2731427 2636416 2493914 2581983 2569313 2440955 2447859 2486021 2553564 2493423 2430725 2334977
4713 2334977 2400646 2507065 2538460 2430826 2391372 2389878 2449966 2485328 2323578 2441745 2534961
4702 2534961 2660165 2732377 2731367 2706322 2698836 2707492 2677637 2742685 2805018 2794147 2645928 2647837
4690 2647837 2670018 2750690 2816782 2665477 2691860 2851021 3000984 3121084 3063212 2956004
4680 2956004 3032360 3011045 2927976 2957012 3091170 3086527 3178801 3209092 3258827 3391802 3499471
4669 3499471 3498599 3474218 3501885 3614710 3721897 3604486 3766192 4097771 4067716 4205228 4397187
4658 4397187 4553849 4521526 4445759 4415560 4318626 4253748 4237961 4360962 4431097 4429507 4476617
4647 4476617 4339543 4478444 4565078 4553977 4723592 4776384 5046778 5140227 5155867 5371147
4637 5371147 5242917 5170871 5221437 5133087 4966494 4955613 5012672 4825567 4861841 4798534 4678442
4626 4678442 4773359 4817331 4934517 4942956 4958582 4936292 5035209 5138683 5201268 5378622 5347806
4615 5347806 5252658 5300832 5279981 5226728 5316559 5375328 5300368 5303218 5559481 5797047 5851667
4604 5851667 5922999 6107159 6193266 6402656 6706199 6826886 7118756 7249242 7517485 7874881
4594 7874881 7824083 8189033 8687385 8927438 9198109 9428264 9669108 9870541 10091715 10493809
4584 10493809 10911151 11392113 11737264 12084349 12617548 13202900 13752098 14302811 14839478
4575 14839478 15527869 16235563 17031836 17855624 18941282 19884312 21029271 22250434 23455273
4566 23455273 24842700 26513286 28395780 30401125 32420669 34607205 36759951 39224727
4558 39224727 41935820 44879126 47785022 50491202 52729697 54453198 55541267 56030106
4550 56030106 56174988 56119698 56098950 56314172 56708778 57717878 59433802 61545607 64226279
4541 64226279 66917593 69913411 73068921 76311310 79413387 81283747 81592588 80519409
4533 80519409 77904363 74539225 70540929 66632844 62835224 59442688 56705114 54233534
4525 54233534 52594306 51432334 50680581 50278427 50177598 49977149 49474458 48914146 47733568
4516 47733568 46146485 44195550 41885616 39164839 36730243 34126389 31822639 29605442
4508 29605442 27621763 26002844 24548935 23422463 22250013 21315158 20343153 19780499 19187879
4499 19187879 18537419 18027095 17436529 16872646 16494680 16358483 16115793 15850723 15643696
4490 15643696 15584456 15439157 15685555 15735440 15798979 15911946 16136427 16393788 16702187 17229800
4480 17229800 17567041 18065304 18292946 18600970 18889225 19228011 19453522 19876631 20455179
4471 20455179 21070365 21771830 22580322 23385052 24366261 25499220 26544258 27919558 29287789
4462 29287789 31047926 32873514 34639139 36570783 38706907 40763054 42755052 44727233
4454 44727233 46291782 47680053 48823164 49803824 50551816 51313590 52068967 52745526 53472487
4445 53472487 54613436 56036069 57649551 59426490 61672356 64176496 66720272 69497964
4437 69497964 72104183 74518192 76574392 78196148 79028016 79247153 79133961 78482575 77313052
4428 77313052 75610776 73396899 70852550 68399982 65863114 63799245 62307089 60920150
4420 60920150 59901398 59267244 58836296 58348480 58126620 58040383 57955961 57708147 57562550 57861839
4410 57861839 58012143 57075452 54899817 52355836 49354291 45750001 42204550 38975829
4402 38975829 36167977 33541165 31408913 29499982 27774844 26492406 25247132 24509410
4394 24509410 24005685 23739615 23560394 23695495 23466499 22981519 22508464 21776116 20646403
4385 20646403 19378144 17976909 16762070 15595321 14643620 13708350 12986558 12243240 11595543
4376 11595543 11093441 10509854 10115980 9608948 9246205 8968313 8527044 8189138 8080077
4367 8080077 7809974 7693979 7438519 7186743 6993418 6940641 6723806 6464947 6305568 6153119
4357 6153119 6056571 6073879 5986918 5830445 5713719 5701101 5769408 5711795 5690375 5641626 5509394
4346 5509394 5432537 5290350 5373941 5302861 5195336 5169270 5096146 5251186 5017162 4965470 5040330
4335 5040330 4899415 4868727 4911514 4956843 4890446 4942615 4827012 5037838 5119415 5090334 5294094
4324 5294094 5421960 5619140 5907841 5933420 5855783 5633988 5582099 5603261 5527760 5518128 5678913
4313 5678913 5640325 5662662 5801305 5932633 5902601 6058068 6118551 6355746 6517640 6420955
4303 6420955 6786304 6903162 7086566 7027398 6941495 6942026 7096832 7186371 7244575 7159113 7170905
4292 7170905 7188999 7476881 7948706 8198969 8428284 8266010 8252599 8053507 7742612 7514036
4282 7514036 7471226 7699485 7587841 7365201 7337447 7234597 7193444 7494836 7573934 7756009
4272 7756009 7871482 7780160 7541284 7239061 6964558 6708602 6619063 6587784 6689475 6628043
4262 6628043 6527420 6391307 6497561 6527855 6477574 6278765 6052574 6069879 5996378 5730741
4252 5730741 5669075 5517660 5325221 5274728 5224015 5128001 5128115 5083382 4950913 4767291 4876131
4241 4876131 4645986 4489149 4446942 4486426 4532417 4347401 4311523 4235846 4076569 3986660 3916874
4230 3916874 3808398 3741913 3652630 3757052 3766940 3717619 3879025 3881196 3806303 3890082 3818760
4219 3818760 3841232 3736625 3747914 3689290 3833068 3856816 3900820 4038871 4050196 4060145 4202303
4208 4202303 4187709 4224909 4363728 4451424 4253215 4464733 4613257 4580157 4690389 4893143
4198 4893143 4992815 5173200 5510051 5573857 5628651 5923351 6264189 6535484 6641914 6601506
4188 6601506 6420676 6635304 6915025 7062781 7298270 7526367 7709867 8049235 8106683 8162743
4178 8162743 7825204 7271582 7062046 6669088 6275441 5912894 5750349 5524124 5132965 4956353
4168 4956353 4917444 4686390 4495016 4445217 4323141 4286831 4095717 4171823 4140970 3990943
4158 3990943 4040212 3969668 3843635 3931678 4013596 4147919 4365034 4630134 4920753 5148952
4148 5148952 5270433 5278011 5146701 4829069 4459521 4016534 3852351 3673951 3586844 3573078
4138 3573078 3599938 3590706 3507970 3370184 3414149 3209449 3352023 3561484 3588869 3736603 3929927
4127 3929927 4105955 4606895 4910283 5242468 5309410 5072047 4787278 4353844 4084026 3900404
4117 3900404 3752184 3418444 3097106 3101775 3032835 3036471 3036152 3106601 2920807 2940294 2987686
4106 2987686 2994699 2964915 2990427 3089225 3025093 3115221 3240681 3326917 3353543 3327451 3221113
4095 3221113 3191090 3145668 3053919 3096729 3040010 2865666 2727863 2842648 2909683 2668055 2648144
4084 2648144 2656586 2724252 2714833 2531874 2505178 2561550 2556712 2419982 2446012 2440534 2555518 2616209
4072 2616209 2547259 2677093 2874145 2936830 2966288 3012368 2836308 2831667 2896394 2743200 2695354
4061 2695354 2808003 2744438 2782493 2667255 2629921 2605891 2582422 2557551 2556811 2519589 2598769
4050 2598769 2540340 2439995 2742502 2881655 2774236 2875972 2922857 2880355 2984002 2957756
4040 2957756 3073803 2983522 2937407 3006872 2936462 2815425 2825395 2751911 2694538 2618127 2695569
4029 2695569 2604870 2658766 2882315 2815505 2775395 2721763 2874347 2769318 2784926 2945780 3025079
4018 3025079 2925262 2959825 2904694 2868728 2969615 2941305 2916145 2855134 2883273 2924550 3014039
4007 3014039 3020216 2995829 3113876 3260638 3124094 3048192 3057438 3180928 3171841 3010242 3113845
3996 3113845 3093094 3134230 3126248 3051773 3036170 3023342 3045200 3116260 3144011 2998312 2903742
3985 2903742 3064071 3117620 2988196 3045802 2947303 2947133 2966068 2968875 3057302 2966675 3008854 3023067
3973 3023067 3061918 2969211 2923151 2945372 2989448 2835548 2931974 2966222 2871188 2975584 2911384
3962 2911384 2965179 3127040 3091544 3212947 3196719 3169144 3139797 3107262 3076462 3079122 3103908
3951 3103908 3117580 3091659 3023583 3073851 3164868 3164532 3260628 3358569 3155889 3098380 3359754
3940 3359754 3464777 3585394 3694644 3739206 3686517 3646854 3680806 3739889 3919654 4253610
3930 4253610 4477976 4458643 4597736 4469885 4082842 3950877 4044888 3875384 3815563 3824203
3920 3824203 3940551 3760794 3850285 3943366 3935189 4094592 4112234 4178868 4479976 4634019 4712471
3909 4712471 4785261 4828041 4761270 4849486 4839870 5140623 5229325 5349996 5583740 5755343 5722580
3898 5722580 5382278 5101838 4905418 4759399 4475292 4384801 4245563 4201769 4180583 4054934
3888 4054934 4189192 4358351 4296279 4354208 4301992 4145989 4032322 4073384 4017260 4129179
3878 4129179 4214694 4313009 4342548 4475357 4359563 4440999 4428814 4532800 4505377 4446773 4560732
3867 4560732 4700180 4608292 4687281 4851941 4867690 4922073 5027911 4973454 5053609 5185744 5178203
3856 5178203 5201229 5313131 5484841 5510693 5550949 5538450 5826126 6122596 6092723 6267147
3846 6267147 6456144 6631819 6650406 6841722 6945402 7092798 7418948 7844961 8072636 8341246
3836 8341246 8636336 8722653 8998350 9351415 9895089 10645874 11550809 12842997 14368376
3827 14368376 15219168 15066658 14046357 12883734 12151207 11689187 11150728 10976686 10808916
3818 10808916 10681031 10753653 10815436 10858157 11226518 11525684 11639487 11816078 12242704 12623924
3808 12623924 12913386 13244535 13734638 14149732 14912897 15356718 15776297 16369089 16995967
3799 16995967 17786595 18528097 19385896 20318556 21111780 22112680 23166157 24278973 25466825
3790 25466825 26835338 28113379 29516793 31165646 32672328 34163181 35903353 37506256
3782 37506256 39206402 40646866 41965269 43211490 44637654 45658816 46587355 47526386
3774 47526386 48290786 49093668 49950305 50810259 51829533 52934202 54155631 55335524 56767360
3765 56767360 57905267 59109883 60195752 60979969 61612274 61788864 61702755 61076885 60213670
3756 60213670 58881751 57345727 56020388 54500420 52890025 51346861 49909764 48465326
3748 48465326 47158652 46061715 44858166 43683240 42527358 41582208 40521436 39512178
3740 39512178 38273790 36830713 35354874 33815507 32268941 30645418 29090018 27672414
3732 27672414 26081847 24666731 23341064 22129892 20882585 19663480 18653795 17733632
3724 17733632 16870238 16132867 15269736 14662715 14132521 13559970 13021144 12526003 11987517
3715 11987517 11473207 11102459 10777613 10486205 10104879 9867242 9533878 9242584 9212761 8858755
3705 8858755 8617031 8500360 8448966 8355593 8399753 8499524 8308547 8135830 7855593 7634010
3695 7634010 7457949 7308788 7035863 6591257 6589229 6422969 6422061 6243442 6307861 6161929 6126098
3684 6126098 6020558 5913456 5878318 5781330 5678429 5693206 5615808 5391771 5145180 5135756 5224997
3673 5224997 5045175 5159177 5238861 5120546 5067948 5049827 4962102 4840264 5028298 4910619
3663 4910619 4791240 4664650 4467810 4501445 4625638 4537722 4442298 4404911 4532997 4569387
3653 4569387 4444514 4502366 4445199 4431939 4586593 4505797 4266369 4083912 4146783 4219238 4212800
3642 4212800 4307548 4369553 4310171 4227833 4218852 4181534 4274055 4389625 4400398 4422027 4277783
3631 4277783 4257259 4420380 4472417 4686446 4782316 4771418 4834609 4731108 4896029 5043073
3621 5043073 5081243 5271667 5363155 5241094 5484929 5652215 5738636 5904394 6065031 6245315
3611 6245315 6526473 6794671 6847553 6718289 6870513 6994496 7021600 7099283 6993916 6957576
3601 6957576 6397439 6006188 5742659 5435685 5290562 5182929 4969000 4803335 4686605 4478786
3591 4478786 4427378 4593321 4595895 4567371 4466343 4516575 4404824 4402763 4432863 4440019 4403704
3580 4403704 4533812 4539930 4583483 4627970 4765320 4580996 4569722 4736163 4803987 4950110 4869483
3569 4869483 4844971 5031316 5121455 5023667 4947539 5007031 4842974 4693036 4657937 4676596 4460604
3558 4460604 4281728 4225341 4348540 4316461 4449490 4475618 4606350 4457185 4478777 4542626
3548 4542626 4426534 4435236 4491282 4535702 4521059 4582717 4629900 4721960 4845041 4730926 4876442
3537 4876442 4972572 4965101 5076434 5112604 5165612 5287192 5309327 5260247 5349115 5439290 5495955
3526 5495955 5864768 5788452 5609848 5716803 5750622 5695064 5932685 5844387 5959187 6305475
3516 6305475 6397160 6489531 6496074 6420737 6506642 6482564 6473598 6708885 6843060 6956988 7173144
3505 7173144 7071033 7344343 7382682 7466931 7714746 7943493 8034857 8310445 8593234 8866632
3495 8866632 9096458 9544434 9888772 10122065 10312895 10464611 10580653 10644753 10912147 11188257
3485 11188257 11499915 11834449 12526062 13098583 13848756 14708062 15400081 15710158 15788827 15503984
3475 15503984 14834193 13952208 13210102 12495232 11852309 11587205 11188526 10918534 11029849
3466 11029849 10779519 10815613 10811220 10944692 11082283 11241386 11205487 11587534 11816250 11833424
3456 11833424 11789867 11639938 11591965 11752216 11698471 11734387 11939219 12194001 12379123 12511134
3446 12511134 12917455 13303251 13658281 14045515 14438995 15172423 15805959 16552222 17312324
3437 17312324 18343041 19281690 20207808 20787879 21730443 22298303 23088225 23752932 24547247
3428 24547247 25594812 27110598 28558995 30207027 30892776 31737953 32455101 33404678 34591844
3419 34591844 35994904 36953425 38320817 39370641 40955204 42665510 44518555 46592613
3411 46592613 49119785 51374289 54345300 57010624 60264133 63377316 67352456 71828176
3403 71828176 77190013 82815670 89880698 96634633 104917238 113314645 123266645 133473516
3395 133473516 147184381 162878670 184819612 212422463 252425476 308861041 401323457
3388 401323457 468380063 438935034 368006009 296613692 249247140 209883783 177928890
3381 177928890 153889748 136314518 123131895 113678935 105792870 99503811 94033502 89653242
3373 89653242 85768532 82759294 79927131 77556379 75118918 72859177 70781322 68533488
3365 68533488 66367209 64421854 62173902 60065682 58049176 56282638 54559485 52783029
3357 52783029 51299063 49433535 47561494 45530998 43439239 41377779 39473501 37682295
3349 37682295 36066071 34391894 32791282 31211967 29795398 28447493 27034293 25690610
3341 25690610 24434038 23141464 22065256 20981023 19970597 19010769 18301270 17549857 17035745
3332 17035745 16380692 15672270 15007456 14585356 14080240 13703231 13290901 13007020 12654832
3323 12654832 12425704 12283632 12050223 11758280 11496091 11422371 11261868 11061605 10772732 10550336
3313 10550336 10531851 10303165 10329405 10184149 10019459 9665680 9548352 9303307 9306413 9293210
3303 9293210 9245478 9036810 9085890 8900014 8760136 8648079 8571088 8615618 8691874 8656908 8805073
3292 8805073 8719061 8821403 8946160 9043667 9055583 9328919 9349452 9412422 9810799 10191056
3282 10191056 10296897 10252986 10172471 10095286 10202048 10175584 9883485 9662001 9380332 8943035
3272 8943035 8873293 8698537 8646842 8606326 8523761 8619900 8579945 8868743 8639663 8660436 8612744
3261 8612744 8561524 8712747 8949832 8970787 9139041 9147319 9139102 9297017 9294449 9240543 9303947
3250 9303947 9446811 9648072 9945552 10250044 10452272 10457155 10596032 10959721 11152892 11604540
3240 11604540 11972514 12226477 12463582 13025586 13430798 13730026 14123142 14666041 15166050
3231 15166050 15918267 16592483 17208446 17910138 18757742 19407761 20265378 20978574 21607704
3222 21607704 22289069 22812437 23197859 23576105 23894658 24214918 24565419 24778302 25026238
3213 25026238 25278039 25486260 25528833 25463748 25186838 25075003 24888823 24506554 24277306 24055089
3203 24055089 24325289 24786927 24848377 24840287 24725792 24719895 24568711 24034360 23317300 22153557
3193 22153557 21179376 20199797 19289814 18375020 17470638 16779609 16254571 15836939 15549053
3184 15549053 15312813 15003037 15098465 14911588 14857922 14909680 14896619 14661164 14579299 14525272
3174 14525272 14614092 14813633 14980563 14808184 14945339 14527405 14338222 14070354 13687168 13484848
3164 13484848 13442163 13289785 13147309 12944078 12911083 12863580 12742769 12789065 12719950 12612487
3154 12612487 12671699 12502784 12413965 12472614 12523915 12531275 12624280 12652566 12637560 12837675 12994124
3143 12994124 13126128 13179816 13315808 13544428 13561973 13810779 14100675 14386267 14687236 14839950
3133 14839950 15324791 15650509 15809545 16204060 16541795 16671589 16913780 16994580 17209258 17341529
3123 17341529 17354498 17660489 17962777 18040198 18038474 18415944 18605597 18715451 19036741 19294097
3113 19294097 19530343 19829130 20084229 20479903 20888357 21309292 21779374 22312440 22881590
3104 22881590 23556689 24170430 25130875 26030616 26976172 28048627 29064737 30292741 31559570
3095 31559570 32929164 34559902 35948820 37453448 38991442 40537505 42477268 44440101
3087 44440101 45843982 46342971 46240264 45996905 45864340 45758147 45946763 46329609 46829712
3078 46829712 47143162 47597337 48147961 48423579 48271500 47801360 47327384 46891507 46396096
3069 46396096 45993092 45806794 45611271 45127181 45113267 45196465 45214678 45630494 46062151 46914246
3059 46914246 47837068 48956542 50361619 51857315 53539561 55998328 58470054 61174485
3051 61174485 64157683 67515104 70996958 74843172 78732997 82844277 86939640 90749039
3043 90749039 94380336 97334783 99849343 101777918 103221030 103947137 104236374 103743090 103034600
3034 103034600 101887888 100385202 98675011 96322001 93550254 90380056 86751813 82784094
3026 82784094 78534174 74364413 70141813 66079376 62152101 58374718 55032009 51982033
3018 51982033 49187275 46574465 44182311 42241455 40509605 38897547 37199374 35928372
3010 35928372 34663313 33581139 32492523 31451578 30727178 29993691 29211729 28661683 27983625
3001 27983625 27292794 26784801 26302956 25942002 25523400 25048169 24774199 24449655 24073735
2992 24073735 23904314 23756445 23499526 23362903 23167383 23133367 22906582 22679523 22573444 22386706
2982 22386706 22145758 22119990 22090232 22136710 22002683 21932477 21979044 21916178 21944449 21977790 21969349
2971 21969349 21848271 21942338 22064305 22103481 22237731 22377664 22480695 22475971 22601137 22722202
2961 22722202 22818817 22956738 23237557 23376209 23628838 23897099 24192400 24511285 24847225 25239876
2951 25239876 25674434 26227735 26708488 27222724 28026768 28752602 29361533 29956833 30655443
2942 30655443 31396343 32347713 33358696 34442501 35685323 36943000 38333068 39904450
2934 39904450 41684651 43448816 45176632 47076565 48876818 50461259 51831269 52945618
2926 52945618 53643789 53824912 53644411 52993108 52091708 51229851 50397653 49495101 48956617
2917 48956617 48426470 48109125 48007333 47987475 48428049 49029349 49702833 50624662 51742157
2908 51742157 53104405 54606417 56355180 58353084 60691680 63022887 65539596 68275734
2900 68275734 71224074 74475739 78114248 81850898 85830068 90067772 94466010 98959514
2892 98959514 103411005 107426938 111063880 113969699 116087782 117284162 117408902 116622142
2884 116622142 115250864 113313200 111116105 108326879 104919767 101392444 98069132 94868643
2876 94868643 92235607 90136917 88629196 87611826 87067456 87030558 87748193 88821165 90222565
2867 90222565 92100866 94280783 96951861 100177877 103578001 107090492 110645713 114335285
2859 114335285 117822707 121344495 124745071 127625956 130022566 132020555 133138764 133469900
2851 133469900 133117841 131968457 130370656 128088165 125788216 123556452 121109976 118601174
2843 118601174 116507089 114448021 112447977 110671598 109344838 108090979 106961148 106248313
2835 106248313 105728156 105421698 105520823 105801678 106219389 107176211 108183617 109316191 110991287
2826 110991287 112661876 114413122 116707018 119038040 121735683 124789779 127937529 131332840
2818 131332840 134940622 138725706 142616032 146084005 149013046 151932336 155092362 158335917
2810 158335917 161583075 165230607 169425139 173876314 178834014 184548559 190471258 196557333
2802 196557333 202924099 209239429 215516069 221668960 227581080 233658967 239709671 245950424
2794 245950424 252768934 259371086 266043008 272517283 278187200 282757339 286592224 289391533
2786 289391533 291206344 292308072 292616003 291541848 288726717 283603533 275915096 265930324
2778 265930324 253930165 241115087 227976057 215417452 203580424 192968780 183147167
2771 183147167 174026336 165294630 157129253 149595453 142703791 136685353 131161867 126361092
2763 126361092 122125792 118361471 114854587 111898012 109318104 106418803 103819023 101108468
2755 101108468 98375274 95869853 93641647 91577027 89590000 87707560 85927511 84142782
2747 84142782 82462293 80948768 79576922 78292401 77426053 76264004 75341070 74610877 74209625
2738 74209625 74010480 74174471 74768627 75691545 76544278 76859509 75903434 74143636 72008693
2729 72008693 70071972 68583195 67518713 66583774 65877278 65520586 64958236 64638884 64480609
2720 64480609 64185925 63848934 63755693 63688995 63578949 63512961 63433069 63276394 63347207 63399819
2710 63399819 63650080 63587994 63407659 63050955 62352094 61786383 61354856 60968068 60596400 60242023
2700 60242023 60063098 59982701 60014963 60224578 60621199 61434135 61927675 62558573 63737978 64887633
2690 64887633 66254063 67691512 69667378 71950067 74940269 78607703 83048019 87430870
2682 87430870 90480039 92623350 95237560 98998859 102997635 108039754 113613868 119277189
2674 119277189 124842571 129789372 133575936 135881714 136488905 135144843 132055160 127491883
2666 127491883 122154664 116556823 110921979 105593188 100126643 93072183 85531528 78823290
2658 78823290 72833342 67616141 63080643 59122459 55700759 52726266 49984797 47542318
2650 47542318 45545397 43739928 42180339 40670121 39251822 38082990 36807783 35688818
2642 35688818 34712392 33865339 33348657 32430426 31750904 31201950 30447216 29751588 29250193
2633 29250193 28825571 28290897 27799490 27549457 27089176 26753293 26228425 25844166 25544719
2624 25544719 25225988 25082277 24791457 24483103 24287073 24238798 24141663 24145068 23863877 23723610
2614 23723610 23578449 23325841 23390953 23177225 23179199 23323493 23445665 23502913 23483391 23396904
2604 23396904 23573118 23750999 23744757 23585244 23620865 23607605 23608062 23623001 23729663 23728189 23802014
2593 23802014 23909452 24116525 24304560 24522832 24871547 25139665 25463409 25908611 26560263
2584 26560263 27083687 27599572 27932483 28447586 29116280 29812072 30372592 30989641 31464075
2575 31464075 31914626 32086632 32071576 32251222 32402909 32724988 32870693 33173688 33465636 33798683
2565 33798683 34372784 34875473 35602872 36395703 37334655 38341299 39472378 40638341 41903387
2556 41903387 43233748 44665602 46302228 48341442 50470684 52709724 54912723 56936622
2548 56936622 59094893 61132862 62547204 63714566 64833538 65898645 67149434 68805891
2540 68805891 70550430 72771659 75209646 78196493 81502178 84509975 86998800 89173520
2532 89173520 90943071 92964136 95567081 98569124 102399892 106308756 108853901 109759907
2524 109759907 109740430 109370508 108762821 108469197 108814855 109476026 110826106 112544837 114751775
2515 114751775 117675799 121083872 124772603 129200605 134257309 139703917 145836740 152494102
2507 152494102 159623634 167194270 175173394 183529087 192146419 200777974 208668342 214643157
2499 214643157 218438005 220767653 222410035 224651346 228207831 233507056 240345207 248988344
2491 248988344 259386660 272150939 287835142 306740656 328795752 354133370 382384820
2484 382384820 410985567 435095304 447670907 443912381 424271580 393528352 357914798
2477 357914798 321871972 288156695 258043615 231477178 208523828 188511884 171119258
2470 171119258 156267242 143231933 132074258 122297677 113681576 105994409 99062942 92983517
2462 92983517 87431712 82338571 77818206 73529303 69636084 66105365 62818146 59923741
2454 59923741 57227468 54668528 52321726 50281824 48073474 46108906 44374594 43037427
2446 43037427 41578341 40189402 39192471 38212648 37254729 36073960 34982691 33857227 32457004
2437 32457004 31153022 29877296 28461998 27371707 26220388 25153120 24128411 23258243
2429 23258243 22420752 21642188 20937696 20309039 19665993 19020694 18512152 17835206 17415468
2420 17415468 16832749 16444745 15917442 15534268 14965851 14615139 14253701 13855877 13386031
2411 13386031 13171964 12863387 12507581 12124650 11930521 11657472 11276464 11056649 10893872
2402 10893872 10619350 10457160 10279229 10051520 9829998 9485775 9203197 8977689 8856055
2393 8856055 8679217 8585748 8425581 8121568 8038717 7853716 7673636 7555511 7399302 7272083
2383 7272083 7092865 6848968 6637905 6696037 6562860 6375092 6126779 6241380 6145905 5987786
2373 5987786 5946319 5937464 5803315 5601210 5556641 5500230 5289323 5292651 5252701 5263045 5057547
2362 5057547 4956082 4981761 5061500 4874304 4510081 4524239 4784853 4495713 4368686 4412160
2352 4412160 4490663 4528473 4563282 4441058 4451881 4497415 4489535 4342498 4438862 4566105 4357300
2341 4357300 4250123 4221334 4339769 4398305 4298990 4357206 4522474 4594198 4504252 4391648 4464618
2330 4464618 4442955 4462619 4537378 4452113 4503215 4450700 4548003 4454445 4499150 4734997 4661945
2319 4661945 4660567 4603665 4575389 4636476 4719077 4651567 4675628 4752644 4801143 4804800 4850278 4856527
2307 4856527 4804570 4776602 4802692 4793784 4569725 4591121 4616610 4860610 4935386 4826599 4800868
2296 4800868 4801293 5003123 5133311 5298243 5246902 5057631 4924495 4929255 4972969 4922501 4815995
2285 4815995 4984271 4947237 4795606 4835854 4747778 4786649 4750272 4788707 4759545 4733300 5034664
2274 5034664 5036827 5090704 5069488 5171584 5269924 5326417 5343072 5150709 4986613 4915918 4579170
2263 4579170 4457512 4130245 3911779 3605344 3543714 3409459 3142340 3027846 2902757 2858701
2253 2858701 2871697 2817166 2702219 2448609 2447763 2340460 2385551 2350439 2225981 2177303 2200441
2242 2200441 2239123 2022554 2067520 2007460 1968036 1937169 1789292 1790141 1769437 1747102 1815760
2231 1815760 1684142 1746786 1614312 1575498 1505924 1479213 1392382 1349790 1367414 1432079 1357183
2220 1357183 1261322 1312355 1096560 1109129 1109710 1166658 1146106 1113727 960434 871883 875311 932460
2208 932460 916531 904159 1120808 1121597 944693 823300 885850 918615 892953 835687 953316
2197 953316 922321 802503 868626 985580 793372 718398 531912 744391 753754 717690 724600
2186 724600 772303 729260 608472 696745 750363 862892 676225 670400 791938 800524 717241
2175 717241 653375 538895 606689 557751 510923 542185 505798 611600 474415 541320 536364
2164 536364 409556 467211 458085 524353 588029 666867 552888 482366 412990 401856 363365
2153 363365 354867 378839 531153 420265 462210 417205 357368 265725 482747 560136 458309
2142 458309 341125 399723 385186 298165 328443 281938 255599 409766 420326 427828 580437
2131 580437 349336 473064 354882 406282 339897 433265 476554 426859 486714 474159 283060
2120 283060 260558 375250 358377 387717 315441 223992 119766 250286 335239 350285 336934
2109 336934 262863 288385 262708 223751 37823 28347 128545 274313 243066 186505 41802
2098 41802 289645 240285 221098 184342 131802 246427 206015 246098 28330 154821 248266
2087 248266 122981 41248 92667 -14359 73485 205605 212417 252368 205624 122934 115457
2076 115457 128150 98814 87853 30878 265024 270177 207954 140343 283426 254752 299190
2065 299190 351803 290568 317429 173677 120893 134990 168462 52007 79518 210755 261943
2054 261943 296795 416301 279802 191431 257854 230512 174760 133480 67116 128128 103829
2043 103829 165781 156398 101283 257778 276078 148938 148112 113133 50430 337532 242038 123515
2031 123515 54679 34544 188707 122298 99478 176706 140851 39726 215400 181809 142590
2020 142590 141941 171639 304745 286000 226124 212315 36312 29676 -73062 97262 97360 105239
2008 105239 218551 235582 233250 125136 173566 264682 137259 -22962 74562 243277 116986
1997 116986 194378 367035 323956 235810 239974 245897 189422 254477 281419 362014 439502 441182
1985 441182 426747 454096 491293 394759 451290 547757 600069 710167 757254 770787 679988
1974 679988 782870 858451 872839 820679 853507 820846 940623 1034434 1068350 1084416 1077923
1963 1077923 1092416 1150202 1234323 1323321 1390626 1260580 1366433 1429942 1360003 1650137 1732387
1952 1732387 1792226 1946711 2037187 2250125 2471726 2466335 2749487 3081126 3209537 3379456
1942 3379456 3714381 4206737 4770169 5331141 5894734 6242449 6761051 7500523 8198397 9197203
1932 9197203 10625353 12558495 15460465 19667145 23973239 26419685 24309764 19816939
1924 19816939 16096281 12869642 10590974 8829606 7401731 6408957 5671767 5066249 4616472
1915 4616472 4213479 3777690 3458039 2981483 2681597 2522614 2334783 2254433 2094811 1965396
1905 1965396 1664083 1502304 1425664 1349125 1436490 1337471 1259672 1161754 1063876 1042356 1074416
1894 1074416 874286 966588 964119 794958 785789 779999 631163 680900 722665 655040 630786
1883 630786 615373 664327 487941 463629 413729 328844 349105 379402 345882 468744 465979
1872 465979 240936 281910 219498 230156 242547 288999 286843 268147 243019 171905 152575 171503
1860 171503 164516 252264 119544 105146 237951 153898 187745 72962 14702 159082 96866
1849 96866 -10680 9791 -19633 56787 -7449 -135685 -48141 126025 111758 71849 109241
1838 109241 76946 -29950 -59005 5764 83629 2230 -36757 -144488 -210693 -49137 23564
1827 23564 -18127 -7721 -10489 -11689 37189 71341 104030 9008 -129661 91630 5654 -184385
1815 -184385 8306 86953 10282 16369 -6046 -19761 90614 -9893 -85553 -112308 -107519
1804 -107519 -147259 38902 57618 21956 22352 49988 17356 -33728 -11641 -18166 15917 30028
1792 30028 14329 53037 -34463 -19806 70226 4343 -190414 -72712 -26093 -90354 84376
1781 84376 -30846 48178 -76940 127349 55676 927 76810 36901 105728 175985 11564
1770 11564 -95419 -97579 -12424 -40017 -203305 -119264 -54746 -61093 39452 27912 -121013
1759 -121013 -69204 -81237 -35007 51080 -82507 -137904 -5795 148830 81357 132097 91665
1748 91665 3796 -192321 -161769 -98699 -71701 14721 90673 -47821 -197395 -255516 -203882
1737 -203882 -181821 -206292 -91208 -101312 5894 -37812 32981 19480 76537 86970 16564
1726 16564 -15226 94455 66543 -58695 -17676 -133866 -63065 -42261 -121557 -304 -77020
1715 -77020 16623 45241 12235 64004 143395 -3570 -42613 -53923 -40623 -87342 -63395 10547
1703 10547 -47340 -6874 -107607 -88694 -117943 -121150 3812 -94913 -83343 -43022 -120724 -204530
1691 -204530 -101278 -122941 -55413 62027 -136314 -171385 -280560 -49646 121505 -71204
1681 -71204 -52055 -22156 32856 1952 -34602 -107610 -82482 -68126 20896 143336 55611 63964
1669 63964 25187 -123416 33471 -12484 -36072 -61487 -141068 -176828 -37765 25886 -1956
1658 -1956 -23608 5547 -98333 -44038 -81519 -148695 -103732 -163486 -119760 -147647 -92090 -60734
1646 -60734 36633 52441 -18535 -2200 -52116 -119205 53225 -113824 -73769 -18194 -30914
1635 -30914 95269 75533 -10351 -130012 -181923 11952 -88272 -154446 -147445 -229315 -208649
1624 -208649 -215696 -293548 -181001 -151233 -172631 -626 44037 84585 42618 15867 -115670
1613 -115670 -78373 -131460 -213536 -220843 -40457 -189648 -165682 -54303 -7110 148815 13722
1602 13722 -126757 -131509 45251 -125541 -147309 -162882 -128371 -180300 -154705 -147217 -157424 -138171
1590 -138171 -187610 -118559 -115421 57739 101707 -112203 -163228 -97862 -45053 -5140 -17084
1579 -17084 -161689 -141231 -224565 -235850 -219983 -202661 -91127 -116433 -119456 -103225 -165104 -148218
1567 -148218 -92027 -147646 -186324 -186306 -82394 -78116 -54749 -137177 -39444 -59832 -53593 -56679 -131520
1554 -131520 -101600 -140398 -104577 -93951 -17578 44004 -39314 -90329 -156822 -220529 -49111
1543 -49111 8781 15278 -44185 -34433 -71651 -96186 -96923 -52335 -86161 -65221 -28840 -62884 77374
1530 77374 -27197 -155375 -217711 -44817 92418 94657 73319 104604 105119 -46063 -272
1519 -272 5448 105983 33543 -3369 -184694 -149366 -52394 -17286 -137337 -106087 -664 -79465
1507 -79465 6343 -128785 -83893 -11735 -76786 -32383 -93681 -33222 117888 97431 86610
1496 86610 -119050 -219015 -60697 -33528 -106378 -195047 -163215 -62962 53600 65411 79733
1485 79733 3317 -4143 165815 26768 -65358 -71583 8713 -138478 -106078 -53621 -171435
1474 -171435 -29000 53057 32630 -20133 -107905 -119334 -42867 -160766 -171380 -27926 -135271
1463 -135271 -201808 -160778 -184567 -50971 -156970 -66823 -44593 -116580 -88031 -176299 -50625
1452 -50625 -115946 -252835 -219074 -212708 -91363 -77805 74550 51628 -85589 -96240 -204484
1441 -204484 -103286 -74485 -9857 -63402 -65920 -62671 -11138 3821 68760 -141742 -99654 -60803
1429 -60803 -536 -106816 -193913 -76737 -22749 47051 -69500 -59313 132340 20408 12936
1418 12936 -100139 -145814 -165286 -87742 -20805 -20716 -95501 -194747 -93536 78607 50872 -104466
1406 -104466 -108563 -44570 30353 27089 68981 35929 -39682 168455 30932 -503 -24513 -132808
1394 -132808 -134752 -139551 -19222 -18285 -120169 -147742 -112333 -59454 -70306 -204840 -80425 -37705
1382 -37705 -37468 -124350 -49508 -125471 -105490 -44980 -92936 -54997 -84493 -94224 -92507 -126269 -43883
1369 -43883 -93145 -135164 -20766 25316 -118427 -184330 -159106 -133465 -89369 -27077 -47801
1358 -47801 -3110 -232021 -123500 6360 -21964 -121903 -206082 -54493 63206 -115242 -157880
1347 -157880 -190681 -55739 -88559 -157878 -64896 -16150 -198853 -249261 -161284 -172286 -162569
1336 -162569 -75803 -64835 -217765 -217494 -205919 -14395 64065 -48404 -51305 -106723 -56739 -46704
1324 -46704 -148393 -28202 104400 -11427 -99699 -66677 -59443 -116735 -53417 -90404 -65058
1313 -65058 -36518 -98082 50294 25753 48716 78353 -30222 -183626 -28155 23374 8465
1302 8465 -91738 -165882 -57567 -41956 -229705 -143613 -28536 3456 50593 -113786 -139149
1291 -139149 43375 48916 -74728 -55596 -69426 -23375 -32879 -227254 -58418 52695 137415
1280 137415 30768 -49297 22857 85414 57918 19717 -43580 -113934 -8094 -96049 -25940
1269 -25940 -42286 -61144 -76190 -96273 -153414 -144057 -145002 113630 82261 -19702 -29957 -80353
1257 -80353 29197 -120212 -107650 -151792 -121858 -101542 6962 -13653 88609 -15784 -130224
1246 -130224 -141880 86398 30151 -128478 -123481 -113012 -196330 -64776 -82795 -57231 -505
1235 -505 -156252 -178614 -93230 -9446 41903 -8186 -74892 77411 40792 -80539 -147144 -14384
1223 -14384 144977 74374 -31299 -129956 -182857 -18658 -41527 115315 -137427 -622 32530
1212 32530 12271 -134956 2448 47348 -3729 67771 23235 141815 75059 -50680 -229
1201 -229 -60870 -129678 -237845 -123737 -46321 -118135 36921 -109228 -92832 -22029 19487
1190 19487 193423 90953 -70200 -41491 -65455 -115430 -4327 168650 17899 -60216 -183990
1179 -183990 -131154 -77691 -74526 29920 -134695 -26161 -15013 -58046 362 -119202 -123001
1168 -123001 -156334 4434 46364 84814 45226 36279 3674 -119304 -192003 -255769 -193847
1157 -193847 -97554 -102672 -10751 -6272 89313 -8931 -77306 -158491 -6363 38102 -25810 -10149
1145 -10149 -66925 -52305 8197 -134418 -20469 5021 -78334 -202722 -75561 52024 -7635
1134 -7635 40401 -148305 -71218 -205545 -208274 -176133 -115002 -17786 -9646 114280 101611 21216
1122 21216 -27307 -93158 -54872 -97681 -25980 35413 136999 48669 -57475 -179303 -219656
1111 -219656 -71819 -24024 9573 -125149 -234679 -280433 -65361 12474 -12087 2633 10156
1100 10156 17818 -13798 141869 -66359 128225 133324 85355 110166 64542 189923 71564
1089 71564 -69885 -97255 -29762 -63551 -101267 -167897 -145830 -79749 -107941 -78214 -63387 88387
1077 88387 112780 -138225 -49390 -19475 -22811 -54396 -214253 -177183 -135399 163989 53588
1066 53588 -42920 -62126 -69370 -149333 -46835 -26771 -126095 -78148 6200 -26494 -70257 29826
1054 29826 -87182 -50756 -46846 -23735 10953 -50436 5158 -116961 -54116 -29948 -7897 24750
1042 24750 68207 108260 126693 186452 108102 90106 3235 -71467 -130777 34540 10761 86520
1030 86520 39597 -10299 44731 -70279 -125624 -29053 -88293 -41227 -31395 -23477 -85932 -83913
1018 -83913 -45647 -53647 44537 -57740 -76274 37079 15192 56558 53758 82262 33741 -59333
1006 -59333 67292 -13559 -90212 -101946 -94648 -130469 -83649 -79557 -103387 13152 45613 -87664
994 -87664 -95408 -214186 -184898 -87379 35006 4131 87499 22657 -169125 -166572 -147821 -942
982 -942 42881 243824 82104 135130 64356 -17146 -160674 -107069 43756 -33461 -79022 -94126
970 -94126 77512 53638 -52866 -52882 -153960 -114226 -64214 118561 -18535 -71372 -73132 -52833
958 -52833 27641 66287 15264 85080 -20606 -71776 12233 36171 27820 -48159 -20246 139296
946 139296 77019 -107594 -41086 -55726 -127116 -35224 -29310 -44501 -15569 92461 151979 70722
934 70722 48939 -99196 -9198 -40754 -47158 -56587 -79628 -40302 -22716 -23195 -4764 -111983
922 -111983 111594 70638 -19650 -97858 100765 -101428 30875 113112 105556 107468 89415
911 89415 14344 46975 153529 62124 139163 13331 116130 -71263 -43244 120992 106455
900 106455 -64733 14839 115607 100094 135055 19936 47991 95255 45942 -51509 9654
889 9654 95258 72124 -1028 12030 52381 -113802 -23663 87182 50683 27454 89412 136611
877 136611 22471 3739 -106859 -42557 -47145 -95858 -113263 -91951 20484 53952 103016
866 103016 -17257 -211986 -85555 -45717 88825 142133 -67644 30704 19684 -27057 -54773
855 -54773 50697 167391 193371 163834 25795 130900 86847 -12942 -30422 25326 84426
844 84426 -43251 -6040 -63831 -84269 19609 45716 78578 3915 -19980 -40273 -78730 -103012
832 -103012 -199132 -10414 18940 -66120 -75663 -105084 -51720 27360 49711 77660 33694 28765
820 28765 -52508 -40465 -126959 -52278 -103914 23134 142992 172350 165924 -56284 -56237 -167340
808 -167340 56690 -18561 -118357 69425 75619 14783 134931 78844 -41946 101190 -53312
797 -53312 67340 119280 -16696 35310 3703 73056 -34457 5527 -105223 -175561 -19720
786 -19720 -5292 58720 91461 63067 34530 -38720 -121650 -75994 117602 94897 116929 269661
774 269661 103906 201693 124330 21741 34873 -28140 42731 65761 -5742 -13195 43873 -13377
762 -13377 15597 15667 -64422 50579 59854 120126 112754 -12310 75253 56445 34031 80461 120239
749 120239 37614 -9099 62871 144499 88490 78979 102464 72885 -32228 -37716 87354 100288
737 100288 58929 209908 36109 -138762 54325 -100176 -144589 24453 72846 121734 -94040
726 -94040 986 66442 -7619 -74694 -22041 28722 17805 119322 74220 57002 -43296 -14192
714 -14192 17692 60963 90008 84088 95232 73014 84623 174415 9763 72894 -36093 -31908
702 -31908 76583 137102 -6731 -46411 39443 52102 45851 -11 -28254 81502 128566 36586
690 36586 71274 154283 37155 53156 106582 -32876 108607 107069 -10035 155414 117363
679 117363 60390 97814 104644 13074 72807 121700 77185 45185 101175 60474 -79211 -38475
667 -38475 71949 229954 192437 96334 9649 72044 -53588 24622 -18014 -119535 112745
656 112745 90751 31935 65102 27214 82160 117332 205151 79454 68543 63970 114470 102211
644 102211 139032 33211 54463 235426 172951 121830 121452 61925 199457 90961 124958
633 124958 3276 -72835 -16324 88755 141161 63479 71048 168133 220660 312561 181315
622 181315 106191 -30075 48376 -4872 -30845 92034 76527 -39038 2993 150296 -54399
611 -54399 103216 194658 224466 171830 128987 130270 72668 -25480 123361 137733 29855 20895
599 20895 115003 107355 51783 -136076 -168167 -24639 32279 -32986 -56390 51525 -3113 -145655
587 -145655 -46162 76469 178951 80208 -82377 107047 50399 -43605 -33260 -53718 -46083
576 -46083 -48893 68782 -14119 25662 2273 199498 206813 170267 17486 87812 41732 -893
564 -893 38887 100095 17201 62376 224611 78074 -6377 -18197 65397 48729 118606 -6260
552 -6260 98377 128481 404 -30815 2774 -72782 -70014 39356 119395 96257 20525 93131
540 93131 137010 93132 18154 18597 -18744 161875 107938 61236 68063 103632 60964 43352
528 43352 63027 100105 336975 276615 209651 134064 114044 120034 88047 83790 104117 36337
516 36337 77222 57199 50379 -4943 33985 42970 -32576 -17216 265 36511 31018 105849 -93596
503 -93596 -115589 20862 150388 121948 42016 -29777 -26864 118629 47800 126990 123724 -75031
491 -75031 56385 156965 24741 133377 112541 236240 191690 54777 104619 122748 77403
480 77403 33268 -9239 -76506 -50503 53111 115600 113251 144697 143162 -23899 137402 247091
468 247091 191833 64970 151066 231524 152958 14193 131327 159616 22179 191265 45427
457 45427 77154 93682 147780 157307 78682 258229 213985 24471 108400 54588 146355 27511
445 27511 146220 58145 -134302 -20716 -11876 24109 76028 121682 172155 140284 129261 186840
433 186840 108897 190960 329805 261483 238750 170647 58494 103099 181535 47773 -23532
422 -23532 66302 256086 96370 -7044 164814 233256 150449 173847 104914 238069 269363
411 269363 19868 104400 28335 47969 66775 104030 53235 64288 62299 -55344 68531
400 68531 82137 77590 155906 157889 112641 28511 -50863 -134289 10416 -59629 -116673 -78380
388 -78380 14588 72031 77553 -50471 54942 178507 114382 -23389 14132 83302 130730
377 130730 56873 -5417 -32277 87932 19297 88478 151292 -9596 34604 69606 -102954
366 -102954 53859 37227 -51876 -34688 173982 155726 51975 11239 -25245 34758 58683
355 58683 34396 118813 178303 273305 144385 108884 195099 83532 -24616 -130974 -54964
344 -54964 111520 25648 78585 251513 138931 102320 79423 68007 -27589 27714 -13590
333 -13590 164982 91724 11857 78234 93054 50168 -3347 -124274 -51669 846 -57741 105934
321 105934 280371 290351 258029 104798 161527 140599 78670 112704 173859 67015 43895
310 43895 -22135 8668 42156 148297 128575 83615 25972 139798 57189 55099 -40498 25831
298 25831 -47576 -43796 51049 -28859 -5169 112928 222162 103888 154530 222431 142824 -129322
286 -129322 -56214 -60053 -32099 -11240 38723 24114 82849 36324 -28891 43916 -130031 65919
274 65919 -13365 -25806 -104301 22930 55466 -106872 94954 160669 60772 117086 118334 33595
262 33595 -16381 -151345 50996 -103419 -74680 80211 219470 137488 31005 61406 24357
251 24357 100135 56576 14394 86416 132905 25292 37423 96782 104880 25506 -25261 40109
239 40109 -12892 2802 86710 148259 60092 -18742 54989 -876 45661 17042 73927 194228
227 194228 35894 88033 -8470 114510 208127 -53483 77399 173612 87218 148292 -13704
216 -13704 -15243 25518 79124 124895 45680 95800 146855 97430 23496 19655 155652 4007
204 4007 33462 47234 3787 -1731 189585 8034 -16840 -14888 -101964 -120079 19468 76687
192 76687 8596 164475 145371 87738 77553 74084 -57343 63619 106642 18379 43245 141882
180 141882 99027 130092 79843 2625 127004 107611 84647 175173 -5327 126540 142873
169 142873 152469 19611 -12531 45907 -40314 3567 65759 29834 58791 72794 35131 147802
157 147802 222690 178995 111353 64626 -95184 -10933 86656 17932 -72053 67979 183658
146 183658 147558 -17775 73175 195770 201055 362736 214766 66139 76319 181458 114923
135 114923 79506 11727 51318 121979 6230 2759 -60841 -8263 108032 65422 92284 128667
123 128667 116287 124257 109843 68758 75616 142048 75985 99444 82013 71250 81499 86148
111 86148 32912 41613 80763 44217 -32016 61543 146684 124885 132356 210683 194837 76168
99 76168 -33184 -48913 -11356 65968 72129 21015 -14120 31855 41203 52316 129079 7027
87 7027 61152 27733 -56583 38033 66738 60798 44878 55620 49194 94548 106349 114993 48039
74 48039 -11614 40382 40585 26985 82816 27083 5299 -12754 30147 113856 9159 52559
62 52559 161244 107730 185566 105113 111420 159494 115323 59484 -98955 29236 22112 78252
50 78252 96940 6614 11370 112078 41855 140757 88440 -91330 50558 11528 50823 59571
38 59571 108979 94663 -9818 131122 25865 74100 76094 20568 79824 82704 62766 128862
26 128862 54785 133294 94385 97893 38854 105184 150093 233740 263928 128897 1054 66548
14 66548 82560 37503 53379 -19493 28740 -9555 36985 -13240 67995 75927 104917 137966
2 137966 170438 134626
0 134626
$$ Imaginary data points
##PAGE= N=2
##DATA TABLE= (X++(I..I)), XYDATA
16383 -3585533 -3564960 -3616181 -3528389 -3412652 -3333102 -3321257 -3305485 -3217302 -3086887 -3120517 -3107993
16372 -3107993 -3131500 -2984150 -2917230 -2944203 -2889862 -2823748 -2775242 -2807260 -2819301 -2615916 -2560332
16361 -2560332 -2580565 -2483024 -2457873 -2439492 -2417898 -2380778 -2376439 -2301421 -2263088 -2299969 -2181555
16350 -2181555 -2071167 -2020467 -1886374 -1916120 -2010527 -1889587 -1913302 -1883426 -1892612 -1737395 -1717108
16339 -1717108 -1724544 -1511730 -1587227 -1566280 -1531959 -1615953 -1509891 -1457352 -1461425 -1415585 -1350016
16328 -1350016 -1240302 -1188461 -1187395 -1144444 -1060595 -1011951 -971550 -908482 -959205 -1022084 -948193
16317 -948193 -914602 -731195 -638580 -772420 -738465 -732260 -672161 -676800 -677502 -541022 -556107 -467274
16305 -467274 -424799 -356419 -346613 -306389 -255621 -244520 -175513 -113560 -99388 -155850 -57028 -24240
16293 -24240 25202 24397 106322 184631 246095 254668 293128 265338 310720 317181 396919 372919
16281 372919 445672 389651 483504 528803 592430 665442 559372 625296 630563 692662 794083
16270 794083 701615 761757 764333 811300 856206 910108 983357 901165 954778 861389 974964
16259 974964 988649 1055281 1183223 1212559 1260450 1256631 1308721 1308830 1253908 1171057 1179026 1385543
16247 1385543 1344501 1400488 1454942 1351360 1373434 1449893 1374393 1501786 1460649 1613688 1599404
16236 1599404 1701361 1757050 1689613 1619658 1709591 1744453 1845748 1790561 1776696 1845596 1975847
16225 1975847 1987676 1972367 1857285 1815531 1791070 1952356 2132349 2174877 2106287 2031247 2126617
16214 2126617 2119987 2116591 2233389 2318101 2050439 2056523 2119160 2140244 2279836 2233137 2371798
16203 2371798 2398693 2450295 2464187 2456533 2420320 2367787 2286284 2383939 2407421 2262233 2320208
16192 2320208 2497556 2504039 2559822 2584727 2531369 2481805 2510676 2557764 2573354 2597348 2578454
16181 2578454 2635908 2703726 2712318 2630439 2752679 2731895 2767611 2915061 2819492 2669512 2786457
16170 2786457 2694870 2828146 2824148 2892799 2882399 2849596 2841106 2904628 2848278 2845149 2884888 2895109
16158 2895109 2946949 2929505 2973461 2923239 2870558 3092237 2990267 3061362 3105237 3090487 3049484
16147 3049484 3073676 3074282 3171547 2999329 3044707 3233362 3091797 3062987 3106108 3123663 3043756
16136 3043756 3081905 3000396 3084961 3151673 3165893 3096011 3196333 3302281 3219266 3226361 3233465
16125 3233465 3156436 3211559 3335582 3105157 3234096 3259767 3170253 3150185 3105990 3095873 3154451
16114 3154451 3074805 3037074 3139168 3170944 3101269 3182990 3310373 3339593 3263731 3186940 3241109
16103 3241109 3359272 3335458 3361643 3394004 3360059 3363523 3374971 3400490 3404009 3362735 3365392 3350313
16091 3350313 3205983 3287933 3483076 3342811 3311565 3372426 3351196 3300768 3420340 3500179
16081 3500179 3334527 3418663 3390793 3380349 3221442 3318596 3381738 3306820 3383467 3450839 3427965
16070 3427965 3313355 3287312 3360260 3348808 3475729 3354964 3448136 3527258 3449425 3351400 3459721
16059 3459721 3430601 3375957 3457467 3514604 3473881 3432433 3295395 3360926 3532538 3561801 3408578
16048 3408578 3361962 3362501 3380655 3580414 3538767 3534666 3441978 3529052 3463350 3482703 3584686
16037 3584686 3315474 3363282 3468382 3441825 3478739 3480673 3521410 3387536 3446547 3480697 3343451
16026 3343451 3351332 3511072 3669796 3565991 3537596 3548621 3548187 3447532 3574947 3634317 3491961
16015 3491961 3442110 3487422 3621431 3619540 3504403 3532139 3455847 3400689 3457299 3461531 3539153
16004 3539153 3497312 3351676 3461769 3554503 3544332 3479452 3537478 3535287 3545237 3554680 3390171
15993 3390171 3441464 3371535 3352618 3436170 3489999 3601830 3685856 3633457 3436457 3527379 3612631
15982 3612631 3529689 3468621 3600221 3545467 3543859 3689213 3668260 3523757 3371398 3312306 3531034
15971 3531034 3648777 3510035 3501094 3520743 3542333 3446901 3641288 3464059 3521710 3555461 3520526
15960 3520526 3555355 3535031 3484742 3492483 3368983 3341827 3469959 3577520 3541692 3458662 3397197
15949 3397197 3229970 3369059 3467351 3360086 3454710 3486940 3458050 3630001 3495969 3434219
15939 3434219 3530451 3570705 3523981 3468041 3618986 3688845 3477525 3413966 3572736 3557192 3580175
15928 3580175 3596095 3572815 3629972 3604886 3508610 3391994 3582767 3547960 3493807 3505673 3520256
15917 3520256 3570411 3518675 3769758 3629570 3607952 3527132 3388678 3389055 3380847 3484382 3458567
15906 3458567 3386476 3578635 3646798 3438182 3555288 3511975 3508309 3400004 3378559 3417426 3474998
15895 3474998 3461826 3343843 3467828 3566924 3572485 3522144 3560287 3647824 3628109 3562271 3622257
15884 3622257 3663414 3608717 3516128 3666038 3530366 3640006 3480773 3431620 3638612 3546568
15874 3546568 3588775 3685810 3613324 3495573 3521517 3467149 3596515 3569320 3546853 3419147 3516134
15863 3516134 3542460 3468617 3475255 3447880 3463081 3506083 3474153 3523963 3568144 3406067 3484684
15852 3484684 3478253 3442577 3463549 3620535 3687666 3674327 3583836 3525962 3433176 3386918 3427693
15841 3427693 3558332 3592943 3439809 3450152 3527112 3700952 3695857 3535343 3451774 3517375 3490130
15830 3490130 3549795 3438602 3472312 3571631 3584500 3600957 3527071 3539531 3585831 3510164 3364824
15819 3364824 3436001 3342395 3383356 3547893 3524996 3517686 3394559 3474883 3461236 3433822 3401328
15808 3401328 3477843 3510562 3447685 3444457 3371519 3609080 3623329 3383421 3411235 3377635 3221770
15797 3221770 3442923 3579909 3588018 3617676 3558938 3614220 3579262 3577603 3421703 3503316 3510530
15786 3510530 3596273 3528047 3400082 3461557 3530941 3598288 3615448 3590948 3657645 3710157 3653236
15775 3653236 3596903 3513694 3400416 3439320 3538199 3533573 3554414 3714404 3725171 3407137 3459820
15764 3459820 3594150 3364927 3440138 3694872 3733153 3714269 3631815 3594803 3621498 3746683
15754 3746683 3555481 3573895 3687290 3551671 3496390 3533993 3439369 3679836 3643428 3530958
15744 3530958 3532442 3520334 3601469 3576965 3561492 3659542 3458713 3576164 3570413 3704059 3489731
15733 3489731 3536042 3670331 3605531 3719258 3693938 3674465 3484622 3537507 3500959 3399784
15723 3399784 3452825 3614394 3630607 3610217 3564289 3480735 3549963 3603986 3569459 3648455 3493799
15712 3493799 3566040 3514228 3517233 3512196 3443856 3595819 3539578 3581373 3691471 3681679 3579470
15701 3579470 3485287 3450469 3534634 3571577 3663591 3664977 3423485 3530113 3563455 3628145 3632016
15690 3632016 3778728 3693842 3608041 3535064 3486262 3529491 3593141 3573244 3546511 3693214 3571886
15679 3571886 3587563 3528124 3534194 3502409 3482435 3688140 3584396 3607533 3701057 3594853 3540037
15668 3540037 3611984 3459469 3546195 3611225 3560036 3609205 3663666 3606727 3441910 3552411 3670604
15657 3670604 3448437 3503703 3634667 3531810 3568814 3549356 3465538 3671563 3721952 3609165
15647 3609165 3675224 3584634 3586161 3615815 3593617 3621759 3591369 3578430 3544578 3593858 3605878
15636 3605878 3482925 3509865 3560320 3632723 3583626 3575348 3562769 3705582 3606978 3564120 3495173
15625 3495173 3568076 3604379 3679151 3580828 3445489 3645650 3642953 3557141 3611367 3657702 3486894
15614 3486894 3442469 3537377 3520954 3536310 3646817 3728745 3662094 3580167 3509209 3460726 3560575
15603 3560575 3561391 3522235 3551261 3533991 3530504 3502463 3593632 3768642 3619558 3708446 3883277
15592 3883277 3835431 3617793 3459617 3490476 3649631 3665453 3684816 3723510 3722399 3603203 3688830
15581 3688830 3685468 3585744 3590185 3653968 3566147 3727578 3652023 3420675 3594212 3666559 3634147
15570 3634147 3631772 3604280 3595078 3753086 3723874 3683643 3599418 3812700 3777238 3619550 3533438
15559 3533438 3558321 3488351 3496379 3834486 3800578 3664287 3712928 3565333 3468805 3710658 3674117
15548 3674117 3745266 3763930 3699437 3673234 3701269 3767605 3629706 3656072 3676535 3668983 3545496
15537 3545496 3493438 3615033 3676043 3596450 3581684 3740222 3663496 3492996 3730757 3691423
15527 3691423 3594226 3648405 3586617 3445635 3545237 3514904 3682778 3598166 3593895 3558784 3415701
15516 3415701 3529039 3653638 3729159 3725066 3727028 3613458 3610863 3788157 3702323 3483693 3668701
15505 3668701 3709091 3643414 3677673 3640464 3642043 3709598 3710956 3608633 3494974 3469460 3431150
15494 3431150 3583639 3699823 3570462 3545901 3640836 3737506 3753211 3646334 3753340 3845896
15484 3845896 3749056 3594187 3599835 3700988 3648256 3653224 3679534 3609054 3546434 3607192 3622081
15473 3622081 3570138 3744231 3775417 3650741 3543573 3657401 3606990 3585467 3697578 3847776
15463 3847776 3703044 3692752 3657978 3702252 3678356 3687650 3650264 3605320 3648079 3634307 3778297
15452 3778297 3723638 3635876 3641660 3567500 3604180 3705082 3619598 3656931 3751083 3800970 3826872
15441 3826872 3720116 3818955 3830708 3814137 3848415 3886295 3889142 3749261 3613466 3658650 3587893
15430 3587893 3567019 3642617 3712460 3738251 3641450 3642506 3659967 3708732 3651015 3555664 3650319
15419 3650319 3710645 3667530 3713704 3508664 3670855 3709808 3760043 3679419 3658730 3705862 3677850
15408 3677850 3748377 3751665 3877371 3760831 3668126 3741570 3898970 3672887 3602260 3712611
15398 3712611 3661204 3526636 3605196 3851869 3875059 3699904 3637605 3784614 3832121 3752978
15388 3752978 3742197 3690106 3605815 3853253 3799620 3668931 3720447 3659812 3694677 3596561 3656751
15377 3656751 3828599 3779758 3698955 3563821 3748682 3841480 3772891 3788024 3686108 3741201
15367 3741201 3817925 3890973 3811759 3710247 3880492 3706014 3618463 3599810 3631426 3606384 3636770
15356 3636770 3543802 3765075 3798141 3496623 3434745 3532843 3642874 3650808 3706467 3704949 3762896
15345 3762896 3719603 3696176 3591044 3656202 3844281 3776994 3700296 3529641 3672128 3546481
15335 3546481 3635144 3857359 3783164 3701364 3809350 3770921 3657369 3612056 3563037 3566196 3633190
15324 3633190 3719163 3769835 3677940 3762928 3746313 3687990 3695523 3711813 3785310 3631119 3653075
15313 3653075 3728873 3635442 3714994 3886184 3670938 3712619 3502414 3689971 3692721 3700615 3662991
15302 3662991 3609474 3785201 3768315 3706944 3880230 3724557 3761154 3702432 3760067 3763122 3578598
15291 3578598 3680857 3673772 3703811 3712443 3873489 3815650 3732656 3836310 3698468 3755079 3972944
15280 3972944 3928140 3763284 3733749 3943428 3908815 3723896 3745054 3848873 3619978 3625490
15270 3625490 3742915 3773359 3666022 3599287 3578024 3655290 3677955 3719192 3721695 3654319 3753176
15259 3753176 3705394 3594275 3627657 3708040 3571396 3588049 3514140 3606629 3685237 3745344 3841555
15248 3841555 3750275 3643857 3623078 3764154 3762747 3755987 3739977 3725168 3813773 3760071 3739986
15237 3739986 3819316 3722961 3805740 3816919 3769326 3632925 3639585 3665964 3656272 3676191 3605374
15226 3605374 3694496 3752177 3742751 3721280 3769141 3709921 3728602 3627205 3672725 3810820 3837258
15215 3837258 3934016 3816554 3698298 3805110 3853940 3872437 3790577 3778739 3775019 3742840 3691633
15204 3691633 3646879 3830356 3736897 3644725 3592856 3638247 3684209 3846929 3863589 3794782 3779125
15193 3779125 3905249 3839772 3766174 3767490 3833021 3865574 3780038 3795538 3789340 3788271 3741308 3718782
15181 3718782 3714080 3863027 3717154 3764564 3753235 3701409 3671254 3804472 3827481 3771593 3774188
15170 3774188 3921834 3782335 3796701 3665452 3543965 3715999 3857741 3835018 3677816 3776564
15160 3776564 3734193 3735909 3641162 3714627 3724790 3819473 3897161 3948359 3742376 3716826 3804916
15149 3804916 3780481 3772488 3629765 3741363 3825943 3717377 3706653 3804489 3620647 3754758
15139 3754758 3900360 3910339 3775944 3703040 3804735 3672773 3762425 3860632 3765804 3705837 3769435
15128 3769435 3841645 3930274 3684445 3665991 3700417 3765857 3764224 3724019 3835629 3920745 3833755
15117 3833755 3802569 3711142 3856607 3965276 3908415 3880790 3935158 3903220 3799427 3728335 3885886
15106 3885886 3872108 3741647 3734776 3698215 3818745 3799640 3915610 3918415 3835055 3791783 3712672
15095 3712672 3769169 3748324 3959787 3873983 3795013 3815578 3842370 3783632 3771091 3827128 3808663
15084 3808663 3679795 3679645 3707610 3773384 3890534 3906008 3892295 3995921 3850414 3748694 3876254
15073 3876254 3721553 3907674 3763515 3946401 3879958 3894809 3865893 3835475 3755800 3703592
15063 3703592 3706095 3673233 3637905 3800956 3775952 3754364 3820679 3768806 3758469 3841326 3876732
15052 3876732 3869307 3745698 3742468 3829708 3749609 3812069 3831008 3794829 3995371 3993601 3891405
15041 3891405 3982985 4030269 3739734 3751118 3931859 3911788 3777269 3801472 3835144 3853893 3848100
15030 3848100 3835609 3817863 3703777 3873222 3928592 3863800 3799928 3819248 3819001 3975284 3849102
15019 3849102 3970125 4002575 3805898 3786177 3810794 3795361 3687159 3652225 3795041 3805945
15009 3805945 3857534 3779985 3839775 3823428 3839866 3781398 3778232 3857154 3839896 3859867 3856848 3884369
14997 3884369 4011650 3960105 3816395 3884627 3851173 3876271 3867229 3780189 3805496 3832434 3824999
14986 3824999 3756906 3778749 3830949 3870402 3915867 3850755 3903633 3891621 3916278 4013631 3946750
14975 3946750 3864197 3929676 3846716 3887968 3771455 3753386 3973385 3916831 3723637 3883041
14965 3883041 3906065 3945891 3940100 3784518 3849728 3830482 3778943 3807801 3934288 3674504 3684388
14954 3684388 3862387 3821674 3931860 3816073 3855596 3910047 3871916 3730980 3634483 3838276
14944 3838276 3777923 3832331 3953419 3875265 3909508 3971636 3943382 3927507 3822179 3825163 3717713
14933 3717713 3817553 3893611 3837330 3816656 3970192 3974830 3746863 3900336 3965091 4028342 3859927
14922 3859927 3883054 3875852 3815817 3790096 3740212 3954965 3860960 3826730 3921222 3979691 3902671
14911 3902671 3898084 3953147 3978488 3811118 3793750 3901837 3941335 3831688 3829461 3885488 3994175
14900 3994175 3874819 3866505 3866731 3807140 4008668 4000993 3907621 3817354 3802878 3861255 3737928
14889 3737928 3753493 3888487 3929557 3955876 3955712 3837415 3872922 3947658 3720477 3784535 3900303
14878 3900303 3982069 3848842 3868615 3876300 3855457 3809112 3860424 3748727 3628764 3726150 3694615
14867 3694615 3798060 3823115 3856926 3854934 3837280 3944418 3771383 3819230 3723569 3799935 3897805
14856 3897805 3838949 3721377 3822806 3800298 3799626 3947183 3874782 3837107 3855676 3811402 3804008
14845 3804008 3971391 3759170 3939078 3966295 3864793 3881120 3915985 3948818 3792816 3747730
14835 3747730 3797075 3927461 3916505 4008294 3999447 3786205 3933122 3889965 3836880 3836450 3753963
14824 3753963 3862571 3994816 3916426 3860424 3958772 3922599 3992881 4070741 4038471 3943254 3832995
14813 3832995 3846751 3921087 4021817 3966012 3892042 3908803 3895600 3941480 4016529 3857316 3805855
14802 3805855 3934015 3987923 4054493 3947653 3754016 3826905 3880203 3906472 4024994 3947835
14792 3947835 3838964 3934962 3788567 3864349 4077900 3970359 3787550 3799275 3894430 3978687
14782 3978687 3997096 3846101 3773312 3944308 4003806 4066666 4053101 3949536 3892359 3769010
14772 3769010 4013315 4140266 4084292 3925264 3874089 4022942 4132437 4091978 4088966 4018946
14762 4018946 3963855 4023417 4053669 4044318 3861002 3931942 3897490 3868989 3903147 3755972 3856068
14751 3856068 3891371 3906234 3895009 3800655 3875932 3919753 3909686 3980207 4070026 4021405 4019116
14740 4019116 4034104 3893879 3872091 3943513 3997041 3982052 4029821 3986985 3875883 3736423 3878843
14729 3878843 3917882 3864757 3837307 3881729 3973148 3953764 4030088 3956935 3856460 3903281 3854226
14718 3854226 3862484 3929810 4031100 4069287 4124800 3876272 3848056 3895473 3789513 3849982 4050561
14707 4050561 3914569 3906539 4029409 4010470 3994912 3943947 3893178 3768070 3853859 3930626 3864080
14696 3864080 3783059 3840521 3955133 4007054 3956745 3822575 3847056 3981387 3854952 3800433
14686 3800433 3832207 3980026 4036251 4123501 4035808 3968486 4003758 3960078 4075111 4046781 3912077
14675 3912077 4037841 4025172 4021094 4000867 4005942 3980944 4014455 4126183 4057759 3947042 3904564
14664 3904564 4030438 4183342 4046991 4080303 4091127 4029999 4033990 3908513 3845175 3969933
14654 3969933 3962616 3966562 3992649 4086635 4000983 3940187 3989665 4129361 3964640 4015261 3949536
14643 3949536 3874758 4005996 3807280 3821893 3950863 3916828 3802331 3902266 3971308 3945684
14633 3945684 3967392 3984364 3919725 3946908 3867822 4027004 3947108 4070138 4059186 3861823 3889484
14622 3889484 3995123 3882784 3803303 3910080 3927612 3963790 4024317 3984250 3996068 3959988 3725897
14611 3725897 3852687 3913364 3969051 3828943 3926750 3955029 3959632 3906889 3923317 3953359 3883953
14600 3883953 3981493 4153912 4097984 3942051 4015424 4026993 3923053 4045719 4018913 4047548
14590 4047548 4062842 4060002 4064164 4025299 4004649 3874570 4063550 4072733 3978493 4053709 3990217
14579 3990217 4032483 3987809 3894416 3954491 4053315 4019618 4008749 3991939 3846756 3952715 4001834
14568 4001834 4087079 3935161 3976326 3971676 4013655 4038485 4049508 4059576 4048487 3998629 4037993
14557 4037993 3921999 3848436 3899096 3917384 3953833 4027750 3985486 3953703 3989877 3987134 4026800
14546 4026800 4007846 3982398 4054669 3995379 3976215 3982323 4099467 3947854 3997529 4058971 4000594
14535 4000594 4001887 4124526 4230181 4182548 4033086 4057582 4086652 3990417 4115947 4059391 4070432
14524 4070432 4018807 4028976 4038553 4002630 4053112 3995303 4038829 4004786 3973906 4070193 4031225
$$ [...]
##END NTUPLES=NMR SPECTRUM
##END=
