##TITLE=1H_CG-1210-X
 DMSO
 8 sc, 
 14.8.2024
##JCAMPDX= 6.0         $$ Bruker NMR JCAMP-DX V2.0
##DATA TYPE= NMR SPECTRUM
##DATA CLASS= NTUPLES
##ORIGIN= UXNMR, Bruker Analytische Messtechnik GmbH
##OWNER= root
$$ XWIN-NMR		Version 3.5
$$ Wed Aug 14 13:58:37 2024 Russian Standard Time (UT+4h)  she@DPX200
##.OBSERVE FREQUENCY= 200.1318
##.OBSERVE NUCLEUS= ^1H
##.ACQUISITION MODE= SIMULTANEOUS
##.ACQUISITION SCHEME= undefined
##.AVERAGES= 8
##.DIGITISER RES= 18
##SPECTROMETER/DATA SYSTEM= spect
##.PULSE SEQUENCE= zg30
##.SOLVENT NAME= DMSO
##.SHIFT REFERENCE= (INTERNAL, DMSO, 0, 21.0135)
##AUDIT TRAIL= $$ (NUMBER, WHEN, WHO, WHERE, WHAT)
$$ ##TITLE= Audit trail, XWIN-NMR		Version 3.5
$$ ##JCAMPDX= 5.01
$$ ##ORIGIN= Bruker BioSpin GmbH
$$ ##OWNER= she
$$ F:/spectra/data/she/nmr/H-F/1/pdata/1/auditp.txt
$$ ##AUDIT TRAIL=  $$ (NUMBER, WHEN, WHO, WHERE, WHAT)
(   1,<2024-08-14 13:57:16.40 +0400>,<she>,<DPX200>,
      <created by zg, POWCHK disabled, PULCHK disabled
       configuration hash MD5:
       00 E9 B6 7A A2 85 ED C7 34 08 36 98 17 FE 4E 26
       data hash MD5: 16K
       03 EC AB 5D 95 66 7C A1 19 1C DC 31 D7 DE 92 FB>)
(   2,<2024-08-14 13:57:19.54 +0400>,<she>,<DPX200>,
      <Start of raw data processing
       efp BC_mod = 2 LB = 0.24 FT_mod = 6 PKNL = 1 PHC0 = -25997.92 PHC1 = 12.78748 SI = 16K 
       data hash MD5: 16K
       98 D3 AB EA 5A A0 0B 37 F7 5F 3C B2 BE 1D 78 BD>)
(   3,<2024-08-14 13:57:41.51 +0400>,<she>,<DPX200>,
      <pk PHC0 = -0.6852237 PHC1 = 0 
       data hash MD5: 16K
       34 46 49 F5 AA C9 E2 8A 7A E3 D3 C5 A3 ED 77 8B>)
(   4,<2024-08-14 13:57:45.09 +0400>,<she>,<DPX200>,
      <abs ABSG = 5 
       data hash MD5: 16K
       80 9A FC 82 F6 73 4A 82 D0 C6 77 3E 15 2C 31 D2>)
$$ ##END=
$$ 
$$ hash MD5
$$ C8 41 85 28 DD 0E 7D F5 FE 84 BF 42 A7 2B 51 AD
##$RELAX= 
##$RELAX= 
##$RELAX= 
##$RELAX= 
##$RELAX= 
##$RELAX= 
$$ Bruker specific parameters
$$ --------------------------
##$DU= <F:/spectra>
##$EXPNO= 1
##$NAME= <H-F>
##$PROCNO= 1
##$TYPE= <nmr>
##$USER= <she>
##$AMP= (0..31)
100 100 100 100 100 100 100 100 100 100 100 100 100 100 100 100 100 100 
100 100 100 100 100 100 100 100 100 100 100 100 100 100 
##$AQSEQ= 0
##$AQ_mod= 1
##$AUNM= <au_zg>
##$AUTOPOS= <>
##$BF1= 200.13
##$BF2= 200.13
##$BF3= 200.13
##$BF4= 200.13
##$BF5= 200.13
##$BF6= 200.13
##$BF7= 200.13
##$BF8= 200.13
##$BYTORDA= 1
##$CFDGTYP= 0
##$CFRGTYP= 5
##$CHEMSTR= <none>
##$CNST= (0..31)
1 1 145 1 1 1 1 1 1 1 1 1 1 1 1 1 1 1 1 1 1 1 1 1 1 1 1 1 1 1 1 1 
##$CPDPRG= <>
##$CPDPRG1= <>
##$CPDPRG2= <>
##$CPDPRG3= <>
##$CPDPRG4= <mlev>
##$CPDPRG5= <mlev>
##$CPDPRG6= <mlev>
##$CPDPRG7= <mlev>
##$CPDPRG8= <mlev>
##$CPDPRGB= <>
##$CPDPRGT= <>
##$D= (0..31)
0 1.2 0 0 0 0 0 0 0 0.06 0 0.03 0 0 0 0 0.0002 0 0 0 0 0 0 0 0 0 0 0 0 
0 0 0 
##$DATE= 1723629435
##$DBL= (0..7)
120 120 120 120 120 120 120 120 
##$DBP= (0..7)
150 150 150 150 150 150 150 150 
##$DBP07= 0
##$DBPNAM0= <>
##$DBPNAM1= <>
##$DBPNAM2= <>
##$DBPNAM3= <>
##$DBPNAM4= <>
##$DBPNAM5= <>
$$ [...]
##$SUBNAM3= <"">
##$SUBNAM4= <"">
##$SUBNAM5= <"">
##$SUBNAM6= <"">
##$SUBNAM7= <"">
##$SUBNAM8= <"">
##$SUBNAM9= <"">
##$SW= 24.0689170037331
##$SWIBOX= (0..15)
0 0 2 0 0 0 0 0 0 0 0 0 0 0 0 0 
##$SW_h= 4816.95568400771
##$TD= 16384
##$TD0= 1
##$TE= 0
##$TE2= 300
##$TE3= 300
##$TEG= 300
##$TL= (0..7)
0 120 120 120 120 120 120 120 
##$TP= (0..7)
150 150 150 150 150 150 150 150 
##$TP07= 0
##$TPNAME0= <>
##$TPNAME1= <>
##$TPNAME2= <>
##$TPNAME3= <>
##$TPNAME4= <>
##$TPNAME5= <>
##$TPNAME6= <>
##$TPNAME7= <>
##$TPOAL= (0..7)
0.5 0.5 0.5 0.5 0.5 0.5 0.5 0.5 
##$TPOFFS= (0..7)
0 0 0 0 0 0 0 0 
##$TUNHIN= 0
##$TUNHOUT= 0
##$TUNXOUT= 0
##$USERA1= <user>
##$USERA2= <user>
##$USERA3= <user>
##$USERA4= <user>
##$USERA5= <user>
##$V9= 5
##$VALIST= <valist>
##$VCLIST= <CCCCCCCCCCCCCCC>
##$VD= 0
##$VDLIST= <DDDDDDDDDDDDDDD>
##$VPLIST= <PPPPPPPPPPPPPPP>
##$VTLIST= <TTTTTTTTTTTTTTT>
##$WBST= 1024
##$WBSW= 4
##$XGAIN= (0..3)
0 0 0 0 
##$XL= 0
##$YL= 0
##$YMAX_a= 162746
##$YMIN_a= -162799
##$ZGOPTNS= <>
##$ZL1= 120
##$ZL2= 120
##$ZL3= 120
##$ZL4= 120
##$ABSF1= 21.05168
##$ABSF2= -3.017454
##$ABSG= 5
##$ABSL= 3
##$ALPHA= 0
##$AQORDER= 0
##$ASSFAC= 0
##$ASSFACI= 0
##$ASSFACX= 0
##$ASSWID= 0
##$AUNMP= <proc_1d>
##$AZFE= 0.1
##$AZFW= 0.1
##$BCFW= 0
##$BC_mod= 2
##$BYTORDP= 0
##$COROFFS= 0
##$CY= -3
##$DATMOD= 1
##$DC= 0
##$DFILT= <>
##$DTYPP= 0
##$F1P= 0
##$F2P= 0
##$FCOR= 1
##$FTSIZE= 16384
##$FT_mod= 6
##$GAMMA= 0
##$GB= 0
##$INTBC= 1
##$INTSCL= 3.70164e-10
##$ISEN= 128
##$LB= 0.24
##$LEV0= 0
##$LPBIN= 0
##$MAXI= 10000
##$MC2= 0
##$MEAN= 0
##$ME_mod= 0
##$MI= 1.114404
##$NCOEF= 0
##$NC_proc= -5
##$NLEV= 6
##$NOISF1= 3.799351
##$NOISF2= 2.8
##$NSP= 0
##$NTH_PI= 0
##$NZP= 0
##$OFFSET= 21.01348
##$PC= 1
##$PHC0= -25998.61
##$PHC1= 12.78748
##$PH_mod= 1
##$PKNL= yes
##$PPARMOD= 0
##$PSCAL= 0
##$PSIGN= 0
##$REVERSE= no
##$SF= 200.130003049853
##$SI= 16384
##$SIGF1= 3
##$SIGF2= 2
##$SINO= 5.538805
##$SIOLD= 16384
##$SREGLST= <1H.CDCl3>
##$SSB= 0
##$STSI= 16384
##$STSR= 0
##$SW_p= 4816.95568400771
##$SYMM= 0
##$S_DEV= 0
##$TDeff= 16384
##$TDoff= 0
##$TI= <>
##$TILT= no
##$TM1= 0
##$TM2= 0
##$TOPLEV= 0
##$USERP1= <user>
##$USERP2= <user>
##$USERP3= <user>
##$USERP4= <user>
##$USERP5= <user>
##$WDW= 1
##$XDIM= 16384
##$YMAX_p= 358441321
##$YMIN_p= -668109
$$ End of Bruker specific parameters
$$ ---------------------------------
##NTUPLES= NMR SPECTRUM
##VAR_NAME=  FREQUENCY,     SPECTRUM/REAL,   SPECTRUM/IMAG
##SYMBOL=    X,             R,               I
##VAR_TYPE=  INDEPENDENT,   DEPENDENT,       DEPENDENT
##VAR_FORM=  AFFN,          ASDF,            ASDF
##VAR_DIM=   16384,         16384,           16384
##UNITS=     HZ,            ARBITRARY UNITS, ARBITRARY UNITS
##FACTOR=    0.29402158847633, 1,            1
##FIRST=     4205.4276629459, 0,             0
##LAST=      -611.528021061808, 0,           0
##MIN=       -611.528021061808, -668109,     0
##MAX=       4205.4276629459, 358441321,     0
$$ Real data points
##PAGE= N=1
##DATA TABLE= (X++(R..R)), XYDATA
$$ [...]
$$ plain form
7867 219700 164715 177586 148797 106872 132674 167331 207273 180485 159134 115092 120962 68767
7855 68767 72322 126671 140289 161631 187377 180103 152242 212191 186556 165218 153321 202406
7843 202406 152728 89267 165711 204831 179396 234625 244545 264605 237025 189172 212758 238796
7831 238796 301135 195081 193750 216722 324491 301235 231993 187416 185451 234934 311543 288535
7819 288535 250026 199279 189576 244751 247203 255324 234131 272089 309432 297855 244326 224735
7807 224735 260670 196337 228572 257979 242915 308718 354406 300612 343312 342852 391819 354528
7795 354528 309880 329169 356115 337936 300581 380992 382166 321031 276866 240298 333487 388986
7783 388986 398877 415552 327832 396878 346466 345162 385088 444841 382462 358765 345188 392838
$$ packed form
7867B19700n4985J2871k8789m1925K5802L4657L9942k6788k1351m4042N870n2195
7855F8767L555N4349J3618K1342K5746p274k7861N9949k5635k1338j1897M9085
7843B02406m9678o3461P6444L9120k5435N5229R920K0060k7580m7853K3586K6038
7831B38796O2339j06054j331K2972J07769k3256o9242m4577j965M9483P6609k3008
7819B88535l8509n0747r703N5175K452Q121k1193L7958L7343j1577n3529j9591
7807B24735L5935o4333L2235K9407j5064O5803M5688n3794M2700m60M8967l7291
7795C54528m4648J9289K6946j8179l7355Q0411J174o1135m4165l6568R3189N5499
7783C88986R891J6675q7720O9046n0412j304L9926N9753o2379k3697j3577M7650
$$ plain form
7771 392838 355600 329901 358772 417395 476559 516380 584242 560181 559822 562095 567443 575022 561012
7758 561012 572850 580283 520373 551544 640181 648278 659357 679860 700360 627503 629249 606094
7746 606094 612127 648246 651228 718822 715772 703256 685837 763353 694444 754219 797395 760257
7734 760257 794338 842387 886132 880954 883879 809439 773644 789608 877404 866195 928022 1006746
7722 1006746 970503 948756 975567 999821 1037226 1044866 1134913 1125602 1140404 1128884 1167728 1175052
7710 1175052 1236907 1313831 1328803 1361355 1346673 1424753 1481096 1434954 1433467 1531607 1588979 1562430
7698 1562430 1624954 1751858 1709921 1739096 1815510 1856146 1915598 2066666 2121841 2239991 2268889
7687 2268889 2317828 2324558 2440933 2446645 2552663 2667443 2721455 2815959 2889449 3057863 3112034
$$ packed form
7771C92838l7238k5699K8871N8623N9164L9821O7862k4061l59K273N348P579j4010
7758E61012J1838P433n9910L1171Q8637Q097J1079K0503K0500p2857J746k3155
7746F06094O033L6119K982O7594l050j2516j7419P7516o8909N9775M3176l7138
7734G60257L4081M8049M3745n178K925p4440l5795J5964Q7796j1209O1827P8724
7722A006746l6243k1747K6811K4254L7405P640R0047r311J4802j1520L8844P324
7710A175052O1855P6924J4972L2552j4682P8080N6343m6142j487R8140N7372k6549
7698A562430O2524J26904m1937K9175P6414M0636N9452J51068N5175J18150K8898
7687B268889M8939O730J16375N712J06018J14780N4012R4504P3490J68414N4171
$$ plain form
7676 3112034 3182385 3327849 3326368 3439877 3570475 3709968 3899216 3947489 4076863 4263473
7666 4263473 4435656 4531970 4697913 4845879 5035549 5186124 5347904 5463963 5644780 5901226
7656 5901226 6058551 6214557 6425488 6666101 6886331 7039015 7249724 7476195 7706693 7984567
7646 7984567 8171810 8452810 8747860 8975749 9182059 9362094 9452826 9511986 9593619 9648746
7636 9648746 9613882 9652122 9652023 9616326 9573185 9488371 9426656 9371804 9309472 9248616 9106061 9007039
7624 9007039 8978290 8796856 8675156 8565743 8419663 8311670 8141913 7999647 7841686 7623890
7614 7623890 7368554 7157620 6928173 6665581 6426841 6186648 5837951 5617391 5454155 5230155
7604 5230155 5090302 4944641 4768399 4660419 4500812 4368094 4246794 4028138 3874644 3812134
$$ packed form
7676C112034P0351J45464j481J13509J30598J39493J89248M8273J29374J86610
7666D263473J72183R6314J65943J47966J89670J50575J61780J16059J80817K56446
7656E901226J57325J56006K10931K40613K20230J52684K10709K26471K30498K77874
7646G984567J87243K81000K95050K27889K06310J80035R0732N9160Q1633N5127
7636I648746l4864L8240r9l5697m3141q4814o1715n4852o2332o0856j42555r9022
7624I007039k8749j81434j21700j09413j46080j07993j69757j42266j57961k17796
7614G623890k55336k10934k29447k62592k38740k40193l48697k20560j63236k24000
7604E230155j39853j45661j76242j07980j59607j32718j21300k18656j53494o2510
$$ plain form
7594 3812134 3596373 3428909 3370238 3208610 3163917 3042477 3001420 2870510 2837055 2711302
7584 2711302 2646384 2470056 2466032 2443570 2299236 2284602 2207832 2138111 2106094 2035650 1976586
7573 1976586 1920726 1870765 1858405 1730050 1704373 1603663 1592900 1567416 1475155 1408273 1355149
7562 1355149 1326806 1311284 1306944 1248545 1250759 1247901 1172997 1162841 1131913 1129175 1093882 1093048 1052475
7549 1052475 1004445 965296 1040448 1069820 1027205 1047954 967029 974550 892987 784385 813028
7538 813028 828190 785061 777759 746562 679758 684613 764491 815271 766178 709531 642883 640471
7526 640471 678876 735149 702195 704852 697128 710270 576573 513047 583265 591759 591048 540337
7514 540337 532547 513206 578339 582648 543805 448595 431144 468269 425677 440102 396293 392899
$$ packed form
7594C812134k15761j67464n8671j61628m4693j21440m1057j30910l3455j25753
7584B711302o4918j76328m024k2462j44334j4634p6770o9721l2017p0444n9064
7573A976586n5860m9961j2360j28355k5677j00710j0763k5484r2261o6882n3124
7562A355149k8343j5522m340n8399K214k858p4904j0156l0928k738l5293q34m0573
7549A052475m8030l9149P5152K9372m2615K0749q0925P521q1563j08602K8643
7538H13028J5162m3129p302l1197o6804M855P9878N0780m9093n6647o6648k412
7526F40471L8405N6273l2954K657p724J3142j33697o3526P0218Q494p11n0711
7514E40337p790j9341O5133M309l8843r5210j7451L7125m2592J4425m3809l394
$$ plain form
7502 392899 437032 454206 426672 417328 432670 381418 398536 399034 378814 402573 409964 339660
7490 339660 357174 367699 411687 355077 328336 325925 312869 296267 342987 357641 311095 235377
7478 235377 290431 313182 231055 277032 249737 293533 366823 286982 268163 202736 159685 251074
7466 251074 271809 234002 276630 326388 338167 263767 232579 233932 207900 212089 230534 240197
7454 240197 261062 280081 236172 235546 239273 243008 221449 201009 194986 151859 138838 214025 206270
7441 206270 126013 90885 226790 191668 87218 117153 239465 276603 156415 171591 247992
7430 247992 248567 192383 132359 129376 127690 180464 185079 205735 168717 153665 164217 152726 125986
7417 125986 169460 169155 97840 109914 166846 253542 181747 162635 145345 150118 139590 79118
$$ packed form
7502C92899M4133J7174k7534r344J5342n1252J7118M98k0220K3759P391p0304
7490C39660J7514J0525M3988n6610k6741k411j3056j6602M6720J4654m6546p5718
7478B35377N5054K2751q2127M5977k7295M3796P3290p9841j8819o5427m3051R1389
7466B51074K0735l7807M2628M9758J1779p4400l1188J353k6032M189J8445R663
7454B40197K0865J9019m3909o26L727L735k1559k0440o023m3127j3021P5187p755
7441B06270q0257l5128J35905l5122j04450K9935J22312L7138j20188J5176P6401
7430B47992N75n6184o0024k983j686N2774M615K0656l7018j5052J0552j1491k6740
7417A25986M3474l05p1315J2074N6932Q6696p1795j9112j7290M773j0528o0472
$$ plain form
7405 79118 134668 73724 54394 138140 119252 133935 155495 119797 78282 157482 212545 109275
7393 109275 166452 131093 115684 113243 121384 84199 61687 131928 132336 137722 176926 71129
7381 71129 155240 197936 196478 163943 133323 142640 149333 142521 105657 52424 149915 147438 110720
7368 110720 178693 118929 9014 61155 106225 47441 43982 59901 159417 100384 66175 129617
7356 129617 191521 159916 165822 114408 153136 194173 174954 88307 141874 181943 193439 172007
7344 172007 137282 166555 185062 229254 240998 243375 185344 118992 150004 289199 228892 234129
7332 234129 260750 269041 291071 345471 386088 428524 566148 579359 634047 636789 684189 732673
7320 732673 713425 691097 601634 538289 529773 447734 386342 324103 421316 353414 413299 375003
$$ packed form
7405G9118N5550o0944j9330Q3746j8888J4683K1560l5698m1515P9200N5063j03270
7393A09275N7177l5359j5409k441Q141l7185k2512P0241M08N386L9204j05797
7381G1129Q4111M2696j458l2535l0620R317O693o812l6864n3233R7491k477l6718
7368A10720O7973n9764j09915N2141M5070n8784l459J5919R9516n9033l4209O3442
7356A29617O1904l1605N906n1414L8728M1037j9219q6647N3567M0069J1496k1432
7344A72007l4725K9273J8507M4192J1744K377n8031o6352L1012J39195o0307N237
7332B34129K6621Q291K2030N4400M0617M2436J37624J3211N4688K742M7400M8484
7320G32673j9248k2328q9463o3345q516q2039o1392o2239R7213o7902N9885l8296
$$ plain form
7308 375003 381529 375315 337759 362613 426616 505135 531929 554006 646804 707477 724741 774694
7296 774694 810641 936126 931068 888136 831641 801536 742047 615005 615942 606591 490266 409524
7284 409524 368630 344180 349328 344027 276457 167730 191770 278270 254599 282230 223671 201270
7272 201270 198952 156287 177533 204986 174042 133752 131950 190582 177152 90461 95850 142838
7260 142838 118871 163638 192262 140722 164878 174225 83220 78642 144012 103543 72907 153059
7248 153059 150814 146671 158200 174514 182661 164276 90523 51410 98864 91764 131884 110773
7236 110773 69420 130797 155974 142439 180461 93972 111909 152919 75377 93079 111174 109437
7224 109437 62424 23257 87594 77909 56995 65119 46565 92388 142563 132314 71376 51357
$$ packed form
7308C75003O526o214l7556K4854O4003P8519K6794K2077R2798O0673J7264M9953
7296G74694L5947J25485n058m2932n6495l0105n9489j27042R37r351j16325q0742
7284D09524m0894k4450N148n301o7570j08727K4040Q6500k3671K7631n8559k2401
7272B01270k318m2665K1246K7453l0944m0290j802N8632j3430q6691N389M6988
7260A42838k3967M4767K8624n1540K4156R347r1005m578O5370m0469l0636Q0152
7248A53059k245m143J1529J6314Q147j8385p3753l9113M7454p100M0120k1111
7236A10773m1353O1377K5177j3535L8022q6489J7937M1010p7542J7702J8095j737
7224A09437m7013l9167O4337r685k0914Q124j8554M5823N0175j0249o0938k0019
$$ plain form
7212 51357 85821 72742 104998 166475 126788 120585 106871 83188 20811 80054 165682 170900
7200 170900 94570 93745 131806 183809 151506 123396 144933 196385 158438 261475 210334 210883
7188 210883 215591 223692 192751 259058 318722 312284 302308 193903 314991 303503 340128 410762
7176 410762 548597 541507 489364 379536 404116 395801 446633 400934 290448 357881 315905
7165 315905 358291 326981 379733 494208 406802 465446 483152 469869 504258 575305 643080
7154 643080 704509 758118 781863 859316 819715 860377 852306 865106 828125 742151 610808 549070
7142 549070 484201 455111 391582 421964 372551 385231 450792 395921 384428 446254 485228 492064
7130 492064 528186 512940 478003 565332 630976 653883 650277 607741 634913 537597 584947 571363
$$ packed form
7212E1357L4464j3079L2256O1477l9687o203j3714k3683o2377N9243Q5628N218
7200A70900p6330q25L8061N2003l2303k8110K1537N1452l7947J03037n1141N49
7188B10883M708Q101l0941O6307N9664o438r976j08405J21088j1488L6625P0634
7176D10762J37835p090n2143j09828K4580q315N0832m5699j10486O7433m1976
7165C15905M2386l1310N2752J14475q7406N8644J7706j3283L4389P1047O7775
7154F43080O1429N3609K3745P7453l9601M0662q071J2800l6981q5974j31343o1738
7142E49070o4869k9090o3529L0382m9413J2680O5561n4871j1493O1826L8974O836
7130D92064L6122j5246l4937Q7329O5644K2907l606m2536K7172r7316M7350j3584
$$ plain form
7118 571363 563638 370777 322940 296570 317634 298079 220470 242616 300328 357424 273002 247721
7106 247721 271846 247097 284425 277221 195172 228065 180001 160687 131475 153011 92558 167492
7094 167492 219994 100827 -18869 67235 167457 106347 124073 72844 72255 145395 125551
7083 125551 83650 92047 76173 25429 -1975 62492 34175 77856 90603 79206 52187 93972
7071 93972 25693 -12792 94479 104270 47010 -15058 64759 132164 94600 91370 64580 54144
7059 54144 60628 106121 93390 52996 20928 57126 2078 14827 10999 50021 54127 62291 22425
7046 22425 40206 63892 33504 28933 58388 53800 -45262 26612 48566 86290 101894 109874
7034 109874 106521 77706 112234 110720 81024 81496 112837 146818 115996 184073 166614 211050
$$ packed form
7118E71363p725j92861m7837k6370K1064j9555p7609K2146N7712N7096q4422k5281
7106B47721K4125k4749L7328p204q2049L2893m8064j9314k9212K1536o0453P4934
7094A67492N2502j19167j19696Q6104J00222o1110J7726n1229n89P3140j9844
7083A25551m1901Q397j5874n0744k7404O4467k8317M3681J2747j1397k7019M1785
7071I3972o8279l8485J07271R791n7260o2068P9817O7405l7564l230k6790j0436
7059E4144O484M5493j2731m0394l2068L6198n5048J2749l828L9022M106Q164l9866
7046B2425J7781K3686l0388m571K9455m588r9062P1874K1954L7724J5604P980
7034A09874l353k8815L4528j514k9696M72L1341L3981l0822O8077j7459M4436
$$ plain form
7022 211050 194310 155460 216551 247924 256214 246539 239141 209364 269110 352281 317140 412748
7010 412748 466635 496887 533017 551537 513503 535943 409722 391235 437794 427128 417827 380872
6998 380872 351724 364845 333701 302923 251835 286251 393843 404222 450079 415673 536940
6987 536940 665669 728669 818553 818100 838295 888796 842167 843848 744194 719253 571809 522135
6975 522135 409139 426786 444986 456549 374022 302054 350125 274294 364027 397408 360025
6964 360025 352523 380142 379414 376318 448268 520324 536178 482177 453334 406146 340300 340718 270229
6951 270229 205335 152386 215879 181335 210577 184063 201625 194326 230120 206753 153098 175448
6939 175448 147822 161246 178783 119578 71984 129611 207649 103944 90125 150176 78029
$$ packed form
7022B11050j6740l8850O1091L1373Q290r675p398k9777N9746Q3171l5141R5608
7010D12748N3887L0252L6130J8520l8034K2440j26221j8487M6559j0666r301l6955
6998C80872k9148J3121l1144l0778n1088L4416J07592J0379M5857l4406J21267
6987E36940J28729O3000Q9884m53K0195N0501m6629J681r9654k4941j47444m9674
6975E22135j12996J7647J8200J1563q2527p1968M8071p5831Q9733L3381l7383
6964C60025p502K7619p28l096P1950P2056J5854n4001k8843m7188o5846M18p0489
6951B70229o4894n2949O3493l4544K9242k6514J7562p299L5794k3367n3655K2350
6939A75448k7626J3424J7537n9205m7594N7627P8038j03705j3819O0051p2147
$$ plain form
6928 78029 74577 14152 -4352 73410 72816 73442 87878 73134 41377 -31999 19286 88170 947
6915 947 -69998 -83324 -34123 -3536 24657 55491 55928 24366 30769 41104 62962 19980 109112
6902 109112 109720 -37855 101 27474 74084 42390 -14190 -56714 -79808 -68178 -33780 24547
6890 24547 -21526 33937 29109 42791 11172 -4835 27784 16361 -9400 14575 2898 -12467
6878 -12467 -17719 7538 10158 21702 30749 42404 34763 102 -37251 -17860 13675 16190 70971
6865 70971 35133 31142 55525 36243 22881 95722 10922 73657 50658 86397 124524 15627
6853 15627 40158 82753 45824 86325 62859 25729 -29105 -7132 -25503 -22825 -69713 -56177
6841 -56177 -64781 -38841 -81728 -687 -19497 -31525 -50579 -51957 -38302 -263 4824 -86299
$$ packed form
6928G8029l452o0425j8504P7762n94O26J4436j4744l1757p3376N1285O8884q7223
6915I47p0945j3326M9201L0587K8193L0834M37l1562O403J0335K1858m2982Q9132
6902A09112O08j47575L7956K7373M6610l1694n6580m2524k3094J1630L4398N8327
6890B4547m6073N5463m828J3682l1619j6007L2619j1423k5761K3975j1677j5365
6878a2467n252K5257K620J1544R047J1655p641l4661l7353J9391L1535K515N4781
6865G0971l5838l991K4383j9282j3362P2841q4800O2735k2999L5739L8127j08897
6853A5627K4531M2595l6929M0501k3466l7130n4834K1973j8371K678m6888J3536
6841e6177q604K5940m2887Q1041j8810j2028j9054j378J3655L8039N087r1123
$$ plain form
6829 -86299 -121 -15651 -37915 18264 70040 50196 5172 71118 33104 -873 -25473 34236
6817 34236 -12104 52723 54684 -50440 -2122 -85492 -60216 -49663 -36130 -18660 26185 -88248
6805 -88248 -68272 -31426 -23539 73833 80566 -908 69387 37499 4539 27799 86805 63499
6793 63499 25441 -16588 -24152 18442 -30308 -32128 15238 -29489 -34989 49910 53145 35339 46800
6780 46800 60959 80 -2703 39266 28917 67371 4285 -17157 -35184 25035 -7944 -41825
6768 -41825 -8498 -6962 -18196 -105999 -15879 5063 -90573 -98642 -73203 -53187 -40516 -71985
6756 -71985 -29707 63054 69036 17810 -26438 -47427 1994 12904 -89324 -111231 -111810 -63206
6744 -63206 -21623 -2239 5240 -48744 -17385 46517 -4491 10977 14625 6276 -43433 -88099
$$ packed form
6829h6299Q6178j5530k2264N6179N1776j9844m5024O5946l8014l3977k4600N9709
6817C4236m6340O4827J961j05124M8318q3370K5276J0553J3533J7470M4845j14433
6805h8248J9976L6846P887R7372O733q1474P0295l1888l2960K3260N9006k3306
6793F3499l8058m2029p564M2594m8750j820M7366m4727n500Q4899L235j7806J1461
6780D6800J4159o0879k783M1969j0349L8454o3086k1442j8027O0219l2979l3881
6768d1825L3327J536j1234q7803R0120K0942r5636q069K5439K0016J2671l1469
6756g1985M2278R2761N982n1226m4248k0989M9421J0910j02228k1907n79M8604
6744f3206M1583J9384P479n3984L1359O3902n1008J5468L648q349m9709m4666
$$ plain form
6732 -88099 -44702 -54941 12069 -21162 21362 -17937 -4079 87950 27250 -11474 3145 -5174
6720 -5174 -31230 -33136 -16829 -40715 -9468 106914 11459 -70496 -48702 38480 25119 45135
6708 45135 11327 8492 38010 -46463 -48745 17748 -49636 -65490 -4825 42528 32361 -21522
6696 -21522 11429 27691 74550 66672 47275 35698 -66925 -117088 -20062 28035 -74648 -54520
6684 -54520 14228 5749 48170 17758 -21037 -23647 -16608 -33691 -34026 -39257 -4456 -31791 -56381
6671 -56381 -46656 7747 65814 34363 43815 -56857 -31200 54123 40813 -8284 -43759 32
6659 32 -36513 -29059 -8665 23228 5910 104132 102822 49664 -48761 3797 14853 23071 -44395
6646 -44395 -46872 21148 -43279 19638 -11486 -72607 -93941 40289 82585 45159 57603 -54784
$$ packed form
6732h8099M3397j0239O7010l3231M2524l9299J3858R2029o0700l8724J4619q319
6720e174k6056j906J6307k3886L1247J16382r5455q1955K1794Q7182j3361K0016
6708D5135l3808k835K9518q4473k282O6493o7384j5854O0665M7353j0167n3883
6696b1522L2951J6262M6859p878j9397j1577j02623n0163R7026M8097j02683K0128
6684e4520O8748q479M2421l0412l8795k610P039j7083l35n231L4801k7335k4590
6671e6381R725N4403N8067l1451R452j00672K5657Q5323j3310m9097l5475M3791
6659C2l6545P454K0394L1893j7318R8222j310n3158r8425N2558J1056Q218o7466
6646d4395k477O8020o4427O2917l1124o1121k1334J34230M2296l7426J2444j12387
$$ plain form
6634 -54784 -18844 46603 33840 35230 -38388 -60647 -40912 9768 -60487 -39074 3766 32941
6622 32941 -36238 -10986 -1490 -62693 -69679 -36054 -48552 23810 -57566 -52907 11816 -36344
6610 -36344 -107840 -18533 26761 38020 47228 34326 -244 -45167 -48489 -54336 -962 -57274
6598 -57274 -55158 -29469 45315 -5227 48029 73832 32605 77554 13030 28161 34108 14358
6586 14358 37608 -48247 -58180 59165 18907 -44314 11050 7064 99092 60344 9620 -7971
6574 -7971 5558 -42024 -3110 25426 11840 -22762 22712 -39400 -50509 -30284 -61020 -34514
6562 -34514 -20654 -3909 -83455 313 -6543 45190 80507 -23920 33538 40758 -17225 -21577
6550 -21577 -24743 -9808 -16453 -55473 -50359 -101118 -56752 -83392 -57993 -4061 47921 44398 -20432
$$ packed form
6634e4784L5940O5447j2763J390p3618k2259J9735N0680p0255K1413M2840K9175
6622C2941o9179K5252R496o1203o986L3625j2498P2362q1376M659O4723m8160
6610c6344p1496Q9307M5294J1259R208j2902l4570m4923l322n847N3374n6312
6598e7274K116K5689P4784n0542N3256K5803m1227M4949o4524J5131N947j9750
6586A4358K3250q5855r933J17345m0258o3221N5364l986R2028l8748n0724j7591
6574g971J3529m7582L8914K8536j3586l4602M5474o2112j1109K0225l0736K6506
6562c4514J3860J6745p9546Q3768o856N1733L5317j04427N7458P220n7983m352
6550b1577l166J4935o645l9020N114n0759M4366k6640K5399N3932N1982l523o4830
$$ plain form
6537 -20432 45906 26215 -46363 -80045 -32880 -13216 -54468 -7254 -1532 -1203 14700 17464 29888
6524 29888 -20498 -9837 -14981 21294 73208 24943 -86170 -28968 19880 -64492 -49348 -7880
6512 -7880 46706 4638 18159 71014 40032 40377 67125 -6194 -13057 -26144 -26618 -78800 -46180
6499 -46180 -71243 -112487 -70167 -61775 33239 -51885 -69242 -40459 -47730 -73408 3472 -8118
6487 -8118 10021 -51903 -35415 34543 84171 21698 -12121 56217 17179 -17114 -12500 -40899
6475 -40899 -30761 -65165 -69089 26276 97944 91189 66478 22725 -3506 -76127 -19384 10238
6463 10238 -52993 -2359 1291 -4999 -6926 10738 -113332 -127641 11226 2149 46906 1641
6451 1641 75527 79190 7381 38876 5890 30998 21103 37507 4234 -15168 -20976 -37914 4066
$$ packed form
6537b0432O6338j9691p2578l3682M7165J9664m1252M7214N722L29J5903K764J2424
6524B9888n0386J0661n144L6275N1914m8265j11113N7202M8848q4372J5144M1468
6512g880N4586m2068J3521N2855l0982L45K6748p3319o863j3087m74n2182L2620
6499d6180k5063m1244M2320Q392R5014q5124j7357K8783p271k5678P6880j1590
6487h118J8139o1924J6488O9958M9628o2473l3819O8338l9038l4293M614k8399
6475d0899J0138l4404l924R5365P1668o755k4711m3753k6231p2621N6743K9622
6463A0238o3231N0634L650o290j927J7664j24070j4309J38867r077M4757m5265
6451A641P3886L663p1809L1495l2986K5108r895J6404l3273j9402n808j6938M1980
$$ plain form
6438 4066 -1474 -17655 -81519 -33109 14366 9930 -15515 -52583 -33564 -87857 -113335 -71509
6426 -71509 -24552 -53416 13928 -11413 -22468 34227 -20233 -28567 -47879 -22158 -50985 -31934
6414 -31934 1224 77387 44653 70103 -34627 -59494 -22388 -21755 -14012 -98018 -30768 -94469
6402 -94469 -83204 -109470 -27325 -191483 -65183 -47705 -60185 -21320 -1163 885 -24515 -18254
6390 -18254 32518 42359 -8329 -3278 -5755 -40836 -67273 -46143 4334 -10457 -64078 -56023 -81944
6377 -81944 -55932 -59815 -21233 -20053 -12547 -33620 -40933 17400 -49057 -55025 -25306 -57808 -27663
6364 -27663 -24714 21102 -29430 -45348 -49666 -58562 -24749 -48288 -62652 -27815 -95443 -50959
6352 -50959 -81592 -47989 -112091 -155192 -54723 -105664 -51325 -62613 -113422 -42160 -70210 -141399
$$ packed form
6438D066n540j6181o3864M8410M7475m436k5445l7068J9019n4293k5478M1826
6426g1509M6957k8864O7344k5341j1055N6695n4460q334j9312K5721k8827J9051
6414c1934L3158P6163l2734K5450j04730k4867L7106O33P743q4006O7250o3701
6402i4469J1265k6266Q2145j64158J26300J7478j2480L8865K0157K048k5400O261
6390a8254N0772R841n0688N051k477l5081k6437K1130N0477j4791n3621Q055k5921
6377h1944K6012l883L8582J180P506k1073p313N8333o6457n968K9719l2502L0145
6364b7663K949M5816n0532j5918m318q896L3813k3539j4364L4837o7628M4484
6352e0959l0633L3603o4102m3101J00469n0941N4339j1288n0809P1262k8050p1189
$$ plain form
6340 -141399 -89879 7102 31042 -3411 5174 42579 14383 -37476 256 -64478 -68605 -28816
6328 -28816 -78166 -100947 -96507 -46616 -54942 -37634 -37155 -27456 26634 -32467 -68232 -93218 -90016
6315 -90016 -108901 -75494 -89728 -85220 -46076 -67519 -3654 -68198 -67484 -59131 -16811 15580 -8315
6302 -8315 -43746 -38402 -36253 -34659 -67528 -89282 -42844 -45000 -99777 -38442 14717 15825 39260
6289 39260 8376 -25615 20280 36115 -83591 -98957 -118365 -81744 -78776 -64379 -4608 -91070
6277 -91070 -12354 18276 -42939 -32257 -21788 -35885 1005 13235 -14339 -31622 -39006 -62039
6265 -62039 -113274 -23979 -22998 22370 20389 -13725 -17485 5373 -71448 -90311 -23742 -71693 -52987
6252 -52987 -66891 -41704 -13959 22938 -32328 -28114 47224 -17598 -17983 -27500 -28180 -45364 -95499
$$ packed form
6340a41399N1520R6981K3940l4453Q585L7405k8196n1859L7732o4734m127L9789
6328b8816m9350k2781M440M9891q326J7308M79R699N4090n9101l5765k4986L202
6315i0016j8885L3407j4234M508L9144k1443O3865o4544P14Q353M2320L2391k3895
6302h315l5431N344K149J594l2869k1754M6438k156n4777O1335N3159J108K3435
6289C9260l0884l3991M5895J5835j19706j5366j9408L6621K968J4397N9771q6462
6277i1070P8716L0630o1215J0682J0469j4097L6890J2230k7574j7283p384k3033
6265f2039n1235Q9295R81M5368j981l4114l760K2858p6821j8863O6569m7951J8706
6252e2987j3904K5187K7745L6897n5266M214P5338o4822l85r517o80j7184n0135
$$ plain form
6239 -95499 -28571 -34824 -54917 -51367 -4596 -56121 -33278 35422 -27238 -1916 -72152 -39225
6227 -39225 -65653 -14443 43492 55140 5538 -27703 -37541 76069 -58166 -101836 -36894 19531
6215 19531 -7084 -8501 29787 529 -44648 -79842 -11636 -8952 -49776 -70131 -9356 -70731
6203 -70731 -70780 -39815 60464 -7254 -61797 -36220 -25184 -17174 -7697 -52627 -13928 104255
6191 104255 26337 -13537 -22042 -76873 -77475 -72843 10023 -53702 -87457 -40897 3491 -77258
6179 -77258 -2754 -32621 -54648 -22253 -43167 -26395 -55525 -41496 -47703 54930 -44171 -79946
6167 -79946 -156270 -72164 16668 -13843 46559 -5079 -4691 -27059 -80923 -86154 -23434 5324
6155 5324 -5690 31022 48160 50016 42817 20130 26675 -892 -33910 -33527 31034 24486 -1212
$$ packed form
6239i5499O6928o253k0093L550M6771n1525K2843O8700o2660K5322p0236L2927
6227c9225k6428N1210N7935J1648m9602l3241r838J13610j34235m3670O4942N6425
6215A9531k6615j417L8288k9258m5177l5194O8206K684m0824k0355O0775o1375
6203g0731m9L0965J00279o7718n4543K5577J1036Q010R477m4930L8699J18183
6191A04255p7918l9874q505n4831o02M632Q2866o3725l3755M6560M4388q0749
6179g7258P4504k9867k2027L2395k0914J6772k9130J4029o207J02633r9101l5775
6167g9946p6324Q4106Q8832l0511O0402n1638L88k2368n3864n231O2720K8758
6155E324j1014L6712J7138J856p199k2687O545k7567l3018L83O4561o548k5698
$$ plain form
6142 -1212 9851 -26836 10754 19970 -29396 -56059 -33096 36033 5552 34330 3516 -30630
6130 -30630 -10148 5693 1316 -20855 -62327 -10491 -7153 -88659 -109171 -41593 10533 34135
6118 34135 -16589 73897 3703 -48566 -98320 -121094 -52082 2693 4979 29414 1859 11145
6106 11145 62502 29058 -11913 34510 23815 -14514 11379 62681 110452 26013 -13831 -43751
6094 -43751 -77152 -51102 -15671 28849 45383 32569 -39971 -106317 -32142 22663 -9353 -73611
6082 -73611 12501 17389 57908 49687 -10121 -116830 -51263 -23605 45850 53484 84589 36945
6070 36945 13732 30412 -16212 23575 81860 69957 -9784 17194 10247 48783 34253 -17814
6058 -17814 3011 24402 6209 -63293 -46146 -24927 61492 83916 131906 85632 -6565 -80025
$$ packed form
6142a212J1063l6687L7590R216m9366k6663K2963O9129l0481K8778l0814l4146
6130c0630K0482J5841m377k2171m1472N1836L338q1506k0512O7578N2126K3602
6118C4135n0724R0486p0194n2269m9754k2774O9012N4775K286K4435k7555R286
6106A1145N1357l3444m0971M6423j0695l8329K5893N1302M7771q4439l9844k9920
6094d3751l3401K6050L5431M4520J6534j2814p2540o6346P4175N4805l2016o4258
6082g3611Q6112M888M0519q221n9808j06709O5567K7658O9455P634L1105m7644
6070C6945k3213J6680m6624L9787N8285j1903p9741K6978o947L8536j4530n2067
6058a7814K0825K1391j8193o9502J7147K1219Q6419K2424M7990m6274r2197p3460
$$ plain form
6046 -80025 -106739 -90831 48275 95859 40523 -47997 -29133 -76159 -106700 -80037 -31592 -35588
6034 -35588 -35077 6743 -65033 -78004 -49693 -100250 -40581 21445 -40416 -69624 -6321 -4875
6022 -4875 -2779 -42140 -44150 -44205 -1346 14397 80656 118355 -10755 15133 -16430 -25486 -5108
6009 -5108 -12898 -47833 124 -797 15134 86945 26015 -79832 -26662 -30325 1449 7226 -32655
5996 -32655 -96364 18211 -47220 -53927 -21294 314 -59446 -35156 -49906 -9514 11928 -34559
5984 -34559 -33256 -65665 -17591 19611 65793 32607 -32892 -31199 -42244 -31115 -25897 -40525
5972 -40525 -40226 9366 54107 48479 117266 95397 48022 8304 -13303 10300 11165 -57805 -4454
5959 -4454 -43384 -68435 11263 -29912 -17019 4686 -43585 -54120 10462 -24579 37778 -47984
$$ packed form
6046h0025k6714J5908J39106M7584n5336q8520J8864m7026l0541K6663M8445l996
6034c5588N11M1820p1776j2971K8311n0557N9669O2026o1861k9208O3303J446
6022d875K096l9361k010n5M2859J5743O6259L7699j29110K5888l1563r056K0378
6009e108p790l4935M7957r21J5931P1811o0930j05847N3170l663L1774N777l9881
5996c2655o3709J14575o5431o707L2633K1608n9760K4290j4750M0392K1442m6487
5984c4559J303l2409M8074L7202M6182l3186o5499J693j1045J1129N218j4628
5972d0525K99M9592M4741n628O8787k1869m7375l9718k1607K3603Q65o8970N3351
5959d454l8930k5051P9698m1175J2893K1705m8271j0535O4582l5041O2357q5762
$$ plain form
5947 -47984 13388 40340 17030 -52096 -38935 -21282 -56419 -27989 -48932 -69176 -13384 30880
5935 30880 53196 60035 65616 38743 -15888 38841 20185 -5546 -50594 -12799 -13593 -50621 -81750
5922 -81750 -37450 -43223 -101653 -106291 -77284 -70685 -9140 -4330 -42799 41609 99399 -49896
5910 -49896 -18623 34686 -3388 -44246 16908 9343 22615 -50536 -29 -8924 41028 45304
5898 45304 -15624 -65545 -109740 -30342 60802 -32480 -25744 -11329 6735 113320 33251 -37073
5886 -37073 -31024 -49402 5531 26324 -39677 -100839 -85634 52975 42039 28509 14094 22029
5874 22029 -9309 -55598 -41404 -54416 -86113 -89487 -36882 -358 -3575 -30989 -117346 -64578
5862 -64578 9456 -23774 -84553 -39564 -33173 -1230 -15267 8469 48054 -2472 -35540 -19782
$$ packed form
5947d7984O1372K6952k3310o9126J3161J7653l5137K8430k0943k0244N5792M4264
5935C0880K2316O839N581k6873n4631N4729j8656k5731m5048L7795p94l7028l1129
5922h1750M4300n773n8430m638K9007O599O1545M810l8469Q4408N7790j49295
5910d9896L1273N3309l8074m0858O1154p565J3272p3151N0507q895M9952M276
5898D5304o0928m9921m4195P9398R1144r3282O736J4415J8064J06585q0069p0324
5886c7073O049j8378N4933K0793o6001o1162J5205J38609j0936j3530j4415P935
5874B2029l1338m6289J4194j3012l1697l374N2605L6524l217k7414q6357N2768
5862f4578P4034l3230o0779M4989O391L1943j4037K3736L9585n0526l3068J5758
$$ plain form
5850 -19782 -42261 40669 -15688 22896 31879 57106 33698 -46506 -35658 40327 30966 -924
5838 -924 -13562 -5123 -15256 -51348 -94676 -45253 -21712 -32537 -8548 -9147 -5776 6578 19885
5825 19885 -13523 -48022 14975 2463 -18281 -7296 -56892 -28881 -26894 -13018 -86653 -32648
5813 -32648 -30055 3094 48004 26458 39753 12092 100779 122294 89363 44797 -51297 15142
5801 15142 7549 14342 -11636 -14712 -61384 -52641 -121145 -135282 -55658 -17600 19811 14077 -46566
5788 -46566 640 -57911 -68507 -37185 -36285 19591 7834 31591 4425 -7549 40971 30999
5776 30999 93888 32033 43099 66623 10943 -27936 -57199 -17026 -64657 32913 -14962 -25303
5764 -25303 -22523 -7926 -14249 19238 -2684 -47924 -3192 4124 16905 3085 -35703 -9320
$$ packed form
5850a9782k2479Q2930n6357L8584Q983K5227k3408q0204J0848P5985r361l1890
5838i24j2638Q439j0133l6092m3328M9423K3541j0825K3989n99L371J2354J3307
5825A9885l3408l4499O2997j2512k0744J0985m9596K8011J987J3876p3635N4005
5813c2648K593L3149M4910k1546J3295k7661Q8687K1515l2931m4566r6094O6439
5801A5142p593O793k5978l076m6672Q743o8504j4137P9624L8058L7411n734o0643
5788d6566M7206n8551j0596L1322R00N5876j1757K3757k7166j1974M8520r972
5776C0999O2889o1855J1066K3524n5680l8879k9263M0173m7631R7570m7875j0341
5764b5303K780J4597o323L3487k1922m5240M4732P316J2781j3820l8788K6383
$$ plain form
5752 -9320 -17128 -49000 -32350 -64234 -56170 -783 13420 65238 102229 -27712 -8942 -17561
5740 -17561 10616 -8802 -69936 -93740 -27111 -25890 10012 -58535 -55359 -25983 -60907 -76097
5728 -76097 6150 62426 8792 28566 45530 14024 36507 7836 35874 -44736 -62803 -16331
5716 -16331 -40008 -18817 35707 69102 -10392 -36353 -50178 -29508 -108757 -40271 -6248 -43380
5704 -43380 -75550 -93569 -86084 -2271 -51602 -67287 -37195 25408 -24516 45006 48338 50508
5692 50508 29676 -13117 12819 17951 -13169 3973 35130 -14633 -8162 1462 -24741 30824
5680 30824 -26560 -22484 28614 -22846 335 -15782 18904 24358 -33455 -3347 -19383 -66632
5668 -66632 38259 78813 -24806 -33369 -14327 8363 -28871 -14160 9156 60689 56297 3022
$$ packed form
5752i320p808l1872J6650l1884Q064N5387J4203N1818L6991j29941J8770q619
5740a7561K8177j9418o1134k3804O6629J221L5902o8547L176K9376l4924j5190
5728g6097Q2247N6276n3634J9774J6964l1506K2483k8671K8038q0610j8067M6472
5716a6331k3677K1191N4524L3395p9494k5961j3825K0670p9249O8486L4023l7132
5704d3380l2170j8019P485Q3813m9331j5685L0092O2603m9924O9522L332K170
5692E0508k0832m2793K5936N132l1120J7142L1157m9763O471R624k6203N5565
5680C0824n7384M076N1098n1460K3181j6117L4686N454n7813L0108j6036m7249
5668f6632J04891M0554j03619q563J9042K2690l7234J4711K3316N1533m392n3275
$$ plain form
5656 3022 11687 113 4649 56632 937 -48167 17998 -38 32545 47330 18072 44380
5644 44380 7464 77331 118910 76271 12993 276 34126 8844 100659 33551 12127 -10228
5632 -10228 2551 -13393 -42119 -18955 6770 -3621 -14157 34593 35652 50073 9781 -8922
5620 -8922 -5569 -52840 -16358 -9705 -28231 -28552 -13230 -19858 -59198 54141 101850 64459 3238
5607 3238 -55282 -70713 -24643 -1397 5057 -17399 -35626 15065 108208 2577 -5949 41756
5595 41756 15698 4765 -23592 29907 5827 37121 -20507 -61585 28875 14742 -67348 -65543
5583 -65543 -113685 -63325 -63365 -47773 -7031 -48563 -28846 35720 -53822 -40068 -79703 -60522
5571 -60522 -3094 -52588 -64624 13653 22593 -23666 -49763 -109346 -68609 4171 7880 -8136
$$ packed form
5656C022Q665j1574M536N1983n5695m9104O6165j8036L2583J4785k9258K6308
5644D4380l6916O9867M1579m2639o3278j2717L3850k5282R1815o7108k1424k2355
5632a0228J2779j5944k8726K3164K5725j0391j0536M8750J059J4421m0292j8703
5620h922L353m7271L6482O653j8526l21J5322o628l9340J13339M7709l7391o1221
5607C238n8520j5431M6070K3246O454k2456j8227N0691R3143j05631q526M7705
5595D1756k6058j0933k8357N3499k4080L1294n7628m1078R0460j4133q2090J805
5583f5543m8142N0360m0J5592M0742m1532J9717O4566q9542J3754l9635J9181
5571f0522N7428m9494j2036P8277Q940m6259k6097n9583M0737P2780L709j6016
$$ plain form
5559 -8136 -58530 3057 15876 -46893 -51329 -29728 -33907 -3798 -27198 -63469 -44864 -40071 -53721
5546 -53721 -65616 -27083 -61377 -76794 -33649 -14337 -18569 -76778 -60664 -3256 9162 61862
5534 61862 64351 57644 14235 -9852 34896 -38004 -67038 1090 -42350 -89251 -54892 -18222
5522 -18222 -67366 -47165 -48647 -16225 -46276 -86938 -67842 -39821 -34735 -49736 -38489 -30312
5510 -30312 -3623 11933 18633 -9753 -65276 -45592 -14641 12594 21112 -35515 -19131 108852
5498 108852 95648 -1599 -9204 -47200 -54607 -28637 18810 50252 58481 6007 -1824 -47790
5486 -47790 -28873 62594 48246 95576 42581 -18883 17300 -27981 -142936 -112066 -72371 -9470
5474 -9470 -24998 -72531 -16944 45467 -40878 -11182 -33990 2436 -65866 -18931 -18757 -32188
$$ packed form
5559h136n0394O1587J2819o2769m436K1601m179L0109k3400l6271J8605M793j3650
5546e3721j1895L8533l4294j5417M3145J9312m232n8209J6114N7408J2418N2700
5534F1862K489o707m3409k4087M4748p2900k9034O8128m3440m6901L4359L6670
5522a8222m9144K0201j482L2422l0051m0662J9096K8021N086j5001J1247Q177
5510c0312K6689J5556O700k8386n5523J9684L0951K7235Q518n6627J6384J27983
5498A08852j3204r7247p605l7996p407K5970M7447L1442Q229n2474p831m5966
5486d7790J8917R1467j4348M7330n2995o1464L6183m5281j14955L0870L9695O2901
5474i470j5528m7533N5587O2411q6345K9696k2808L6426o8302M6935J74j3431
$$ plain form
5462 -32188 33774 -9426 23267 -3751 32020 -63520 -57841 -43068 -24891 19417 -80611 -70254
5450 -70254 -48420 1124 43649 -39603 17858 -11928 42483 96893 28762 771 33660 17892
5438 17892 -28241 13135 -13325 -42802 -56424 16504 -34150 -52519 -7708 1252 -2290 30573
5426 30573 30770 58162 -11100 -76764 -76106 1965 53875 -47637 -93030 -64638 10281 -31906
5414 -31906 -48010 24648 64036 37249 11334 -9242 22750 -75694 -24388 -40022 -9058 -20528
5402 -20528 -22413 -24521 -150879 -96176 4636 4631 36760 -27856 25838 -19807 -555 -12519 -32901
5389 -32901 -38665 -39110 17896 44829 37182 16304 4819 -52108 -7681 -9972 65980 23505 5383
5376 5383 29118 17629 6396 20491 -9720 -40140 -48906 -35260 -20994 2462 -36843 -14207
$$ packed form
5462c2188O5962m3200L2693k7018L5771r5540N679J4773J8177M4308j00028J0357
5450g0254K1834M9544M2525q3252N7461k9786N4411N4410o8131k7991L2889j5768
5438A7892m6133M1376k6460k9477j3622P2928n0654j8369M4811Q960l542L2863
5426C0573J97K7392o9262o5664O58P8071N1910j01512m5393K8392P4919m2187
5414c1906j6104P2658L9388k6787k5915k0576L1992r8444N1306j5634L0964j1470
5402b0528j885k108j26358N4703J00812nL2129o4616N3694m5645J9252j1964k0382
5389c2901n764m45N7006K6933p647k0878j1485n6927M4427k291P5952m2475j8122
5376E383K3735j1489j1233J4095l0211l0420q766J3646J4266K3456l9305K2636
$$ plain form
5364 -14207 -20586 -15872 34982 49363 25127 22656 17648 33319 36388 -27520 -39527 -72222 -81878
5351 -81878 -39390 -8921 49897 32457 27860 100029 55656 59517 119892 91183 76439 40456
5339 40456 63608 -26849 19216 102126 61907 -13895 46390 86451 23495 11359 -27029 86775
5327 86775 79950 60874 38705 156556 108229 4997 103876 99355 50771 12048 -3425 -5690
5315 -5690 -44743 22161 12978 -4477 -12648 -14635 -9589 36104 14755 47269 82124 72652 44508
5302 44508 23429 78866 48076 47702 61644 -3741 35344 65029 -819 921 -10891 44167
5290 44167 60975 89181 16905 118358 111929 82315 47219 12546 56767 41020 101657 82205
5278 82205 114751 36634 27675 96895 133175 124099 51656 93412 50798 111297 82566 43042
$$ packed form
5364a4207o379M714N0854J4381k4236k471n008J5671L069o3908j2007l2695r656
5351h1878M2488L0469N8818j7440m597P2169m4373L861O0375k8709j4744l5983
5339D0456K3152r0457M6065Q2910m0219p5802O0285M0061o2956j2136l8388J13804
5327H6775o825j9076k2169J17851m8327j03232R8879m521m8584l8723j5473k265
5315e690l9053O6904r183j7455q171j987N046M5693k1349L2514L4855r472k8144
5302D4508k1079N5437l0790l74J3942o5385L9085K9685o5848J740j1812N5058
5290D4167J6808K8206p2276J01453o429k9614l5096l4673M4221j5747O0637j9452
5278H2205L2546p8117q959O9220L6280r076p2443M1756m2614O0499k8731l9524
$$ plain form
5266 43042 71087 130744 126819 182431 214686 171262 135077 118936 159083 60436 53851 140726
5254 140726 151469 180912 268017 261371 192507 209717 210356 297103 271849 248496 365849 450344
5242 450344 464983 418976 421117 383420 488779 452851 439863 388745 331840 338965 443899 487030
5230 487030 491670 599841 633590 610083 694353 726584 745795 708281 579293 556689 530176
5219 530176 490501 487835 492517 471281 392411 405814 413021 399718 466186 476522 435176 487412
5207 487412 560184 504719 429360 396890 360910 359773 322262 246513 273981 254373 228808 216946
5195 216946 229532 133813 114279 150156 190792 246825 182439 96266 124895 136135 172900 135929
5183 135929 127864 131138 133242 72205 103421 245189 111426 168226 104029 82138 112565 81492
$$ packed form
5266D3042K8045N9657l925N5612L2255m3424l6185j6141M0147r8647o585Q6875
5254A40726J0743K9443Q7105o646o8864J7210O39Q6747k5254k3353J17353Q4495
5242D50344J4639m6007K141l7697J05359l5928j2988n1118n6905P125J04934M3131
5230D87030M640J08171L3749k3507Q4270L2231J9211l7514j28988k2604k6513
5219E30176l9675k666M682k1236p8870J3403P207j3303O6468J0336m1346N2236
5207D87412P2772n5465p5359l2470l5980j137l7511p5749K7468j9608k5565j1862
5195B16946J2586r5719j9534L5877M0636N6033o4386q6173K8629J1240L6765l6971
5183A35929q065L274K104o1037L1216J41768j33763N6800o4197k1891L0427l1073
$$ plain form
5171 81492 107864 67877 82092 52846 68106 17817 36153 72183 69602 -3576 -30475 65895
5159 65895 42005 40016 48558 43758 -13988 74852 49467 35717 69606 59028 88499 19072
5147 19072 70208 53041 60269 19215 33727 31489 15845 15251 64456 52253 84169 58244 26476
5134 26476 22686 6405 21528 32943 44393 -25072 38566 -29901 -35537 50672 51540 36930 75644
5121 75644 76775 183648 112172 99035 92294 63126 137978 66920 1847 28560 69975 105004
5109 105004 73778 84472 80250 98407 67741 148378 102457 82405 61224 78692 113470 50226
5097 50226 95272 67150 60833 39482 35045 14536 47600 60503 104814 97340 143580 80927
5085 80927 21697 80186 47359 42226 196208 185136 158944 95300 92667 97449 80791 87052
$$ packed form
5171H1492K6372l9987J4215k9246J5260n0289J8336L6030k581p3178k6899R6370
5159F5895k3890j989Q542m800n7746Q8840k5385j3750L3889j0578K9471o9427
5147A9072N1136j7167P228m1054J4512k238j5644n94M9205j2203L1916k5925l1768
5134B6476l790j6281J5123J1415J1450o9465O3638o8467n636Q6209Q68j4610L8714
5121G5644J131J06873p1476j3137o741k9168P4852p1058o5073K6713M1415L5029
5109A05004l1226J0694m222J8157l0666Q0637m5921k0052k1181J7468L4778o3244
5097E0226M5046k8122o317k1351m437k0509L3064J2903M4311p474M6240o2653
5085H0927n9230N8489l2827n133J53982j1072k6192o3644k633M782j6658O261
$$ plain form
5073 87052 40219 45168 106682 87606 69774 39359 103311 62851 37553 60440 18387 73182
5061 73182 26276 65754 47447 19816 22001 50862 55117 35878 45365 80647 102373 57093
5049 57093 98417 153556 45519 72185 125126 64445 121584 47597 7646 45179 89471 -6177
5037 -6177 22683 7714 84138 51243 16768 54376 -4793 4075 17943 34307 81106 102294
5025 102294 60573 25654 22170 -8999 -33560 -21762 -12067 -17806 -24239 6883 -17907 37859
5013 37859 33952 77776 39919 20740 23854 12930 25942 16619 -74580 -33226 -3190 -17523
5001 -17523 27416 46217 -5139 -51306 -91397 -18381 -36492 -45954 -23211 29521 64076 69690
4989 69690 46547 13819 32404 4169 -21001 -1889 -6002 -8018 13627 9665 -49288 -10664
$$ packed form
5073H7052m6833M949O1514j9076j7832l0415O3952m0460k5298K2887m2053N4795
5061G3182m6906L9478j8307k7631K185K8861M255j9239R487L5282K1726m5280
5049E7093M1324N5139j08037K6666N2941o0681N7139p3987l9951L7533M4292r5648
5037f177K8860j4969P6424l2895l4475L7608n9169Q868J3868J6364M6799K1188
5025A02294m1721l4919l484l1169k4561J1798R695n739o433L1122k4790N5766
5013C7859l907M3824l7857j9179L114j0924J3012r323r1199M1354L0036j4333
5001a7523M4939J8801n1356m6167m0091P3016j8111r462K2743N2732L4555N614
4989F9690k3143l2728J8585k8235k5170J9112m113k016K1645l962n8953L8624
$$ plain form
4977 -10664 37882 27745 17695 -18590 -16408 -34597 -25771 33177 66579 36803 -1672 3580
4965 3580 85388 238 257 -9492 -3627 -13537 -39504 -1715 -43804 45158 -19607 -57986 -5859
4952 -5859 23919 -2608 33668 7309 -9178 64038 54568 23344 24014 -14716 -9877 9600 67554
4939 67554 49064 22112 41655 60255 17442 -11583 11810 49967 54872 43618 17977 50730
4927 50730 15122 29854 75955 -6670 45861 65668 44384 4962 22712 -5382 27198 54885
4915 54885 97256 4129 80515 84917 93927 71327 32859 -14407 25518 -4724 55139 83105
4903 83105 52586 74544 41484 63830 13011 22698 53088 68346 82004 122659 96008 71148
4891 71148 50963 12316 4073 -1841 31115 97334 85189 71369 -12542 70441 112602 83158
$$ packed form
4977a0664M8546j0137j0050l6285K182j8189Q826N8948L3402k9776l8475N252
4965C580Q1808q5150J9r749N865r910k5967L7789m2089Q8962o4765l8379N2127
4952e859K9778k6527L6276k6359j6487P3216r470l1224O70l8730M839J9477N7954
4939F7554j8490k6952J9543J8600m2813k9025K3393L8157M905j1254k5641L2753
4927E0730l5608J4732M6101q2625N2531J9807k1284l9422J7750k8094L2580K7687
4915E4885M2371r3127P6386M402R010k2600l8468m7266L9925l0242N9863K7966
4903H3105l0519K1958l3060K2346n0819R687L0390J5258J3658M0655k6651k4860
4891G1148k0185l8647q243n914L2956O6219j2145j3820q3911Q2983M2161k9444
$$ plain form
4879 83158 91448 87983 64691 97540 86965 5460 21878 86304 36608 45481 63395 71241 9392
4866 9392 -40202 23042 72166 39717 20935 42330 -2819 5172 38636 86519 106505 45800
4854 45800 -14414 35344 6445 40444 49997 72386 83781 35350 53708 41875 44125 53352
4842 53352 70407 12304 20067 38091 25421 62402 83706 41897 115503 116329 7137 113843
4830 113843 90685 85781 43184 22032 57152 50222 44948 41307 25347 14895 -19824 -50493
4818 -50493 27463 19782 79884 133364 56667 69237 100848 44347 41188 82634 61798 70510
4806 70510 36148 69103 74291 4237 11972 101228 137767 73142 31687 30148 17118 -63439
4794 -63439 -36158 37626 46452 78455 31315 23004 29949 19562 16014 64557 27516 65454 121163
$$ packed form
4879H3158Q290l465k3292L2849j0575q1505J6418O4426m9696Q873J7914P846o1849
4866I392m9594O3244M9124l2449j8782K1395m5149P991L3464M7883J9986o0705
4854D5800o0214M9758k8899L3999R553K2389J1395m8431J8358j1833K250R227
4842E3352J7055n8103P763J8024j2670L6981K1304m1809P3606Q26j09192J06706
4830A13843k3158m904m2597k1152L5120o930n274l641j5960j0452l4719l0669
4818e0493P7956p681O0102N3480p6697J2570L1611n6501l159M1446k0836Q712
4806G0510l4362L2955N188p0054P735Q9256L6539o4625m1455j539j3030q0557
4794f3439K7281P3784Q826L2003m7140q311O945j0387l548M8543l7041L7938N5709
$$ plain form
4781 121163 82474 59973 45133 40223 85401 30673 56418 66806 59875 98722 122895 86420
4769 86420 46195 145860 90972 57306 55657 84622 122905 98288 65128 107323 42231 124799
4757 124799 142253 121350 138771 146711 122054 130724 148733 101785 60253 38898 68002 65351
4745 65351 58533 121332 162138 147306 96609 130718 162830 226730 221803 163145 187557 203741
4733 203741 175753 200691 246698 261018 222388 214730 290758 272122 288173 295023 280056 355848
4721 355848 425238 505472 507197 567378 521965 529111 610307 567239 545842 563344 612401 599917
4709 599917 579633 608782 596170 593085 635868 669686 698697 716124 799467 831468 911614 905240
4697 905240 877833 918587 867566 833804 858058 858149 691187 638704 624034 655651 659787 634998
$$ packed form
4781A21163l8689k2501j4840m910M5178n4728K5745J0388o931L8847K4173l6475
4769H6420m0225R9665n4888l3666j649K8965L8283k4617l3160M2195o5092Q2568
4757A24799J7454k0903J7421P940k4657Q670J8009m6948m1532k1355K9104k651
4745F5351o818O2799M0806j4832n0697L4109L2112O3900m927n8658K4412J6184
4733B03741k7988K4938M6007J4320l8630p658P6028j8636J6051O850j4967P5792
4721C55848O9390Q0234J725O0181m5413P146Q1196m3068k1397J7502M9057j2484
4709E99917k0284K9149j2612l085M2783L3818K9011J7427Q3343L2001Q0146o374
4697I05240k7407M0754n1021l3762K4254R1j66962n2483j4670L1617M136k4789
$$ plain form
4685 634998 661652 616478 603678 610834 631158 587057 567467 551091 592862 526760 517619 502619
4673 502619 494503 422881 433480 538155 461625 469355 433331 388416 402061 421359 414394 413148
4661 413148 392406 360545 368216 398528 383333 390376 386424 371206 402861 389877 330635 306757
4649 306757 393599 359722 367441 354853 415041 433974 367155 349408 358346 348902 365336 313210
4637 313210 327603 414677 423288 420526 397984 399695 408515 442554 441921 506712 425498 389691 403199
4624 403199 375985 356990 418010 395605 488276 524997 473203 508802 512189 498162 420899 488086
4612 488086 465186 434699 480759 434062 556016 552767 594513 637735 597260 660514 661530 672942
4600 672942 744023 727666 738611 701563 664596 741574 724235 687152 715050 640738 651761 803862
$$ packed form
4685F34998K6654m5174j2800P156K0324m4101j9590j6376M1771o6102r141j5000
4673E02619q116p1622J0599J04675p6530P730l6024m4915J3645J9298o965j246
4661D13148k0742l1861P671L0312j5195P043l952j5218L1655j2984n9242k3878
4649C06757Q6842l3877P719j2588O0188J8933o6819j7747Q938r444J6434n2126
4637C13210J4393Q7074Q611k762k2542J711Q820L4039o33O4791q1214l5807J3508
4624D03199k7214j8995O1020k2405R2671L6721n1794L5599L387j4027p7263O7187
4612D88086k2900l0487M6060m6697J21954l249M1746M3222m0475O3254J016J1412
4600F72942P1081j6357J0945l7048l6967P6978j7339l7083K7898p4312J1023J52101
$$ plain form
4588 803862 831795 840516 763906 758510 774972 827905 811386 848826 825910 858935 919984 929023
4576 929023 873643 863455 876937 847292 878478 951347 916208 943198 961858 997703 1001864 1001887
4564 1001887 1063698 1122497 1119530 1125462 1101612 1144253 1181351 1198076 1236100 1353819 1312730 1272790
4552 1272790 1403079 1501197 1564185 1494739 1421060 1426933 1486738 1383021 1401338 1405767 1331760
4541 1331760 1327765 1284939 1336862 1416162 1458328 1545192 1588048 1581530 1553768 1486544 1438157 1418270
4529 1418270 1358718 1363050 1384970 1415920 1418048 1343982 1405941 1377968 1520293 1580666 1596369 1627240
4517 1627240 1623099 1670614 1658210 1656674 1678822 1699803 1659565 1614447 1556347 1528516 1572235 1564563
4505 1564563 1553624 1643518 1669693 1704970 1713766 1722263 1757668 1797811 1854799 1877971 1850562 1935142
$$ packed form
4588H03862K7933Q721p6610n396J6462N2933j6519L7440k2916L3025O1049R039
4576I29023n5380j0188J3482k9645L1186P2869l5139K6990J8660L5845M161K3
4564A001887O1811N8799k967N932k3850M2641L7098J6725L8024J17719m1089l9940
4552A272790J30289R8118O2988o9446p3679N873N9805j03717J8317M429p4007
4541A331760l995m2826N1923P9300M2166Q6864M2856o518k7762o7224m8387j9887
4529A418270n9552M332K1920L0950K128p4066O1959k7973J42325O0373J5703L0871
4517A627240m141M7515j2404j536K2148K0981m0238m5118n8100k7831M3719p672
4505A564563j0939Q9894K6175L5277Q796Q497L5405M0143N6988K3172k7409Q4580
$$ plain form
4493 1935142 1911940 1935392 1952300 1997925 2062607 2166427 2174693 2175092 2105403 2121538 2144423 2194728
4481 2194728 2135428 2177596 2230924 2213031 2295365 2319964 2334614 2433361 2546431 2652934 2664639
4470 2664639 2733249 2824316 2892422 2971726 3023778 3080812 3164898 3214203 3356305 3431036 3508720
4459 3508720 3529001 3576184 3665138 3772655 3888247 4011237 4193283 4374747 4522892 4684175
4449 4684175 4940730 5257506 5557577 5897169 6159540 6490344 6883957 7386051 7900053 8506638
4439 8506638 9195361 10021912 11003455 11932310 12625425 13377495 14102521 14906750 15839956 16507815
4429 16507815 16981581 17499783 18219588 19118621 19993264 21109549 22339583 23601604 25108081
4420 25108081 26724519 28568121 30633633 32884145 35474884 38496849 41908738 45729895
$$ packed form
4493A935142k3202K3452J6908M5625O4682J03820Q266L99o9689J6135K2885N0305
4481B194728n9300M2168N3328j7893Q2334K4599J4650R8747J13070J06503J1705
4470B664639O8610R1067O8106P9304N2052N7034Q4086M9305J42102P4731P7684
4459C508720K0281M7183Q8954J07517J15592J22990J82046J81464J48145J61283
4449D684175K56555L16776L00071L39592K62371L30804L93613N02094N14002O06585
4439H506638O88723Q26551R81543R28855O93115P52070P25026Q04229R33206O67859
4429A6507815M73766N18202P19805Q99033Q74643J116285J230034J262021J506477
4420B5108081J616438J843602K065512K250512K590739L021965L411889L821157
$$ plain form
4412 45729895 49891946 54787832 60749612 67804296 76445681 86525450 98350469 113114440
4404 113114440 132265638 157992322 194100095 243859162 306448462 358441321 353250584
4397 353250584 301139490 245166886 199808773 165690016 139571048 119160797 102687258
4390 102687258 88545303 77178590 68377660 61323451 55516272 50439442 45853832 41677819
4382 41677819 38105478 35004941 32459320 30043008 27929165 26011372 24305730 22792319
4374 22792319 21365973 20138010 19093371 18060424 17059536 16184968 15416358 14684513 14064342
4365 14064342 13451269 12815016 12200649 11705123 11156332 10627949 10082873 9527844 8988748
4356 8988748 8591987 8180063 7773578 7406613 7082401 6733668 6515163 6237607 5992802 5766212
$$ packed form
4412D5729895M162051M895886N961780P054684Q641385J0079769J1825019J4763971
4404A13114440J9151198K5726684L6107773M9759067O2589300N1992859n190737
4397C53250584n2111094n5972604m5358113l4118757k6118968k0410251j6473539
4390A02687258j4141955j1366713q800930p054209n807179n076830m585610m176013
4382D1677819l572341l100537k545621k416312k113843j917793j705642j513411
4374B2792319j426346j227963j044639j032947j000888q74568p68610p31845o20171
4365A4064342o13073o36253o14367m95526n48791n28383n45076n55029n39096
4356H988748l96761m11924m06485l66965l24212l48733k18505k77556k44805k26590
$$ plain form
4346 5766212 5582070 5301388 5100827 4862479 4689481 4544688 4408951 4223769 4070029 3881017
4336 3881017 3721021 3538217 3416193 3301227 3185716 3098636 2996941 2953160 2884354 2794381
4326 2794381 2734002 2625691 2594864 2489537 2449082 2330953 2360896 2346735 2205662 2190025 2183650
4315 2183650 2093964 2004991 1867030 1732122 1774645 1657300 1669634 1621129 1552943 1405572 1425238
4304 1425238 1397603 1335446 1291057 1344511 1361225 1308492 1240284 1197522 1159711 1217796 1229879
4293 1229879 1227961 1204998 1206247 1137021 1083321 1044556 876239 859155 808966 795612 790395 840598
4281 840598 764532 847535 867280 759980 786999 797743 867503 885538 942988 926575 970977
4270 970977 966311 873856 862478 761621 745839 730248 709343 750366 733504 659245 670290 841045
$$ packed form
4346E766212j84142k80682k00561k38348j72998j44793j35737j85182j53740j89012
4336C881017j59996j82804j22024j14966j15511q7080j01695m3781o8806q9973
4326B794381o0379j08311l0827j05327m0455j18129K9943j4161j41073j5637o375
4315B183650q9686q8973j37961j34908M2523j17345J2334m8505o8186j47371J9666
4304A425238k7635o2157m4389N3454J6714n2733o8208m2762l7811N8085J2083
4293A229879j918k2963J249o9226n3700l8765j68317j7084n0189j3354n217N0203
4281H40598p6066Q3003J9745j07300K7019J0744O9760J8035N7450j6413M4402
4270I70977m666r2455j1378j00857j5782j5591k0905M1023j6862p4259J1045J70755
$$ plain form
4258 841045 740253 741294 692639 653941 708569 655557 669155 630448 658375 658948 588586 552120
4246 552120 549515 628004 634802 589664 652509 606629 621873 600533 574575 550998 620749 584538
4234 584538 537298 608215 586007 550189 540406 471602 476109 486075 507526 523910 570831 512322
4222 512322 447188 377515 409937 445982 458243 355436 343139 327752 353382 403157 386237
4211 386237 331051 305871 310183 277460 344533 365869 351549 307465 338364 284114 291621 333062
4199 333062 292945 265188 272453 294968 305143 232145 242676 217227 207243 239098 309215 352895
4187 352895 321649 214318 193710 266522 294334 303713 332691 308124 271226 252871 301986 273775
4175 273775 304239 283611 322119 242051 253506 315076 298992 284566 374454 268318 186078
$$ packed form
4258H41045j00792J041m8655l8698N4628n3012J3598l8707K7927N73p0362l6466
4246E52120k605P8489O798m5138O2845m5880J5244k1340k5958k3577O9751l6211
4234E84538m7240P0917k2208l5818r783o8804M507R966K1451J6384M6921n8509
4222E12322o5134o9673L2422L6045J2261j02807j2297j5387K5630M9775j6920
4211C86237n5186k5180M312l2723O7073K1336j4320m4084L0899n4250P507M1441
4199C33062m0117k7757P265K2515J0175p2998J0531k5449r984L1855P0117M3680
4187C52895l1246j07331k0608P2812K7812R379K8978k4567l6898j8355M9115k8211
4175B73775L0464k0628L8508q0068J1455O1570j6084j4426Q9888j06136q2240
$$ plain form
4164 186078 278365 214029 208694 269666 301557 315501 283594 254556 301763 217316 271493 283236
4152 283236 296371 270254 231895 299960 184526 232809 221543 240220 236157 266750 274829 179838
4140 179838 262965 231085 190180 234421 195199 229669 295943 283877 251983 240400 228182 169984
4128 169984 168307 107328 167173 163329 155817 114930 195832 230747 222222 276545 212233 177806
4116 177806 231707 211820 214980 160231 183823 237842 203844 180713 118688 175780 258424 237091
4104 237091 202062 201675 169486 181181 212320 198832 191888 199367 206396 211500 247110 153806 161297
4091 161297 131651 78425 153685 173286 180990 208610 231121 209120 141046 217133 177267 225071
4079 225071 236698 252087 269236 196666 253226 240910 207117 183208 239878 208431 231157 249522
$$ packed form
4164A86078R2287o4336n335O0972L1891J3944l1907k9038M7207q4447N4177J1743
4152B83236J3135k6117l8359O8065j15434M8283j1266J8677m063L0593Q079r4991
4140A79838Q3127l1880m0905M4241l9222L4470O6274j2066l1894j1583j2218n8198
4128A69984j677o0979N9845l844p512m0887Q0902L4915q525N4323o4312l4427
4116A77806N3901j9887L160n4749K3592N4019l3998k3131o2025N7092Q2644k1333
4104B37091l5029l87l2189J1695L1139j3488o944P479P029N104L5610r3304P491
4091A61297k9646n3226P5260J9601P704K7620K2511k2001o8074P6087l9866M7804
4079B25071J1627J5389J7149p2570N6560j2316l3793k3909N6670l1447K2726J8365
$$ plain form
4067 249522 248219 161499 137881 200839 228675 244782 243216 213790 210574 209989 212074 185052 162863
4054 162863 181425 266732 227310 284890 301580 222443 191378 222101 277309 248164 275725 279204
4042 279204 160947 165770 174144 252441 190838 228610 265608 256688 323944 312854 301758 291105
4030 291105 345034 367713 308055 286037 326396 412022 435405 320046 367113 345005 331359
4019 331359 305479 405100 340378 357434 399016 420219 434819 458183 391146 361988 424053 441308
4007 441308 353678 347042 357844 328945 376978 467747 435196 443019 537319 472127 522514 439776
3995 439776 478228 466612 405669 395342 490846 499085 527979 512283 476011 428259 486552 500014
3983 500014 593970 540660 566473 565878 627850 642164 587671 615515 574122 663331 662486 697812
$$ packed form
4067B49522j303q6720k3618O2958K7836J6107j566k9426l216n85K085k7022k2189
4054A62863J8562Q5307l9422N7580J6690p9137l1065L0723N5208k9145K7561L479
4042B79204j18257M823Q374P8297o1603L7772L6998q920O7256j1090j1096j0653
4030B91105N3929K2679n9658k2018M0359Q5626K3383j15359M7067k2108j3646
4019C31359k5880R9621o4722J7056M1582K1203J4600K3364o7037k9158O2065J7255
4007D41308q7630o636J0802k8899M8033R0769l2551P823R4300o5192N0387q2738
3995D39776L8452j1616o0943j0327R5504Q239K8894j5696l6272m7752N8293J3462
3983E00014R3956n3310K5813n95O1972J4314n4493K7844m1393Q9209q45L5326
$$ plain form
3971 697812 595388 572480 555470 614527 614331 553223 576727 599606 572987 569851 661993 704437
3959 704437 555448 573018 638349 612438 608438 673282 529417 558275 625431 574643 590157
3948 590157 652943 533159 562845 505204 467370 507285 523437 473060 455452 434665 419299
3937 419299 505617 409916 383791 388351 379982 415617 394260 342407 317760 420613 365485 337101
3925 337101 342121 432100 449150 385836 359933 316007 318913 343932 384277 384518 397617 331153
3913 331153 333283 252050 255403 280271 310037 298017 365689 263298 242694 305209 305037 331806
3901 331806 360945 337432 297033 354432 374127 350716 358764 388408 417909 323726 340314 396624
3889 396624 391851 326985 367150 406506 391848 345533 388886 400218 483013 460402 454409 408068
$$ packed form
3971F97812j02424k2908j7010N9057j96o1108K3504K2879k6619l136R2142M2444
3959G04437j48989J7570O5331k5911m000O4844j43865K8858O7156n0788J5514
3948E90157O2786j19784K9686n7641l7834L9915J6152n0377j7608k0787j5366
3937D19299Q6318r5701k6125M560q369L5635k1357n1853k4647J02853n5128k8384
3925C37101N020Q9979J7050o3314k5903m3926K906K5019M0345K41J3099o6464
3913C31153K130q1233L353K4868K9766j2020O7672j02391k0604O2515j72K6769
3901C31806K9139k3513m0399N7399J9695k3411Q048K9644K9501r4183J6588N6310
3889C96624m773o4866M0165L9356j4658m6315M3353J1332Q2795k2611n993m6341
$$ plain form
3877 408068 389067 412911 417365 361055 346754 356902 397353 430599 413202 462917 485866 491986
3865 491986 530922 536336 508439 570102 542200 573679 623435 573696 539402 544993 584608 557116
3853 557116 541534 615125 636263 603451 685681 720707 689636 700338 762330 775166 696762 734753
3841 734753 796829 883080 863660 957833 984915 1009013 1106226 1227162 1193654 1336782 1473964
3830 1473964 1502257 1595189 1676813 1753163 1895937 2004864 2132321 2213599 2382189 2524744
3820 2524744 2698421 2795529 2962250 3086749 3308394 3572835 3783340 4019820 4304995 4672693
3810 4672693 5005787 5389750 5888490 6497073 7133243 7886237 8904139 10156555 11601103
3801 11601103 13187792 14615510 15757574 16805644 18102117 19890965 22114130 24029153
$$ packed form
3877D08068j9001K3844M454n6310j4301J0148M0451L3246j7397M9715K2949O120
3865D91986L8936N414k7897O1663k7902L1479M9756m9739l4294N591L9615k7492
3853E57116j5582P3591K1138l2812Q2230L5026l1071J0702O1992J2836p8404L7991
3841G34753O2076Q6251j9420R4173K7082K4098R7213J20936l3508J43128J37182
3830A473964K8293R2932Q1624P6350J42774J08927J27457Q1278J68590J42555
3820B524744J73677R7108J66721J24499K21645K64441K10505K36480K85175L67698
3810D672693L33094L83963M98740O08583O36170P52994J017902J252416J444548
3801A1601103J586689J427718J142064J048070J296473J788848K223165J915023
$$ plain form
3793 24029153 25267077 25697767 26169929 27121198 28677212 30221692 30805644 29967464 28458586
3784 28458586 27257485 26739909 26428350 25721306 24222912 22087530 20198050 18690691 17464956
3775 17464956 16277218 14895480 13212298 11600075 10198654 9055197 8048133 7210790
3767 7210790 6500124 5835292 5339996 4899868 4584689 4241931 3926365 3738855 3509713 3220842
3757 3220842 3078752 2893587 2712226 2620540 2409576 2311646 2185447 2069200 2022907 1801683
3747 1801683 1786566 1745888 1694053 1584959 1507317 1442788 1454575 1427004 1303740 1246299 1232652
3736 1232652 1115941 1018396 1019065 929202 862523 885197 885041 879556 804498 816977 768780 692640
3724 692640 686687 678561 712135 673533 640127 577278 625721 498670 554611 559577 457996 498618
$$ packed form
3793B4029153J237924M30690M72162R51269J556014J544480N83952q38180j508878
3784B8458586j201101n17576l11559p07044j498394k135382j889480j507359j225735
3775A7464956j187738j381738j683182j612223j401421j143457j007064q37343
3767G210790p10666o64832m95296m40128l15179l42758l15566j87510k29142k88871
3757C220842j42090j85165j81361r1686k10964r7930j26199j16247m6293k21224
3747A801683j5117m0678n1835j09094p7642o4529J1787k7571j23264n7441j3647
3736A232652j16711r7545O69q9863o6679K2674j56n485p5058J2479m8197p6140
3724F92640n953q126L3574l8602l3406o2849M8443j27051N5941M966j01581M0622
$$ plain form
3712 498618 581645 555438 438533 399701 446823 468676 415925 417998 338353 401747 450942 430230
3700 430230 406028 388973 327360 321048 297760 291476 328171 220749 203273 295519 346605 297983
3688 297983 379514 367984 283718 248207 329567 263171 287444 182133 217777 284374 245455
3677 245455 241168 197300 282728 274029 208986 168658 182234 208916 245743 181037 167556 284268
3665 284268 259563 264917 253225 237004 247420 314175 269093 271001 302838 257343 268931 281861
3653 281861 229128 241201 196045 183637 249657 248664 229863 222792 274572 322460 305569 232623
3641 232623 279523 346211 295465 257031 255896 215929 220497 245510 235645 215150 195856 193914
3629 193914 213533 170076 258650 247970 242572 233458 211299 157130 167182 189689 207623 286980
$$ packed form
3712D98618Q3027k6207j16905l8832M7122K1853n2751K073p9645O3394M9195k0712
3700D30230k4202j7055o1613o312k3288o284L6695j07422j7476R2246N1086m8622
3688B97983Q1531j1530q4266l5511Q1360o6396K4273j05311L5644O6597l8919
3677B45455m287m3868Q5428q699o5043m0328J3576K6682L6827o4706j3481J16712
3665B84268k4705N354j1692j6221J0416O6755m5082J908L1837m5495J1588J2930
3653B81861n2733J2073m5156j2408O6020r93j8801p071N1780M7888j6891p2946
3641B32623M6900O6688n0746l8434j135l9967M568K5013r865k0495j9294j942
3629A93914J9619m3457Q8574j0680n398r114k2159n4169J0052K2507J7934P9357
$$ plain form
3617 286980 271903 239843 258305 341782 316892 317082 346398 309222 376296 379501 410297 351825
3605 351825 372067 368491 310390 335060 358364 389303 390539 385759 341833 341142 366313 322907 355406
3592 355406 424610 440350 505861 601606 661289 667612 626130 598275 644829 661327 743357 720199
3580 720199 704714 830037 926365 1044079 1113532 1255891 1321834 1281901 1378671 1523109 1585963
3569 1585963 1769062 1870474 1907238 2153399 2282400 2548559 2768142 2896476 3023438 3216858
3559 3216858 3418814 3528352 3739767 3990268 4285341 4502314 4695655 4893924 5068562 5171977
3549 5171977 5314931 5339021 5424097 5536855 5695836 5803461 5970854 6160674 6202985 6207093
3539 6207093 6135533 5987695 5918525 5871786 5705614 5563965 5548818 5512065 5386690 5240613
$$ packed form
3617B86980j5077l2060J8462Q3477k4890J90K9316l7176O7074L205L0796n8472
3605C51825K0242l576n8101K4670K3304L0939J236m780m3926o91K5171m3406L2499
3592C55406O9204J5740O5511R5745N9683O323m1482k7855M6554J6498Q2030k3158
3580G20199j5485J25323R6328J17714O9453J42359O5943l9933R6770J44438O2854
3569A585963J83099J01412L6764K46161J29001K66159K19583J28334J26962J93420
3559C216858K01956J09538K11415K50501K95073K16973J93341J98269J74638J03415
3549E171977J42954K4090Q5076J12758J58981J07625J67393J89820M2311M108
3539F207093p1560j47838o9170m6739j66172j41649j5147l6753j25375j46077
$$ plain form
3529 5240613 5046183 4873624 4666949 4371273 4140402 3943082 3816971 3663717 3487774 3301510
3519 3301510 3202699 3020533 2814108 2660577 2444708 2309848 2201691 2156555 2057847 1994906
3509 1994906 1953211 1905092 1861215 1848469 1862412 1972554 2256041 2536731 2623274 2334628 2014950
3498 2014950 1806858 1672355 1420756 1196430 1149889 1015288 950575 909961 854475 758581
3488 758581 769310 708634 645012 623616 584249 577974 628902 586176 492516 397271 419260 417084
3476 417084 401583 431690 409385 430078 387717 319168 297075 296205 342785 291710 342963 320358
3464 320358 374217 363049 342585 263968 213594 299365 288950 256246 130210 131245 183577 219075
3452 219075 115367 117450 201064 228874 297568 208129 244818 236431 244460 262243 251825 215463
$$ packed form
3529E240613j94430j72559k06675k95676k30871j97320j26111j53254j75943j86264
3519C301510r8811j82166k06425j53531k15869j34860j08157m5136r8708o2941
3509A994906m1695m8119m3877j2746J3943J10142K83487K80690Q6543k88646l19678
3498B014950k08092j34503k51599k24326m6541j34601o4713m0614n5486r5894
3488G58581J0729o0676o3622k1396l9367o275N0928m2726r3660r5245K1989k176
3476D17084j5501L0107k2305K0693m2361o8549k2093q70M6580n1075N1253k2605
3464C20358N3859j1168k0464p8617n0374Q5771j0415l2704j26036J035N2332L5498
3452B19075j03708K083Q3614K7810O8694q9439L6689q387Q029J7783j0418l6362
$$ plain form
3440 215463 255765 225849 185145 188431 196245 255801 228183 121166 108520 226542 230806 225387
3428 225387 206670 184354 208966 254841 221975 233287 245319 248531 239041 158144 171003 260387
3416 260387 211846 226192 130791 170981 210030 231668 237392 228790 205335 176628 271563 244922
3404 244922 199032 223785 190240 182569 100744 151296 124414 135963 192212 193122 212291 187003
3392 187003 226986 255858 233281 178066 169620 118245 144572 147714 159407 185873 176309 136350
3380 136350 134272 138697 186382 152714 223428 147621 97942 94046 146160 202657 223547 184754
3368 184754 198000 246047 160504 127747 184312 223873 258170 294009 302174 271316 257574 265651
3356 265651 235191 265694 269876 360658 337715 317748 303296 347510 336507 321515 332403 250878
$$ packed form
3440B15463M0302k9916m0704L286P814N9556k7618j07017j2646J18022M264n419
3428B25387j8717k2316K4612M5875l2866J1312J2032L212r490q0897J2859Q9384
3416B60387m8541J4346r5401M0190L9049K1638N724q602k3455k8707R4935k6641
3404B44922m5890K4753l3545p671q1825N0552k6882J1549N6249R10J9169k5288
3392A87003L9983K8872k2577n5215q446n1375K6327L142J1693K6466r564l9959
3380A36350k078M425M7685l3668P0714p5807m9679l896N2114N6497K0890l8793
3368A84754J3246M8047q5543l2757N6565L9561L4297L5839Q165l0858j3742Q077
3356B65651l0460L0503M182R0782k2943j9967j4452M4214j1003j4992J0888q1525
$$ plain form
3344 250878 267974 279048 295713 274392 307121 334870 294779 259984 286366 306526 273815 348752
3332 348752 348639 280179 315096 351004 302521 311446 324260 267129 276939 379629 365310 393262
3320 393262 371719 306794 326440 416709 370567 322516 321042 302525 285872 325711 372232 358521
3308 358521 356697 380869 423920 407549 401700 416785 420469 377773 413677 471983 413021 528333
3296 528333 488509 420960 468477 506693 505468 523320 482022 508420 551960 545004 560036 581780
3284 581780 525023 502478 519941 519511 569844 564669 518250 629092 526524 566753 653792 660423
3272 660423 621637 589693 566899 574908 617024 655219 703223 666097 676747 677299 611686 643709
3260 643709 700429 645273 709201 717420 797617 816293 778514 796897 883070 854106 853720 855638
$$ packed form
3344B50878J7096J1074J6665k1321L2729K7749m0091l4795K6382K0160l2711P4937
3332C48752j13o8460L4917L5908m8483Q925J2814n7131R810J02690j4319K7952
3320C93262k1543o4925J9646R0269m6142m8051j474j8517j6653L9839M6521j3711
3308C58521j824K4172M3051j6371n849J5085L684m2696L5904N8306n8962J15312
3296E28333l9824o7549M7517L8216j225J7852m1298K6398M3540o956J5032K1744
3284E81780n6757k2545J7463m30N0333n175m6419J10842j02568M0229Q7039O631
3272F60423l8786l1944k2794Q009M2116L8195M8004l7126J0650N52o5613L2023
3260F43709N6720n5156O3928Q219Q0197J8676l7779J8383Q6173k8964l86J918
$$ plain form
3248 855638 922569 968379 1018148 989670 1038995 1066884 1140632 1181992 1264896 1284902 1271696 1351158
3236 1351158 1506886 1651474 1630942 1666388 1763793 1762818 1782397 1967419 2072497 2135789 2335008
3225 2335008 2434124 2540375 2679281 2794886 2963838 3143105 3324743 3524731 3751471 3951926
3215 3951926 4255396 4696247 5041219 5511495 5926793 6486637 7146828 7928059 8786430 9648129
3205 9648129 10690689 11663577 12624301 13493810 14126775 14642117 14919845 15037136 15070283 15043613
3195 15043613 15025541 15019852 15008758 15033325 14937876 14771426 14382051 13811649 13036033 12213997
3185 12213997 11369930 10457058 9618476 8782861 8066590 7521833 6961060 6403558 5953150
3176 5953150 5552112 5241018 4988734 4751037 4422032 4159736 3979950 3774409 3576273 3485081
$$ packed form
3248H55638O6931M5810M9769k8478M9325K7889P3748M1360Q2904K0006j3206P9462
3236A351158J55728J44588k0532L5446R7405r75J9579J85022J05078O3292J99219
3225B335008R9116J06251J38906J15605J68952J79267J81638J99988K26740K00455
3215C951926L03470M40851L44972M70276M15298N59844O60191P81231Q58371Q61699
3205I648129J042560R72888R60724Q69509O32965N15342K77728J17291L3147k6670
3195A5043613j8072n689j1094K4567r5449j66450l89375n70402p75616q22036
3185A2213997q44067r12872q38582q35615p16271n44757n60773n57502m50408
3176E953150m01038l11094k52284k37697l29005k62296j79786k05541j98136r1192
$$ plain form
3166 3485081 3333421 3207492 3080957 2937224 2833479 2680448 2549950 2556063 2546701 2430778
3156 2430778 2313008 2259846 2200404 2119778 2143246 2051586 1942479 1887648 1827403 1849023 1779843
3145 1779843 1835595 1818621 1775614 1760557 1804695 1756768 1777868 1700936 1630681 1620119 1585986
3134 1585986 1696835 1690402 1668157 1676174 1718686 1681411 1678945 1754203 1772201 1846083 1876655 1926336
3122 1926336 1971159 2021444 2059023 2194921 2276198 2400874 2553346 2649339 2833006 3105698
3112 3105698 3325044 3558387 3739668 4009978 4286658 4407246 4537296 4595337 4661739 4716881
3102 4716881 4608107 4610554 4546577 4483117 4466836 4466274 4468521 4545779 4614187 4694114 4808030 4927892
3090 4927892 5098808 5264960 5462644 5625357 5899441 6202980 6544226 6951182 7370834 7761088
$$ packed form
3166C485081j51660j25929j26535j43733j03745j53031j30498O113r362j15923
3156B430778j17770n3162n9442q0626K3468r1660j09107n4831o0245K1620o9180
3145A779843N5752j6974m3007j5057M4138m7927K1100p6932p0255j0562l4133
3134A585986J10849o433k2245Q017M2512l7275k466P5258J7998P3882L0572M9681
3122A926336M4823N0285L7579J35898Q1277J24676J52472R5993J83667K72692
3112C105698K19346K33343J81281K70310K76680J20588J30050N8041O6402N5142
3102D716881j08774K447o3977o3460j6281n62K247P7258O8408P9927J13916J19862
3090D927892J70916J66152J97684J62713K74084L03539L41246M06956M19652L90254
$$ plain form
3080 7761088 8392805 9001838 9733988 10618065 11549740 12674293 13961588 15346820 16827136
3071 16827136 18401014 19984641 21430014 22544350 23661117 24594771 25074473 25380993 25642903
3062 25642903 25678724 25680954 25604760 25500521 25399662 25166366 24935391 24530503 23854562 23089426
3052 23089426 22141461 21019482 19717216 18279353 17034875 15841951 14633627 13512527
3044 13512527 12495041 11497617 10764854 10089036 9420000 8830593 8423326 7935634 7536398
3035 7536398 7199545 6895755 6602724 6376546 6186735 5949657 5768477 5575152 5462344 5299757
3025 5299757 5250206 5180324 5163541 5176679 5213480 5265317 5295777 5305303 5467018 5562312 5574519
3014 5574519 5553099 5507385 5451757 5259229 5140520 4927348 4723298 4638911 4453905 4359912
$$ packed form
3080G761088O31717O09033P32150Q84077R31675J124553J287295J385232J480316
3071A6827136J573878J583627J445373J114336J116767R33654M79702L06520K61910
3062B5642903L5821K230p6194j04239j00859k33296k30975m04888o75941p65136
3052B3089426r47965j121979j302266j437863j244478j192924j208324j121100
3044A3512527j017486r97424p32763o75818o69036n89407m07267m87692l99236
3035G536398l36853l03790k93031k26178j89811k37078j81180j93325j12808j62587
3025E299757m9551o9882j6783J3138L6801N1837L0460R526J61715R5294J2207
3014E574519k1420m5714n5628j92528j18709k13172k04050q4387j85006r3993
$$ plain form
3004 4359912 4340635 4249213 4215828 4171438 4155290 4121940 4195376 4199995 4277469 4345370 4413139 4569089
2992 4569089 4585562 4586415 4800798 4957818 5160716 5263430 5390397 5687460 5839197 6076771
2982 6076771 6378964 6680115 7014763 7324179 7781379 8263582 8790816 9467012 10063548 10773443
2972 10773443 11728236 12705257 13827870 15161609 16492705 18094752 19981597 21877384
2964 21877384 23856034 25654916 27368812 28650580 29462796 30070770 30324943 30386185 30399379
2955 30399379 30436079 30476379 30479032 30315582 29927398 29242976 28088917 26700576 25068005 23263424
2945 23263424 21466652 19636862 17936010 16399149 15058555 13844598 12733989 11815797
2937 11815797 10908103 10194150 9588406 8837899 8263988 7723261 7320155 6827273 6469358
$$ packed form
3004D359912j9277r1422l3385m4390j6148l3350P3436M619P7474O7901O7769J55950
2992D569089J6473Q53K14383J57020K02898J02714J26967K97063J51737K37574
2982F076771L02193L01151L34648L09416M57200M82203N27234O76196N96536P09895
2972A0773443R54793R77021J122613J333739J331096J602047J886845J895787
2964B1877384J978650J798882J713896J281768Q12216O07974K54173O1242J3194
2955C0399379L6700M0300K653j63450l88184o84422j154059j388341j632571j804581
2945B3263424j796772j829790j700852j536861j340594j213957j110609r18192
2937A1815797r07694p13953o05744p50507n73911n40727m03106m92882l57915
$$ plain form
2928 6469358 6211710 5953097 5618199 5388091 5156060 4977040 4781695 4607339 4528020 4320720
2918 4320720 4163365 4048205 3926327 3747844 3650992 3645804 3493090 3407414 3389513 3366152 3362618
2907 3362618 3379459 3270683 3293368 3347413 3296251 3249820 3377649 3518659 3535397 3583696 3632796
2896 3632796 3702759 3770583 3846361 3848079 3858496 3759994 3602939 3604313 3491261 3334442 3338891
2885 3338891 3193916 3117724 2987943 2992340 2986605 2943878 2918479 2891387 2974355 3108412 3105718
2874 3105718 3136283 3314610 3411492 3504456 3614988 3716186 3922798 4169441 4434903 4624626
2864 4624626 4856931 5133892 5439316 5789854 6212217 6674516 7174428 7799102 8290650 8769413
2854 8769413 9264610 9724103 10127432 10527537 10712304 10735923 10638910 10462665 10203037 9837257
$$ packed form
2928F469358k57648k58613l34898k30108k32031j79020j95345j74356p9319k07300
2918D320720j57355j15160j21878j78483r6852n188j52714q5676j7901k3361l534
2907C362618J6841j08776K2685N4045n1162m6431J27829J41010J6738M8299M9100
2896C632796O9963O7824P5778J718J0417r8502j57055J374j13052j56819M449
2885C338891j44975p6192j29781M397n735m2727k5399k7092Q2968J34057k694
2874C105718L0565J78327R6882R2964J10532J01198K06612K46643K65462J89723
2864D624626K32305K76961L05424L50538M22363M62299M99912O24674M91548M78763
2854H769413M95197M59493M03329M00105J84767K3619r7013j76245k59628l65780
$$ plain form
2844 9837257 9524057 9212885 8997712 8929945 8868721 8858776 9053520 9265249 9508459 9888431
2834 9888431 10253810 10525959 10645841 10694132 10646670 10359223 9975238 9425657 8879156 8362162
2824 8362162 7735064 7143433 6554054 6008167 5466720 5114019 4795853 4437325 4096820 3826877
2814 3826877 3617491 3534934 3323762 3114004 3017593 2838382 2705163 2541534 2440469 2466591
2804 2466591 2402066 2340033 2357193 2287943 2302858 2316531 2398275 2402591 2476386 2533263 2494884 2557757
2792 2557757 2742053 2780989 2884211 2894234 2912262 2940808 2789220 2705802 2561953 2467061 2354336
2781 2354336 2227541 2142801 2008846 1825736 1790758 1752017 1677353 1557286 1420732 1450322
2771 1450322 1396472 1268729 1243129 1293368 1249068 1250234 1292702 1235580 1181970 1159243 1215345
$$ packed form
2844I837257l13200l11172k15173o7767o1224r945J94744K11729K43210L79972
2834I888431L65379K72149J19882M8291m7462k87447l83985n49581n46501n16994
2824H362162o27098n91631n89379n45887n41447l52701l18166l58528l40505k69943
2814C826877k09386q2557k11172k09758r6411j79211j33219j63629j01065K6122
2804B466591o4525o2033J7160o9250J4915J3673Q1744M316P3795N6877l8379O2873
2792B557757J84296L8936J03222J0023J8028K8546j51588q3418j43849r4892j12725
2781B354336j26795q4740j33955j83110l4978l8741p4664j20067j36554K9590
2771A450322n3850j27743k5600N0239m4300J166M2468n7122n3610k2727N6102
$$ plain form
2760 1215345 1151338 1196453 1214888 1189174 1182853 1127366 1098187 1134425 1177758 1163892 1183989 1229855
2748 1229855 1266950 1234259 1248784 1173742 1214221 1198727 1242494 1288371 1259853 1332273 1318057
2737 1318057 1264435 1262310 1315343 1272729 1314872 1323520 1344367 1271237 1239058 1287596 1351530 1382090
2725 1382090 1357125 1368661 1387919 1425090 1456481 1460557 1498624 1523723 1542390 1591385 1597842 1556656
2713 1556656 1555022 1664629 1793412 1811810 1843336 1896896 1951051 2020650 2056112 2205256 2392124
2702 2392124 2423354 2543550 2647132 2802954 2938608 3114257 3346879 3568622 3758295 3958765
2692 3958765 4224378 4565080 4838982 5065588 5364054 5681878 6020984 6285304 6553151 6826706
2682 6826706 7168345 7545094 8007894 8418956 8911622 9477917 10130255 10740962 11598783 12514239
$$ packed form
2760A215345o4007M5115J8435k5714o321n5487k9179L6238M3333j3866K0097M5866
2748A229855L7095l2691J4525p5042M0479j5494M3767M5877k8518P2420j4216
2737A318057n3622k125N3033m2614M2143Q648K0847p3130l2179M8538O3934L0560
2725A382090k4965J1536J9258L7171L1391M076L8067K5099J8667M8995O457m1186
2713A556656j634J09607J28783J8398L1526N3560N4155O9599L5462J49144J86868
2702B392124L1230J20196J03582J55822J35654J75649K32622K21743J89673K00470
2692C958765K65613L40702K73902K26606K98466L17824L39106K64320K67847K73555
2682F826706L41639L76749M62800M11062M92666N66295O52338O10707Q57821R15456
$$ plain form
2672 12514239 13470946 14552162 15820434 17232104 18924242 20930110 23126092 25801687
2664 25801687 28809669 32315058 36545285 41600900 47797465 55121960 63119124 70311643
2656 70311643 74575137 74636416 70932440 65151896 58623862 52231699 46307575 40968249
2648 40968249 36381195 32343867 28829267 25837119 23260224 21019155 19118257 17394131
2640 17394131 15825030 14532488 13471069 12422743 11556440 10737733 10044789 9378420 8826000
2631 8826000 8298493 7759783 7341486 6982515 6634034 6236808 5965696 5620713 5408678 5177456
2621 5177456 5012310 4789768 4535368 4356711 4160812 3909850 3755965 3588697 3451083 3284579
2611 3284579 3093288 2968898 2815867 2733650 2584737 2458297 2355407 2303245 2180146 2088675
$$ packed form
2672A2514239R56707J081216J268272J411670J692138K005868K195982K675595
2664B5801687L007982L505389M230227N055615O196565P324495P997164P192519
2656G0311643M263494O1279l703976n780544o528034o392163n924124n339326
2648D0968249m587054m037328l514600k992148k576895k241069j900898j724126
2640A7394131j569101j292542j061419j048326q66303q18707o92944o66369n52420
2631H826000n27507n38710m18297l58971l48481l97226k71112l44983k12035k31222
2621E177456j65146k22542k54400j78657j95899k50962j53885j67268j37614j66504
2611C284579j91291j24390j53031q2217j48913j26440j02890n2162j23099r1471
$$ plain form
2601 2088675 2047309 2027041 1990664 1849004 1817158 1720294 1651645 1553298 1540493 1487584 1394333
2590 1394333 1381064 1268021 1208267 1221529 1240811 1165071 1196591 1160192 1092561 1020169 1079334
2579 1079334 976342 986398 1029104 959076 925789 868185 943827 896673 850741 808241 804142
2568 804142 765971 697111 729107 793903 725920 675295 620827 634842 640742 581544 546555 577504
2556 577504 597387 586818 583613 543121 514791 522665 450454 464648 459520 461614 496724 479682
2544 479682 462786 470221 390508 375264 387884 398559 322503 286727 276296 365257 347709 344668
2532 344668 301276 361082 397256 336182 378782 398887 358164 343105 434947 381539 394822 381025
2520 381025 275102 299986 309250 261225 228742 237409 271376 283147 337583 306089 264898 287590
$$ packed form
2601B088675m1366k0268l6377j41660l1846r6864o8649r8347j2805n2909r3251
2590A394333j3269j13043n9754J3262J9282p5740L1520l6399o7631p2392N9165
2579A079334j02992J0056M2706p0028l3287n7604P5642m7154m5932m2500m099
2568H04142l8171o8860L1996O4796o7983n0625n4468J4015N900n9198l4989L0949
2556E77504J9883j0569l205m0492k8330P874p2211J4194n128K094L5110j7042
2544D79682j6896P435p9713j5244J2620J0675p6056l5776j0431Q8961j7548l041
2532C44668m3392N9806L6174o1074M2600K0105m0723j5059R1842n3408J3283j3797
2520C81025j05923K4884R264m8025l2483Q667L3967J1771N4436l1494m1191K2692
$$ plain form
2508 287590 305138 310001 282109 218259 210785 173468 253209 291223 289225 304642 264370 216944
2496 216944 168546 108758 179967 170243 260032 244723 168027 188073 273949 309127 252228 220779
2484 220779 196070 159960 175024 220889 244321 264165 241441 221506 253309 195265 199202 186498
2472 186498 168299 135665 211305 237471 117747 91874 92060 103355 157006 162197 204597 174058
2460 174058 128918 159076 78802 175542 225535 185274 219306 244567 248513 273181 338568 342614
2448 342614 340078 366061 393929 417365 468789 499693 532236 540698 502185 485577 408208 329698
2436 329698 356543 422969 352091 325900 273047 249679 262134 206353 223406 227466 267514 116481
2424 116481 92128 179791 133429 138103 175136 162033 81178 101892 126638 89178 73090 51478
$$ packed form
2508B87590J7548M863k7892o3850p474l7317P9741L8014j998J5417m0272m7426
2496B16944m8398n9788P1209r724Q9789j5309p6696K0046Q5876L5178n6899l1449
2484B20779k4709l6110J5064M5865K3432J9844k2724j9935L1803n8044L937j2704
2472A86498j8199l2634P5640K6166j19724k5873J86J1295N3651N191M2400l0539
2460A74058m5140L0158q0274R6740M9993m0261L4032K5261L946K4668O5387M046
2448C42614k536K5983K7868K3436N1424L0904L2543Q462l8513j6608p7369p8510
2436C29698K6845O6426p0878k6191n2853k3368J2455n5781J7053M060M0048j51033
2424A16481k4353Q7663m6362M674L7033j3103q0855K0714K4746l7460j6088k1612
$$ plain form
2412 51478 142321 111653 92224 108202 132142 153119 82460 141982 122465 87299 37018 79760
2400 79760 72149 142825 116196 169857 162954 124787 100030 58990 99813 95171 22506 70206
2388 70206 84708 83141 -2822 43147 89606 71715 58279 68076 90525 35377 17948 94556
2376 94556 107593 68221 168901 122811 58374 117636 83721 83893 56318 70135 27660 54720
2364 54720 -726 12759 55692 -27407 27596 34707 24146 -22378 55039 64685 53956 41193
2352 41193 77654 53598 106466 9565 20311 32565 96388 110593 55022 35133 45065 27417
2340 27417 41289 4578 -6328 71956 98432 89525 114199 83481 84672 33092 61419 36471
2328 36471 110555 86238 32258 51375 39218 48374 72942 48362 70502 26750 39748 28393
$$ packed form
2412E1478R0843l0668j9429J5978K3940K0977p0659N9522j9517l5166n0281M2742
2400G9760p611P0676k6629N3661o903l8167k4757m1040M0823m642p2665M7700
2388G0206J4502j567q5963M5969M6459j7891j3436R797K2449n5148j7429P6608
2376I4556J3037l9372J00680m6090o4437N9262l3915J72k7575J3817m2475K7060
2364E4720n5446J3485M2933q3099N5003P111j0561m6524P7417R646j0729j2763
2352D1193L6461k4056N2868r6901J0746J2254O3823J4205n5571j9889R932j7648
2340B7417J3872l6711j0906P8284K6476q907K4674l0718J191n1580K8327k4948
2328C6471P4084k4317n3980J9117j2157R156K4568k4580K2140m3752J2998j1355
$$ plain form
2316 28393 -41784 28383 21812 43657 8819 29922 21426 31411 -28040 59131 68799 24834 20765
2303 20765 128040 118873 15266 -28180 30042 34325 11864 27035 101438 148011 18207 -27124
2291 -27124 6843 29912 11735 58495 63523 61969 103576 17678 26771 10822 -4405 63319
2279 63319 52240 39528 -390 14641 -34871 -15194 7543 43675 57909 26344 39148 -26413
2267 -26413 11713 44714 81856 14027 13643 46111 47708 49935 51686 5142 32596 5085 34705
2254 34705 21083 -1649 -50847 -14262 -29 -4475 -36223 -15404 70573 32667 -12967 12940
2242 12940 -30249 -66924 -14881 -22100 44120 -1321 -7517 15514 -624 -66663 -117471 -45684
2230 -45684 21573 67452 29310 13873 50098 72608 6259 52259 -1956 -2735 90255 101685
$$ packed form
2316B8393p0177P0167o571K1845l4838K1103q496R985n9451Q7171R668m3965m069
2303B0765J07275r167j03607m3446N8222M283k2461J5171P4403M6573j29804m5331
2291b7124L3967K3069j8177M6760N028j554M1607q5898R093j5949j5227O7724
2279F3319j1079j2712l9918J5031m9512J9677K2737L6132J4234l1565J2804o5561
2267b6413L8126L3001L7142o7829l84L2468J597K227J751m6544K7454k7511K9620
2254C4705j3622k2732m9198L6585J4233m446l1748K0819Q5977l7906m5634K5907
2242A2940m3189l6675N2043p219O6220m5441o196K3031j6138o6039n0808P1787
2230d5684O7257M5879l8142j5437L6225K2510o6349M6000n4215p79R2990J1430
$$ plain form
2218 101685 80965 62435 100565 21130 -6569 25797 30177 58176 38179 4193 -15573 -42884
2206 -42884 -63843 -12856 48060 3948 -6878 57088 79588 21680 -56306 -32875 40258 40382
2194 40382 48849 -28822 2705 -23409 -34505 -11167 18479 11661 83300 90844 11513 -24792
2182 -24792 30317 5432 28326 7586 -59437 10542 43339 -44857 -63219 -28099 -16769 -48362
2170 -48362 -82969 -79476 -30377 -26806 74329 117199 124903 109323 52306 -29829 -63718 -28304
2158 -28304 -6947 -38939 24995 21940 -410 1798 19171 46409 47332 13238 -35691 -38511 -9308
2145 -9308 -44088 -50632 -62847 -64382 -69984 -92712 -24320 -47824 10135 -16717 4616 31084 -10199
2132 -10199 13763 33524 -7233 62113 103031 83726 -743 65023 36859 30354 86296 74343
$$ packed form
2218A01685k0720j8530L8130p9435k7699L2366M380K7999j9997l3986j9766k7311
2206d2884k0959N0987O0916m4112j0826O3966K2500n7908p7986K3431P3133J24
2194D0382Q467p7671L1527k6114j1096K3338K9646o818P1639P544p9331l6305
2182b4792N5109k4885K2894k0740o7023O9979L2797q8196j8362L5120J1330l1593
2170d8362l4607L493M9099L571J01135M2870P704j5580n7017q2135l3889L5414
2158b8304K1357l1992O3934l055k2350K208J7373K7238R23l4094m8929k820K9203
2145i308l4780o544j2215j535n602k2728O8392k3504N7959k6852K1333K6468m1283
2132a0199K3962J9761m0757O9346M0918j9305q4469O5766k8164o505N5942j1953
$$ plain form
2120 74343 58961 -1828 -1785 53928 18840 58300 64544 65516 24961 40621 -19405 -15852 85207
2107 85207 22952 22561 -6950 10932 -11554 57766 36250 1814 40259 53269 -26911 -1143
2095 -1143 21117 27561 82730 38771 79339 61270 90201 131524 150765 149630 184504 189148 255083
2082 255083 361803 471453 552569 531550 500751 360882 370406 318491 276985 138913 194220
2071 194220 166740 157118 138260 49304 101214 77071 126154 135268 93192 54814 102300 13159
2059 13159 20165 -5672 -10224 2910 31985 52971 26854 96626 145588 69574 86551 98611
2047 98611 21501 23772 -30199 -11455 26805 24242 49275 -9731 5880 8586 -9184 -26227
2035 -26227 16487 73760 19158 -57379 -12152 -13695 42017 58481 15623 -13560 48781 53772
$$ packed form
2120G4343j5382o0789M3N5713l5088L9460O244R72m0555J5660o0026L553J01059
2107H5207o2255l91k9511J7882k2486O9320k1516l4436L8445J3010q0180K5768
2095a143K2260O444N5169m3959M0568j8069K8931M1323J9241j135L4874M644O5935
2082B55083J06720J09650Q1116k1019l0799j39869R524n1915m1506j38072N5307
2071A94220k7480r622j8858q8956N1910k4143M9083R114m2076l8378M7486q9141
2059A3159P006k5837m552J3134K9075K0986k6117O9772M8962p6014J6977J2060
2047I8611p7110K271n3971J8744L8260k563K5033n9006J5611K706j7770j7043
2035b6227M2714N7273n4602p6537M5227j543N5712J6464m2858k9183O2341M991
$$ plain form
2023 53772 53501 9260 16508 28119 -10188 9311 50744 -21599 13183 45476 30486 24131 33223
2010 33223 -5004 -31989 1328 37124 19400 5358 -17679 -37932 -46795 -16772 65845 43984
1998 43984 -12126 32352 2523 -65819 -2801 -418 -52794 -8421 13844 -59848 45736 58072
1986 58072 53706 33999 52761 25110 46536 -9776 8142 76872 118193 76852 -10742 -38977
1974 -38977 -6730 -53099 -72027 -31326 -6534 10723 28033 -3512 85511 36661 -57085 -31405
1962 -31405 26428 -24835 26903 -16588 12518 40825 56877 54741 75234 89278 76796 75307
1950 75307 3704 21308 -9636 51028 77614 63353 37853 13578 68495 29509 -63729 -35944
1938 -35944 -53905 -67821 54760 -8039 -9806 54641 23152 21788 61181 54309 -3675 10306
$$ packed form
2023E3772k71m4241P248J1611l8307J9499M1433p2343L4782L2293j4990o355R092
2010C3223l8227k6985L3317L5796j7724j4042k3037k0253q863L0023Q2617k1861
1998D3984n6110M4478k9829o8342O3018K383n2376M4373K2265p3692J05584J2336
1986E8072m366j9707J8762k7651K1426n6312J7918O8730M1321m1341q7594k8235
1974c8977L2247m6369j8928M0701K4792J7257J7310l1545Q9023m8850r3746K5680
1962c1405N7833n1263N1738m3491K9106K8307J6052k136K0493J4044j2482j489
1950G5307p1603J7604l0944O0664K6586j4261k5500k4275N4917l8986r3238K7785
1938c5944j7961j3916J22581o2799j767O4447l1489j364L9393o872n7984J3981
$$ plain form
1926 10306 -92796 5512 19745 8698 -43634 -22090 18485 -62966 -67454 -10428 -1440 -10294
1914 -10294 -62427 -1105 -23258 -39119 -74812 -33926 -44996 -93035 -71060 -21852 -78049 -61715
1902 -61715 10984 -29485 13046 17491 -9559 -44248 -50823 -46124 9768 -49480 -21666 35459
1890 35459 69868 29626 -22501 -30552 -12672 3888 5701 8110 -32278 42865 -5864 -84137
1878 -84137 -58422 -48985 -40132 15971 10700 28122 -31385 -70960 17575 17993 -45085 -40407 32106
1865 32106 52834 43631 -35513 1726 9355 -30007 -21405 78603 8369 17197 37028 27952 43986
1852 43986 64516 -31665 -50315 13213 31496 13819 67004 87290 64275 9801 30769 -24217
1840 -24217 -6595 30348 52862 86357 48158 43381 -44203 42956 20814 -29580 5422 -36464
$$ packed form
1926A0306j03102R8308J4233j1047n2332K1544M0575q1451m488N7026Q988q854
1914a0294n2133O1322k2153j5861l5693M0886j1070m8039K1975M9208n6197J6334
1902f1715P2699m0469M2531M445k7050l4689o575M699N5892n9248K7814N7125
1890C5459L4409m0242n2127q051J7880J6560J813K409m0388P5143m8729p8273
1878h4137K5715R437Q853N6103n271J7422n9507l9575Q8535M18o3078M678P2513
1865C2106K0728r203p9144L7239P629l9362Q602J00008p0234Q828J9831r076J6034
1852D3986K0530r6181j8650O3528J8283j7677N3185K0286k3015n4474K0968n4986
1840b4217J7622L6943K2514L3495l8199m777q7584Q7159k2142n0394L5002m1886
$$ plain form
1828 -36464 -13720 -33168 -42209 25188 11618 -6411 -47161 -40451 45532 59624 3900 -24824
1816 -24824 57487 101768 -40235 -28703 -30245 33207 -9436 -38185 -38309 -11785 32626 16149
1804 16149 42513 -21405 -29400 6872 -43109 -43188 14636 8356 38383 -26344 -29213 -18521 -35671
1791 -35671 -29236 -37504 12755 -32517 13956 -3310 -22748 -73548 -11681 67595 45960 -10032
1779 -10032 24475 -18318 -15360 -49424 -26022 7428 57379 53216 -29670 -11526 89058 37051
1767 37051 70009 36485 -62686 -76331 -48342 -12013 -19296 -23780 29903 -195 -18155 6961
1755 6961 12573 851 -33896 9091 8112 -18256 23040 63205 25527 -22327 -68488 -11049 13129
1742 13129 3223 20923 -49880 -73600 21814 47349 27116 -66421 -52838 -22745 33461 77201
$$ packed form
1828c6464K2744j9448r041O7397j3570j8029m0750O710Q5983J4092n5724k8724
1816b4824Q2311M4281j42003J1532j542O3452m2643k8749j24K6524M4411j6477
1804A6149K6364o3918p995L6272m9981p9N7824o280L0027o4727k869J0692j7150
1791c5671O435q268N0259m5272M6473j7266j9438n0800O1867P9276k1635n5992
1779a0032L4507m2793K958l4064K3402L3450M9951m163q2886J8144J00584n2007
1767C7051L2958l3524r9171j3645K7989L6329p283m484N3683l0098j7960K5116
1755F961N612j1722l4747M2987r79k6368M1296M0165l7678m7854m6161N7439K4178
1742A3129r906J7700p0803k3720R5414K5535k0233r3537J3583L0093N6206M3740
$$ plain form
1730 77201 75191 -32123 -4818 -2445 -72271 -66509 2189 28636 43668 -57271 -2789 -8533
1718 -8533 -1911 -65591 -155320 -104225 41342 6585 -200 16103 56555 58607 -26516 -7972
1706 -7972 -17301 -18581 -17049 3585 -132237 -78235 -20266 -25932 -11738 -24451 6621 -10055 -48280
1693 -48280 -6822 20616 47026 59558 -51722 -78169 -11685 38451 -28709 -15225 -500 -75222
1681 -75222 13551 -56474 -119377 -55913 29504 38840 -18488 -34104 -8306 24065 -84392 -96326
1669 -96326 -31002 13707 -56241 -42967 -5245 940 23968 -8231 1173 37745 54046 62187
1657 62187 -29750 -36367 -47121 -6722 41946 -6977 -37137 -42358 -65079 -37787 12314 4576
1645 4576 12057 -16682 -63845 -41731 -56882 -75439 -34396 -12886 -31873 -86058 -77487 -46986
$$ packed form
1730G7201k010j07314K7305K373o9826N762O8698K6447J5032j00939N4482n744
1718h533O622o3680q9729N1095J45567l4757o785J6303M0452K052q5123J8544
1706g972r329j280J532K0634j35822N4002N7969n666J4194j2713L1072j6676l8225
1693d8280M1458K7438K6410J2532j11280k6447O6484N0136o7160J3484J4725p4722
1681g5222Q8773p0025o2903O3464Q5417R336n7328j5616K5798L2371j08457j1934
1669i6326O5324M4709o9948J3274L7722O185K3028l2199R404L6572J6301Q141
1657F2187r1937o617j0754M0399M8668m8923l0160n221k2721K7292N0101p738
1645D576P481k8739m7163K2114j5151j8557M1043K1510j8987n4185Q571L0501
$$ plain form
1633 -46986 -34555 11897 -2008 -73285 -20584 30672 -45443 -39306 -55210 44191 74830 50809
1621 50809 95449 54790 81963 -47875 -14883 54785 -8057 -90 4302 13921 -36284 -17247
1609 -17247 -31174 -80793 -68130 -38627 -4712 56690 33029 -30871 -90283 -71604 78569 20388
1597 20388 -37979 -6490 1152 -23588 -37647 -3800 6862 -92696 -50833 -70085 -36542 -72010
1585 -72010 -59359 -19266 -37551 6918 -20926 -42121 -16035 -103716 -43647 13922 70710 60536
1573 60536 5818 -4248 -9930 -86456 -10851 20772 -51070 18340 68456 42787 -54614 -38252
1561 -38252 -121 -53498 19407 26303 -3281 17772 -11279 12491 28861 9335 -99526 -85233
1549 -85233 24566 39975 -1327 -20793 -40670 -40684 -101437 -103556 -63560 -105824 -8488 -74003
$$ packed form
1633d6986J2431M6452j3905p1277N2701N1256p6115O137j5904R9401L0639k4021
1621E0809M4640m0659K7173j29838L2992O9668o2842P967M392R619n0205J9037
1609a7247j3927m9619J2663K9503L3915O1402k3661o3900n9412J8679J50173n8181
1597B0388n8367L1489P642k4740j4059L3847J0662r9558M1863j9252L3543l5468
1585g2010J2651M0093j8285M4469k7844k1195K6086q7681O0069N7569N6788j0174
1573F0536n4718j0066n682p6526P5605L1623p1842O9410N0116k5669r7401J6362
1561c8252L8131n3377P2905O896k9584K1053k9051K3770J6370j9526j08861J4293
1549h5233J09799J5409m1302j9466j9877j4o0753k119L9996m2264R7336o5515
$$ plain form
1537 -74003 -15032 -32395 -62812 -28714 -89209 -81031 -14536 -43977 -51619 -40477 -70794 -56152
1525 -56152 -64419 -2324 -32098 -54581 -5840 -38438 -13479 49239 33017 19969 -81728 19103
1513 19103 -50604 -66689 50863 81288 43969 -66130 10180 28955 117044 15196 578
1502 578 51265 -52654 -20253 -65783 -51795 -45328 20848 447 -31794 27010 63965 -3004
1490 -3004 -31652 -58183 14852 -7094 63108 108918 86765 77692 3553 -31804 53082 89131
1478 89131 94858 69573 68469 23487 23048 29298 69827 32830 28447 44164 4385 11047 -49316
1465 -49316 -33655 34408 13773 1035 27907 60052 5475 28915 43359 -21140 65821 31174
1453 31174 -21208 -39106 -40151 -12270 -95351 -78828 -55672 6047 -33949 -13127 -39136 -48573
$$ packed form
1537g4003N8971j7363l0417L4098o0495Q178O6495k9441p642J1142l0317J4642
1525e6152q267O2095k9774k2483M8741l2598K4959O2718j6222j3048j01697J00831
1513A9103o9707j6085J17552L0425l7319j10099P6310J8775Q8089j01848j4618
1502E78N0687j03919L2401m5530J3988O467O6176k0401l2241N8804L6955o6969
1490c004k8648k6531P3035k1946P0202M5810k2153r073p4139l5357Q4886L6049
1478H9131N727k5285j104m4982m39O250M0529l6997m383J5717l9779O662o0363
1465d9316J5661O8063k0635j2738K6872L2145n4577K3440J4444o4499Q6961l4647
1453C1174n2382j7898j045K7881q3081J6523K3156O1719l9996K0822k6009r437
$$ plain form
1441 -48573 15474 -18799 -15706 21431 6783 36619 111732 -2312 -32422 20978 -7350 -55678
1429 -55678 -27139 -15079 3081 -29986 6754 17516 7472 17376 85495 100164 23293 -13827
1417 -13827 -35762 -53215 -45666 -83012 -160328 -141564 -15650 -39657 -80041 -86613 -46156 10518
1405 10518 33628 -42184 -65501 -58494 1902 -36017 -43619 -46557 -40482 19012 18241 103792 110611
1392 110611 68696 27170 -68466 40701 56253 16779 -7249 -36719 5040 -4628 -10578 -20266
1380 -20266 -2366 -423 37515 48979 44065 3456 37106 4891 -47919 57580 -51504 -76580
1368 -76580 -42010 13385 36751 34408 84842 49436 88033 35877 15034 -61148 28047 37605
1356 37605 -62244 -31707 9784 -13728 -50327 12638 -25870 -39207 -13855 -10485 18678 -45092
$$ packed form
1441d8573O4047l4273L093L7137j4648K9836P5113j14044l0110N3400k8328m8328
1429e5678K8539J2060J8160l3067L6740J0762j0044R904O8119J4669p6871l7120
1417a3827k1935j7453P549l7346p7316J8764J25914k4007m0384o572M0457N6674
1405A0518K3110p5812k3317P007O0396l7919p602k938O075N9494p71Q5551O819
1392A10611m1915m1526r5636J09167J5552l9474k4028k9470M1759r668n950r688
1380b0266J7900J943L7938J1464m914m0609L3650l2215n2810J05499j09084k5076
1368g6580L4570N5395K3366k343N0434l5406L8597n2156k0843p6182Q9195R558
1356C7605r9849L0537M1491k3512l6599O2965l8508j3337K5352L370K9163o3770
$$ plain form
1344 -45092 -17844 -607 -39981 54040 70434 -8678 28790 -115 -22460 34390 17820 77249
1332 77249 -1493 -23454 -55826 -36795 -40324 -17995 -44657 -5689 37196 10744 60485 24301
1320 24301 -24238 -30001 -3122 -35375 -29929 -11368 -60450 -50247 -17975 30110 -18372 28695
1308 28695 39468 49339 27973 -2124 9492 10529 -83855 -62686 23066 -23377 -58247 -105955
1296 -105955 -104034 -40701 -828 -53812 -45767 -63524 -22495 1113 5418 -42521 -54388 -55191 -68685
1283 -68685 14335 41167 16873 19353 -13266 -38261 -117120 -38456 -13763 -38049 -22505 -16076
1271 -16076 -44305 -2632 -99772 -71391 -38320 -64471 -39879 -36899 -65179 -15935 40028 -49782
1259 -49782 -50964 39508 -18058 -23973 -21127 18971 40147 -34192 -36394 -53683 3721 22201 -30051
$$ packed form
1344d5092K7248J7237l9374R4021J6394p9112L7468k8905k2345N6850j6570N9429
1332G7249p8742k1961l2372J9031l529K2329k6662L8968M2885k6452M9741l6184
1320B4301m8539n763K6879l2253N446J8561m9082J0203L2272M8085m8482M7067
1308B8695J0773R871k1366l0097J1616J037r4384K1169Q5752m6443l4870m7708
1296a05955J921O3333L9873n2984Q045j7757M1029K3608M305m7939j1867q03j3494
1283f8685Q3020K6832k4294K480l2619k4995p8859P8664K4693k4286J5544O429
1271a6076k8229M1673r7140K8381L3071k6151K4592K980k8280M9244N5963q9810
1259d9782j182R0472n7566n915K846M0098K1176p4339k202j7289N7404J8480n2252
$$ plain form
1246 -30051 23534 24623 -18530 -53947 -73376 -56150 -56462 -31290 19334 -11305 -51330 -38780
1234 -38780 53847 40414 44109 69943 6341 -43941 -39980 -22687 -135202 -114527 -57446 19225
1222 19225 -8552 -61215 16243 -165 1430 12692 -47635 -42276 4804 28694 53699 50984
1210 50984 37831 73913 40923 -20859 3593 43288 -23616 -43541 -46189 -24958 -55068 -58237
1198 -58237 10201 -15947 -32822 -67008 -56986 7916 -60993 -46079 -29099 -16587 -26304 -53590
1186 -53590 -16845 42224 18755 44752 29704 50148 70623 -31733 -69460 -42848 10566 17946
1174 17946 30084 -8656 6709 39545 -53636 -116700 -12289 -11286 14436 47611 -40117 -6873
1162 -6873 -35882 26500 7847 53664 97601 32105 52442 40400 57981 63933 -6913 -9973
$$ packed form
1246c0051N3585J089m3153l5417j9429J7226l12K5172N0624l0639m0025J2550
1234c8780R2627j3433L695K5834o3602n0282L961J7293j12515K0675N7081P6671
1222A9225k7777n2663P7458j6408J595J1262o0327N359M7080K3890K5005k715
1210E0984j3153L6082l2990o1782K4452L9695o6904j9925k648K1231l0110l169
1198e8237O8438k6148j6875l4186J0022O4902o8909J4914J6980J2512r717k7286
1186e3590L6745N9069k3469K5997j5048K0444K0475j02356l7727K6612N3414P380
1174A7946J2138l8740J5365L2836r3181o3064J04411J003K5722L3175q7728L3244
1162f873k9009O2382j8653M5817M3937o5496K0337j2042J7581N952p0846l060
$$ plain form
1150 -9973 26534 -21737 -22081 25201 -79558 -89578 -59308 -3619 -13326 -37967 37675 -13697
1138 -13697 -46136 -41531 2097 -25813 -83517 -44873 1279 -27114 6269 73839 66937 -12657
1126 -12657 -28093 -9524 -8822 -33488 15730 18153 -6329 -23575 27739 11974 -38373 -64239
1114 -64239 -55282 19057 -16409 19986 -61733 -89858 -115758 -75969 38437 -9026 28853 -34430
1102 -34430 -47973 -19677 -17966 -43711 1887 42625 33245 -7540 -11637 3145 -25976 -31398 -65419
1089 -65419 3906 -5604 -3445 48724 11699 -23091 74567 2020 -53962 27356 -1362 79067
$$ packed form
1150i973L6507m8271l44M7282j04759j0020L0270N5689r707k4641P5642n1372
1138a3697l2439M605M3628k7910n7704L8644M6152k8393L3383O7570o902p9594
1126a2657j5436J8569P02k4666M9218K423k4482j7246N1314j5765n0347k5866
1114f4239Q957P4339l5466L6395q1719k8125k5900L9789J14406m7463L7879o3283
1102c4430j3543K8296J711k5745M5598M0738r380m0785m097J4782k9121n422l4021
1089f5419O9325r510K159N2169l7025l4790R7658p2547n5982Q1318k8718Q0429
$$ [...]
##END NTUPLES=NMR SPECTRUM
##END=
