##TITLE=1H_CG-1210-2
 CDCl3
 8 sc, 
 9.8.2024
##JCAMPDX= 6.0         $$ Bruker NMR JCAMP-DX V2.0
##DATA TYPE= NMR SPECTRUM
##DATA CLASS= NTUPLES
##ORIGIN= UXNMR, Bruker Analytische Messtechnik GmbH
##OWNER= root
$$ XWIN-NMR		Version 3.5
$$ Fri Aug  9 13:52:40 2024 Russian Standard Time (UT+4h)  she@DPX200
##.OBSERVE FREQUENCY= 200.1313
##.OBSERVE NUCLEUS= ^1H
##.ACQUISITION MODE= SIMULTANEOUS
##.ACQUISITION SCHEME= undefined
##.AVERAGES= 8
##.DIGITISER RES= 18
##SPECTROMETER/DATA SYSTEM= spect
##.PULSE SEQUENCE= zg30
##.SOLVENT NAME= Acetone
##.SHIFT REFERENCE= (INTERNAL, Acetone, 0, 20.896)
##AUDIT TRAIL= $$ (NUMBER, WHEN, WHO, WHERE, WHAT)
$$ ##TITLE= Audit trail, XWIN-NMR		Version 3.5
$$ ##JCAMPDX= 5.01
$$ ##ORIGIN= Bruker BioSpin GmbH
$$ ##OWNER= she
$$ F:/spectra/data/she/nmr/H-F/1/pdata/1/auditp.txt
$$ ##AUDIT TRAIL=  $$ (NUMBER, WHEN, WHO, WHERE, WHAT)
(   1,<2024-08-09 13:51:30.06 +0400>,<she>,<DPX200>,
      <created by zg, POWCHK disabled, PULCHK disabled
       configuration hash MD5:
       00 E9 B6 7A A2 85 ED C7 34 08 36 98 17 FE 4E 26
       data hash MD5: 16K
       F2 0D 4E B8 92 8B 60 37 D7 66 EB A9 2C A0 8B 1B>)
(   2,<2024-08-09 13:51:32.62 +0400>,<she>,<DPX200>,
      <Start of raw data processing
       efp BC_mod = 2 LB = 0.24 FT_mod = 6 PKNL = 1 PHC0 = -25799.3 PHC1 = 15.38749 SI = 16K 
       data hash MD5: 16K
       58 05 D3 E0 DD 94 80 85 CA 8B B7 F6 20 33 DC 79>)
(   3,<2024-08-09 13:51:50.87 +0400>,<she>,<DPX200>,
      <pk PHC0 = 4.132236 PHC1 = -3.8 
       data hash MD5: 16K
       26 E6 1A AC 1E DE 45 E1 83 11 D1 14 01 10 45 A8>)
(   4,<2024-08-09 13:51:53.85 +0400>,<she>,<DPX200>,
      <abs ABSG = 5 
       data hash MD5: 16K
       3C 92 42 EA 81 B3 9D 59 F2 B1 BA F3 C3 03 D2 46>)
$$ ##END=
$$ 
$$ hash MD5
$$ 91 51 A2 79 9D CC 08 C1 FD 3A E5 97 80 1A 42 CC
##$RELAX= 
##$RELAX= 
##$RELAX= 
##$RELAX= 
##$RELAX= 
##$RELAX= 
$$ Bruker specific parameters
$$ --------------------------
##$DU= <F:/spectra>
##$EXPNO= 1
##$NAME= <H-F>
##$PROCNO= 1
##$TYPE= <nmr>
##$USER= <she>
##$AMP= (0..31)
100 100 100 100 100 100 100 100 100 100 100 100 100 100 100 100 100 100 
100 100 100 100 100 100 100 100 100 100 100 100 100 100 
##$AQSEQ= 0
##$AQ_mod= 1
##$AUNM= <au_zg>
##$AUTOPOS= <>
##$BF1= 200.13
##$BF2= 200.13
##$BF3= 200.13
##$BF4= 200.13
##$BF5= 200.13
##$BF6= 200.13
##$BF7= 200.13
##$BF8= 200.13
##$BYTORDA= 1
##$CFDGTYP= 0
##$CFRGTYP= 5
##$CHEMSTR= <none>
##$CNST= (0..31)
1 1 145 1 1 1 1 1 1 1 1 1 1 1 1 1 1 1 1 1 1 1 1 1 1 1 1 1 1 1 1 1 
##$CPDPRG= <>
##$CPDPRG1= <>
##$CPDPRG2= <>
##$CPDPRG3= <>
##$CPDPRG4= <mlev>
##$CPDPRG5= <mlev>
##$CPDPRG6= <mlev>
##$CPDPRG7= <mlev>
##$CPDPRG8= <mlev>
##$CPDPRGB= <>
##$CPDPRGT= <>
##$D= (0..31)
0 1.2 0 0 0 0 0 0 0 0.06 0 0.03 0 0 0 0 0.0002 0 0 0 0 0 0 0 0 0 0 0 0 
0 0 0 
##$DATE= 1723197089
##$DBL= (0..7)
120 120 120 120 120 120 120 120 
##$DBP= (0..7)
150 150 150 150 150 150 150 150 
##$DBP07= 0
##$DBPNAM0= <>
##$DBPNAM1= <>
##$DBPNAM2= <>
##$DBPNAM3= <>
##$DBPNAM4= <>
$$ [...]
##$SUBNAM3= <"">
##$SUBNAM4= <"">
##$SUBNAM5= <"">
##$SUBNAM6= <"">
##$SUBNAM7= <"">
##$SUBNAM8= <"">
##$SUBNAM9= <"">
##$SW= 24.0689771365484
##$SWIBOX= (0..15)
0 0 2 0 0 0 0 0 0 0 0 0 0 0 0 0 
##$SW_h= 4816.95568400771
##$TD= 16384
##$TD0= 1
##$TE= 0
##$TE2= 300
##$TE3= 300
##$TEG= 300
##$TL= (0..7)
0 120 120 120 120 120 120 120 
##$TP= (0..7)
150 150 150 150 150 150 150 150 
##$TP07= 0
##$TPNAME0= <>
##$TPNAME1= <>
##$TPNAME2= <>
##$TPNAME3= <>
##$TPNAME4= <>
##$TPNAME5= <>
##$TPNAME6= <>
##$TPNAME7= <>
##$TPOAL= (0..7)
0.5 0.5 0.5 0.5 0.5 0.5 0.5 0.5 
##$TPOFFS= (0..7)
0 0 0 0 0 0 0 0 
##$TUNHIN= 0
##$TUNHOUT= 0
##$TUNXOUT= 0
##$USERA1= <user>
##$USERA2= <user>
##$USERA3= <user>
##$USERA4= <user>
##$USERA5= <user>
##$V9= 5
##$VALIST= <valist>
##$VCLIST= <CCCCCCCCCCCCCCC>
##$VD= 0
##$VDLIST= <DDDDDDDDDDDDDDD>
##$VPLIST= <PPPPPPPPPPPPPPP>
##$VTLIST= <TTTTTTTTTTTTTTT>
##$WBST= 1024
##$WBSW= 4
##$XGAIN= (0..3)
0 0 0 0 
##$XL= 0
##$YL= 0
##$YMAX_a= 372161
##$YMIN_a= -308372
##$ZGOPTNS= <>
##$ZL1= 120
##$ZL2= 120
##$ZL3= 120
##$ZL4= 120
##$ABSF1= 20.93127
##$ABSF2= -3.13792
##$ABSG= 5
##$ABSL= 3
##$ALPHA= 0
##$AQORDER= 0
##$ASSFAC= 0
##$ASSFACI= 0
##$ASSFACX= 0
##$ASSWID= 0
##$AUNMP= <proc_1d>
##$AZFE= 0.1
##$AZFW= 0.1
##$BCFW= 0
##$BC_mod= 2
##$BYTORDP= 0
##$COROFFS= 0
##$CY= -3
##$DATMOD= 1
##$DC= 0
##$DFILT= <>
##$DTYPP= 0
##$F1P= 0
##$F2P= 0
##$FCOR= 1
##$FTSIZE= 16384
##$FT_mod= 6
##$GAMMA= 0
##$GB= 0
##$INTBC= 1
##$INTSCL= 3.70164e-10
##$ISEN= 128
##$LB= 0.24
##$LEV0= 0
##$LPBIN= 0
##$MAXI= 10000
##$MC2= 0
##$MEAN= 0
##$ME_mod= 0
##$MI= 1.114404
##$NCOEF= 0
##$NC_proc= -6
##$NLEV= 6
##$NOISF1= 3.799351
##$NOISF2= 2.8
##$NSP= 0
##$NTH_PI= 0
##$NZP= 0
##$OFFSET= 20.89601
##$PC= 1
##$PHC0= -25795.17
##$PHC1= 11.58749
##$PH_mod= 1
##$PKNL= yes
##$PPARMOD= 0
##$PSCAL= 0
##$PSIGN= 0
##$REVERSE= no
##$SF= 200.129526570205
##$SI= 16384
##$SIGF1= 3
##$SIGF2= 2
##$SINO= 5.538805
##$SIOLD= 16384
##$SREGLST= <1H.CDCl3>
##$SSB= 0
##$STSI= 16384
##$STSR= 0
##$SW_p= 4816.95568400771
##$SYMM= 0
##$S_DEV= 0
##$TDeff= 16384
##$TDoff= 0
##$TI= <>
##$TILT= no
##$TM1= 0
##$TM2= 0
##$TOPLEV= 0
##$USERP1= <user>
##$USERP2= <user>
##$USERP3= <user>
##$USERP4= <user>
##$USERP5= <user>
##$WDW= 1
##$XDIM= 16384
##$YMAX_p= 531271084
##$YMIN_p= -660285
$$ End of Bruker specific parameters
$$ ---------------------------------
##NTUPLES= NMR SPECTRUM
##VAR_NAME=  FREQUENCY,     SPECTRUM/REAL,   SPECTRUM/IMAG
##SYMBOL=    X,             R,               I
##VAR_TYPE=  INDEPENDENT,   DEPENDENT,       DEPENDENT
##VAR_FORM=  AFFN,          ASDF,            ASDF
##VAR_DIM=   16384,         16384,           16384
##UNITS=     HZ,            ARBITRARY UNITS, ARBITRARY UNITS
##FACTOR=    0.29402158847633, 1,            1
##FIRST=     4181.90847747249, 0,            0
##LAST=      -635.047206535218, 0,           0
##MIN=       -635.047206535218, -660285,     0
##MAX=       4181.90847747249, 531271084,    0
$$ Real data points
##PAGE= N=1
##DATA TABLE= (X++(R..R)), XYDATA
$$ [...]
5717I3611j18187n068m9233o7173k6995j7950J03468R2470L3731N5916n3235j14567
$$ 93611 -24576 -29644 -78877 -146050 -173045 -190995 -87527 4943 38674 94590 41355 -73212
5705g3212K7064n425p5665M635K7123k2773J01824L3741K3486n8446L9244k1974
$$ -73212 -46148 -51573 -127238 -122603 -95480 -118253 -16429 17312 40798 -17648 21596 -378
5693c78q6864M0702j20505M8062J09664l1213Q3946n402p5428q9399R077K5407
$$ -378 -87242 -46540 -167045 -118983 -9319 -40532 43414 38012 -37416 -126815 -117738 -92331
5681i2331R8697j7120J08926j2992l2747j04003K2601J732M986k5390k6223K5188
$$ -92331 6366 -10754 98172 85180 52433 -51570 -28969 -27237 -22251 -47641 -73864 -48676
5669d8676k5828M1685M5107J7649J5969L9112m383l3824p2873M5862J16932j4609
$$ -48676 -74504 -32819 12288 29937 45906 85018 80635 46811 -26062 19800 136732 122123
5657A22123R704N6528j6453L9082j72106l8526k3297j3994L4791j42882Q1635
$$ 122123 131827 188355 171902 210984 38878 352 -22945 -36939 -2148 -145030 -63395
5646f3395k4775J3101R4889K9675m0749j07767N5505m0107N7985o1103R2522N9233
$$ -63395 -88170 -75069 19820 49495 8746 -99021 -43516 -83623 -25638 -86741 5781 65014
5634F5014q7584J05387k8033j06575k7916P5231k2412r4302J36121J140L2637
$$ 65014 -22570 82817 54784 -51791 -79707 -4476 -26888 -121190 14931 16071 48708
5623D8708m8383l1049p1495R166J0565J4998P3983m0287k9456j986M3249j03483
$$ 48708 325 -30724 -102219 -93053 -82488 -67490 6493 -33794 -63250 -65236 -21987 -125470
5611a25470N2374K9354k5536K3043N7047p7121l5926R7931r7487M9709N0524n5502
$$ -125470 -73096 -43742 -69278 -46235 10812 -66309 -102235 -4304 -101791 -52082 -1558 -57060
5599e7060O6072p1395o3610K4801J6726M3518J8826L5975m1003k3567j26295J08077
$$ -57060 9012 -62383 -125993 -101192 -84466 -40948 -22122 13853 -27150 -50717 -177012 -68935
5587f8935K7169k1193J5205J88390q7443J0594j4977m8968m4115j6807o1635O7087
$$ -68935 -41766 -62959 -47754 140636 53193 63787 48810 -158 -44273 -61080 -122715 -55628
5575e5628R6193m2570N6863L617p4463J5064M8446N2657j55334j44382J19723
$$ -55628 40565 -2005 54858 58475 -15988 -924 47522 100179 -55155 -199537 -79814
5564g9814N3661M7448J6515n1762k5947O3490o3958j5947p7488J36279Q7456K5146
$$ -79814 -26153 21295 37810 -13952 -39899 23591 -40367 -56314 -133802 2477 89933 115079
5552A15079L1810o4942p8479N5981o2004l1122k9811L2183L3671J2805j79943
$$ 115079 146889 81947 3468 59449 -2555 -33677 -63488 -31305 2366 15171 -164772
5541a64772O6146L8079Q688O4562q973j26080O0751J09406Q3422r3392p462R6610
$$ -164772 -98626 -60547 -51859 12703 3730 -122350 -61599 47807 131229 37837 30375 126985
5529A26985p2894j13563L7566p8446P4217N0496J05076j01357M3938Q1242j07591
$$ 126985 54091 -59472 -21906 -100352 -26135 24361 129437 28080 72018 153260 45669
5518D5669m6188n8055j8981k4899J22705m684J11791K5399J2575r6807o5866j04238
$$ 45669 -519 -58574 -77555 -102454 20251 15567 127358 152757 165332 68525 2659 -101579
5506a01579Q4289J4865L943J42273j6887J96j0169j05309J610m779o701j7857
$$ -101579 -17290 -2425 1518 143791 126904 127100 116931 11622 13232 8453 1752 -16105
5494a6105M3125k1584O5529O5050j35448l2201P8777q0101M0299J01523p6749
$$ -16105 27020 5436 70965 136015 567 -31634 47143 -32958 7341 108864 32115
5483C2115m8067R8430J4365Q8500p2119n4349q298L9062J3540k8774p2833Q8599
$$ 32115 -15952 82478 96843 185343 113224 58875 50577 89639 103179 74405 1572 90171
5471I0171r867j5756J21254J578o0671J880k456p6308N7355L5836M7139p421j1271
$$ 90171 80304 64548 185802 187380 126709 128589 126133 49825 107180 143016 190155 182734 171463
5458A71463r661j5205m9274J4376L8495l037l5550R711o1265Q2448L2779Q7634
$$ 171463 161802 146597 97323 111699 150194 147157 111607 121318 60053 142501 175280 262914
5446B62914M2598j70807l8026P6199l4430L9804O977M3947J58095n683m0408R93
$$ 262914 305512 134705 96679 172878 138448 178252 185229 229176 387271 381588 341180 342173
5434C42173n6733j1214J02442n7109M3218k9679j03163L3652O1227r0312j12600
$$ 342173 285440 274226 376668 319559 362777 333098 229935 263587 324814 234502 121902
5423A21902M6679N7889p0331K5410N0339N4606J6074q766j8871j18330K9400j18825
$$ 121902 168581 226470 156139 181549 231888 286494 302568 293802 274931 156601 186001 67176
5411F7176R0905P153k029J17431n5336J39694k1580j02013n7901J7202n0935R2049
$$ 67176 158081 165234 163205 280636 225300 364994 343414 241401 183500 200702 149767 241816
5399B41816J42969M559m3582j19041k4003M2276K6419o7823j16233K5715J14499
$$ 241816 384785 389344 345762 226721 202718 244994 271413 203590 87357 113072 227571
5388B27571J02505o168j03515K7250O902j8145l6471J26146M2717r4682K2603
$$ 227571 330076 323908 220393 247643 254545 236400 199929 326075 368792 274110 296713
5377B96713J6768N7734j17387O5358j25271l9918J41714j09944O2265L8552L6830
$$ 296713 313481 371215 253828 319186 193915 153997 295711 185767 248032 286584 323414
5366C23414l4930k2835N442J8204p8930M9705J9099j18890J90099P547j2212J34771
$$ 323414 288484 265649 271091 289295 210365 260070 279169 160279 350378 357925 345713 480484
5354D80484k5891l4946J2020r5904J1442O4402J0468R1555M4382l5849K6064L5124
$$ 480484 454593 419647 431667 335763 347205 411607 422075 513630 558012 522163 548227 583351
5342E83351j28407J4753k010k3103M8575J01218j5477m8426q0941k50M3319l1895
$$ 583351 454944 469697 467687 444584 493159 594377 578900 530474 449533 449283 492602 460707
5330D60707O0224Q329N0243L6439L6421L137L4599L6945n7819k8035k2565P3877
$$ 460707 520931 529260 579503 615942 652363 655500 690099 727044 669225 641190 618625 692502
5318F92502L407L6173o8098Q4147J03263k7569r8634l3526N7937J06806j5801
$$ 692502 695909 732082 663984 748131 851394 823825 725191 691665 749602 856408 840607
5307H40607M4233O6873N016K4521l5338N78p289J13816l5251M4965o234P1771
$$ 840607 884840 951713 956729 981250 945912 946490 939201 1053017 1017766 1062731 1056497 1128268
5295A128268L4884j1730Q3307P2985r0983J0223J07625k640J4656K6196O0469
$$ 1128268 1163152 1151422 1234729 1307714 1216731 1226954 1334579 1331939 1346595 1372791 1433260
5284A433260P5609L1989O7934j0525O9653m4259N9614J52932P8688Q3061P601
$$ 1433260 1508869 1540858 1608792 1598267 1667920 1623661 1683275 1836207 1914895 1997956 2005557
5273B005557j0867m2074J32506J57039N5301m340N0447J22530K25056N2058Q744
$$ 2005557 1994690 1952616 2085122 2242161 2297462 2293122 2343569 2466099 2691155 2743213 2751957
5262B751957M1530L9719J5621P3676J72194J68794J37288J47125R5426J89896
$$ 2751957 2793487 2833206 2848827 2922503 3094697 3263491 3400779 3547904 3643330 3833226
5252C833226O3150J49815J95264L03992J25576R5234L44081K70341K79829M18276
$$ 3833226 3896376 4046191 4241455 4545447 4671023 4766257 5110338 5380679 5660508 6078784
5242F078784K29472K08402L42226K89519L63909M24375L99042L40212L74656M93342
$$ 6078784 6308256 6516658 6858884 7148403 7512312 7936687 8335729 8675941 9050597 9543939
5232I543939N73978O11686P38619P79226Q35489R93827J319034J482958J720649
$$ 9543939 10117917 10729603 11468222 12247448 13082937 14076764 15395798 16878756 18599405
5223A8599405J878049J952209J683457Q71217l12266j168320j513740j082002
$$ 18599405 20477454 22429663 24113120 24984337 24672071 23503751 21990011 20908009
5215B0908009q99746m67489q4763J59101M20504P02408J148927J404506J806771
$$ 20908009 20008263 19540774 19456011 19615112 20035616 20738024 21886951 23291457 25098228
5206B5098228K278335K812759L252663L318639K065107m08414l018711m428069
$$ 25098228 27376563 30189322 33441985 36760624 38825731 38417317 35398606 30970537
5198C0970537m222305l383462k367852j803843j287596j039210o75174j43489
$$ 30970537 26748232 23364770 20996918 19193075 17905479 16866269 16191095 16047606
5190A6047606J43917K20839N92983Q68960J200679J405817J019749Q4719j580673
$$ 16047606 16191523 16412362 17005345 17874305 19074984 20480801 21500550 21585269 20004596
5181B0004596k393670k634631k283222j867577j380271j135547q92291o61254
$$ 20004596 17610926 14976295 12693073 10825496 9445225 8309678 7417387 6756133
5173F756133n51314m82937m56265m76629l42007k84138k34814j88034j91923k09717
$$ 6756133 6204819 5721882 5265617 4788988 4446981 4162843 3928029 3739995 3548072 3338355
5163C338355j80370j26958j02199j41968j34249j14902j20706K7079o5137m1300
$$ 3338355 3157985 3031027 2928828 2786860 2652611 2537709 2417003 2444082 2378945 2337645
5153B337645R724j3635j14948o9756j07441Q2129M8120j31352q9456q5548l7004
$$ 2337645 2347369 2333734 2218786 2149030 2041589 2123718 2171838 2040486 1951030 1865482 1828478
5142A828478k1233r3616r1844k2730j38644k01171Q3909N1150m2009J7145j26077
$$ 1828478 1807245 1713629 1621785 1599055 1460411 1259240 1343149 1394299 1352290 1369435 1243358
5131A243358O269J46542j64773k7077q0068k3498J4547l5216l8269p3152n979
$$ 1243358 1249627 1396169 1231396 1204319 1124251 1100753 1115300 1080084 1041815 968663 962684
5120I62684L6448O610p3796m7945l0164R7161o7672m6681Q6981J053j15116j3739
$$ 962684 999132 1005742 931946 884001 853837 950998 883326 836645 923626 924679 809563 795824
5108G95824r4168L6841l2415M4528J29543m1268j43355n0466J25890R327K4065
$$ 795824 701656 738497 706082 750610 880153 838885 695530 645064 770954 780281 804346
5097H04346n7514M0731j11470n0168Q0440r4622m1322k3232L020j4665p8540n3092
$$ 804346 746832 787563 676093 625925 706365 611743 570421 547189 550209 535544 457004 403912
5085D03912N2433N4324q1101K262R8987p966M9232o3557J8526l615L2751k085
$$ 403912 456345 510669 429568 431830 530817 522851 572083 508526 527052 523437 556188 554103
5073E54103k833j28161P9133q701l9804r7581K8127L067o7071J10205j40469L4671
$$ 554103 551270 423109 502242 493541 453737 356156 384283 387350 320279 430484 290015 324686
5061C24686n6930Q4346K8387m069q1498n0071J6370M7203Q6837j0605j9426L3169
$$ 324686 267756 352102 380489 376420 294922 244851 261221 308424 395261 384656 365230 398399
5049C98399m5590J459j267j13966M8977l3958J32019J0450n361J6287j6358o5782
$$ 398399 352809 354268 353001 239035 288012 254054 386073 396523 391162 407449 391091 325309
5037C25309P1662j3850q8182j3091P1111o3324Q8821m0686o8545n469N4945P398
$$ 325309 396971 383121 294939 281848 352959 289635 378456 337770 269225 263756 318701 326099
5025C26099n7764Q3978J9653J22453q4226O3536n3600j0657k3600J05815l2563
$$ 326099 268335 352313 371966 494419 410193 473729 420129 409472 385872 491687 459124
5014D59124N7500j09923N9615k5771O3723o877k4255m3127n0300p9480q8135J14370
$$ 459124 516624 406701 466316 440545 504268 497391 473136 430009 379709 300229 212094 326464
5002C26464L0549J39240j202P4204j08479P276J34832l8489J0429n6589k4309
$$ 326464 357013 496253 495051 569255 460776 468052 602884 564395 574824 518235 493926
4991D93926p6527L9545O1432q4150k6023q7182M933N5384N8904p9021K6848Q4368
$$ 493926 417399 456944 518376 434226 408203 321021 325954 381338 440242 361221 388069 472437
4979D72437q8564J8218J24441k0318p5653K3536P6318o1258O9017k0434L1336
$$ 472437 383873 402091 526532 506214 430561 454097 530415 469157 538174 517740 549076
4968E49076J8697r5242j41383P8713N9789P4903q0076j22058P6547N1680L3241
$$ 549076 567773 472531 331148 409861 469650 544553 464477 342419 418966 470646 503887
4957E03887j17228l8384L2547P3957l547J4871J08629k4000k6457m8862J4845
$$ 503887 386659 348275 380822 454779 451232 466103 574732 550732 524275 475413 490258
4946D90258j4740m238m7409k0682l534J5959k416k8991N563m0683K7209n0352
$$ 490258 475518 471280 423871 403189 399655 415614 413198 384207 389770 349087 376296 325944
4934C25944K9645p997J62221l69q1196o9374R1867N8531l8796n0328P458J28537
$$ 325944 355589 347592 509813 509444 428248 358874 450741 509272 470476 420148 427606 556143
4922E56143K8998p9378J9110n247o9818k2821P9766j6871M6469J19442m4286J3743
$$ 556143 585141 505763 524873 519626 449808 426987 506753 489882 536351 655793 611507 625250
4910F25250l193J3596j11043o6384R4538p3179M4394J35691M1571o5498Q3998
$$ 625250 622057 635653 524610 458226 552764 479585 523979 659670 701241 635743 719741
4899G19741m176j14711N4372j07760L1727K706J35830P7358L6763K4942n3079
$$ 719741 715565 600854 655226 547466 579193 581899 717729 795087 831850 856792 803713
4888H03713N4862p0576n1789N9849j8564L9027K2025J9603p446L8682j6200J7261
$$ 803713 858575 787999 736210 796059 777495 816522 838547 858150 850704 889386 873186 890447
4876H90447J31843k1553j0457J7262J13149o2886l452j3009n2802m6866Q4211
$$ 890447 1022290 1000737 990280 1007542 1120691 1057805 1054353 1041344 988542 941676 1025887
4865A025887K7942m0473P4236k7814P6108L4887l0866K7222O5082L0638j8207
$$ 1025887 1053829 1013356 1087592 1059778 1135886 1170773 1139907 1167129 1232211 1262849 1244642
4854A244642L7912J88056L4614K1967J6832r7113J68730l9418M4532L938J39448
$$ 1244642 1282554 1470610 1505224 1527191 1544023 1446910 1615640 1576222 1620754 1624692 1764140
4843A764140k4857O4849J87192m3569J47499j36872K6215L5605J88757J37672
$$ 1764140 1739283 1804132 1991324 1947755 2095254 1958382 1984597 2020202 2208959 2346631
4833B346631J41449O0298J9465M3755N9876l4903J20499M6331L2805Q2236P8121
$$ 2346631 2488080 2548378 2567843 2611598 2671474 2636571 2757070 2803401 2836206 2918442 2996563
4822B996563J64437k7568N4793J33761R3498J32854P4285K15567P0423P9132L53862
$$ 2996563 3161000 3133432 3188225 3321986 3415484 3548338 3622623 3838190 3908613 3987745 4341607
4811D341607K01972J75750R8332O2890J40906J64583J05457J51278K63609K85569
$$ 4341607 4543579 4719329 4817661 4880551 5021457 5186040 5291497 5442775 5706384 5991953
4801E991953J86650K31580L37908K71567K32319M03753J76375K40965L98946L98111
$$ 5991953 6178603 6410183 6748091 7019658 7251977 7655730 7832105 8073070 8472016 8870127
4791H870127M03446M72529L77651N26758N48842P96770P29385P36574R76844J094181
$$ 8870127 9273573 9746102 10123753 10650511 11199353 11996123 12725508 13462082 14438926 15533107
4781A5533107J415780J552181J749195K100484K286160K037440J051180m44754
$$ 15533107 16948887 18501068 20250263 22350747 24636907 26674347 27725527 27280773
4773B7280773j691787k019729j669813j154925o65863l49609n8402L76103P97102
$$ 27280773 25588986 23569257 21899444 20744519 20078656 19729047 19670645 20046748 20843850
4764B0843850Q39639J352357J704001K130864K925813L535632L685422K404084
$$ 20843850 21683489 23035846 24739847 26870711 29796524 33332156 37017578 39421662
4756C9421662k66496l355954m805689m434485l548137k663588k111089j412474
$$ 39421662 39155166 35799212 30993523 26559038 23010901 20347313 18236224 16823750
4748A6823750r21173o57619l96363m8688Q3279M49030N65105J027167J163506
$$ 16823750 15902577 15244958 14848595 14799907 14883186 15332216 15897321 16924488 18087994
4739A8087994J071695L20950j194118k241737k357462k070901j646039j310762
$$ 18087994 19159689 19480639 18286521 16044784 13687322 11616421 9970382 8659620
4731H659620j056723p85362p49257m18882l58184l92347k59782l98249l43937
$$ 8659620 7602897 6817535 6068278 5649396 5291212 4898865 4639083 4240834 3896897
4722C896897k31203k41785j97602j08419j17536j98539j99936q0173k1807o9226
$$ 3896897 3665694 3423909 3226307 3117888 3000352 2801813 2601877 2521704 2499897 2430671
4712B430671p4842p4393j0617j21305n7203k2811m581n3924n3005j76613o6596
$$ 2430671 2355829 2281436 2270819 2149514 2092311 2069500 2064919 2010995 1957990 1781377 1714781
4701A714781j7210k3807L5104j5052p8298q8607q3349L8484p3958N786P4032N1536
$$ 1714781 1697571 1673764 1708868 1693816 1615518 1526911 1443562 1482046 1408088 1413874 1487906 1539442
4689A539442j11193q893K1491m9339j17678j4801J62916j6952L8118m3773j7832
$$ 1539442 1428249 1419356 1440847 1391508 1273830 1259029 1421945 1404993 1443111 1399338 1381506
4678A381506j25652j15803J08494M2685l9373l2280Q5070K720m0221Q6177J7083
$$ 1381506 1255854 1140051 1248545 1291230 1251857 1219577 1304647 1307367 1267146 1353323 1370406
4667A370406O158l0671m4715O9919p2534m1132n624p7952j5723j4457N8813K6632
$$ 1370406 1376564 1345893 1301178 1371097 1298563 1257431 1251807 1173855 1158132 1143675 1202488 1229120
4655A229120o470L0794l7862N074M233m0852Q0121J2527j4805M7717l4873j422
$$ 1229120 1222650 1253444 1215582 1220656 1224889 1184037 1264158 1276685 1261880 1309597 1274724 1273302
4643A273302j36281o8924J26265L3844l2213N7020J7223j8041n1845L4190n3991
$$ 1273302 1137021 1068097 1194362 1228206 1195993 1253013 1270236 1252195 1200350 1234540 1180549
4632A180549j4358N8327L9813J0920K0051k7896O8234M3146k0857J10127l7896
$$ 1180549 1166191 1224518 1264331 1275251 1295302 1267406 1335640 1378786 1357929 1468056 1430160
4621A430160o7738r9192N5430M0765J10603K8163j7651k1547P0211O3101P9129
$$ 1430160 1362422 1263230 1318660 1359425 1470028 1498191 1480540 1458993 1529204 1592305 1671434
4610A671434p3876N5961M6052K8735K8218O8331m4199J11660Q6114K0275M3099
$$ 1671434 1597558 1653519 1699571 1728306 1756524 1824855 1780656 1892316 1978430 1998705 2041804
4599B041804K8779N3690n2617J00423J6944K5782J5553R8326k182M7339K5450
$$ 2041804 2070583 2124273 2071656 2172079 2189023 2214805 2230358 2328684 2326502 2373841 2399291
4588B399291M5430n4838Q3566J26331j1646R6341N0461M4151K7238k1159J51048
$$ 2399291 2444721 2389883 2473449 2599780 2588134 2684475 2734936 2779087 2806325 2785166 2936214
4577B936214J33553J33853J44258L7967J6233R9122J9374Q5117P2969J14055K26586
$$ 2936214 3069767 3203620 3347878 3385845 3402078 3501200 3520574 3605691 3678660 3792715 4019301
4566D019301O0716J49814J85636J20842J64402J59129K98238K14574K32886L29865
$$ 4019301 4080017 4229831 4415467 4536309 4700711 4859840 5158078 5372652 5605538 5935403
4556E935403K53390L42141K49140L65326K74905K02923L23501J77249L95766L68850
$$ 5935403 6188793 6530934 6780074 7145400 7420305 7623228 7946729 8123978 8519744 8888594
4546H888594M07795N24170N71276O03967N88875O82926P93965Q99199J015360
$$ 8888594 9296389 9820559 10391835 10995802 11584677 12267603 13061568 13960767 14976127
4537A4976127J129471J231199J420906J686624K083707J864743J669459N38987
$$ 14976127 16105598 17336797 18757703 20444327 22528034 24392777 26062236 26601223
4529B6601223o48340j232939j163336p01537l45640J66730J20473J70856N61926
$$ 26601223 25952883 24719944 23556608 22855071 22509431 22676161 22796634 22967490 23529416
4520B3529416Q21087J242102J711380K162516K153256J452502M44071l29469j030204
$$ 23529416 24350503 25592605 27303985 29466501 31619757 33072259 33516330 33186861 32156657
4511C2156657j556867j737083k236178k445052k003537j405467r28235m70067
$$ 32156657 30599790 28862707 26626529 24181477 22177940 20772473 19844238 19374171
4503A9374171k32566k61102q0998K66958O75269R51043Q30070J71209j099268
$$ 19374171 19141605 18880503 18799505 19066463 19741732 20692775 21522845 21694054 20594786
4494B0594786k178261k405195k266204j964819j533389j282649j032195p43452
$$ 20594786 18416525 16011330 13745126 11780307 10246918 8964269 7932074 7188622
4486G188622p20222m68793l92609l92214l57647l67813k49308j66673j80660k3233
$$ 7188622 6468400 5999607 5606998 5214784 4857137 4489324 4240016 4073343 3892683 3869450
4476C869450j27928l64884j42917l3767j46310j77086j24610m8625j22854r6307
$$ 3869450 3741522 3376638 3233721 3199954 3053644 2876558 2751948 2703323 2580469 2484162
4466B484162p1417p6023m6272n7060L4119k6268p5243r8767n6779n2115J7815
$$ 2484162 2412745 2336722 2290450 2233390 2267509 2241241 2165998 2067231 2010452 1958337 1976152
4455A976152j07244k5353m5792m3678m3338k4726p8509O7679m0908j365j06977
$$ 1976152 1868908 1843555 1797763 1754085 1710747 1686021 1607512 1675191 1634283 1632918 1525941
4444A525941j5402L0809R037K380R5164n6621k5654P8214J442k8136m3348p0369
$$ 1525941 1510539 1541348 1550385 1552765 1647929 1591308 1565654 1643868 1645310 1617174 1573826 1503457
4432A503457r654n2267N3580j4848j9643K8585j17066L573l248J290l5497M2418
$$ 1503457 1493803 1441536 1495116 1480268 1460625 1489210 1372144 1375717 1372469 1373759 1338262 1380680
4420A380680k5814j3034J1766J52755k0647M4796n0537j66457j18237k8083r870
$$ 1380680 1354866 1341832 1353598 1506353 1485706 1530502 1479965 1313508 1195271 1167188 1157318
4409A157318Q762j88196l265N6513M9872R6460O934j4356L4469J1718k1277Q6021
$$ 1157318 1166080 977884 974619 1031132 1081004 1177464 1184398 1170042 1204511 1216229 1194952 1280973
4397A280973J29742J03540J57086J42957J73165J08197p0532k11779k20306j82272
$$ 1280973 1410715 1514255 1671341 1814298 1987463 2095660 2025128 1813349 1593043 1410771
4387A410771j10023q2335j40588k3649l5106p7579K836r1374M1477n5926L6173
$$ 1410771 1300748 1218413 1077825 1054176 1019070 941491 944327 852953 894430 838504 874677
4376H74677L1369R8492R9242Q4412J25610J52925K33983J67368J19376n3632k15244
$$ 874677 906046 1004538 1103780 1188192 1313802 1466727 1700710 1868078 1987454 1933822 1718578
4365A718578k99606j38901j29870j68058j12048m4601o6252o2737k5620m5380
$$ 1718578 1418972 1280071 1150201 982143 870095 825494 759242 696505 670885 625505
4355F25505k2883J8375L2886O7955l8194l6027M0735R7453n1650J7232J05859
$$ 625505 602622 620997 653883 721838 683644 647617 688352 785805 734155 751387 857246
4344H57246o591M5651r5098n0964l8584j57238Q4139j23694K4258L157n8744l1879
$$ 857246 850655 896306 801208 750244 711660 554422 638561 514867 539125 542282 483538 451659
4332D51659P2168k8567n5926q1040l3526Q3877o590L5963Q8436r5488Q872o7767
$$ 451659 523827 495260 439334 358294 324768 408645 402055 438018 526454 430966 439838 372071
4320C72071p082L9451j40822P266L2730Q1503L2502L8074M9984q3903j04087P8913
$$ 372071 364989 404440 263618 270884 303614 385117 417619 455693 505677 421774 317687 396600
4308C96600M2242N5312l8990r5294j35114N3303J50104o4307j48469l984J12054
$$ 396600 438842 494154 455164 359870 224756 278059 428163 363856 215387 211403 323457
4297C23457j1905N756J28415k6049m5519l9100J1257j4800j09657Q0420k1860
$$ 323457 311552 317308 445723 419674 374155 335055 346312 331512 221855 302275 280415
4286B80415J16064L44L254R314j2841N4502k4522J6615j00743j4965Q4743O230
$$ 280415 396479 396823 400077 409391 396550 451052 426530 443145 342402 327437 412180 418410
4274D18410j20256r3954M9850R3796J5924k0764o4484n7426R078P6939J2567m0026
$$ 418410 298154 204200 254050 347846 363770 343006 278522 221096 230174 307113 319680 279654
4262B79654j0076O200M0011N3552J2034K3194l1042M2042n912j48291K6676n1963
$$ 279654 269578 275778 315789 369341 381375 404569 373527 415569 409657 261366 288042 236079
4250B36079L7923l4078n7998J27725o2913l1873R651n3107L4359N9431L82o952
$$ 236079 274002 239924 181926 309651 246738 214865 224516 171409 205768 265199 265581 258629
4238B58629m232J4747j23736m5196R3696K9838K1717m2239j08607J2188J01163
$$ 258629 254397 269144 145408 100212 193908 223746 245463 203224 94617 106805 207968
4227B07968L9745j8559l7613m6952O2304k8497M109k2946j0746O9459N4423j39344
$$ 207968 247713 229154 191541 144589 206893 178396 182505 159559 148813 218272 272695 133351
4215A33351q9569J5844J04785P3936o4652M7932p5090j1563J44578l7495P737
$$ 133351 43782 59626 164411 238347 173695 221627 146537 134974 279552 242057 249794
4204B49794k01906R1325O8753N1558n3285O9623q2915j8110L3348m0516J04444
$$ 249794 47888 139213 207966 259524 206239 275862 192947 174837 208185 167669 272113
4193B72113o3499L6308O1172P5253n0705j46422k2368P3756n7227L3044J35863
$$ 272113 208614 244922 306094 381347 330642 184220 161852 235608 178381 211425 347288
4182C47288L9736m5082k1495J6638M8660j8884J0679J0117r796o0476R9627j6534
$$ 347288 387024 341942 320447 337085 385745 366861 377540 387657 377861 317385 417012 400478
4170D00478K636j30116J55193l1699j5494L3047N0418M4975j04519Q3938R199
$$ 400478 403114 272998 428191 396492 380998 414045 464463 509438 404919 488857 498056
4159D98056m5559Q9068J10690m6616q9499J15746m9170q2953R1902l0937r7120
$$ 498056 452497 541565 652255 605639 516140 631886 582716 499763 591665 560728 463608
4148D63608r963L6818j06174K6420Q0874j41971k6423J21832o8092Q5359K3517
$$ 463608 453645 490463 384289 410709 491583 349612 323189 445021 376929 462288 485805
4137D85805R522p1347P4602R0734l6312m9472j9111K4745j07778P3093Q1330M6621
$$ 485805 495327 423980 498582 589316 553004 503532 484421 509166 401388 474481 555811 602432
4125F02432J1677m5846M2222Q475l4491J20436P228n6169N3357M1473m5666O5562
$$ 602432 614109 568263 610485 618960 584469 704905 712133 655964 709321 750794 705128 770690
4113G70690k1310K0618O1841J6442L6136k2225l6499o1407L0330k1987k5257M9863
$$ 770690 749380 769998 831839 848281 884417 862192 825693 764286 794616 772629 747372 797235
4101G97235l1906J57574N7965k3543N5420l6448L2968L6515j17615J56472Q2899
$$ 797235 765329 922903 980868 957325 1012745 976297 1009265 1045780 928165 1084637 1167536
4090A167536p4326M2877Q7415J6256O2551n7336P8546J53615k1292P4658J20585
$$ 1167536 1093210 1136087 1223502 1239758 1302309 1244973 1323519 1477134 1455842 1530500 1651085
4079A651085J02545J58184O4046J27084J65290J95689M94695N01945O18931J47533
$$ 1651085 1753630 1911814 1975860 2102944 2268234 2463923 2958618 3460563 4079494 4227027
4069D227027m81047p13012n85658n25686l59910l13845p6554q1829o6794r1635
$$ 4227027 3745980 3032968 2447310 1921624 1561714 1247869 1171315 1089486 1022692 931057
4059I31057m5344l0021k2766q7223p7127M8519o6379N0187l7720L1745j01997
$$ 931057 885713 855692 832926 745703 668576 717095 650716 700903 663183 694928 592931
4048E92931M3709l864j18250N9449O2082J3165L9716o7953M9050P108j17262J68
$$ 592931 636640 632776 514526 573975 636057 649222 688938 620985 670035 677143 559881 560049
4036E60049K1408K1449R2587m0511L5679k0737q1083K4539M4664O414N0304O1112
$$ 560049 581457 602906 695493 654982 690661 669924 588841 613380 658044 664458 714762 775874
4024G75874P8093m2548p7395M7699j54308J4066J72882M0063j30907L6664o3772
$$ 775874 853967 811419 734024 781723 627415 641481 814363 854426 723519 760183 696411
4013F96411J18690N2879j27974l9791J13814K3770l6267n9498J47396K6466l2557
$$ 696411 815101 867980 740006 700215 814029 837799 801532 742034 889430 915896 883339
4002H83339l590j939L4805O1998l1842J1868K6878L6508J02251l6947K43k1543
$$ 883339 879749 877810 912615 974613 942771 954639 981517 1018025 1120276 1083329 1083572 1062029
3990A062029k988J1223O962O3691m7642k4066O9675K6860k6739m1071J5955K08908
$$ 1062029 1059041 1070264 1077226 1140917 1093275 1069209 1138884 1165744 1139005 1097934 1113889 1322797
3978A322797l2067L097O533L5215Q9877r652M0588k7783J05939j5175J28876K6148
$$ 1322797 1290730 1293827 1300360 1335575 1425452 1415800 1456388 1428605 1534544 1519369 1648245 1674393
3966A674393o9160J84491n3158k3295N1624L5275n091M4455l0629N4308Q0210
$$ 1674393 1605233 1789724 1736566 1713271 1764895 1800170 1795079 1839534 1808905 1863213 1943423
3955A943423J12804O7384k4394O0221P5896O8800o787L6845Q4823P3808K6441
$$ 1943423 2056227 2123611 2099217 2159438 2235334 2304134 2297347 2334192 2419015 2492823 2519264
3944B519264M0078N6905J02684j6118J14803N2021L3348L1525Q9620M6319L6751
$$ 2519264 2559342 2616247 2718931 2702813 2817616 2869637 2902985 2934510 3024130 3070449 3107200
3933C107200J04308P5043P2351J73138J29720P2496J6255K01331N1811J44824
$$ 3107200 3211508 3286551 3358902 3532040 3661760 3734256 3750511 3951842 4003653 4148477
3923D148477J52537K13544K03621L12906K81144J91710K29471O6713K97245L74079
$$ 4148477 4301014 4514558 4718179 5031085 5312229 5503939 5733410 5800123 6097368 6471447
3913F471447K71118M13154K86192L27160L20938M25033L83669L03393O46038O62896
$$ 6471447 6742565 7155719 7441911 7769071 8090009 8515042 8898711 9202104 9848142 10511038
3903A0511038O04516O36740P40460R02740J067803J076492J305769J575354J727657
$$ 10511038 11115554 11752294 12492754 13395494 14463297 15539789 16845558 18420912 20148569
3894B0148569J942522J978017J764883O56760o52725j329476j368059q77940n27069
$$ 20148569 22091091 24069108 25833991 26490751 25838026 24508550 23140491 22262551 21735482
3885B1735482p0070J05499J10258L69947O80087J163817J529536J812661J718268
$$ 21735482 21665412 21770911 21881169 22251116 22931203 24095020 25624556 27437217 29155485
3876B9155485J464719R58306M73290m92228j548181k199464k689844k461934k048368
$$ 29155485 30620204 31578510 32051800 31559572 30011391 27811927 25122083 22660149 20611781
3867B0611781j362288r61585o48991l75053l30367k02479J89716M95368P90067
$$ 20611781 19249493 18287908 17638917 17263864 16933497 16731018 16920734 17416102 18206169
3858A8206169P53784L37093o57147j627417k140879k080641j805792j527459j134204
$$ 18206169 18959953 19297046 18639899 17012482 14871603 12790962 10985170 9457711 8323507
3849H323507q34852p13921o39617m73046n75695l40116m09206j69339k40409k52617
$$ 8323507 7488655 6774734 6135117 5662071 5086376 4746260 4337054 4167715 3927306 3674689
3839C674689r2943j58012j33784j72532j06145j08019r2602j21011q3624j26464
$$ 3674689 3581746 3423734 3289950 3117418 3011273 2903254 2810652 2689641 2606017 2479553
3829B479553j47412r1696p3635n4810j826j31545l6695J4900k1119q6553L3689
$$ 2479553 2332141 2240445 2166810 2112000 2110174 1978629 1941934 1956834 1935715 1849162 1882851
3818A882851j51530o7m4108J5464j41946j08073J65424o6593j02802n7595j0666
$$ 1882851 1731321 1731254 1687146 1702610 1560664 1452591 1618015 1551422 1448620 1391025 1380359
3807A380359P3751q4525o1272p50l11N7542j39611M2946o1865l1243l9275n0029
$$ 1380359 1454110 1369585 1308313 1307563 1307252 1364794 1225183 1268129 1206264 1175021 1135746 1085717
3795A085717M1488n2792L4682q176j8809m8229n7711L5564l5284L7062n2066j1205
$$ 1085717 1127205 1074413 1109095 1100919 1082110 1033881 976170 1011734 976450 1013512 961446 950241
3783I50241L9619k8034j8866p1492J35369p3375R48Q3435k8729o5203M3460n148
$$ 950241 989860 961826 942960 871468 1006837 933462 934410 1017845 989116 923913 967373 962225
3771I62225o7123o6162K5032P3754k3268J7902M662O3540p3959K7270m4049p1927
$$ 962225 895102 828940 853972 927726 904458 922360 927022 990562 916603 943873 899824 827897
3759H27897J523m963P1348M1210k6591K522k6403k6480J00884K2913J4548L1087
$$ 827897 829420 824457 895805 937015 910424 912946 886543 860063 960947 983860 998408 1029495
3747A029495p7060k2270p851Q5929J3881M026l324q0649J34961j2103o2531K8748
$$ 1029495 952435 930165 922314 1008243 1022124 1026150 1022826 942177 1077138 1065035 1002504 1031252
3735A031252j8201P9887j7400K7787j4472Q7766p449q5990Q250L6984N1815K706
$$ 1031252 1013051 1092938 1075538 1103325 1088853 1176619 1169170 1083180 1091430 1128414 1180229 1182935
3723A182935P0894N9138l1194J0251L541L4049o83L1144p1145j849L1710J57862
$$ 1182935 1253829 1312967 1281773 1292024 1295565 1329614 1328931 1360075 1288930 1287081 1318791 1476653
3711A476653J244m057O5005J4665M3845o8242K9922N2065n845J34832M3815K5116
$$ 1476653 1477897 1473840 1538845 1553510 1597355 1529113 1559035 1611100 1605255 1740087 1783902 1809018
3699A809018J72978K734J31914J38431J23577p4497k9301j15274j16813k8915
$$ 1809018 1981996 1984730 2116644 2255075 2378652 2304155 2274854 2159580 2042767 2013852
3689B013852o9077p6166M5205O6403J33566J1109j10696K4679J28329n2266M5357
$$ 2013852 1944775 1868609 1913814 1980217 2113783 2124892 2014196 2038875 2167204 2114938 2160295
3678B160295P9534N9992J26230M5643k3119k6019n0936K03609n983J12847J27882
$$ 2160295 2239829 2299821 2426051 2471694 2448575 2422556 2371620 2575229 2569246 2682093 2809975
3667B809975n3461K1659N3436J48155L6469O0895k7717M786J77780P6410J11435
$$ 2809975 2756514 2778173 2831609 2979764 3016233 3077128 3049411 3054197 3231977 3308387 3419822
3656C419822Q8510k4644M7179J15322M7829J24188K46615Q2903J79072R9482N2686
$$ 3419822 3508332 3483688 3530867 3646189 3694018 3818206 4064821 4147724 4326796 4426278 4478964
3645D478964K32522Q3390R7186J64631J93836K08008J63407K06713L02584J67951
$$ 4478964 4711486 4794876 4892062 5056693 5250529 5458537 5621944 5828657 6131241 6299192
3635F299192K80018L03314L12990M16750M70385M63830M85526N39649L74903K99074
$$ 6299192 6579210 6882524 7195514 7612264 8082649 8546479 9032005 9571654 9946557 10245631
3625A0245631K84607M62191L31466M53447N53480O36759O06248R06594R42029
$$ 10245631 10530238 10992429 11323895 11777342 12330822 12967581 13573829 14480423 15422452
3616A5422452J015424R88424Q42825N71976N25281L48620M45589P38183Q75320
$$ 15422452 16437876 17426300 18269125 18841101 19366382 19715002 20160591 20898774 21774094
3607B1774094J239756J590422J660936J461802R60901J30047n28701n61993l88564
$$ 21774094 23013850 24604272 26265208 27727010 28687911 28817958 28289257 27727264 27338700
3598B7338700r3801M36720Q98408J300369J732005J138703J06222r50510j898678
$$ 27338700 27244899 27681619 28580027 29880396 31612401 32751104 32857326 31906816 30008138
3589C0008138j947039j605506j212266l52409P0418O16289P55674K16715n52254
$$ 30008138 28061099 26455593 25243327 24890918 24961336 25577625 26333299 26550014 25997760
3580B5997760j665314k091143k084274j736582j228026q51219l48894N096J9168
$$ 25997760 24332446 22241303 20157029 18420447 17192421 16341202 15992308 15997404 16016572
3571A6016572k05887o53401j020006j123649j138503q24630n71765l57841j85593
$$ 16016572 15810685 15157284 14137278 13013629 11875126 11050496 10478731 10120890 9935297
3562I935297Q4032N1319O5904j24311k88702j06619j42649K8354J35010L65935
$$ 9935297 10019329 10070648 10136552 10012241 9723539 9616920 9474271 9502625 9637635 10003570
3552A0003570L48669L70741K48371J31539N8332J22209K38217K63211K12037M53403
$$ 10003570 10352239 10722980 10971351 11102890 11161222 11283431 11521648 11784859 11996896 12450299
3542A2450299O27083P46967N80970N76707J12515k92204k70584k46424r2984M8409
$$ 12450299 13077382 13824349 14405319 14982026 15094541 14802337 14531753 14285329 14192345 14240754
3532A4240754L23957N57918N93595N03425J05495k82394o81785j001787q21910
$$ 14240754 14564711 15122629 15716224 16219649 16325144 16042750 15360965 14359178 13537268
3523A3537268o32338m09364k2684P7208K51115q2107j49577n80216j045476q82156
$$ 13537268 12904930 12495566 12472882 12550090 12801205 12719098 12569521 11989305 10943829 10061673
3513A0061673q35346p46686n05582k30410j73668k81445k55387k72352l76670
$$ 10061673 9226327 8479641 7974059 7743649 7569981 7288536 7033149 6760797 6384127
3504F384127o55260n35064l73504k93844k22702l15631k85661j80718j60666j86239
$$ 6384127 5728867 5193803 4820299 4526455 4303753 3988122 3702461 3521743 3361077 3174838
3494C174838j62029k22167q4465q5965j54381k9072j11752q7464q3996r1439m5039
$$ 3174838 3012809 2790642 2706177 2620212 2465831 2436759 2325007 2237543 2153547 2062108 2017069
3483B017069j15582J01675p329m6608n9771j10082L9873o8424m0035O3108k1720
$$ 2017069 1901487 2003162 1995833 1949225 1889454 1779372 1819245 1750821 1710786 1773894 1752174
3472A752174n3626k7151K9121j20218O3398n6717m2277J7217m68r4047n0029M2931
$$ 1752174 1698548 1671397 1700518 1580300 1643698 1586981 1544704 1561921 1561453 1467406 1417377 1460308
3460A460308M0098M0160k6772M5822l3538L8294p7065m6218R7839k2108q82Q2972
$$ 1460308 1500406 1540566 1513794 1559616 1526078 1564372 1487307 1441089 1538928 1516820 1515938 1598910
3448A598910l0818L460m1396o0977m786J09792o5565n8339P8593N0698J07323
$$ 1598910 1568092 1571552 1530156 1469179 1464393 1574185 1508620 1450281 1528874 1579572 1686895
3437A686895j63664m0915Q3946K7615L4960K8217N3181q7687q0m9705K0262m2741
$$ 1686895 1523231 1482316 1566262 1593877 1628837 1657054 1710235 1622548 1622468 1572763 1593025 1550284
3425A550284j3179R9525k1883P3795Q2753r9324O739k7056k5824J30646k0528
$$ 1550284 1537105 1636630 1614747 1688542 1771295 1671971 1678710 1651654 1625830 1756476 1735948
3414A735948P1217m0922r1824L1685R2507o2628k5717O8161L6225N7640R1523
$$ 1735948 1807165 1766243 1674419 1706104 1798611 1735983 1710266 1778427 1814652 1872292 1963815
3403A963815n3274m2094j4929l3832O7940q0480J08289J01577n3164m6564k607
$$ 1963815 1910541 1868447 1853518 1819686 1887626 1807146 1915435 2017012 1963848 1917284 1914677
3392A914677L8564L8603o0262K019Q8254K4325j4043n874o8532m004J18784J5192
$$ 1914677 1953241 1991844 1931582 1933601 2021855 2046180 2032137 2026263 1957731 1953727 2072511 2087703
3380B087703l8016O9829O4403P2703n7714o8171J5867o4120J01153J3675J14970
$$ 2087703 2049687 2119516 2183919 2256622 2198908 2130737 2146604 2082484 2183637 2197312 2312282
3369B312282P9335Q7547k01790j2935J0428J02425J1123N5555k5853N477L6894
$$ 2312282 2391617 2479164 2277374 2264439 2274867 2377292 2388415 2443970 2418117 2423594 2460488
3358B460488k9634K7967Q7690k3013L9291P0000q5281L8082Q0455m3162L2325
$$ 2460488 2430854 2458821 2546511 2523498 2562789 2632789 2547508 2585590 2666045 2622883 2655208
3347B655208K8992K9130J10498P4871J9749l4027P403p6705R3610N6751O5190
$$ 2655208 2684200 2713330 2823828 2898699 2918448 2884421 2891824 2815119 2908729 2965480 3030670
3336C030670L3471Q7221J66803p288n2038l2187P7819R2767j5218O3694m3006
$$ 3030670 3064141 3151362 3318165 3310877 3258839 3226652 3304471 3397238 3382020 3445714 3402708
3325C402708l3580R3213m9463L7561R1247J0625J3594m3269m0473m6940P5175
$$ 3402708 3369128 3462341 3412878 3450439 3541686 3552311 3565905 3522636 3482163 3435223 3510398
3314C510398M461J02167q136J4652Q759j409J0225o4462P8419J09532l5395J33201
$$ 3510398 3514859 3617026 3608890 3623542 3632301 3630892 3641117 3576655 3655074 3764606 3729211 3862412
3302C862412L473p9121J4598Q4959p775N9483L5163N3358J76700p2483O1596J97915
$$ 3862412 3865885 3786764 3801362 3886321 3878546 3938029 3973192 4026550 4203250 4130767 4192363 4390278
3290D390278j8228j10325m865R8188J25943n4543k2956L0760P5496J14094k7404
$$ 4390278 4372050 4261725 4256860 4355048 4480991 4426448 4403492 4434252 4509748 4623842 4596438
3279D596438J32744Q7819O0002J05839J8778r0952K6975L413J18417N4447J11928
$$ 4596438 4729182 4817001 4877003 4982842 5001620 4910668 4937643 4941056 5059473 5113920 5225848
3268E225848O0770Q252k134k6781J09850n1216J13003K3067j9159o7926N5888
$$ 5225848 5286618 5294870 5292736 5265955 5375805 5324589 5437592 5460659 5441500 5373574 5429462
3257E429462J25136M5015J04307J00912J98617r6673k1995J11417N656J41246
$$ 5429462 5554598 5599613 5703920 5804832 6003449 5906776 5884781 5996198 6001854 6143100
3247F143100J1547J55382J36911J52863J52707o624N8795N6189K35923J25153
$$ 6143100 6154647 6310029 6446940 6599803 6752510 6745886 6804681 6860870 7096793 7221946
3237G221946J16726R0052J5481J71037O4616K0402L4309R3793N6103J45176N4294
$$ 7221946 7338672 7428724 7444205 7615242 7679858 7700260 7734569 7828362 7884465 8029641 8083935
3226H083935M0002O0328J612N4531l4634K00482P0327Q9237p488n722J9636J65893
$$ 8083935 8123937 8184265 8185877 8240408 8205774 8406256 8476583 8565820 8558332 8552610 8572246 8738139
3214H738139J40458N5836Q8468J68196J58441J84711J25151m7243J17041K71383
$$ 8738139 8878597 8934433 9022901 9191097 9349538 9534249 9659400 9612157 9729198 10000581
3204A0000581J72450O1579J47226K55739J90230J09092K09798J73966J68116J18942
$$ 10000581 10173031 10234610 10381836 10637575 10827805 10936897 11146695 11320661 11488777 11607719
3194A1607719K88443K66459J80216R3884J98034K26638K73442Q0277K10071J71500
$$ 11607719 11896162 12162621 12342837 12436721 12634755 12861393 13134835 13215112 13425183 13596683
3184A3596683K31123J64681J59095K82410J53815L04057K78976K32527R0162J17292
$$ 13596683 13827806 13992487 14151582 14433992 14587807 14891864 15170840 15403367 15493529 15610821
3174A5610821K11847K45171K25705K55874K35132L00810K40257K82891L01728
$$ 15610821 15822668 16067839 16293544 16549418 16784550 17085360 17325617 17608508 17910236
3165A7910236M04172K73242M03006L73016L21178L86771K85848M24947M64197
$$ 17910236 18314408 18587650 18990656 19363672 19684850 20071621 20357469 20782416 21246613
3156B1246613N21297N24455N62745N33750O44984O39311O88870P06515Q74816
$$ 21246613 21767910 22292365 22855110 23388860 24033844 24673155 25362025 26068540 26943356
3147B6943356J017090R76599J053594J125176J096030J274001J307535J386043
$$ 26943356 27960446 28937045 29990639 31115815 32211845 33485846 34793381 36179424
3139C6179424J380865J448767J483080J496374J627348J799995J872067K057113
$$ 36179424 37560289 39009056 40492136 41988510 43615858 45415853 47287920 49345033
3131D9345033K255305K498645K759971K926731L291367M007784M663935N210455
$$ 49345033 51600338 54098983 56858954 59785685 63077052 67084836 71748771 76959226
3123G6959226N964615O226876N974776N240871L817360K324952P02013p55677
$$ 76959226 82923841 89150717 95125493 100366364 104183724 106508676 107210689 106455012
3115A06455012j753689j878266j607145o57690K3533M93037K45478o39354j747433
$$ 106455012 104701323 102823057 101215912 100558222 100581755 101074792 101320270 100680916 98933483
3106I8933483l173004m434577n598182o177864o142851n598669m825054l892834
$$ 98933483 95760479 91325902 85727720 79549856 73407005 67808336 62983282 59090448
3098E9090448k894953k122787j809804j280634r29059o51740l60086j78427j43468
$$ 59090448 56195495 54072708 52262904 50982270 50053211 49401471 49041385 48862958 48719490
3089D8719490J13583J76923K92213K91151N10245M73700N72265P31691O77020
$$ 48719490 48833073 49009996 49302209 49593360 50103605 50577305 51149570 51881261 52558281
3080E2558281P57539P44084Q85478Q05164Q45340R13429R30644Q96214Q90088
$$ 52558281 53315820 54059904 54945382 55750546 56595886 57509315 58439959 59336173 60226261
3071F0226261R45429R30141J069494J000343R67990Q94606Q75132Q47323P94347
$$ 60226261 61171690 62101831 63171325 64171668 65139658 66034264 66909396 67756719 68551066
3062F8551066Q20694Q79820R50064R36166J076424R94996J131087J159449J215228
$$ 68551066 69371760 70251580 71201644 72137810 73214234 74209230 75340317 76499766 77714994
3053G7714994J343197J376476J598046J634588J702200J948350K023031K021710
$$ 77714994 79058191 80434667 82032713 83667301 85369501 87317851 89340882 91362592
3045I1362592K132798K235618K313330K381773K572133K724666K990077L289660
$$ 91362592 93495390 95731008 98044338 100426111 102998244 105722910 108712987 112002647
3037A12002647L620522M051652M391101M671055N242231O054596O872876Q190473
$$ 112002647 115623169 119674821 124065922 128736977 133979208 140033804 146906680 155097153
3029A55097153R825167J1339796J2014981J1787007J0281452P929502N172471
$$ 155097153 164922320 176262116 188277097 200064104 210345556 218275058 223447529
3022B23447529J696793j607628l799428m372437l433933j769851p53386o12898
$$ 223447529 225144322 223536694 219737266 215364829 211930896 210161045 209407659 208794761
3014B08794761j439045k696055m500059o771377r298413j0809584j1311309j1004701
$$ 208794761 207355716 204659661 200159602 193388225 184089812 173280228 161968919 150964218
3006A50964218r903915q628654p176908n596480l994525k613542j475477p44861
$$ 150964218 141060303 132431649 125254741 119658261 115663736 113050194 111574717 110829856
2998A10829856k43800L66487J018996J521354K178574K735862L558518M236808
$$ 110829856 110586056 110952543 111971539 113492893 115671467 118407329 121965847 126202655
2990A26202655M950077N873872O885254Q135867R518989J0862737J1688207J1459548
$$ 126202655 131152732 137026604 143911858 152047725 161566714 172429451 184117658 195577206
2982A95577206J0622516R875390R458344Q736541O613178L556219L29784k627590
$$ 195577206 206199722 216075112 225533456 234269997 240883175 244439394 244769178 242141588
2974B42141588m730486n502860n576341n050717m231274l264579k917386l409102
$$ 242141588 237411102 231908242 226331901 221281184 217049910 213785331 210867945 207458843
2966B07458843m594161o345098q228345j0167872j1670579j2752928j2854984
$$ 207458843 202864682 196519584 188291239 178123367 166452788 153699860 140844876
2959A40844876j2120191j0871951r427500q132676o574753n159554l821295k855846
$$ 140844876 128724685 117852734 108425234 100292558 93717805 88558251 84736956 81881110
2951H1881110k023788j408757q15970q3551M64922J017998J301578J341700R38181
$$ 81881110 79857322 78448565 77632595 77549044 78013966 79031964 80333542 81675242 82613423
2942H2613423M01518r6155m78151o48511o82855m28200l88499j55224L624M6967
$$ 82613423 83014941 82918786 82440635 81792124 81109269 80681069 80292570 80137346 80140970 80187937
2932H0187937j59052p12823j270894j410616j632335k040237k270799k446128
$$ 80187937 80028885 79316062 78045168 76634552 75002217 72961980 70691181 68245053
2924F8245053k509287k232617k115563j890656j658074j338559j000852q07758
$$ 68245053 65735766 63503149 61387586 59496930 57838856 56500297 55499445 54691687
2916E4691687k29361j23375L16245M89712O72768R86043J326825J603328J996115
$$ 54691687 54462326 54338951 54655196 55144908 55817676 56803719 58130544 59733872 61729987
2907F1729987K521369K957598L683314M313366M970698N443533N217650M735680
$$ 61729987 64251356 67208954 70892268 75205634 80176332 85619865 90837515 95573195
2899I5573195M571996M544942M266027L097570J388236n12109j925268k885151
$$ 95573195 100145191 104690133 108956160 112053730 113441966 112929857 111004589 108119438
2891A08119438l985522n489850o758665p426468p589429p482033o909950o144034
$$ 108119438 104133916 98644066 91885401 84458933 76869504 69387471 62477521 56333487
2883E6333487n365976m546294l716646k758880k252931j610363j495090j082359
$$ 56333487 50967511 46421217 42704571 39945691 37692760 36082397 34587307 33504948
2875C3504948q84616p15729l92480l00515p036J7961k8950L00122K93634N02816
$$ 33504948 32620332 31904603 31512123 31211608 31204572 31222533 31193583 31493705 31787339 32290155
2865C2290155P56596J132764J347026J281402J159375J004860R43626J019087
$$ 32290155 33046751 34179515 35526541 36807943 37967318 38972178 39915804 40934891
2857D0934891J229676J395113J070964N27086m6808k14907l39873m9543k39618
$$ 40934891 42164567 43559680 44630644 45157730 45110922 44896015 44556142 44506599 44266981
2848D4266981o87082q30879j045269q05103k63785J76691M42347P74253Q06338
$$ 44266981 43579899 42749020 41703751 40898648 40634863 40811554 41253901 42028154 42834492
2839D2834492R73279R47236Q91459N95596K90695j57826o99938r03109r22286
$$ 42834492 43807771 44755007 45646466 46242062 46532757 46374931 45674993 44771884 43849598
2830D3849598r27026j150249j510164j514659j541333j339308j136344r35264
$$ 43849598 42922572 41772323 40262159 38747500 37206167 35866859 34730515 33795251
2822C3795251q20923q13833p60662p62457n19861m04445J31233J85724K48697
$$ 33795251 32974328 32160495 31399833 30637376 30117515 29713070 29844303 30030027 30278724
2813C0278724M16011K92519K70185N08315P55029Q15772P36023Q17930O69136
$$ 30278724 30694735 30987254 31257439 31765754 32520783 33336555 34072578 34890508 35559644
2804C5559644Q20211J138531J297855J446864J597387J663961J827719K092425
$$ 35559644 36379855 37518386 38816241 40263105 41860492 43524453 45352172 47444597
2796D7444597K408992K800335K657870K575470K279467K126557J819607J522994
$$ 47444597 49853589 52653924 55311794 57887264 60166731 62293288 64112895 65635889
2788F5635889Q98448M70577M0478o35116j370958j954096k228597k244326k253405
$$ 65635889 66534337 67004914 67045392 66410276 65039318 63085222 60856625 58612299 56358894
2779E6358894j888398j705862j163219o10884m00432m226n5066L30555P80783
$$ 56358894 54470496 52764634 51601415 50990531 50590099 50585873 50530807 50861362 51642145
2770E1642145J247703J491138J470023J398748J559899K260096K898609L112239
$$ 51642145 52889848 54380986 55851009 57249757 58809656 61069752 63968361 67080600
2762F7080600L124808K910030K820770K873758L030289L051035K483218J795322
$$ 67080600 70205408 73115438 75936208 78809966 81840255 84891290 87374508 89169830
2754H9169830J294424J426907J806444J996614J915441J829996K159634L109532
$$ 89169830 90464254 91891161 93697605 95694219 97609660 99439656 101599290 104708822
2746A04708822L797052L356034K318472J859388J822453K660406L870427M858333
$$ 104708822 108505874 111861908 114180380 116039768 117862221 120522627 124393054 129251387
2738A29251387N071193N419799O011407O751430Q402913J1456990J4013372J4522360
$$ 129251387 134322580 139742379 145753786 152505216 160908129 172365119 186378491 200900851
2730B00900851J4885194J7091454K1146214K9963968M6358061O8720055P9304968
$$ 200900851 215786045 232877499 254023713 283987681 330345742 399065797 478370765
2723D78370765N2900319k0991984q5700189r1784483o8797182m7085806l2751348
$$ 478370765 531271084 510279100 424578911 332794428 263997246 216911440 184160092
2716A84160092k3139613j7372468j4393630j2481461j0371397q577698o550087
$$ 184160092 161020479 143648011 129254381 116772920 106401523 97823825 91273738
2709I1273738n220205m028123k925070k299167j695495j017094m19072k76161
$$ 91273738 86053533 82025410 79100340 76801173 75105678 74088584 73669512 73393351
2701G3393351l34069l49057k51105R2143L92031Q33888J255912J547045J717157
$$ 73393351 73059282 72710225 72459120 72551263 72943294 73777182 75033094 76580139 78297296
2692G8297296K269419L002909L854201M899250N431791N938345P061109Q700311
$$ 78297296 80566715 83569624 87423825 92323075 97754866 103693211 110754320 119454631
2684A19454631J1262462J5473614K0866804K4175874J9824148L261101j8652173
$$ 119454631 130717093 146190707 167057511 191233385 211057533 214318634 195666461
2677A95666461l0535481k9345482k3537640j7980841j3645703j0512981q357321
$$ 195666461 165130980 135785498 112247858 94267017 80621314 70108333 61751012
2670F1751012o987370n985151m834015m080378l401394k982455k602191k160697
$$ 61751012 54763642 48778491 43944476 39864098 36462704 33480249 30878058 28717361
2662B8717361j919985j683050j351282j273571j240146j147100j160701r72144
$$ 28717361 26797376 25114326 23763044 22489473 21249327 20102227 18941526 17969382
2654A7969382r01188p87964p61647p33090n58885n68722n12928m76325l91229
$$ 17969382 17068194 16280230 15518583 14785493 14226608 13657886 13144958 12668633 12277404
2645A2277404n21790m17171n45455l71743l27898l38918l63838j96223k74411
$$ 12277404 11755614 11338443 10792988 10421245 10093347 9754429 9390591 9194368 8919957
2636H919957k92536k36759l81107k63215j90871j87378j09140k29035j55669o1054
$$ 8919957 8627421 8390662 8009555 7746340 7555469 7368091 7258951 7029916 6874247 6813193
2626F813193j50334k14324k20912r3534p3419k52044j05746p9070j04546R201
$$ 6813193 6662859 6448535 6227623 6134089 6060670 5808626 5702880 5623810 5519264 5528465
2616E528465k12334k33255j26094k06466r11j25101k24591p4998k7870L1466j50216
$$ 5528465 5316131 5082876 4956782 4750316 4749405 4624304 4399713 4324715 4296845 4328311 4178095
2605D178095n3242j35149J15466o2979j04340r5550k24049j83087r2849j31681
$$ 4178095 4124853 3989704 4105170 4042191 3937851 3842301 3618252 3435165 3342316 3210635
2595C210635r988O393j928j03288j22120P310m4903j30114m3790M0755j13928
$$ 3210635 3200647 3207040 3205112 3101824 2979704 2987014 2942111 2811997 2768207 2808962 2695034
2584B695034r0936m7232L3487L7308p9946n6482N29J66422l2560j29169K5855
$$ 2695034 2604098 2556866 2590353 2627661 2547715 2491233 2491762 2658184 2625624 2496455 2522310
2573B522310K2563k9781L1094o6147L4490k2560n1737j8245j02634r487J8164
$$ 2522310 2544873 2515092 2546186 2480039 2514529 2491969 2440232 2421987 2319353 2309866 2328030
2562B328030K3927k0921k3526J20027J874P189n1611j30466p2987o0258r396p476
$$ 2328030 2351957 2331036 2307510 2427537 2429411 2436600 2384989 2254523 2181536 2121278 2111882 2104406
2550B104406m7206j2858m1541j3729p8024O0330q3807n3765M658q3573P7391K9209
$$ 2104406 2057200 2044342 2002801 1989072 1911048 1971378 1887571 1833806 1838464 1754891 1832282 1861491
2538A861491J06870n3070R313j6069K9290J652j09367K0629p5408R1077P1605
$$ 1861491 1968361 1915291 1924604 1908535 1937825 1939477 1830110 1850739 1775331 1866408 1938013
2527A938013l8649M2471o1334J1990J8256L7123Q2632N7654R8794J09740M0552
$$ 1938013 1899364 1941835 1880501 1892491 1910747 1947870 2030502 2088156 2186950 2296690 2337242
2516B337242J39397K22706J15593M41551L02716K99634L9293m45296n09527m55250
$$ 2337242 2476639 2699345 2814938 3256489 3559205 3858839 3898132 3452836 2943309 2488059
2506B488059l46605j37755j62416k22842Q5741l8335l6349j16889j35672N249
$$ 2488059 2141454 2003699 1841283 1618441 1704182 1665847 1629498 1512609 1376937 1382186
2496A382186j02589l0253k1651K239r355R362l6250m3861L8521m0141n8859m5066
$$ 1382186 1279597 1249344 1227693 1229932 1220577 1229939 1193689 1149828 1188349 1148208 1089349 1044283
2484A044283J84115P644j41016J9255N0414M9409j7297L9643o9592L6870L776
$$ 1044283 1228398 1236042 1095026 1114281 1164695 1214104 1196807 1236450 1166858 1203728 1207504
2473A207504P3164O0324N2240O2171N1751M6327M6720J09164p1115k26462j94641
$$ 1207504 1280668 1340992 1393232 1455403 1507154 1553481 1600201 1709365 1638250 1411788 1217147
2462A217147j12623j63792k7808j10492L508j2939m214R642N9408N229j47256
$$ 1217147 1104524 940732 912924 802432 805940 793001 788787 798429 857837 863066 715810
2451G15810m8509K348k4927k7653k4350N5644j5627l1118k1601j7782J893l1674
$$ 715810 667301 669649 644722 617069 592719 648363 632736 601618 580017 562235 564128 532454
2439E32454n712Q2354m5302L4762m1594m42p336J7774q592j39875O5564O9418
$$ 532454 526742 609096 563794 598556 556962 556520 549184 566958 558366 418491 484055 553473
2427E53473r9203N4714m6393r664O862J37977q5613q1493J0266l6930j8076k0626
$$ 553473 454270 508984 462591 452927 459789 597766 512153 430660 440926 403996 385920 365294
2415C65294L160r494m9816N7586P3740j9614M9j01325L1896l8679M112J2862M4977
$$ 365294 368454 358960 309144 366730 440470 420856 420905 319580 351476 312797 316909 329771 374748
2402C74748L3209r1589O9436r256l3437p308J4377L3169n3290N5766o4129O2613
$$ 374748 407957 316368 385804 376548 343111 335803 350180 383349 330059 385825 321696 384309
2390C84309N425n0535p531L1998j4220L9201k2578J7803m1757J2376j08707n4590
$$ 384309 389734 339199 331668 363666 349446 388647 366069 383872 342115 354491 245784 191194
2378A91194K9675J8235L1088k3530J30396K850l2393n9315n0760j0977L918J7741
$$ 191194 220869 239104 270192 246662 377058 379908 347515 288200 237440 226463 230381 248122
2366B48122l3528L6484q397K7071M4084K8491k6436n6804K8787o4474L8146M9426
$$ 248122 214594 251078 242681 269752 313836 342327 315891 259087 287874 223400 261546 310972
2354C10972l7061l1511K8546M252K8810j4568L2808r3082m7765K5460k4100l1831
$$ 310972 273911 242400 270946 275198 304008 289440 322248 229166 181401 206861 182761 150930
2342A50930N4416M610K9771l1701p816L9199M8268k3292j56006Q3671K062k0057
$$ 150930 205346 209956 239727 208026 200210 239409 287677 264385 108379 192050 194112 174055
2330A74055j5029L8475k1029L2120k6104n8395M8610p231K2855o0066j1138P8863
$$ 174055 159026 197501 176472 208592 182488 124093 172703 165472 188327 128261 117123 195986
2318A95986m8494k856L1219O631o375p0924L7358N6208j23603J28228K0515m736
$$ 195986 147492 144636 175855 182486 176111 105187 142545 198753 75150 203378 223893 219157
2306B19157o6831M4368l2999j7458O0284l0179L9676P1291j01391M5075L4461
$$ 219157 152326 196694 163695 146237 206521 176342 216018 287309 185918 230993 265454
2295B65454q959m0620j04436R5171N1148l9447n8598J9761j5969L3130O6333M907
$$ 265454 256495 215875 111439 206610 257758 218311 159713 179474 163505 196635 262968 267875
2283B67875P870m6702m3861o1333N3044M2481N96n3577K869o3780K3124K8073
$$ 267875 275745 229043 185182 123849 176893 219374 219970 166393 169262 105482 128606 156679
2271A56679Q457J01343n6408k3944l3672j6551q9330L4309m4215P1131K2118O9913
$$ 156679 165136 266479 210071 186127 152455 135904 46574 80883 36668 107799 129917 199830
2259A99830L4158L3792k1728M3932p2527J9Q0964N8458o4429n2687K1800m7108
$$ 199830 233988 267780 246052 289984 217457 217476 298440 356898 292469 239782 261582 214474
2247B14474k0219P3925M7679p6449J10046Q4943q5094m9230j5373L0423j3710
$$ 214474 194255 268180 315859 239410 349456 434399 349305 300075 284702 315125 301415
2236C01415j9012J976k5188J15079j5670p0767O6465K0852j32770J21444K5604
$$ 301415 282403 284379 259191 374270 358600 287833 354298 375150 242380 363824 389428
2225C89428L1394L7471j68314O2816l081P4910J5696Q5781j2644K5051p368R191
$$ 389428 420822 458293 289979 352795 349714 424624 440320 526101 513457 538508 531140 540331
2213E40331R5148n9775j6944L8109J9833r8750J16091K5033n2015P0036J0593
$$ 540331 635479 575704 558760 596869 616702 517952 634043 659076 607061 677097 687690
2202F87690N0762j2171M0087J00095r100K6759Q0435N5207O8434O4673j6749Q4991
$$ 687690 738452 726281 766368 866463 857363 884122 964557 1019764 1088198 1152871 1136122 1221113
2190A221113L4318P6975J11294J63029K44174O4447P4819J41945J52769O4172
$$ 1221113 1255431 1332406 1443700 1606729 1850903 1915350 1990169 2132114 2284883 2349055
2180B349055J18422J31441P4647J09164K29612J89756J20905J30732J89089K61120
$$ 2349055 2467477 2598918 2673565 2782729 3012341 3202097 3323002 3453734 3642823 3903943
2170C903943L59045K87110K84901K49611N32095N56373Q03595J103404J825624
$$ 3903943 4262988 4550098 4834999 5084610 5616705 6173078 6976673 8080077 9905701
2161I905701K939737K871129N53580l712472l565126k055303j480395j170740
$$ 9905701 12845438 15716567 16270147 12557675 8992549 6937246 5456851 4286111
2153D286111o87572m33814l81064l77852k26767r2276k93584k38934j07654r9512
$$ 4286111 3598539 3164725 2783661 2405809 2179042 2086766 1793182 1554248 1446594 1347082
2143A347082j98659p4760q1701r9663p8618L3315j22801r4557q2292M4420o1587
$$ 1347082 1148423 1073663 991962 892299 813681 846996 724195 629638 547346 591766 530179
2132E30179m1811j30610k0225N7758J6719o0835m7731Q8789r5066L2550J5334
$$ 530179 488368 357758 337533 395291 412010 351175 303444 392233 297167 329717 345051
2121C45051o6828L0418m5147o1282M2538L0706K521q7641P841Q1369r7831L6729
$$ 345051 278223 308641 263494 202212 244750 275456 277977 190336 198177 279546 181715 218444
2109B18444L541p7803J1122J4679p1059L0428J2604o3656k9277Q2046K1813m9274
$$ 218444 221985 144182 155304 169983 98924 129352 141956 78300 49023 131069 152882 103608
2097A03608K814k0165L1386l8888m5243O9162l6424j7118J14955N872j05341o6747
$$ 103608 106422 86257 117643 78755 33512 102674 66250 49132 164087 169959 64618 -2129
2085b129N7595O5771q0007P2688m3165L0789n4012K6209M1518k8176O9496k6203
$$ -2129 55466 121237 41230 113918 70753 101542 47530 73739 115257 87081 156577 130374
2073A30374q973m1096p388K6972l6286n6967J6764P5158m6940l4376K9914O4989
$$ 130374 121401 80305 72917 99889 63603 6636 23400 98558 51618 17242 47156 112145
2061A12145J9494o0692L6624N0457n5780j8466n1779L1593K5620p836M6884p6357
$$ 112145 131639 70947 107571 158028 102248 83782 32003 63596 89216 81380 128264 51907
2049E1907K2130m7295l3999l3618p334L6589J09565j21526l5259P6754K6811j7873
$$ 51907 74037 26742 -7257 -40875 -48209 -11620 97945 -23581 -58840 17914 44725 26852
2037B6852o4775J8338J14272p2889m2645R1225n28M0179k3017q4281P493p759
$$ 26852 -37923 -19585 94687 21798 -20847 70378 69850 110029 87012 2731 10224 2465
2025B465O6711O8940L783n9026O271O9753m7531n4549K202K9982o0032m3211j2678
$$ 2465 69176 138116 141899 82873 89144 158897 111366 56817 59019 89001 28969 -14242 -26920
2012b6920O5391j15372j3364M3444P1570J12306j52414o8386N0726M4543m4497
$$ -26920 38471 -76901 -90265 -46821 24749 137055 -15359 -83745 -33019 11524 -32973
2001c2973L4063J7796r4751m3976J08508n7539K2325J2178M4001Q5307j27660
$$ -32973 1090 18886 -75865 -119841 -11333 -68872 -46547 -34369 9632 94939 -32721
1990c2721P9655j0269k2994k2191M4787M3986N5154n5606o3704N3030Q031R9613
$$ -32721 46934 36665 13671 -8520 36267 80253 135407 79801 16097 69127 77158 176771
1978A76771j84022n1987N6285k8281K372n1239l590Q9040m241o3795J02370k6117
$$ 176771 -7251 -59238 -2953 -31234 -28862 -80101 -83691 5349 1108 -62687 39683 13566
1966A3566N7192n358j17863P6943l800P6902k7831k8883L5054J5687M7735o0021
$$ 13566 70758 65400 -52463 24480 20680 97582 69751 40868 75922 91609 139344 79323
1954G9323K3263Q216J040p7601o2995o1616J53422L8908j07594J596p524r6261
$$ 79323 102586 110802 111842 34241 -28754 -90370 63052 101960 -5634 -4038 -11562 -107823
1942a07823l410N506p062l3345P6720j7035L4686N449M6793j02773n3210m750
$$ -107823 -111233 -105727 -112789 -146134 -69414 -86449 -51763 -46314 479 -102294 -155504 -160254
1930a60254L9190J21071n2374J12283m572j2983l6039Q6420o3005j32912K8135
$$ -160254 -121064 7 -52367 59916 55344 42361 6322 92742 29737 -103175 -75040
1919g5040M8247N8834n9395m1876r259N9102K5216K0682J817l6494P224j01388
$$ -75040 -26793 32041 -27354 -69230 -78489 -19387 5829 26511 28328 -8166 -942 -102330
1907a02330M5128n4799R9254l4356l1400l5910m224m1619P3067Q0164N7186r3736
$$ -102330 -57202 -112001 -12747 -47103 -78503 -114413 -118637 -160256 -87189 -7025 50161 -43575
1895d3575k8400N9089J5003L166N301N8823M8712m1914p8026r7314P4798K6488
$$ -43575 -71975 -12886 2117 5283 10584 69407 118119 76205 -1821 -99135 -24337 2151
1883B151n7391j8112N476J5136k5236j2643k2061J595j8214J74592l7332l4872
$$ 2151 -55240 -73352 -67876 -52740 -77976 -90619 -112680 -111085 -129299 45293 7961 -26911
1871b6911k7141k2337j1606L7022l5184O8075p420o6973K0760m1877k4314k7190
$$ -26911 -54052 -76389 -87995 -50973 -86157 -18082 -25502 -92475 -71715 -113592 -137906 -165096
1859a65096R1683P8874m1189M0937l081r3024j4246J8507M0594l5386J06998o7238
$$ -165096 -73413 5461 -35728 5209 2128 -90896 -105142 -86635 -46041 -81427 25571 -41667
1847d1667j5115Q2123j8727j28296R021L2175o315j3085p4008L8757K6965M1541
$$ -41667 -56782 25341 6614 -121682 -112661 -80486 -86801 -99886 -173894 -135137 -108172 -66631
1835f6631j19950J45371m5436P0655n3282l391M2640k0954j6918N4339l2735J4863
$$ -66631 -186581 -41210 -86646 -15991 -69273 -72664 -30024 -50978 -67896 -13557 -46292 -31429
1823c1429N1021m6648n6167n5646Q3226N4193M5983k8837j7423o1474j0534L2311
$$ -31429 19592 -27056 -83223 -138869 -55643 -1450 44533 15696 -1727 -63201 -73735 -41424
1811d1424p098l369Q5168r6348j25967P0660K8195R7908k0155m1805K5278L9096
$$ -41424 -48522 -51891 33277 -63071 -189038 -118378 -90183 7725 -12430 -54235 -28957 10139
1799A0139r245p8038O4913n569m1906n069j07355K7464K0141O4649n3646R0483
$$ 10139 894 -77144 -12231 -17800 -59706 -64775 -172130 -144666 -124525 -59876 -113522 -23039
1787b3039L076o0807m1092k764O34n299M2276J0571M853J20231j9263q5726k9653
$$ -23039 -19963 -80770 -121862 -124626 -123992 -129291 -87015 -76444 -71591 48640 29377 -56349 -86002
1774h6002r9597J52188j846N4989o6727N5293m8370k1422p0305P841L380J42269
$$ -86002 -185599 -33411 -35257 19732 -46995 8298 -40072 -61494 -131799 -123958 -120578 21691
1762B1691j24882R520J861n493l1348O876J00849j263m4877j4171P5843n5150
$$ 21691 -103191 -93671 -91810 -97303 -128651 -121775 -20926 -22189 -67066 -81237 -5394 -60544
1750f0544L4012n3342L9914n4658N4431M3008j31216Q368N3895J335m2151p873
$$ -60544 -26532 -79874 -39960 -94618 -40187 2821 -128395 -120027 -66132 -64797 -106948 -114821
1738a14821K1515L7148q5484O5411P8693r6383O1029m4976p6765O9104R1795n3165
$$ -114821 -93306 -56158 -141642 -76231 2462 -93921 -32892 -77868 -154633 -85529 6266 -46899
1726d6899n9101R926k7427M9562Q1357n0307N0907k2826j50578O2569J28374q5405
$$ -46899 -106000 -96074 -123501 -73939 7418 -42889 8018 -14808 -165386 -102817 25557 -59848
1714e9848o0687n9546M0519O4608k461O0743P85p7489L7523P6276k2223m3608
$$ -59848 -120535 -180081 -139562 -74954 -77415 -16672 -15887 -93376 -55853 20423 -1800 -45408
1702d5408M0199K6773P3772j068k4209m9097l1255p59K9133k3429o4499k7779
$$ -45408 -5209 21564 95336 94268 70059 20962 -10293 -11052 18081 -5348 -69847 -97626
1690i7626l897K6370J07802p3631j6993j9921j0242R235j19672P3029o2119J45855
$$ -97626 -101523 -75153 32649 -40982 -57975 -77896 -88138 -78903 -198575 -125546 -187665 -41810
1678d1810O664p9700Q173M646M5962j4239J5781N2594J905j6330O969q46j6114
$$ -41810 -35146 -114846 -106673 -102027 -56065 -70304 -54523 -1929 -24 -16354 -9385 -10231 -26345
1665b6345N1733n279o1866K1686j8545l1279J04933K7136M8173p7419q9045Q766
$$ -26345 25388 20109 -41757 -20071 -38616 -69895 35038 62174 110347 32928 -56117 -47351
1653d7351q496Q8109l6407k9776L6886N7280k5677k2976L0816j0248l6787q7737
$$ -47351 -55847 32262 -4145 -33921 2965 60245 34568 11592 42408 32160 -4627 -92364
1641i2364N3848q9027j7453R4188R9252r5984M6371N9815o3752k8690K3196K2240
$$ -92364 -38516 -127543 -144996 -50808 48444 -47540 -1169 58646 -5106 -33796 -10600 11640
1629A1640K7353k5605j13123L6775l2650m999o370Q9822n6962l1375j26856P6533
$$ 11640 38993 13388 -99735 -62960 -95610 -100609 -106979 -17157 -74119 -105494 -232350 -155817
1617a55817n965Q7840l4264j7644r0083O5625K7922P8997R1174r1991K4910k0484
$$ -155817 -161782 -73942 -108206 -125850 -215933 -150308 -122386 -43389 47785 -44206 -19296 -39780
1605c9780J5868j04160J8508L6328J494l6475J33979j08674r7467M1261M0561
$$ -39780 -23912 -128072 -109564 -73236 -71742 -108217 25762 -82912 -180379 -139118 -98557
1594i8557m3434M4313O2566N2969k9810p4377m4927Q4370R8113J2794o0978K1452
$$ -98557 -141991 -97678 -35112 17857 -11953 -86330 -131257 -46887 51226 64020 3042 24494
1582B4494n6583m203N2486o4855M0773J0880j0917n9368o3561o594L9633R3228
$$ 24494 -32089 -36292 16194 -48661 -7888 2992 -7925 -67293 -130854 -137448 -97815 -4587
1570d587k6295N8061K2627j02047j12228J7761J32529p6768K0339Q6165j28229
$$ -4587 -30882 27179 49806 -52241 -164469 -146708 -14179 -90947 -70608 15557 -112672
1559a12672k0667l293K9405K6216j16711J46712Q9239Q6400r0776j01294j7887
$$ -112672 -133339 -136632 -107227 -81011 -197722 -51010 38229 124629 33853 -67441 -85328
1548h5328N179p4265J42953k9458k5782K6273k5649j4087J4069O5426m8881l693
$$ -85328 -80149 -154414 -11461 -40919 -66701 -40428 -66077 -80164 -66095 -669 -49550 -53243
1536e3243L1420j922n9282J01418n9587k9456l9928M5777O7904o2773j1427J4673
$$ -53243 -21823 -23745 -83027 18391 -41196 -70652 -110580 -64803 3101 -59672 -71099 -56426
1524e6426k3331Q5953R729l8375j517o140O8763j68702j1780Q2680R7718Q264
$$ -56426 -79757 6196 15925 -22450 -23967 -30107 38656 -130046 -141826 -59146 38572 46836
1512D6836n1658l1026R5824j52878L9654P9217o772k9007k4819L6214n3480Q6161
$$ 46836 -4822 -35848 59976 -92902 -53248 25969 19197 -9810 -34629 1585 -51895 34266
1500C4266m4272J5120p2301m3820J10281O081l4533J6834N8528M4341q4911N3576
$$ 34266 -10006 5114 -67187 -111007 -726 5355 -29178 -12344 46184 90525 5614 59190
1488E9190m8982j27479o0652O5658P3585L5646q655m6403m9770j0665K9506J4137
$$ 59190 10208 -117271 -177923 -112265 -38680 -3034 -11689 -58092 -107862 -118527 -89021 -74884
1476g4884M719K296r182j9755L3559K7028m7059O8070j8801J8946m3861k0754
$$ -74884 -70165 -67869 -77051 -96806 -63247 -36219 -83278 -15208 -34009 -15063 -58924 -79678
1464g9678j1354J2779m398j762Q07R862n3349M294m8626J6178K1816J03306q466
$$ -79678 -91032 -78253 -82651 -84413 -83606 -73744 -127093 -122799 -171425 -155247 -133431 -30125 -38591
1451c8591K3665k5155k5012l5629Q8069N6600r935j48629K2472P6023m9145j7807
$$ -38591 -14926 -40081 -65093 -100722 -12653 43947 34012 -114617 -92145 -16122 -65267 -83074
1439h3074N5886J8380n6895o7993J9652R8535n5497Q8286n8183m3848O1591K7437
$$ -83074 -27188 -8808 -65703 -133696 -114044 -15509 -71006 17280 -40903 -84751 -23160 4277
1427D277j26824M1380N7686N4837p7534j6661r55j1012J5505L4929m2455M2157
$$ 4277 -122547 -81167 -23481 31356 -46178 -62839 -63794 -74806 -59301 -24372 -66827 -24670
1415b4670l1425j694k0842N3055m6009r25O950l2100K855j8680Q2762P5732j20779
$$ -24670 -56095 -57789 -78631 -25576 -71585 -72510 -65560 -97660 -94805 -113485 -30723 45009 -75770
1402g5770o098k3789K682J2212o84O8521Q0522q7149j8743j08096P8417N9312
$$ -75770 -81868 -105657 -102975 -90763 -91447 -22926 57596 -29553 -48296 -156392 -77975 -18663
1390a8663j0840O155k4473l5171Q2422P606m0504J7844N157N952k6241n0397Q3878
$$ -18663 -29503 -23348 -47821 -82992 -570 7036 -33468 -15624 -10467 -4515 -30756 -81153 2725
1377B725l1656r5399j265j3122l595P2910O8935k2163j0855p6452J26666o1564
$$ 2725 -28931 -124330 -125595 -138717 -142312 -69402 -467 -22630 -33485 -109937 16729 -44835
1365d4835l3955J11860m9656k1402j039m4332R0530q8460L4807n6805R092q041
$$ -44835 -78790 33070 -16586 -37988 -39027 -83359 7171 -81289 -46482 -103287 -94195 -102236
1353a02236M5025J1918p649m1273J6334N7833K9376p2473K1733L8378k8331q1551
$$ -102236 -57211 -45293 -52942 -94215 -77881 -20048 9328 -63145 -41412 -3034 -31365 -112916
1341a12916J14661m1236o0791R668J8452J8907j963o417r0010N2299R1171j0572
$$ -112916 1745 -39491 -100282 -90614 -72162 -53255 -55218 -61635 -151645 -99346 -8175 -18747
1329a8747L7260o2902j9901J05623l9937m2659k4394k7126q6848J26705R2360
$$ -18747 18513 -44389 -64290 41333 1396 -41263 -65657 -92783 -179631 -52926 39434
1318C9434q3244j6813q3994L0737R7209R582n1981L6170J7081k1420p6089r166
$$ 39434 -43810 -60623 -144617 -113880 -16671 -7089 -59070 -22900 -5819 -27239 -103328 -112494
1306a12494Q037N2801K6130M378k1142l4119j4871O0229J45420j49647q2966O0656
$$ -112494 -104457 -51656 -25526 -21148 -42290 -76409 -91280 -31051 114369 -35278 -118244 -57588
1294e7588l6835j1910L8236L3158q4686p9814P1696O6035Q1914q4920N688l2188
$$ -57588 -94423 -106333 -68097 -34939 -119625 -199439 -127743 -61708 20206 -64714 -59026 -91214
1282i1214l8964N8640J53652r047q3286K1437K5445j6782p8794o0664K06229n0775
$$ -91214 -130178 -71538 82114 73067 -10219 11218 36663 19881 -58913 -119577 86652 35877
1270C5877p8020M279O8780M0649m9145J9478n6846n0483k1705L7410O6121m1582
$$ 35877 -42143 -37864 30916 71565 22420 41898 -14948 -65431 -87136 -49726 16395 -25187
1258b5187n9100J0444j2473L2116K1117m9677k621J14669k4913k4627J5887L356
$$ -25187 -84287 -73843 -86316 -54200 -33083 -82760 -85381 29288 4375 -20252 -4365 -1009
1246a009j38756J4101Q6161m1724j2668q3429P5598O550R3703J7072n7248K9979
$$ -1009 -139765 -125664 -39503 -81227 -93895 -177324 -101726 -95176 -1473 15599 -41649 -11670
1234a1670N6596n6973p1521O7210q2493j5723j66M4673j2266j2318L0933l8375
$$ -11670 44926 -12047 -83568 -16358 -98851 -114574 -114740 -70067 -82333 -94651 -63718 -102093
1222a02093O738m9247P7186J5306m5553O56K9107n7891Q5374Q929n8531J677M8010
$$ -102093 -95355 -144602 -67416 -52110 -97663 -97007 -67900 -125791 -40417 -31488 -90019 -88342 -40332
1209d0332J55671Q108j18279m4473o7812O4315o40o2660J5589L2891O4373j2132
$$ -40332 115339 123447 5168 -39305 -107117 -42802 -43442 -106102 -90513 -57622 6751 -5381
1197e381j0948n7773J16756Q8162o2376j36161k8361L970L9157r009j1643K9350
$$ -5381 -16329 -74102 42654 130816 68440 -67721 -96082 -92112 -52955 -61964 -73607 -44257
1185d4257k1125Q648N1915J417n8909J8298J5912o8586j6895N0688J04553r446
$$ -44257 -65382 -56734 -4819 -3402 -62311 -44013 -28101 -96687 -113582 -62894 41659 32213
1173C2213j033M3788r4342M1039O8808q2606r1942j3266O0289m380m9036O3051
$$ 32213 31180 74968 -19374 21665 90473 7867 -84075 -97341 -37052 -41432 -90468 -27417
1161b7417O3114m6826o5947N7700j373p7804P1646L1221o19j08683j0384J8772
$$ -27417 35697 -11129 -77076 -19376 -20749 -98553 -26907 4314 3695 -104988 -115372 -96600
1149i6600n1869J22663p004N6620j09770l7441J05911q9695P5053o2717j9065
$$ -96600 -148469 -25806 -32810 23810 -85960 -123401 -17490 -107185 -32132 -94849 -113914
1138a13914Q0086K6650o8234j9754J1078J39731r6202K8579K6844P663l094M300
$$ -113914 -33828 -7178 -75412 -95166 -84088 55643 -40559 -11980 14864 22527 19433 23733
1126B3733j23651N5751L635p443l0600K7891J4618r8808J13614J1791l4941J3546
$$ 23733 -99918 -44167 -40532 -47975 -78575 -50684 -36066 -134874 -21260 -9469 -44410 -30864
1114c0864J853o7883J42130L2348j06186n0094J08838N451j4530n3444P8538J7953
$$ -30864 -29011 -96894 45236 77584 -28602 -78696 30142 35593 21063 -32381 46157 64110
1102F4110o4347n8816P9084L2493o5695k4987n0599J27128m9853n1653k9892L3876
$$ 64110 -237 -59053 20031 52524 -13171 -38158 -88757 38371 -11482 -63135 -93027 -59151
1090e9151Q6595L967K7030m0001j12196p146Q8177p4512P1863M3200J5481L0542
$$ -59151 27444 31411 58441 18440 -93756 -100902 -12725 -87237 -15374 27826 43307 73849
1078G3849o3213l8941k3192J1487L3557o2956n8330l0825J38919Q254r807M5996
$$ 73849 10636 -28305 -51497 -40010 -6453 -69409 -127739 -158564 -19645 -11391 -21198 24798
1066B4798m5729J1902J3403K8717p778N0956r4292p6720l7159N5915P3332l801
$$ 24798 -20931 -9029 4374 33091 25313 76269 -18023 -94743 -131902 -75987 -2655 -6456
1054f456K5052K9098l672k9273N6801j34812O0296l161o8867N7729M9104j2399
$$ -6456 18596 47694 44022 14749 71550 -63262 -2966 -6127 -74994 -17265 31839 19440
1042A9440p2759K4725K1054N2696k1139k8898j16214m1936L0927O6539k0393L2995
$$ 19440 -53319 -28594 -7540 45156 24017 -4881 -121095 -163031 -132104 -65565 -85958 -52963
1030e2963Q3653j00137K3398M5159p348n8922L4364o0041J0599l4741M339N7416
$$ -52963 30690 -69447 -46049 -890 -8238 -67160 -32796 -92837 -82238 -116979 -112640 -55224
1018e5224N7816m9434J8708j7732K2596l3074N6911k8583k4717M3855j34218J0079
$$ -55224 2592 -46842 -28134 -45866 -23270 -56344 567 -28016 -52733 -8878 -143096 -133017
1006a33017K0427P8248p160m0085o6898J12058J7759k3643M9686P6977n1590n0849
$$ -133017 -112590 -34342 -41502 -81587 -148485 -36427 -18668 -42311 7375 84352 32762 -18087
994a8087M4911j29236j4158J09727L0148K6555P7790l8217j46687Q7254N6633
$$ -18087 26824 -102412 -116570 -6843 23305 49860 127650 89433 -57254 30000 86633
983H6633q3020Q6485q5882J8757m141j9333j256p254O439O2190L1755j06385L9674
$$ 86633 3613 90098 4216 22973 18832 -501 -1757 -9011 -2572 59618 91373 -15012 24662
970B4662k9607N1940o598j79183R2449R0230m0817J19788k1900p9771N3462M1331
$$ 24662 -4945 46995 40397 -138786 -46337 43893 3076 122864 100964 21193 74655 115986
958A15986n87o7205j0473p101j4610j8094J5457M3798K7100p8928j8959J4483
$$ 115986 115399 48194 37721 30620 16010 -2084 13373 57171 84271 5343 -13616 867
946H67O028l21m2733L7452n7366P2954l4977k799m5065L5638m0918P9006P3582
$$ 867 6895 6574 -36159 1293 -56073 16881 -18096 -20895 -65960 -30322 -71240 7766 81348
933H1348k4205j07443K8898K4111n7164o6175K5574n898J12905R133R008N0488
$$ 81348 57143 -50300 -21402 2709 -54455 -120630 -95056 -100954 11951 21084 30092 80580
921H0580j7855K8769r855Q162j22254p8022M5145K3991R5571l0398P639O6705
$$ 80580 62725 91494 81639 89801 -32453 -110475 -65330 -41339 54232 23834 31473 98178
909I8178l3139K7168n9300K5156q5336M1096L6836k0875j02046K7433M8317M6602
$$ 98178 65039 92207 32907 58063 -27273 13823 50659 29784 -72262 -44829 3488 50090
897E0090l026m4728N2471k7495p0007O8290L6497k6840j0670j3259r248N1483
$$ 50090 47064 2336 54807 27312 -42695 25595 62092 35252 24582 11323 2075 53558
885E3558p402k6437r4159K6329N3466O4994J9225r1347J04695n3774m8384J2247
$$ 53558 46156 19719 -74440 -48111 5355 70349 89574 -1773 102922 49148 764 13011
873A3011j6115j7753Q7806m6383n1872M1943M9871m4551L2285P0746K4765o0354
$$ 13011 -3104 -20857 66949 20566 -31306 10637 60508 15957 48242 118988 143753 83399
861H3399R786J9984p0381k6554K3014j5575k7304m6749O0043M179o6933O9611
$$ 83399 93185 113169 42788 16234 39248 23673 -3631 -50380 9663 13842 -53091 16520
849A6520L4399m5756P0117J5586k5505l5890J0427j601k2002k5849l3371P1880
$$ 16520 50919 5163 75280 90866 65361 29471 39898 38297 16295 -9554 -42925 28955
837B8955J0848N01m55P6375q4592K2788n3180J8118M5019N2218m0641n2646l9146
$$ 28955 39803 40304 39849 116224 31632 54420 1240 19358 64377 116595 75954 23308 -15838
824a5838M4109j0421n280p0160K1678K7369R84k478N8052R2165n8146j61377R3857
$$ -15838 28271 17850 12570 -57590 -35912 -8543 -7559 -10037 48015 140180 82034 -79343 14514
811A4514M1895j11087M3134N0744q9j02573n515J64363m747n1591P1520L4651
$$ 14514 56409 -54678 -11544 39200 39111 -63462 -68977 95386 90639 39048 110568 145219
799A45219p4524m2540n1598K2361M6448p984j7639j5656K8963l6225N0452j41403
$$ 145219 70695 28155 -23443 -1082 45366 37382 19743 4087 33050 -3175 47277 -94126
787i4126l7695O711N5233M4109L4536K2019J0982M9051l5192q5850M0300P7982
$$ -94126 -131821 -125110 -69877 -25768 8768 30787 41769 90820 55628 -30222 10078 88060
775H8060m1781p07J5946j6689n705q5898o289O6858M9659J8839k3024K7409M0240
$$ 88060 46279 45572 61518 44829 39124 -46774 -53063 13795 63454 82293 59269 86678 126918
762A26918k9479q7429o5628j5263L4995M6490O4108r4326m0905R4470o1258J4953
$$ 126918 97439 10010 -55618 -70881 -35886 10604 74712 -19614 -60519 33951 -27307 -12354
750a2354O9765K9304J949j01652K3514L5354P6969q3054l9046j2212o5564P5976
$$ -12354 57411 86715 88664 -12988 10526 45880 122849 39795 749 -11463 -77027 -1051
738a051J8693J2752m9907m8464O2701P3414j16088O2655l5678M2300L1652Q286
$$ -1051 17642 30394 -19513 -67977 -5276 68138 -47950 14705 -20973 21327 52979 61265
726F1265P371m2276J5417J9497j06071m8563M0818L152N3857N1811n9075r3937
$$ 61265 68636 26360 41777 61274 -44797 -93360 -52542 -49390 4467 56278 -2797 -96734
714i6734R3704L5892q2523O7613p7119k0511P7510n3967J00094k347K6264L5123
$$ -96734 -3030 32862 -49661 17952 -59167 -79678 -2168 -56135 43959 41612 67876 102999
702A02999p1092J3206L4670o2975M4889L4980q4638j0553k0556O8380M5595n1236
$$ 102999 31907 45113 79783 16808 61697 96677 12039 1486 -19070 49310 94905 43669
690D3669M643J6229N0366n6122J1754j02391n623Q6694K4850K7962m2207J7283
$$ 43669 48312 64541 114907 58785 70539 -31852 -37475 49219 74069 102031 59824 77107
678G7107j11266N7978m380M0978L6275j54215m2208J27101J1868P431K4633j2669
$$ 77107 -34159 23819 19439 60417 96692 -57523 -99731 27370 39238 46669 71302 58633
666E8633M8511o0042l242k585j20062K1146J11930k8468O4670p6156K8600M4411
$$ 58633 107144 47102 43860 41275 -78787 -57641 54289 25821 90491 14335 42935 87346
654H7346P383K4214k4266j29984N0963L5681l4259N7311K0791q7511m813O3557
$$ 87346 94729 118943 94677 -35307 15656 51337 17078 74389 95180 7669 2856 66413
642F6413l0171L7550R7980p517p8772P9780j2566l2052k9243j5445p5745L7473
$$ 66413 36242 73792 171772 164255 85483 165263 152697 120645 91402 75957 212 37685
630C7685j6232m2492J7697M7823J29713m5915J6119k1332k6357m7556K0749J14725
$$ 37685 21453 -21039 -3342 44481 174194 128279 144398 123066 96709 49153 69902 184627
618A84627j30054j1993k4669n4725M4177M8055L7736j06134j2883m487l8507P6117
$$ 184627 54573 42580 17911 -36814 7363 55418 93154 -12980 -25863 -30350 -68857 7260
606G260P2965K340J0173j00234m9452j3475R9751O2939k8224k1855j7763J7548
$$ 7260 80225 82565 92738 -7496 -56948 -70423 29328 92267 64043 42188 24425 41973
594D1973k295p2253N3273j8834k5538k3048K8482N6823P2351J2315j29966k2370
$$ 41973 39678 -32575 20698 1864 -23674 -46722 -18240 38583 110934 123249 -6717 -29087
582b9087Q7619p4513K0987K2842j34356L6308k5398J57688m2567k5347J9225k8201
$$ -29087 58532 -15981 5006 27848 -106508 -70200 -95598 62090 19523 -5824 13401 -14800
570a4800J6636Q5714n1237J0322R7191o3371m6907J6246N5580L622j15048O6088
$$ -14800 1836 87550 36313 46635 143826 80455 33548 49794 105374 108996 -6052 60036
558F0036o470j1990P943L8333n4090K7065J9982k996j7396p3954K9819K1644L1282
$$ 60036 53566 41576 49519 87852 33762 60827 80809 77813 60417 -13537 16282 37926 69208
545F9208o015p4269J34089r1730R291R4592j09671M3847J1698m6008P3962j7169
$$ 69208 63193 -11076 123013 31283 40574 135166 25495 69342 81040 35032 108994 91825
533I1825j6765R690n2543K2565K6155k9091R118n2580K5652J71139o538j12357
$$ 91825 75060 84750 32207 54772 80927 51836 60954 8374 34026 205165 198627 86270
521H6270j4180m0742j4855J28835J6189j19847q5811j6529J8593L7070o388J15079
$$ 86270 72090 31348 16493 145328 161517 41670 -44141 -60670 -42077 -5007 -11395 103684
509A03684R3341n0550q0137n2274N706L2543o5431L9617O1091j15535N5948Q5400
$$ 103684 197025 146475 66338 14064 19770 52313 -13118 26499 87590 -27945 28003 113403
497A13403n5811L1999P0410o4522q2448K8032K2884J18235k12039K1375o68r022
$$ 113403 57592 89591 160001 95479 13031 41063 63947 182182 -29857 -8482 -9150 -18172
485a8172N6392J83182j748n5430r6964K6546o7273J6217N1324j16650K1555L6898
$$ -18172 38220 221402 219654 164224 67260 93806 26533 42750 94074 -22576 -1021 35877
473C5877k2476Q7034L0898n5254m3340n0755L332N3226j3960J9414M6484m1876
$$ 35877 13401 100435 131333 76079 32739 -18016 -14684 38542 24582 43996 90480 48604
461D8604j69003J20549J17189N1126m9017p3086k1750K2372J6237J4259K5152
$$ 48604 -120399 150 117339 168465 119448 46362 24612 46984 63221 77480 102632
450A02632n6924N9999l9208m5621Q804M5165k9961P7947p5697J1662J6944p4995
$$ 102632 45708 105707 66499 20878 29682 74847 44886 122833 47136 58798 75742 747
438G47J41426R040q2124m2251K0204j2609l2394o2132M3153J7879o5604J00073
$$ 747 142173 151213 69089 26838 47042 34433 2039 -60093 -16940 939 -64665 35408
426C5408j11139Q5538m0534K1163J23320O424N2270k4430j41448o9404l7114O1020
$$ 35408 -75731 9807 -30727 -9564 113756 120180 172450 148020 6572 -62832 -99946 -38926
414c8926N0062J6667J7627Q781K9788r161J0441M3776n8955m1829k9066O8701
$$ -38926 11136 27803 45430 54211 83999 74838 85279 129055 70100 28271 -795 67906
402F7906p422K1652l6503k5723M3172j8806P8880j74546K5639J18491l4852J561
$$ 67906 60484 82136 45633 19910 63082 44276 123156 -51390 -25751 92740 57888 59449
390E9449N4712Q984q1827R5034P22l9759r7026O3070l4173M2002J9823p1923R3982
$$ 59449 114161 123145 41318 136352 137074 97315 289 63359 29186 71188 91011 19088 113070
377A13070K3400l4359O9127p4729l3348J967k9980P0321N3282p4713J1884N9319
$$ 113070 136470 102111 171238 96509 63161 65128 35148 105469 158751 84038 95922 155241
365A55241j7470n5332N8160R406j57630n0714J18035M7805L4599m8446n2245l7751
$$ 155241 137771 82439 140599 150005 -7625 -58339 59696 107501 142100 93654 41409 3658
353C658J23637q7088o0232J1992J31965L7800m3309K1980k1944J0240q465J1247
$$ 3658 127295 40207 -20025 -8033 123932 161732 118423 140403 118459 128699 120234 131481
341A31481o3290M300K8833k0724p9828J18942j9494r8288O2206N437j05035R4371
$$ 131481 68191 72491 101324 80600 772 119714 100220 1932 64138 69575 -35460 58911
329E8911L0625j2614o3918K9987K5762O045p8472L0382M4595o150M3665P4581
$$ 58911 89536 76922 13004 42991 68753 74798 -3674 26708 71303 65153 108818 183399
317A83399j3809j14815j1190r6474P0784P9698n4971M8887j3790o032P3921m0041
$$ 183399 169590 54775 43585 -52889 17895 97593 42622 91509 77719 71687 145608 105567
305A05567j14948R2731q1251L5757l3168q680N6108n2946j2880K9600P1911J8117
$$ 105567 -9381 83350 2099 37856 4688 -3992 52116 -830 -13710 15890 87801 105918
293A05918k5835l3256O0562N8276n3030L38l4969K707o0153O7894k1347j0751
$$ 105918 80083 46827 107389 165665 112635 112973 78004 80711 20558 88452 67105 56354
281E6354K1M5026k0778R495m096p3489l9910K3775P7598L5862m5673P6166Q7136
$$ 56354 56375 101401 80623 90118 86022 12533 -27377 -3602 73996 109858 64185 140351 227487
268B27487j71611j4334M5491Q6857j3358j00218l2736O6176J3368L1748p7861
$$ 227487 55876 41542 87033 173890 160532 60314 27578 93754 107122 138870 61009
257F1009N066L0914n9750J22222R432p9487k6405J5242n1059M2630O4506n2286
$$ 61009 66075 96989 37239 159461 168893 89406 63001 78243 27184 69814 134320 82034
245H2034J8363R716n3518o5163N1316Q7283r144q1149q6412O7451L2029K2020
$$ 82034 100397 110113 56595 -8568 42748 130031 120887 39738 -46674 20777 52806 74826
233G4826k7415n3819N9893l5314N3413l8390J31221N5905r6540M7567K5841m2941
$$ 74826 47411 -6408 53485 18171 71584 33194 164415 220320 123780 171347 197188 154247
221A54247r5842J7351K0321L4855M0362j19413O999K2266p3332L0376k7309M8205
$$ 154247 58405 75756 96077 130932 171294 51881 58880 81146 7814 38190 10881 59086
209E9086J7313q0062J9312R7953L5752n3093k1024j6423O7652L1166l9000n044
$$ 59086 76399 -3663 15649 113602 149354 96261 75237 58814 126466 157632 118632 113588
197A13588L1051j0598m8981l678J2607l1187j0228M4257m1949N8006l6956l7146
$$ 113588 144639 134041 85060 81382 93989 62802 52574 96831 54882 112888 75932 38786
185C8786l8182M5721O6349O041j613n8522K5603N8646n9421K6M3196n9792n2751
$$ 38786 604 46325 112674 118715 117102 58580 84183 142829 83408 83434 126630 66838 14087
172A4087j9551Q4884K7K7776k4392J2895J8270j0601J4243K1550j2470m4429j5156
$$ 14087 -5464 79420 79447 107223 82831 95726 113996 103395 117638 139188 126718 82289 67133
159F7133K3421j0532l794p3113P9127N0425m3854o0063m0043l2109J38640Q9776
$$ 67133 90554 80022 76228 3115 82242 132667 88813 28750 -11293 -43402 95238 185014
147A85014j8421q9372m1951l5761J6429O3903j4697P3557j1590n1136O5970q9752
$$ 185014 166593 77221 35270 -491 15938 79841 65144 138701 127111 75975 141945 52193
135E2193n352P4142q0497P5241m0647j5901P137k9603N2218j396k2891l8092J1689
$$ 52193 46841 120983 40486 115727 75080 59179 66316 36713 88931 87535 64644 26552 38241
122C8241L6244J8643j3550o5571L6792L2429k6907k5405l0066M5843J01425r8389
$$ 38241 74485 93128 79578 14007 50799 83228 56321 30916 850 46693 148118 49729
110D9729O040R790L2186N1483j08118L4356N6782l6276L9997N8695l4591o3223
$$ 49729 55769 65559 97745 149228 41110 75466 132248 95972 135969 194664 160073 96850
98I6850n048O0741j12884K3806J1825r808o3942j9036J3241O9717j0395J8362
$$ 96850 91802 152543 39659 63465 75290 65482 1540 -17496 -4255 65462 55067 73429
86G3429j6897M8320J1779k7913Q7682M9921L4208j23282q1536l5971m97L4802
$$ 73429 56532 104852 116631 88718 176400 226321 260529 137247 55711 19740 19243 54045
74E4045k3025P2329K6286l1984l9328l5191R2854j0269k6014M5121J1910k9538
$$ 54045 31020 103349 129635 97651 58323 23132 115986 105717 79703 124824 136734 107196
62A07196j4540n385m6128K1471M9255J2184m1976k7503Q8784O9338n1559q1900
$$ 107196 92656 87271 41143 62614 111869 124053 82077 54574 143358 212696 161137 79237
50G9237q967o4469O3123k1498O9297o5624J1994N143M5845l1328o482O7891k9921
$$ 79237 70270 5801 68924 47426 116723 51099 63093 68236 114081 82753 76271 144162 114241
37A14241j5802m2746L6334P547k1342M0934n301j5300n5135L1468J4569m2636
$$ 114241 98439 55693 92027 99574 78232 119166 113865 98565 43430 74898 89467 46831
25D6831k113k834L0767N2620k8671p3892j2395M5367j2237J8473M2104R554r826
$$ 46831 44718 41884 72651 125271 96600 22708 10313 55680 43443 61916 104020 113574 103748
12A03748J9554j0903o810j07962R1916P2825r1750J6041M4215n2835k4066O2516
$$ 103748 123302 112399 105589 -2373 89543 162368 70618 86659 130874 78039 53973 116489
0A16489
$$ 116489
$$ Imaginary data points
##PAGE= N=2
##DATA TABLE= (X++(I..I)), XYDATA
16383b263646j9276p5561Q0435J22272l934k6156o579J884J7623N9568L1254M5133
$$ -2263646 -2282922 -2358483 -2278048 -2155776 -2159710 -2185866 -2192445 -2190561 -2172938 -2113370 -2082116 -2036983
16371b036983k8809K8588M7949M9882P0293N9493O576k8778L8124L753N1874M9681
$$ -2036983 -2065792 -2037204 -1989255 -1939373 -1869080 -1809587 -1803011 -1831789 -1793665 -1789912 -1738038 -1688357
16359a688357N8262J1015O2695M0449l1904n3711N9657O0522p6441P2928N4611
$$ -1688357 -1630095 -1619080 -1556385 -1515936 -1547840 -1601551 -1541894 -1481372 -1557813 -1484885 -1430274
16348a430274K1310J7461o6341Q9994O2109M1728J6930k0255J4441k1584Q6798
$$ -1430274 -1408964 -1391503 -1457844 -1367850 -1305741 -1264013 -1247083 -1267338 -1252897 -1274481 -1187683
16337a187683p462n358K3745O6559N6990K5596P188P3234K5517N552n3552j5762
$$ -1187683 -1195145 -1200503 -1176758 -1110199 -1053209 -1027613 -1020425 -947191 -921674 -916122 -969674 -985436
16325i85436O872o88j9092J7611J32490L6779O4520N9335n9651L2332M1066j9302
$$ -985436 -978564 -979252 -998344 -980733 -848243 -811464 -746944 -687609 -747260 -714928 -673862 -693164
16313f93164K3854j0491n0928J11091M5613k461M8023O8844m5124M2032R028n5403
$$ -693164 -669310 -679801 -730729 -619638 -574025 -576486 -528463 -459619 -504743 -462711 -453683 -509086
16301e09086M2231O309J2065J4299L1536J7242Q4014J07703l2387M4071j6879
$$ -509086 -466855 -460546 -448481 -434182 -402646 -385404 -301390 -193687 -226074 -182003 -198882
16290a98882l1334N9806k3031L922N5376R650j9421J4146L6840R3436l854K9732
$$ -198882 -230216 -170410 -193441 -189519 -134143 -124493 -143914 -129768 -92928 508 -3346 26386
16278B6386J0065J5327j465j8014n9122Q6437j3133l9487R9856K3515N2333m8505
$$ 26386 36451 51778 50313 32299 -26823 59614 46481 6994 106850 130365 182698 134193
16266A34193K4413J6049Q1907Q8181j7237o3583J539L4195J4108R6536j8535K2495
$$ 134193 158606 174655 256562 344743 327506 263923 265462 299657 313765 410301 391766 414261
16254D14261j991n1914j935N3021Q217M1670n5055q9416K6552M5057M1982N5520
$$ 414261 412270 360356 358421 411442 419659 461329 406274 316858 343410 388467 430449 485969
16242D85969J00998j352k6156N7505j391K1033K4426k483L6149j27032J6218O9161
$$ 485969 586967 585615 559459 616964 615573 636606 661032 658549 694698 567666 583884 653045
16230F53045j0204J25320k9659l0547L9936R306L6209l8667R262L611j6608M8268
$$ 653045 642841 768161 738502 707955 747891 757197 793406 754739 764001 767612 751004 799272
16218G99272L8799J25789N2916j2522p0517k6605K4750l2024k1008n75n2764N7325
$$ 799272 838071 963860 1016776 1004254 933737 907132 931882 899858 878850 878275 825511 882836
16206H82836L7430N7425j7682O8600N0734l5702n3978J04753L2128r2097M919
$$ 882836 920266 977691 960009 1028609 1079343 1043641 989663 1094416 1126544 1034447 1039366
16195A039366j6033R8224m1748n2356O988K8801K1211M879N1165k0433l1953K7145
$$ 1039366 1023333 1121557 1079809 1027453 1034441 1063242 1084453 1089332 1140497 1120064 1088111 1115256
16183A115256Q4827j20856L0348L1838m0825L5843n690O1769P2039P372L517J5550
$$ 1115256 1200083 1079227 1109575 1141413 1100588 1136431 1130741 1192510 1264549 1271921 1275438 1290988
16171A290988l6084o0275L0093m6389J4343K1246k627N0607j5377P1903J0076
$$ 1290988 1254904 1194629 1224722 1178333 1192676 1213922 1211295 1261902 1246525 1318428 1328504
16160A328504L6710j45816n3687J28891q987k5177J14615m5978l1L6956l8690
$$ 1328504 1365214 1219398 1165711 1294602 1285615 1260438 1375053 1329075 1329044 1366000 1327310
16149A327310N0648R8213K565k8144l3060j6800L9745n0126l1982L0548L0678
$$ 1327310 1377958 1476171 1478736 1450592 1417532 1400732 1440477 1390351 1358369 1388917 1419595
16138A419595M5083O8781j01923P341Q3475n3524j12187J48347M8829J9712q1085
$$ 1419595 1464678 1533459 1431536 1438877 1522352 1468828 1356641 1504988 1553817 1573529 1492444
16127A492444l4594L4834L4337p4214M7299r3259L7756J5321r0299P9134m3381
$$ 1492444 1457850 1492684 1527021 1452807 1500106 1406847 1444603 1459924 1369625 1448759 1405378
16116A405378R2254r202J9227k0401J7128K5463N3649L073n3334p4623N3861j5949
$$ 1405378 1497632 1488430 1507657 1487256 1504384 1529847 1583496 1586569 1533235 1458612 1512473 1496524
16104A496524L0000m7175N4990M3729J393Q3552j8847p6081o5486L8130k5228
$$ 1496524 1526524 1479349 1534339 1578068 1579461 1663013 1644166 1568085 1502599 1540729 1515501
16093A515501K3750m063m8285J26855p797j03477M7349K4062O0123K336P670r299
$$ 1515501 1539251 1535188 1486903 1613758 1605961 1502484 1549833 1573895 1634018 1636354 1644024 1634725
16081A634725p4264J06726K0349k9972M6774R9574k08258m210N6456n0515o1090
$$ 1634725 1560461 1667187 1687536 1657564 1704338 1803912 1595654 1591444 1647900 1597385 1536295
16070A536295R985o3372M8316j0879O8565L6994N0239j7217K5099n8242k7215
$$ 1536295 1546280 1482908 1531224 1520345 1588910 1625904 1676143 1658926 1684025 1625783 1598568
16059A598568J178n8915M6192O1621l8626N6231l7737K7735K288k8037j1998K294
$$ 1598568 1599746 1540831 1587023 1648644 1610018 1666249 1628512 1656247 1658535 1630498 1618500 1620794
16047A620794j9032o6879J00609o1363k4445Q4121j4135L4572P0950j7886M8631
$$ 1620794 1601762 1534883 1635492 1574129 1549684 1633805 1619670 1654242 1725192 1707306 1755937
16036A755937o6008P270p0396l5555n4133K409L2737R9718n34j3569j9951N1522
$$ 1755937 1689929 1697199 1626803 1591248 1537115 1539524 1572261 1671979 1671445 1657876 1637925 1689447
16024A689447n1939J3588L2753j2099n5380k9072n1558L3447J02726n9891K4054
$$ 1689447 1637508 1651096 1683849 1671750 1616370 1587298 1535740 1569187 1671913 1612022 1636076
16013A636076Q0013L4062k9922Q568O396j68010J9975l1377P6776N5285O2k0381
$$ 1636076 1716089 1750151 1720229 1728797 1735193 1567183 1587158 1555781 1632557 1687842 1687904 1667523
16001A667523O3704l2762L6127P1725j45092M937j9773j430L9544p0048k8522
$$ 1667523 1731227 1698465 1734592 1806317 1661225 1666162 1646389 1644959 1684503 1614455 1585933
15990A585933K498l2626J00374q288K0050n6736O4314q706L328o2108m6659P8899
$$ 1585933 1588431 1555805 1656179 1647891 1667941 1611205 1675519 1666813 1670141 1608033 1561374 1640273
15978A640273j2752l9289N1004m1763o3332O5279L3417M1554l2732M620q9483
$$ 1640273 1627521 1588232 1639236 1597473 1534141 1599420 1632837 1674391 1641659 1646279 1556796
15967A556796M2142n3522m430R3707J14239J871l3388k9549M5843O3945o5614
$$ 1556796 1598938 1545416 1540986 1634693 1748932 1750803 1717415 1687866 1733709 1797654 1732040
15956A732040r9321q698m4562R6630P7122l1573n4939N5809r749j1863k7163J4133
$$ 1732040 1632719 1624021 1579459 1676089 1753211 1721638 1666699 1722508 1712759 1700896 1673733 1687866
15944A687866r6632k1477J08616R343l6121j0245l5520J00713j4931K6152K6454
$$ 1687866 1591234 1569757 1678373 1687716 1651595 1641350 1605830 1706543 1691612 1717764 1744218
15933A744218r1551p4952N1309M2463k3994j00947R8475Q5819m8736l8545j3057
$$ 1744218 1652667 1577715 1629024 1671487 1647493 1546546 1645021 1730840 1682104 1643559 1630502
15922A630502Q8042Q2026L7527j36604j26486K2416o398o4624O5885R1002j2824
$$ 1630502 1718544 1800570 1838097 1701493 1575007 1597423 1591025 1526401 1592286 1683288 1670464
15911A670464j07522N8401N2707J02976j09064p482p0482M8311p408O5845p4805
$$ 1670464 1562942 1621343 1674050 1777026 1667962 1660480 1589998 1638309 1630901 1696746 1621941
15900A621941K7532j3061p9172J7866Q1527J23793O6633j62944o5370k8037P3291
$$ 1621941 1649473 1636412 1557240 1575106 1656633 1780426 1847059 1684115 1618745 1590708 1663999
15889A663999o7476K2439l3468J39185j739p0883L7930Q3670n5502J6013j08394
$$ 1663999 1596523 1618962 1585494 1724679 1722940 1652057 1689987 1773657 1718155 1734168 1625774
15878A625774Q6055q3596j18585P7348P645J29436M3681k2528o7891l6715L6436
$$ 1625774 1711829 1628233 1509648 1586996 1594641 1724077 1767758 1745230 1677339 1640624 1677060
15867A677060M982n1639m6361q0294K460P9797R8313J8834Q2992l8406l1692m8878
$$ 1677060 1682042 1630403 1584042 1503748 1506208 1586005 1684318 1703152 1786144 1747738 1716046 1667168
15855A667168J31893j67856j679n7605o3009O8068N7036J9074J67861p8343M8651
$$ 1667168 1799061 1631205 1629526 1571921 1508912 1576980 1634016 1653090 1820951 1742608 1791259
15844A791259k7649j4711j2857j42328o0485O1361M6974O2678K1494L5856k0400
$$ 1791259 1763610 1748899 1736042 1593714 1533229 1594590 1641564 1704242 1725736 1761592 1741192
15833A741192l6343J0730k0263N434p424o6914L9005m6820P0566m796m3985J09096
$$ 1741192 1704849 1715579 1695316 1700750 1693326 1626412 1665417 1618597 1689163 1684367 1640382 1749478
15821A749478L2888J4185L0680k4298l2229p8084l6881K4572k6242L2061K3946
$$ 1749478 1782366 1796551 1827231 1802933 1770704 1692620 1655739 1680311 1654069 1686130 1710076
15810A710076J727l3479l4537J45738l852n5926l432j23629l8996O4039K6556
$$ 1710076 1711803 1678324 1643787 1789525 1785673 1729747 1726315 1602686 1563690 1627729 1654285
15799A654285p282K2541o9574J27535K0799M3284p8715k1205l5994Q1289n5653
$$ 1654285 1647003 1669544 1599970 1727505 1748304 1791588 1712873 1691668 1655674 1736963 1681310
15788A681310K9595o0538O3207L8846j7959J1430l6408K8891n1068m7559p797
$$ 1681310 1710905 1650367 1713574 1752420 1734461 1745891 1709483 1738374 1687306 1639747 1631950
$$ [...]
##END NTUPLES=NMR SPECTRUM
##END=
