##TITLE=1H_CG-1210-1
 CDCl3
 8 sc, 
 8.8.2024
##JCAMPDX= 6.0         $$ Bruker NMR JCAMP-DX V2.0
##DATA TYPE= NMR SPECTRUM
##DATA CLASS= NTUPLES
##ORIGIN= UXNMR, Bruker Analytische Messtechnik GmbH
##OWNER= root
$$ XWIN-NMR		Version 3.5
$$ Thu Aug  8 14:01:46 2024 Russian Standard Time (UT+4h)  she@DPX200
##.OBSERVE FREQUENCY= 200.1313
##.OBSERVE NUCLEUS= ^1H
##.ACQUISITION MODE= SIMULTANEOUS
##.ACQUISITION SCHEME= undefined
##.AVERAGES= 8
##.DIGITISER RES= 18
##SPECTROMETER/DATA SYSTEM= spect
##.PULSE SEQUENCE= zg30
##.SOLVENT NAME= Acetone
##.SHIFT REFERENCE= (INTERNAL, Acetone, 0, 21.5218)
##AUDIT TRAIL= $$ (NUMBER, WHEN, WHO, WHERE, WHAT)
$$ ##TITLE= Audit trail, XWIN-NMR		Version 3.5
$$ ##JCAMPDX= 5.01
$$ ##ORIGIN= Bruker BioSpin GmbH
$$ ##OWNER= she
$$ F:/spectra/data/she/nmr/H-F/1/pdata/1/auditp.txt
$$ ##AUDIT TRAIL=  $$ (NUMBER, WHEN, WHO, WHERE, WHAT)
(   1,<2024-08-08 14:00:18.10 +0400>,<she>,<DPX200>,
      <created by zg, POWCHK disabled, PULCHK disabled
       configuration hash MD5:
       00 E9 B6 7A A2 85 ED C7 34 08 36 98 17 FE 4E 26
       data hash MD5: 16K
       9B 13 FE 55 B9 D9 AF 39 C1 B0 A9 5F 60 50 EF F6>)
(   2,<2024-08-08 14:00:20.85 +0400>,<she>,<DPX200>,
      <Start of raw data processing
       efp BC_mod = 2 LB = 0.24 FT_mod = 6 PKNL = 1 PHC0 = -25718.73 PHC1 = 14.38749 SI = 16K 
       data hash MD5: 16K
       00 A8 C5 D0 B7 D5 7A 93 F1 A6 6A 1B FD 8A 0B BA>)
(   3,<2024-08-08 14:00:49.00 +0400>,<she>,<DPX200>,
      <pk PHC0 = 81.81341 PHC1 = -1.6 
       data hash MD5: 16K
       7B 18 BC 63 6E D8 16 E1 82 CC CE 50 11 36 FD 0D>)
(   4,<2024-08-08 14:00:52.51 +0400>,<she>,<DPX200>,
      <abs ABSG = 5 
       data hash MD5: 16K
       C2 6C 13 56 EF 40 A3 F0 AA 7F D4 20 29 27 61 B8>)
$$ ##END=
$$ 
$$ hash MD5
$$ 17 59 D3 27 A7 EE CF D2 7A EA 33 DF 6D 82 3D 86
##$RELAX= 
##$RELAX= 
##$RELAX= 
##$RELAX= 
##$RELAX= 
##$RELAX= 
$$ Bruker specific parameters
$$ --------------------------
##$DU= <F:/spectra>
##$EXPNO= 1
##$NAME= <H-F>
##$PROCNO= 1
##$TYPE= <nmr>
##$USER= <she>
##$AMP= (0..31)
100 100 100 100 100 100 100 100 100 100 100 100 100 100 100 100 100 100 
100 100 100 100 100 100 100 100 100 100 100 100 100 100 
##$AQSEQ= 0
##$AQ_mod= 1
##$AUNM= <au_zg>
##$AUTOPOS= <>
##$BF1= 200.13
##$BF2= 200.13
##$BF3= 200.13
##$BF4= 200.13
##$BF5= 200.13
##$BF6= 200.13
##$BF7= 200.13
##$BF8= 200.13
##$BYTORDA= 1
##$CFDGTYP= 0
##$CFRGTYP= 5
##$CHEMSTR= <none>
##$CNST= (0..31)
1 1 145 1 1 1 1 1 1 1 1 1 1 1 1 1 1 1 1 1 1 1 1 1 1 1 1 1 1 1 1 1 
##$CPDPRG= <>
##$CPDPRG1= <>
##$CPDPRG2= <>
##$CPDPRG3= <>
##$CPDPRG4= <mlev>
##$CPDPRG5= <mlev>
##$CPDPRG6= <mlev>
##$CPDPRG7= <mlev>
##$CPDPRG8= <mlev>
##$CPDPRGB= <>
##$CPDPRGT= <>
##$D= (0..31)
0 1.2 0 0 0 0 0 0 0 0.06 0 0.03 0 0 0 0 0.0002 0 0 0 0 0 0 0 0 0 0 0 0 
0 0 0 
##$DATE= 1723111217
##$DBL= (0..7)
120 120 120 120 120 120 120 120 
##$DBP= (0..7)
150 150 150 150 150 150 150 150 
##$DBP07= 0
##$DBPNAM0= <>
##$DBPNAM1= <>
##$DBPNAM2= <>
##$DBPNAM3= <>
##$DBPNAM4= <>
$$ [...]
##$SUBNAM3= <"">
##$SUBNAM4= <"">
##$SUBNAM5= <"">
##$SUBNAM6= <"">
##$SUBNAM7= <"">
##$SUBNAM8= <"">
##$SUBNAM9= <"">
##$SW= 24.0689771365484
##$SWIBOX= (0..15)
0 0 2 0 0 0 0 0 0 0 0 0 0 0 0 0 
##$SW_h= 4816.95568400771
##$TD= 16384
##$TD0= 1
##$TE= 0
##$TE2= 300
##$TE3= 300
##$TEG= 300
##$TL= (0..7)
0 120 120 120 120 120 120 120 
##$TP= (0..7)
150 150 150 150 150 150 150 150 
##$TP07= 0
##$TPNAME0= <>
##$TPNAME1= <>
##$TPNAME2= <>
##$TPNAME3= <>
##$TPNAME4= <>
##$TPNAME5= <>
##$TPNAME6= <>
##$TPNAME7= <>
##$TPOAL= (0..7)
0.5 0.5 0.5 0.5 0.5 0.5 0.5 0.5 
##$TPOFFS= (0..7)
0 0 0 0 0 0 0 0 
##$TUNHIN= 0
##$TUNHOUT= 0
##$TUNXOUT= 0
##$USERA1= <user>
##$USERA2= <user>
##$USERA3= <user>
##$USERA4= <user>
##$USERA5= <user>
##$V9= 5
##$VALIST= <valist>
##$VCLIST= <CCCCCCCCCCCCCCC>
##$VD= 0
##$VDLIST= <DDDDDDDDDDDDDDD>
##$VPLIST= <PPPPPPPPPPPPPPP>
##$VTLIST= <TTTTTTTTTTTTTTT>
##$WBST= 1024
##$WBSW= 4
##$XGAIN= (0..3)
0 0 0 0 
##$XL= 0
##$YL= 0
##$YMAX_a= 360207
##$YMIN_a= -306110
##$ZGOPTNS= <>
##$ZL1= 120
##$ZL2= 120
##$ZL3= 120
##$ZL4= 120
##$ABSF1= 21.55857
##$ABSF2= -2.510635
##$ABSG= 5
##$ABSL= 3
##$ALPHA= 0
##$AQORDER= 0
##$ASSFAC= 0
##$ASSFACI= 0
##$ASSFACX= 0
##$ASSWID= 0
##$AUNMP= <proc_1d>
##$AZFE= 0.1
##$AZFW= 0.1
##$BCFW= 0
##$BC_mod= 2
##$BYTORDP= 0
##$COROFFS= 0
##$CY= -3
##$DATMOD= 1
##$DC= 0
##$DFILT= <>
##$DTYPP= 0
##$F1P= 0
##$F2P= 0
##$FCOR= 1
##$FTSIZE= 16384
##$FT_mod= 6
##$GAMMA= 0
##$GB= 0
##$INTBC= 1
##$INTSCL= 3.70164e-10
##$ISEN= 128
##$LB= 0.24
##$LEV0= 0
##$LPBIN= 0
##$MAXI= 10000
##$MC2= 0
##$MEAN= 0
##$ME_mod= 0
##$MI= 1.114404
##$NCOEF= 0
##$NC_proc= -6
##$NLEV= 6
##$NOISF1= 3.799351
##$NOISF2= 2.8
##$NSP= 0
##$NTH_PI= 0
##$NZP= 0
##$OFFSET= 21.52184
##$PC= 1
##$PHC0= -25636.92
##$PHC1= 12.78749
##$PH_mod= 1
##$PKNL= yes
##$PPARMOD= 0
##$PSCAL= 0
##$PSIGN= 0
##$REVERSE= no
##$SF= 200.129401324392
##$SI= 16384
##$SIGF1= 3
##$SIGF2= 2
##$SINO= 5.538805
##$SIOLD= 16384
##$SREGLST= <1H.CDCl3>
##$SSB= 0
##$STSI= 16384
##$STSR= 0
##$SW_p= 4816.95568400771
##$SYMM= 0
##$S_DEV= 0
##$TDeff= 16384
##$TDoff= 0
##$TI= <>
##$TILT= no
##$TM1= 0
##$TM2= 0
##$TOPLEV= 0
##$USERP1= <user>
##$USERP2= <user>
##$USERP3= <user>
##$USERP4= <user>
##$USERP5= <user>
##$WDW= 1
##$XDIM= 16384
##$YMAX_p= 362264200
##$YMIN_p= -2526935
$$ End of Bruker specific parameters
$$ ---------------------------------
##NTUPLES= NMR SPECTRUM
##VAR_NAME=  FREQUENCY,     SPECTRUM/REAL,   SPECTRUM/IMAG
##SYMBOL=    X,             R,               I
##VAR_TYPE=  INDEPENDENT,   DEPENDENT,       DEPENDENT
##VAR_FORM=  AFFN,          ASDF,            ASDF
##VAR_DIM=   16384,         16384,           16384
##UNITS=     HZ,            ARBITRARY UNITS, ARBITRARY UNITS
##FACTOR=    0.29402158847633, 1,            1
##FIRST=     4307.15278285745, 0,            0
##LAST=      -509.802901150263, 0,           0
##MIN=       -509.802901150263, -2526935,    0
##MAX=       4307.15278285745, 362264200,    0
$$ Real data points
##PAGE= N=1
##DATA TABLE= (X++(R..R)), XYDATA
$$ [...]
5152a8087J01285K5772Q4350N163J7449o4374k37466K18159L5306l2978j9497
5141A15082Q2986j32845p0254L4552K9632J17204n9901p5157J25722r0033P2040
5130A49028l0088k689L5020l4046j9369P3144j39520N5148N001j4310j74245P0146
5118b6780K29176K114l0955j0289l8249j5637Q762K6788j11554K5883J28388l3819
5106A53828L0434l6989p4974L1987j08919J5782L370M9834J62290J9603K6688
5095B72934r7923O4682l4694m3842m787K0973p1510o826J9407r3308k7311J47609
5083A45404k39753N6878K23436J15894n4470L216q9890L964j08391J640k0300
5072C7628J7735J50912q1485J4897J33462R1320p2291j35429j18918M1513N2715
$$ plain form
5152 -18087 83198 108970 193320 198483 215932 151558 -85908 132251 167557 134579 115082
5141 115082 198068 65223 -5031 29521 59153 176357 116456 41299 167021 76988 149028
5130 149028 118940 116251 151271 117225 97856 171000 31480 86628 91629 77319 -96926 -26780
5118 -26780 202396 204510 173555 163266 125017 109380 118142 144930 33376 59259 187647 153828
5106 153828 184262 147273 72299 104286 -4633 11149 14519 64353 226643 246246 272934
5095 272934 175011 239693 204999 161157 156370 177343 105833 99007 118414 25106 -2205 145404
5083 145404 -94349 -37471 185965 301859 247389 250605 160715 164679 56288 57928 37628
5072 37628 55363 206275 124790 139687 273149 364469 292178 156749 37831 79344 132059
5061A32059K5493N9236L5276L2465p7882k8894n4870K2038n2419J72284M7447
5050C12233L9142k9819r3875n6809l2030O3497m5845r1190L1589J24434N6497
5039B77824j1492n9551L2539O7948N3999j233k03949J72051J09886j86664m5640
5028B05718P3581N9314P2845q059j2439N200L7532j11905k7655O2219l9845J11103
5016D27609j27305l1879p4116K7203K49281J21372j12106J16886J4373n06p7346
5005E33466l2338m4253l579j7916Q2975o9969R866r3296O2378o7337J8452J20901
4993D99350k567j74289m89R0376q667j1810R552J17345m5037P3296K6605l3847
4981E39818r4813p6961K1543j92397L4499M9855N0292P1730k3978m0786J5136
$$ plain form
5061 132059 157552 216788 252064 284529 206647 177753 122883 144921 92502 264786 312233
5050 312233 351375 321556 227681 170872 138842 202339 156494 65304 96893 221327 277824
5039 277824 266332 206781 239320 307268 361267 360034 156085 328136 438022 251358 205718
5028 205718 279299 338613 411458 403399 390960 396160 433692 321787 294132 356351 316506 427609
5016 427609 300304 268425 194309 221512 470793 592165 480059 596945 611318 610812 533466
5005 533466 501128 456875 453296 435380 518355 448386 458252 364956 427334 359997 378449 499350
4993 499350 496783 322494 322005 412381 403714 391904 401456 518801 473764 547060 573665 539818
4981 539818 445005 368044 389587 197190 231689 281544 331836 403566 379588 338802 353938
4970C53938J59444o5127p8640M8902J92367j83132J8840J3003l1001P237r6877
4959C38954P1138J45468j01133l7480O3910m082l6222j02795J23168j29538P3487
4948D04875Q1563J8900L5835j23039L6665N023P6820o810Q091j20376N8259J75513
4936F51319p1396J07579p881m5365j06560P977O6305N199K4699j28847j6117Q8339
4924E75251L5761p7355o6543Q5430j21656R7619J22506J63496J9647m3698J24505
4913I14963j978J860k36631j08261L3501J69805j71466R3849J81118j60907l3982
4902F81871J52458K572n5570Q7435L7243J3997n2330j3494N200M2428R0635O2896
4890A055341J22638k69140l0564M6840k4079L4609m077n895l6740K457K94708
$$ plain form
4970 353938 513382 448255 369615 418517 610884 427752 446592 459595 428594 435831 338954
4959 338954 410092 555560 454427 416947 480857 476775 440553 337758 460926 331388 404875
4948 404875 486438 505338 541173 418134 454799 459822 536642 529832 537923 417547 475806 651319
4936 651319 579923 687502 679621 634256 527696 535673 601978 607177 631876 503029 486912 575251
4924 575251 611012 533657 467114 552544 430888 528507 651013 814509 834156 790458 914963
4913 914963 912985 914845 678214 569953 603454 773259 601793 695642 876760 715853 681871
4902 681871 834329 836901 781331 868766 906009 920006 867676 854182 859382 901810 992445 1055341
4890 1055341 1177979 908839 878275 925115 901036 935645 931568 925673 888933 891390 1186098
4879A186098k4249j6114j17976R7565o8183n4654J60104J61687j68346O8609K7581
4868A252122m916J42425M8229J56380l2559J13849o8085l4377P0567n394J31685
4857A769926K3174n7977M4436R2107J80913j3492K23398Q9429K76448j239l9187
4846B587936K02284J04001n7690J18781J27420J68040k3630L4182J05957J63192
4836C530473R0236K42760K2706N0441K49506J20460J79727K23756K38031J73279
4826E121375R9729L53293K68122K32935L02504K41527L09950L22740L31139L08787
4816G892101L97908N75077M91271M05766N42014N74503O11947O42888P60426Q51758
4806A3745659Q18266Q86025J321521J170101J491557J768985K112968K468544
$$ plain form
4879 1186098 1161849 1145735 1027759 1125324 1057141 1002487 1162591 1324278 1155932 1224541 1252122
4868 1252122 1247206 1389631 1437860 1594240 1561681 1675530 1607445 1573068 1643635 1638241 1769926
4857 1769926 1793100 1735123 1779559 1871666 2052579 2039087 2262485 2351914 2628362 2627123 2587936
4846 2587936 2790220 2894221 2836531 2955312 3082732 3250772 3227142 3261324 3367281 3530473
4836 3530473 3620709 3863469 3886175 3936616 4186122 4306582 4486309 4710065 4948096 5121375
4826 5121375 5221104 5574397 5842519 6075454 6377958 6619485 6929435 7252175 7583314 7892101
4816 7892101 8290009 8865086 9356357 9762123 10304137 10878640 11490587 12133475 12893901 13745659
4806 13745659 14563925 15449950 16771471 17941572 19433129 21202114 23315082 25783626
4798B5783626K643453L479286L710522K754473P62234j052502k141314k050789
4790C3888989j627817j066771o32872p29M43175R09572J480253K016152K603030
4781C8012982L296537M275339N291370O345284N796393K437726j860381n479050
4773E8116200o919411o431756n325776l951784k931425k119093j585719r39827
4765B7911409l86880L11862N23473J378425J872492K279207K536794J359521r02858
4756C6883445k876265l965795m032900l569234k886187k286524j839201j429552
4748A3997787j294773j276788r45424o68172r12562o17538k73910l47895m14993
4739G245732m16277k21398k96555j15319j35255r6687q8889o2191J6811k7372
$$ plain form
4798 25783626 28427079 31906365 35616887 38371360 39133594 38081092 35939778 33888989
4790 33888989 32261172 31194401 30561529 30560800 31003975 31913547 33393800 35409952 38012982
4781 38012982 41309519 45584858 50876228 57221512 63017905 65455631 63595250 58116200
4773 58116200 51196789 44765033 39439257 35487473 32556048 30436955 28851236 27911409
4765 27911409 27524529 27836391 28359864 29738289 31610781 33889988 36426782 37786303 36883445
4756 36883445 34007180 30041385 26008485 22439251 19553064 17266540 15427339 13997787
4748 13997787 12703014 11426226 10480802 9812630 8900068 8282530 8008620 7660725 7245732
4739 7245732 6829455 6608057 6311502 6196183 6060928 5964241 5875352 5813161 5829972 5802600
4729E802600j16156p97j04322j56288k30120j79978n7648k88601o0474j09823
4719D498393k2655j0738O6714J43878K02573O4598O1059l1165K23572J57312K08806
4708E562347J46032j23498j71960k32735m8043k0736q9873K1041j2568N1738J32153
4697E213898J93033K64119K98308L46493M09995O90913N42299M47143L45942P094
4687H759237l51820m45891m96602n78015k54849n5018k45395O9697J30349P3489
4677F605182L41285L56961N68089N75646O83995O62024R60733R37660M62665m60090
4667A1694150j006419j097700j227944r94315o09029n24685m05056l00976k73272
4658E254754J2017j2911J65481J72934J85364K8138L27539M52011K79164o4241
$$ plain form
4729 5802600 5686444 5685647 5581325 5425037 5194917 5014939 4957291 4668690 4608216 4498393
4719 4498393 4475738 4465000 4531714 4675592 4878165 4942763 5003822 4972657 5196229 5353541 5562347
4708 5562347 5708379 5584881 5412921 5180186 5132143 5111407 5021534 5042575 5030007 5081745 5213898
4697 5213898 5406931 5671050 5969358 6315851 6725846 7416759 7959058 8406201 8752143 8759237
4687 8759237 8407417 7961526 7464924 6886909 6632060 6577042 6331647 6401344 6531693 6605182
4677 6605182 6946467 7303428 7871517 8447163 9131158 9793182 10753915 11691575 12154240 11694150
4667 11694150 10687731 9590031 8362087 7367772 6758743 6234058 5829002 5528026 5254754
4658 5254754 5266771 5253860 5419341 5592275 5777639 5805777 6133316 6585327 6864491 6800250
4648F800250m61403n52706o76104o29788n01906n89146l88417k10670k50421j06560
4638B433129k52662r9510j69949k22254K03741p6055j74045k81705m3184P820
4628A325326P2422p6040j20707J3086O8767l6339r5205o6345Q5268m6952j16526
4617A006755n429K8654j1878m84j11517j9561R8006o1592P232n1477J01314N186
4605I85209j95875L8824J36525j65532k0882K1050p886J00349J34997n8700p7082
4594H90997O4535j31314P7301M4361J12981n9417j84997N7754J29374J10103j52548
4583I59130L0274m4670j21059K0131J57637j48028J1099J02076k6232p9846l7927
4572H22585K42812p4125k8453P7689j35700R5474N3712O1611j96171j44743J81766
$$ plain form
4648 6800250 6338847 5786141 5110037 4480249 3978343 3389197 3000780 2790110 2539689 2433129
4638 2433129 2180467 2080957 1911008 1688754 1892495 1816440 1642395 1360690 1317506 1325326
4628 1325326 1397748 1321708 1201001 1214087 1282854 1246515 1151310 1084965 1170233 1123281 1006755
4617 1006755 1001326 1029980 1018102 1017618 906101 886540 984546 922954 930186 878709 980023 985209
4605 985209 789334 828158 964683 799151 778269 799319 791433 891782 1026779 968079 890997
4594 890997 955532 824218 901519 945880 1058861 999444 814447 872201 1001575 1111678 959130
4583 959130 989404 944734 823675 843806 1001443 853415 864514 966590 940358 860512 822585
4572 822585 1065397 991272 962819 1040508 904808 1000282 1053994 1115605 919434 774691 956457
4561I56457J23119j57995K4349L0201r372j29707m5790k7304P8063J18751L6218
4550I96990j46564o0006O5327R8546o8414J42732P8238k7629j76746O8761l4130
4539I37105j3778K549j61575o531J26957o3059k31023J64156R0283n7956k3572
4528G63556J06972p9987m0060J8717j26541P4692J09152o2280L0698o8511J39906
4517H66314n8341J9541j36501J8301P2514J4201n6354n5089l6705J46322J2319
4506H06522j00139K2539J74948k4407r351j9850j47245J84978p481j0578m6666
4495H23270m5982r12M0086O5366p5537k8859r3517J83771R0615R2289j45667N2714
4483I57637O9705j32761M0086n9631J34192p1271L9088q3683j1853N9318J09366
$$ plain form
4561 956457 1079576 921581 945930 976131 966759 837052 791262 763958 842021 960772 996990
4550 996990 850426 790420 855747 954293 885879 1028611 1106849 1079220 902474 971235 937105
4539 937105 923327 925876 764301 757770 884727 821668 590645 754801 845084 787128 763556
4528 763556 870528 790541 750481 769198 642657 717349 826501 764221 794919 726408 866314
4517 866314 807973 827514 691013 709314 781828 796029 739675 684586 647881 794203 806522
4506 806522 706383 728922 903870 879463 870112 850262 703017 887995 880514 869936 823270
4495 823270 777288 776376 816462 881828 806291 777432 683915 867686 958301 1050590 904923 957637
4483 957637 1027342 894581 934667 875036 1009228 937957 977045 893362 881509 940827 1050193
4472A050193m8259l2747J10569m2305Q060Q8960Q99l3852J42724k06996N2289
4461A089535J19027j21299j4330o1543J63912L7342m9904j13428j49385J21831
4451A021758J61130n9288n9762J79282J2973J40122j12113p4987K5599K1598J4511
4440A270823l0896R2845m4245K00840j18231K9726J30060o4734o220j0596r4327
4429A355045P722K67456n9191J46666q9764N1613J34494J6678J51292O0738n2781
4418A989968p0695L5863R4355R8878k5039K02835O4818P4864O5846o5526J46620
4407B612787N6677k0476J04651J87431J72091L7459K6438Q2484J27819O5784J01947
4396C555092P0468J82922K41728m7532J27810K7835J33654K24257L46881K05527
$$ plain form
4472 1050193 1001934 969187 1079756 1037451 1045511 1134471 1135370 1101518 1244242 1037246 1089535
4461 1089535 1208562 1087263 1072933 1011390 1175302 1212644 1162740 1049312 899927 1021758
4451 1021758 1182888 1123600 1063838 1243120 1256093 1396215 1284102 1209115 1234714 1256312 1270823
4440 1270823 1239927 1332772 1288527 1489367 1371136 1400862 1530922 1466188 1459968 1449372 1355045
4429 1355045 1362767 1630223 1571032 1717698 1627934 1679547 1814041 1830719 1982011 2042749 1989968
4418 1989968 1919273 1955136 2049491 2148369 2123330 2326165 2390983 2465847 2531693 2466167 2612787
4407 2612787 2669464 2648988 2753639 2941070 3113161 3150620 3177058 3259542 3387361 3453145 3555092
4396 3555092 3625560 3808482 4050210 4002678 4130488 4158323 4291977 4516234 4863115 5068642
4386E068642J33837L16763K65786L11529K73314K74994K29968L18337J9305J52427
4376G364902K27434K60574L13921M17205L72827M00160M90576M39700O02583O85833
4366A1575715O85284Q29862R84975Q97116J001393R26937Q42981J114422J260365
4357B0119050J602064J858073K192584K559211L029214L800942M006500L475864
4349D2643502J208383j441797k518538k684190k405795j729422q21954l77900
4341C1872289J00062P37313J225757J823884K589558L258751M263416N325590
4333E1196620O476223O151560K823120k377731n941340p207956o978660n576276
4325C8565560m142327k948849k322618j701791j021926m80652M7182N23832Q07283
$$ plain form
4386 5068642 5202479 5519242 5785028 6096557 6369871 6644865 6874833 7193170 7212475 7364902
4376 7364902 7592336 7852910 8166831 8584036 8956863 9357023 9847599 10287299 10889882 11575715
4366 11575715 12260999 13090861 14075836 14972952 15974345 16901282 17744263 18858685 20119050
4357 20119050 21721114 23579187 25771771 28330982 31360196 35161138 39167638 42643502
4349 42643502 43851885 42410088 39891550 37207360 34801565 33072143 32250189 31872289
4341 31872289 31972351 32709664 33935421 35759305 38348863 41607614 45871030 51196620
4333 51196620 57672843 63824403 66647523 64269792 58328452 51120496 44141836 38565560
4325 38565560 34423233 31474384 29151766 27449975 26428049 25947397 25994579 26518411 27325694
4316B7325694J240977J850750K300940J603117m84264k594809l608024l633495
4308B4000886l272353k662276k105440j605094j249115j243258q24966o88548
4300A0349836o39719n73805m86670n48479m84142k73506k39778k16291l66320
4291F521126k16708j12279q6539j88770j0535j40962j00254Q1380J20183R217
4281E875859L3757J126q6802J69502K68792m0702N2090P1339L18831L32082J86678
4270G182552M10768K77677K2068J34551L90138K47217L48705M86659N84177R48308
4260A1032820N58202K42249J32479j84131k95909l82081k79269k28587j78253
4251A0417520K6826R4136K19797J67268P307N78736L75972L45008N17978Q16725
$$ plain form
4316 27325694 28566671 30417421 32718361 34321478 33837214 31242405 27634381 24000886
4308 24000886 20728533 18066257 15960817 14355723 13106608 11863350 11038384 10349836
4300 10349836 9710117 9136312 8649642 8101163 7617021 7343515 7103737 6887446 6521126
4291 6521126 6304418 6192139 6105600 5916830 5906295 5765333 5665079 5746459 5866642 5875859
4281 5875859 5909616 5910742 5823940 5993442 6262234 6221532 6273622 6344961 6663792 6995874 7182552
4270 7182552 7593320 7870997 7893065 8027616 8417754 8664971 9013676 9500335 10084512 11032820
4260 11032820 11591022 11833271 11965750 11781619 11485710 11103629 10824360 10595773 10417520
4251 10417520 10444346 10538482 10758279 10925547 10932854 11511590 11887562 12232570 12750548 13567273
4241A3567273J152350J075812O5223n83937j123360j281075j316757r63339q04628
4232I787562n42532l71833j62767K8823m1121r1118J4743r2803k94215n8126L5439
4221H212052K38443P8813j79489o19778o47433o52077n74859m79487m19881k81145
4211D675159n4062j48219j27849l4079n6363j39686n4550l77840k37466q5192
4201C359853k16412j11478j43486j2851p9460L3906n5902j12402l3127l4035r6418
4190B498188J26518j12445m6049R4703j3168j692J0139P6842p0044J07343j36582
4179B533753j8076N6727N6227l8467j05302O2829O5679K32436n1704K9245J39161
4168B962508l7896k1303K3651L1500K57436R4338q3848K6933n3692K27912J68256
$$ plain form
4241 13567273 14719623 15795435 15860658 15276721 14153361 12872286 11555529 10592190 9787562
4232 9787562 9245030 8873197 8710430 8739253 8698132 8607014 8621757 8528954 8234739 8176613 8212052
4221 8212052 8450495 8529308 8349819 7730041 7082608 6430531 5855672 5376185 4956304 4675159
4211 4675159 4621097 4472878 4345029 4310950 4254587 4114901 4060351 3682511 3445045 3359853
4201 3359853 3143441 3031963 2888477 2875626 2796166 2830072 2774170 2661768 2628641 2594606 2498188
4190 2498188 2624706 2512261 2466212 2560915 2547747 2546055 2556194 2633036 2562992 2670335 2533753
4179 2533753 2515677 2572404 2628631 2590164 2484862 2547691 2613370 2845806 2794102 2823347 2962508
4168 2962508 2924612 2903309 2926960 2958460 3215896 3310234 3226386 3253319 3199627 3427539 3595795
4157C595795J54983M1103J12993J57758j1545M6645J9739k5585K14731J94608
4147D501225M7404K8809J06016R6569J57239J59753K98861J53405J73661J44633
4137E867575J60291K66498K21851J65624J35345L19086L59024K36486K79228M46670
4127H457678L98156M94232L68750L41514M92055N09045O24493P03599Q70332O88312
4117A3948166R47764J103132R14937J179548J273099J503359J556610J984988
4109B4411603K393608K602376L161815L718444L272234J939143j92115j211338
4101D0095770k011886j649700p81674k38071J14777K82269R04168J411856K083364
4092D0210873K687077L447337L978310L571820K416064N91859j059067k098109
$$ plain form
4157 3595795 3750778 3791881 3904874 4062632 4051087 4097732 4117471 4091886 4306617 4501225
4147 4501225 4548629 4577438 4683454 4780023 4937262 5097015 5395876 5549281 5722942 5867575
4137 5867575 6027866 6294364 6516215 6681839 6817184 7136270 7495294 7731780 8011008 8457678
4127 8457678 8855834 9350066 9718816 10060330 10552385 11061430 11685923 12389522 13259854 13948166
4117 13948166 14895930 15999062 16913999 18093547 19366646 20870005 22426615 24411603
4109 24411603 26805211 29407587 32569402 36287846 39560080 41499223 41307108 40095770
4101 40095770 38083884 36434184 35652510 35414439 35529216 35811485 36715653 38127509 40210873
4092 40210873 42897950 46345287 50323597 53895417 56311481 56903340 55844273 53746164
4084E3746164k816714l759693m156963l766478k944129j923539j094195n91183
4076C2693270k95442j27201M67532Q92664J464133J867202J231673o69744k641540
4067C4882547l900258m160994l793994l040358k505556k189834j529104j501138
4059A2261311j047348q04605j058338p66038m85751m99459m26055l25504l54294
4050F493919m48504k33879m25695j21503k59632j99480k85737r5141j30684j19991
4040D173673j23222k48997k51432R7398k2863l3670j23720j32030j79858k9273
4030C126006j03133M5876J17925j76207J8929J3529k24791j69838J15917K85169
4020C049382j23303j91392O6939K01175J12274O1233q422m6794K066J07760Q3741
$$ plain form
4084 53746164 50929450 47169757 43012794 39246316 36302187 34378648 33284453 32693270
4076 32693270 32397828 32270627 32738159 33630823 35094956 36962158 38193831 37524087 34882547
4067 34882547 30982289 26821295 23027301 19986943 17481387 15291553 13762449 12261311
4059 12261311 11213963 10409358 9351020 8584982 8099231 7599772 7173717 6848213 6493919
4050 6493919 6045415 5811536 5385841 5264338 5004706 4805226 4519489 4424348 4293664 4173673
4040 4173673 4050451 3801454 3550022 3647420 3624557 3590887 3467167 3335137 3155279 3126006
4030 3126006 3022873 3068749 3186674 3010467 3029396 3042925 2818134 2648296 2764213 3049382
4020 3049382 2926079 2734687 2801626 3002801 3115075 3176308 3167886 3121092 3123158 3230918 3314659
4009C314659J6717K4750O0751j15491R5002J9547R5550K48944m1911k17147k38535
3998C262836k10466j55950j28542k39236K2072j45009j34309j26274k2738N7090
3988B179474j50191n1815j19445q5218J2014l46348j9574m7962K7525J97830o0182
3977A536108j23286J19785j1141L402k04040n7360J1399J40575N2517p1885J48552
3966A544626J90767j03630r8477j86871j1591q0904p072q5298L9668L9052K9346
3955A269616j96566p1685R6697k1249r3255n6285J42965J07023j03942J96768
3945A270087O0153j13680j1516L31004Q5917k52821j52387j01324J5763m9374
3935A081822o5344m5344l8670k30593r3012J25878M9817o2513m39n2345o9695
$$ plain form
4009 3314659 3331376 3356126 3416877 3301386 3396388 3415935 3511485 3760429 3718518 3501371 3262836
3998 3262836 3052370 2896420 2767878 2528642 2550714 2405705 2271396 2145122 2122384 2179474
3988 2179474 2029283 1977468 1858023 1772805 1784819 1438471 1418897 1370935 1398460 1596290 1536108
3977 1536108 1412822 1532607 1521466 1524868 1320828 1263468 1274867 1415442 1467959 1396074 1544626
3966 1544626 1735393 1631763 1533286 1346415 1334824 1253920 1246848 1161550 1201218 1240270 1269616
3955 1269616 1073050 1001365 1098062 1076813 983558 927273 1070238 1177261 1073319 1270087
3945 1270087 1330240 1216560 1205044 1536048 1621965 1369144 1216757 1115433 1131196 1081822
3935 1081822 1016478 971134 932464 701871 608859 734737 784554 722041 721602 669257 599562
3924E99562P8000R4367j76983J9516J20948L3422K22347p1765L8353L5489m5214
3913I48042J0751j38508k278k415Q1295R2371m5041k70882O8444L7400k3846J26512
3901H81845J3753j89889M4816M3702M1196n136K1685j4070P5833j00419j59728
3890F53588M1004J44132j43046l0258J01174O6679P991j37118K990L3249J2422
3879G52807N0339L2341k3247Q550k0523J9243K42060n3165m573K6879m4332M3556
3867A029935j8894N0548N4657R5131r21J23943L6905J16565J01343j3726o1215
3856A514271J8594M1398q0579q840Q0565o421j77449Q7880K9264k0838Q4444l5092
3844A527197R5837J6105O4341p4903O2066R8585p211O9745J82179J24213J09970
$$ plain form
3924 599562 677562 771929 594946 614462 735410 768832 991179 919414 957767 993256 948042
3913 948042 958793 820285 818007 815592 896887 989258 944217 673335 741779 779179 755333 881845
3901 881845 895598 705709 750525 794227 835423 830287 851972 837902 913735 813316 653588
3890 653588 694592 838724 695678 665420 766594 833273 841264 704146 707136 740385 752807
3879 752807 803146 835487 812240 820790 800267 819510 1061570 1008405 1003832 1030711 986379 1029935
3867 1029935 1011041 1061589 1116246 1211377 1210456 1334399 1371304 1487869 1589212 1575486 1514271
3856 1514271 1532865 1574263 1493684 1484844 1565409 1558988 1381539 1469419 1498683 1477845 1562289 1527197
3844 1527197 1623034 1639139 1703480 1628577 1690643 1789228 1782017 1851762 2033941 2158154 2268124
3833B268124J05023n4404p9879j08090q8310k44619k7649l10103N4755n7851o6489
3822A390508j59623O9210l3670p1571m9405j28090j1392K37427Q1238p9524J35819
3811A380927l8083P8882J42109n7492k20585p1477j76595j00401l6431Q881j79055
3800G30680Q6732N4248m3029m9519k02343k7090J38879p9797J8770P815K9515
3789F64861j82004q9884M8931J41182n408o7561k7242j05700k6581O1652k0296
3778C91950o5854k20O1315P6649j3932l010J51693J7783j34114n881k742J61566
3766F35203j04348J2305m1700m401N9151k2939j60121n3373P4646P5455J80033
3755F49911K9564l1623j20399m2274J72765R4135l8437M8343k305J9989O8787
$$ plain form
3833 2268124 2373147 2318743 2238864 2130774 2042464 1797845 1770196 1460093 1514848 1456997 1390508
3822 1390508 1230885 1300095 1266425 1194854 1145449 1017359 1005967 1243394 1324632 1245108 1380927
3811 1380927 1342844 1421726 1563835 1506343 1285758 1214281 1037686 937285 900854 909735 730680
3800 730680 817412 871660 828631 779112 576769 549679 688558 608761 627531 635346 664861
3789 664861 482857 392973 441904 583086 577678 510117 482875 377175 350594 412246 391950
3778 391950 326096 325876 387191 463840 449908 446898 598591 616374 482260 476379 473637 635203
3766 635203 530855 543160 501460 497059 556210 533271 373150 319777 394423 469878 649911
3755 649911 679475 647852 527453 485179 657944 752079 713642 761985 759680 779669 848456
3744H48456j9547j57644K0825j2115r6089K577m6343l7460m225p7646Q4987k6747
3732D79029J56262J08654j74391l0953Q8409r0904j21298J88394J75945q6668
3722F92479j83185R8308l4158k1525p7930J67995k23115N0665L5084N6042L3624
3711E94284q0072M3804o937j04289k768J72915p1895q7325N6071M0762p2541Q3179
3699E65188n3867J42979L8057L0647j81294P6724J19074q6235m498O1814J33402
3688H41991K8132j7838q421P085M3204J1730J10403q5271r4907k3909J15568k5927
3676I01840Q6006K1778N1673j05611Q6178O4830Q3728n0798j12861P0253L7359
3665A134375M2893q9710L8296Q6320p3096o732R5439j5590j457J15610O0272J46254
$$ plain form
3744 848456 828909 671265 692090 679975 583886 586463 540120 502660 498435 420789 505776 479029
3732 479029 635291 743945 569554 538601 627010 536106 414808 603202 779147 692479
3722 692479 509294 607602 573444 551919 473989 641984 418869 469534 504618 560660 594284
3711 594284 514212 558016 551079 446790 444022 616937 545042 457717 513788 554550 482009 565188
3699 565188 511321 654300 692357 723004 541710 618434 737508 651273 646775 708589 841991
3688 841991 870123 852285 843864 850949 894153 905883 1016286 931015 836108 812199 927767 901840
3676 901840 987846 1009624 1061297 955686 1041864 1106694 1190422 1139624 1026763 1097016 1134375
3665 1134375 1177268 1087558 1125854 1212174 1139078 1132346 1227785 1212195 1210738 1326348 1386620 1532874
3653A532874J07730Q4714l3188m64K11321L5937K46556L05706M25794J49107k42116
3642B823971k92507l24793l74560k41706k56070j54496K5519q8915k2505M1565
3632A135503M6233j48752J04214n205k06210q5590o7196J56371o1962r9744q9845
3621F77817O4893J78995j38744N7670K51304p0808j39965j00119J3959O8839L0227
3610H94068q3438R0380K16748q7223j21768q1061P6375K10477J6084n5395j91367
3599H83880R1430k0590n3476J62829m5303j5646j5399K5165J2982l7604R332l8638
3587I58962M5713O615J42902r3925O0976O6749M8980r6534j59551M4809N4661
3576A080357Q5791K58769j40898n475O0447j13176J61620P0344m9778N5805p0503
$$ plain form
3653 1532874 1640604 1725318 1692130 1691666 1902987 1938924 2185480 2491186 2916980 3066087 2823971
3642 2823971 2531464 2206671 1832111 1590405 1334335 1179839 1205358 1116443 1093938 1135503
3632 1135503 1181736 1032984 1137198 1131993 925783 840193 772997 929368 867406 767662 677817
3621 677817 742710 921705 782961 840631 1091935 1021127 881162 781043 795002 863841 894068
3610 894068 810630 901010 1117758 1030535 908767 827706 904081 1114558 1130642 1075247 883880
3599 883880 975310 954720 901244 1064073 1018770 1003124 987725 1012890 1025872 988268 997600 958962
3587 958962 1004675 1011290 1154192 1060267 1121243 1187992 1236972 1140438 980887 1025696 1080357
3576 1080357 1166148 1424917 1284019 1278544 1338991 1225815 1387435 1457779 1408001 1463806 1393303
3565A393303N8633J60619o3136k21630J46945J56352N6388p4561l4252P6735J26787
3554A782183Q7848j06989J37098j281j4428J04981J46102J92492L6132P2221O6628
3543B502987n67J47752K006J84155J03376J82492K56287J56014K39803O4852K58559
3532D097716J80634K01805L47921L44614J22207n8787j57951K1555L2977O9548
3522E202239K02551J29116K01714J35036N5680J85002J14041K32771K58889q4049
3512F632990O5931j6662J09548j8627l7073J01570O0254j8910j9112J88070J53649
3501G201628K71698K41480K08669L84604J43208J22698r3978J19946J09382J93675
3491H903010K59246R9393L57145M33122L19459M77651M90539N81937N18536N82530
$$ plain form
3565 1393303 1451936 1612555 1549419 1327789 1474734 1631086 1687474 1612913 1578661 1655396 1782183
3554 1782183 1870031 1763042 1900140 1898859 1884431 1989412 2135514 2328006 2364138 2436359 2502987
3543 2502987 2502420 2650172 2652178 2836333 2939709 3122201 3378488 3534502 3774305 3839157 4097716
3532 4097716 4278350 4480155 4828076 5172690 5294897 5236110 5078159 5099714 5132691 5202239
3522 5202239 5404790 5533906 5735620 5870656 5926336 6111338 6225379 6458150 6717039 6632990
3512 6632990 6698921 6682259 6791807 6773180 6736107 6837677 6897931 6879021 6859909 7047979 7201628
3501 7201628 7473326 7714806 7923475 8308079 8451287 8573985 8480007 8599953 8709335 8903010
3491 8903010 9162256 9261649 9618794 10051916 10371375 10849026 11339565 11921502 12440038 13022568
3481A3022568P79315P23254P00252R21950R61857J092745J082359J202944J115058
3472B1602302J512894J628457J401948J472857J564169J685223J434336J070426
3464C3372612Q05793O71148N64933K17084K59088K91649J97028L40594M77517
3455C7197446N99986Q00030R02371J036009R20077P27990P90017L37838N8872
3446D3370636m5742p64257j186429j152267j418969j318354j469963j082396j010300
3437C3921959r61419p71939p04491m96870m62544m58792o49349m35738q91759
3428B8089058j169895j279604j690993j622500j552895j638073j548173j324143
3420A6262782j228521j097676p96974o60906p34974p63408o07781n93631m40748
$$ plain form
3481 13022568 13801883 14525137 15225389 16147339 17109196 18201941 19284300 20487244 21602302
3472 21602302 23115196 24743653 26145601 27618458 29182627 30867850 32302186 33372612
3464 33372612 34178405 34849553 35414486 35631570 35890658 36182307 36379335 36719929 37197446
3455 37197446 37797432 38597462 39499833 40535842 41455919 42183909 42973926 43311764 43370636
3446 43370636 43324894 42560637 41374208 40221941 38802972 37484618 36014655 34932259 33921959
3437 33921959 32960540 32188601 31484110 30987240 30524696 30065904 29416555 28980817 28089058
3428 28089058 26919163 25639559 23948566 22326066 20773171 19135098 17586925 16262782
3420 16262782 15034261 13936585 13139611 12478705 11743731 10980323 10372542 9778911 9338163
3411I338163k92296m41789l85298k01539k29309j15210k49339k60165l48435k36093
3401F578690j11159m06794m34570j27942j11099m11014k00466q1402j00192j65944
3391D428108j14336r9241r5580p4795N6479j18736r705j04705j40728j53409L5802
3380C609154J14413j46627j46821k8336j54748J8275j74924j12531r1747j1082
3370B875026j35862o5569N3763m6421N8747j27218q7758r6088n2835Q5820m2930
3359B418675l4942j14454m4163R7472K3332q7424J2206L878J0649P1976q4741
3348B272464J3062j7149o7742M3052J11889P9561K4702j1344M0075m0719M3773
3337B491624q3725J16409M6965q3372L5430p9725k8530j85167J28818J76385j7062
$$ plain form
3411 9338163 9045867 8604078 8218780 8017241 7787932 7672722 7423383 7163218 6814783 6578690
3401 6578690 6467531 6060737 5626167 5498225 5387126 4976112 4775646 4694244 4594052 4428108
3391 4428108 4313772 4214531 4118951 4044156 4100635 3981899 3972194 3867489 3726761 3573352 3609154
3380 3609154 3723567 3576940 3430119 3401783 3247035 3265310 3090386 2977855 2886108 2875026
3370 2875026 2739164 2673595 2727358 2680937 2739684 2612466 2524708 2428620 2375785 2461605 2418675
3359 2418675 2383733 2269279 2225116 2322588 2345920 2258496 2270702 2274580 2285229 2357205 2272464
3348 2272464 2285526 2268377 2200635 2243687 2355576 2435137 2459839 2448495 2488570 2447851 2491624
3337 2491624 2407899 2524308 2571273 2487901 2523331 2443606 2415076 2229909 2358727 2535112 2518050
3326B518050N3006J998K0086j32605K14483Q0372J65600j82887o9344O7714J45532
3315B882005j3620R7250l7542L5659M6136j23482l8320k586K38485L9026O9870
3304C192881l4303j21975J37313k9536R6525N1746j3034J03400j00970M0952K29549
3293C552548J12011p4573M8026M316J25891j24620J42253O3561J32785q2991L3934
3282C933141m0944J00856K45451Q730O1780K06666J57058q0557J16897O3021P8312
3271D850411L15501K93345m2980j00580k459j76303m6308q2458m25J05072P8781
3260E191597j94174J87204J13128Q4322M6767P733M4126J03650q396O7436l4307
3249E609086J25685N3932k5053Q7087N0596k9829J47400P0576K7215j138l2839
$$ plain form
3326 2518050 2571056 2573054 2593140 2460535 2675018 2755390 2920990 2738103 2668759 2736473 2882005
3315 2882005 2868385 2965635 2928093 2963752 3009888 2886406 2848086 2845500 3083985 3123011 3192881
3304 3192881 3158578 3036603 3173916 3144380 3240905 3292651 3279617 3383017 3282047 3322999 3552548
3293 3552548 3664559 3589986 3638012 3642328 3768219 3643599 3785852 3849413 3982198 3899207 3933141
3282 3933141 3892197 3993053 4238504 4247234 4309014 4515680 4672738 4592181 4709078 4772099 4850411
3271 4850411 5165912 5459257 5416277 5315697 5313238 5136935 5090627 5008169 5007744 5112816 5191597
3260 5191597 4997423 5184627 5297755 5382077 5428844 5436577 5480703 5584353 5575957 5643393 5609086
3249 5609086 5734771 5788703 5763650 5850737 5901333 5871504 6018904 6089480 6116695 6115557 6082718
3238F082718K25343n8973J4054j1725R4642J82529M5184L0961j5182M7854L0120
3227F667525o0355l306K7796Q2116J00881J43956P741j33534j55246J15602J3328
3216F806504J60869k3583N5792R0779J62702o1085J40767J9708o6867L7124J69408
3205G492118R7780Q2807K20454L4838j04757j84K9159J24603J22829J3426K02678
3194H315751J56904L1709K73308J55528L31595J41073J87823O1630J67215R5206
3184I917742j1293K58028L95326K17330L20121L98550M48571J10008l107n7841
3174A1993435j35554n9490o1956J37155K14680L78217N84404L30413o732k41707
3164A3132865m60517l44572m57033j92128j01168j87674K89890K56053k6315j17998
$$ plain form
3238 6082718 6308061 6249088 6263142 6251417 6346059 6528588 6573772 6604733 6589551 6637405 6667525
3227 6667525 6607170 6603864 6631660 6713776 6814657 6958613 6966354 6832820 6677574 6793176 6806504
3216 6806504 6967373 6943790 6999582 7090361 7253063 7191978 7332745 7352453 7285586 7322710 7492118
3205 7492118 7589898 7672705 7893159 7927997 7823240 7823056 7852215 7976818 8099647 8113073 8315751
3194 8315751 8472655 8504364 8777672 8933200 9264795 9405868 9593691 9655321 9822536 9917742
3184 9917742 9906449 10164477 10559803 10777133 11097254 11495804 11944375 12054383 12051276 11993435
3174 11993435 11857881 11798391 11736435 11873590 12088270 12466487 13050891 13381304 13374572 13132865
3164 13132865 12672348 12327776 11870743 11678615 11577447 11389773 11679663 11935716 11909401 11791403
3154A1791403l29122n41230m55614l49815l60088l00708r4287M844K5691k9696
3144I361378l1101n3317j57382n1290k2705J27149k5078J31367K59698L48652
3134I887371K28091K33765K73070K88985M14556L18494M30829Q43568O32831O58519
3124A4210079O59892O61581N30640L71529M58302K93564P74507Q89594J109965
3115A9959653J320907J238974J116741L92379p5257m13312k73887q0153L35853
3106B3521898N80417Q38542J182196R50777K15864l31501r88023j222266j073281
3097B3674623j096000o02067j91601K5402K86190q266m28437j071503j518158
3088A9070183j464908j122777j298679r13763m77885l01501o16327l39805o37043
$$ plain form
3154 11791403 11462281 10921051 10465437 10115622 9755534 9454826 9360539 9365383 9391074 9361378
3144 9361378 9330277 9276960 9119578 9068288 9045583 9172732 9147654 9279021 9538719 9887371
3134 9887371 10115462 10349227 10622297 10911282 11325838 11644332 12075161 12918729 13551560 14210079
3124 14210079 14869971 15531552 16062192 16433721 16892023 17185587 17960094 18849688 19959653
3115 19959653 21280560 22519534 23636275 24028654 23953397 23540085 23266198 23186045 23521898
3106 23521898 24102315 24940857 26123053 27073830 27289694 26958193 25970170 24747904 23674623
3097 23674623 22578623 21976556 21784955 21810357 22096547 22088281 21659844 20588341 19070183
3088 19070183 17605275 16482498 15183819 14270056 13792171 13490670 12874343 12534538 11897495
3079A1897495q13579q04591r38943o83213o12580p00529n13983l43935j37606
3070F348536k16190l84483l44852m43840l48936o5698k62045k03920k12517k60159
3060C605896j29715r1270L2861l471k17689m9485k37744Q724o5812k31358n2635
3049B568302J61779o4191j30219N4634j19661k284J0988R303k20952l8823L0189
3038B259065M9640j16652R9334j14768m0285o8691j22638O2581O2617r0865K4766
3027B004104j4512r5543J1415O7744m4371M5174j64335O9159N6985P2859R180
3016B017859j10221j38635M8536O8758l575O2684o8936M9885J94356P3615k10469
3005A983857j14019J13132K3879J25562J27134m0181r8111J68917M4149P8105
$$ plain form
3079 11897495 11083916 10279325 9340382 8657169 8044589 7344060 6830077 6486142 6348536
3070 6348536 6132346 5747863 5403011 4959171 4610235 4544537 4282492 4078572 3866055 3605896
3060 3605896 3476181 3384911 3417772 3414301 3196612 3147127 2909383 2918107 2852295 2620937 2568302
3049 2568302 2730081 2665890 2535671 2590305 2470644 2468360 2479348 2488651 2267699 2228876 2259065
3038 2259065 2308705 2192053 2291387 2176619 2136334 2067643 1945005 2007586 2070203 1979338 2004104
3027 2004104 1989592 1894049 1905464 1973208 1928837 1974011 1809676 1878835 1935820 2008679 2017859
3016 2017859 1907638 1769003 1817539 1886297 1882722 1945406 1876470 1926355 2120711 2194326 1983857
3005 1983857 1869838 1982970 2006849 2132411 2259545 2219364 2121253 2290170 2334319 2412424
2995B412424l8031M8930m1040j13234k0972L4678O6638j40762o0563N1581p6839
2984B122810J5778r8167J16756P9564j63036m4737l0958j86475M1689J10573q6115
2973A877682j6608q9314o4711Q8431j0284L9106J6487M6340p6779o3354L9677
2962A786673P4699j37413p2565O5086k7367Q4460M9917p0305k9363J40128O9431
2951A933381K5638r9652l9776j40907P1911J716Q9314m8094R1145n2239R6843
2940A929280Q1224m2369j34086M2898k2248J15177R517J4471O0346k4337J25578
2929B155451k3621J33587j57181l3885J44378q7749L3289r1123m1016K8299J70756
2918B231185K1174l3721J25804l4294L1097j12176K26496p6473R4859p795R3048
$$ plain form
2995 2412424 2374393 2423323 2382283 2269049 2248077 2282755 2349393 2208631 2148068 2199649 2122810
2984 2122810 2138588 2040421 2157177 2236741 2073705 2028968 1998010 1811535 1853224 1963797 1877682
2973 1877682 1861074 1771760 1707049 1795480 1785196 1824302 1840789 1887129 1810350 1746996 1786673
2962 1786673 1861372 1723959 1651394 1716480 1689113 1773573 1823490 1753185 1723822 1863950 1933381
2951 1933381 1959019 1859367 1819591 1678684 1750595 1752311 1841625 1793531 1884676 1832437 1929280
2940 1929280 2010504 1968135 1834049 1876947 1854699 1969876 1979393 1993864 2054210 2029873 2155451
2929 2155451 2131830 2265417 2108236 2074351 2218729 2130980 2164269 2073146 2032130 2060429 2231185
2918 2231185 2252359 2218638 2344442 2310148 2341245 2229069 2455565 2379092 2473951 2466156 2559204
2907B559204j07J7428n1439p1624P1683j09787j6947J38936j1214p8334J4110
2896B461909L8945Q0171M7467n8925L6097j7683R7076N4457q1726P0869O766O1075
2884B796498r5011P8051L0329J69L5951p9292L9169J90849k245o4631Q748N7239
2872B995824R9563Q5243M9761J45344P6830L1274R7625J23957j74517L6312J37936
2861C705152R9868Q8329K9587j70704J64050k2040m8803L8503N255Q174m1361
2850C856010k42378J44388L9996j32612j97571p8127L5246o0073r9857P0924M4885
2839C380831r687J67295m3922J01461j51885n6495r0807P1253Q5159p3874J6400
2828C395729q5796M3553Q8336M2700p2772J49535O7849n0590J15522J08877J6797
$$ plain form
2907 2559204 2559097 2576525 2525086 2453462 2525145 2415358 2398411 2537347 2526133 2447799 2461909
2896 2461909 2500854 2581025 2628492 2569567 2605664 2587981 2685057 2739514 2657788 2728657 2735423 2796498
2884 2796498 2701487 2779538 2809867 2810036 2845987 2766695 2805864 2996713 2994468 2929837 2938585 2995824
2872 2995824 3095387 3180630 3230391 3375735 3452565 3483839 3581464 3705421 3530904 3567216 3705152
2861 3705152 3805020 3893349 3922936 3752232 3916282 3894242 3845439 3883942 3889197 3897371 3856010
2850 3856010 3613632 3758020 3798016 3665404 3467833 3389706 3424952 3364879 3265022 3335946 3380831
2839 3380831 3371144 3538439 3494517 3595978 3444093 3387598 3296791 3368044 3453203 3379329 3395729
2828 3395729 3309933 3353486 3441822 3484522 3411750 3561285 3629134 3578544 3694066 3802943 3819740
2817C819740N9740N222J84606M9242p1156J13836Q7334J7137j8490k1562L1922
2806D257571J04962P252q5430m6125K2882k0254N8046Q1908p6578j92352J03019
2795D214901Q0854J8819l0074m7856O7464O8101k4696k7219M1395Q1281J61950
2784D604920M8992j7984K24949j49218R7486O6165J10182M3093K69569o3433J68250
2773E402971J27914K23144L61810K73677Q3120K74647K02429K65880J65552J0471
2763G391615K61047q4509k9470m3853n3078l6822Q2102Q3427L7793j5707J96789
2752G789334k72414j36337J95669j41789k87961o7170j00392j9241j12521j87874
2742F659304O4323L9558r5964J87212p552k1498K40062R5477M869O3209J65552
$$ plain form
2817 3819740 3879480 3884702 4069308 4118550 4047394 4161230 4248564 4265701 4247211 4225649 4257571
2806 4257571 4362533 4369785 4284355 4238230 4261112 4240858 4298904 4380812 4304234 4111882 4214901
2795 4214901 4295755 4314574 4284500 4236644 4304108 4372209 4347513 4320294 4361689 4442970 4604920
2784 4604920 4653912 4635928 4860877 4711659 4809145 4875310 4985492 5028585 5298154 5234721 5402971
2773 5402971 5530885 5754029 6115839 6389516 6472636 6747283 6949712 7215592 7381144 7391615
2763 7391615 7652662 7568153 7538683 7494830 7441752 7404930 7487032 7570459 7608252 7592545 7789334
2752 7789334 7516920 7380583 7576252 7434463 7146502 7079332 6978940 6959699 6847178 6659304
2742 6659304 6723627 6763185 6667221 6854433 6846881 6825383 7065445 7160922 7165791 7229000 7394552
2731G394552J42267K31238L0704P3674J45314K10444J89444m5262P4482M3272
2721H490129Q8969J34664R4195K28046L23802K57654K92291K04579K80790L07178
2711A0702297M06438L83986M57686M97076M99401N49091O04954P91850P82476
2702A5675255Q93342J198827J163275J246854J406699J748618J691650J634344
2694B6658864J426514J155208Q49125K72045j99432k74299l23562k69696p3736
2685B9221031Q1524J78400J49370o7780n67542r13479j177478j435349j590690
2676B3878007j643651j525431j243311j140010q39495m86300m02922m37812k27058
2667A5932017l40781k03404N8815j12535J29685Q2504o0858L24226P2106L08057
$$ plain form
2731 7394552 7536819 7768057 7798761 7872435 8017749 8228193 8417637 8372375 8446857 8490129
2721 8490129 8579098 8713762 8807957 9036003 9359805 9617459 9909750 10114329 10395119 10702297
2711 10702297 11108735 11492721 11950407 12447483 12946884 13495975 14100929 14892779 15675255
2702 15675255 16568597 17767424 18930699 20177553 21584252 23332870 25024520 26658864
2694 26658864 28085378 29240586 30089711 30361756 30162324 29888025 29564463 29294767 29221031
2685 29221031 29302555 29480955 29630325 29562545 28995003 28081524 26904046 25468697 23878007
2676 23878007 22234356 20708925 19465614 18325604 17486109 16999809 16596887 16159075 15932017
2667 15932017 15591236 15387832 15446647 15334112 15463797 15546301 15485443 15809669 15881775 16189832
2657A6189832J50292L32367J05077L04496L32736K64004K64397J93440L05595
2648A8442236L62795L19020L04282M75194K95184M96988N42020P13451L71603
2639B2322773N33252M23957O27792N76643N04099P26636P75785O12422N17971
2630B7621330R59761Q86625P61261Q81152R54221J114324J034044J069769J331402
2621C6613889J065135J182548J346049J357817J513557J587414K022518J932159
2613D8621086K325913K256817K299751K493614K570224K818234K925005L337809
2605F9648453L539246L911113M427989N240987N485488N881119N275001M662724
2597A08072120L850429K584583J084157M2876m64815q78187n75462n09724o13197
$$ plain form
2657 16189832 16340124 16672491 16777568 17082064 17414800 17678804 17943201 18136641 18442236
2648 18442236 18805031 19124051 19428333 19903527 20198711 20695699 21237719 21951170 22322773
2639 22322773 22856025 23279982 23907774 24484417 24988516 25715152 26490937 27103359 27621330
2630 27621330 28581091 29467716 30228977 31110129 32064350 33178674 34212718 35282487 36613889
2621 36613889 37679024 38861572 40207621 41565438 43078995 44666409 46688927 48621086
2613 48621086 50946999 53203816 55503567 57997181 60567405 63385639 66310644 69648453
2605 69648453 73187699 77098812 81526801 86767788 92253276 98134395 103409396 108072120
2597 108072120 111922549 114507132 115591289 115634165 115169350 114291163 113715701 113205977 112592780
2588A12592780p82875j424028k266544l371788m162599m592642m849766m427467
2580H6715071m045835l660924k961469k268584j857112j120368m70600q8602K44766
2571G0486343P21911R24729J536244J792384K129125K650483L012305L747251
2563H7000775M032527M795850N524744O366934P164681Q009034Q799873R240148
2555A40934566R864852J0149966R866975Q731953O998588M647895J999454l32189
2547A92862060j882046k786370l171775k498180j857993j380178j752739k787753
2539A74745026m315589o218410p976138r569916j0696644j0879740j0087188r185676
2531A05815725p635960o075874m818106l659382k395353j765476p91155O4162
$$ plain form
2588 112592780 111809905 110385877 108119333 104747545 100584946 95992304 91142538 86715071
2580 86715071 82669236 79008312 76046843 73778259 71921147 70800779 70330179 70241577 70486343
2571 70486343 71208254 72132983 73669227 75461611 77590736 80241219 83253524 87000775
2563 87000775 91033302 95829152 101353896 107720830 114885511 122894545 131694418 140934566
2555 140934566 150799418 160949384 170816359 179548312 186546900 191194795 193194249 192862060
2547 192862060 190980014 188193644 185021869 182523689 180665696 179285518 177532779 174745026
2539 174745026 170429437 164211027 156234889 146664973 135968329 125088589 115001401 105815725
2531 105815725 98179765 92103891 87285785 83626403 81231050 79465574 78674419 78738581
2523G8738581Q90434J454655J972285K532579K936274K565561K265690J762019
2515I5118078J061336R6702n17063n49583q42483p91557p75720p28498o63165
2506I1408047q23793j407569k176939k911851l447116l914480m002058m269905
2498F8454336m275955l800700l306140k724761k708488k852097k344745j833372
2490D4608078j614545j292096j017897o38386k91123k43484N3281J71187M01519
2481D0136534N72984R90204J284232J515131J784156J948201K139959K000079
2473E2371480J597495J118692J014649P26013J78730l85649p95793r50705j187012
2464E3687900j688185k090381k358987k655873k457238k427732j971559j775236
$$ plain form
2523 78738581 79629015 81083670 83055955 85588534 88524808 91090369 93356059 95118078
2515 95118078 96179414 96276116 95759053 95209470 94366987 93575430 92799710 92071212 91408047
2506 91408047 90584254 89176685 86999746 84087895 80640779 76726299 72724241 68454336
2498 68454336 64178381 60377681 57071541 54346780 51638292 48786195 46441450 44608078
2490 44608078 42993533 41701437 40683540 40045154 39754031 39510547 39563828 39735015 40136534
2481 40136534 40709518 41699722 42983954 44499085 46283241 48231442 50371401 52371480
2473 52371480 53968975 55087667 56102316 56828329 57007059 56621410 55825617 54874912 53687900
2464 53687900 51999715 49909334 47550347 44894474 42437236 40009504 38037945 36262709
2456C6262709j446086j174068p64106n22106k93848l24241j40741K99962L23775
2447C2221250K43228N04216O86568P49160J110930R35689J331141J568229J587183
2438D0937594J807091K067635K279106K229995J955887J720966J813482J896659
2430E6708415J981632J740946J083136L21899j81232k94508m57262o36744q62174
2421E9404108r85189q73630o49795K4858P31220J085016J817077J905215J942661
2412F4401541K247364J979810J367524O94466j49940o06095j055800j508244j471993
2403F5898633k209686k640663k987454k906018k738390k432553k078551k306530
2395D5598788k068267j888670j531301j156653r62785p54100l00262k00125K85257
$$ plain form
2456 36262709 34816623 33642555 32878449 32356343 32062495 31738254 31597513 31897475 32221250
2447 32221250 32464478 32968694 33655262 34404422 35515352 36451041 37782182 39350411 40937594
2438 40937594 42744685 44812320 47091426 49321421 51277308 52998274 54811756 56708415
2430 56708415 58690047 60430993 61514129 61836028 61654796 61360288 60903026 60266282 59404108
2421 59404108 58418919 57545289 56895494 56920352 57651572 58736588 60553665 62458880 64401541
2412 64401541 66648905 68628715 69996239 70690705 70540765 69934670 68878870 67370626 65898633
2403 65898633 63688947 61048284 58060830 55154812 52416422 49983869 47905318 45598788
2395 45598788 43530521 41641851 40110550 38953897 37991112 37237012 36936750 36736625 37021882
2386C7021882L09930M45939Q91343Q29425R04628J086068J351406J480825J761188
2377D6082634J991128J983921K419404K703957K989640L411447L969707M004114
2369F9555952M191621M336418M466015M448297M036274L358233K374048J922214
2361I8689072J272929L52799q06357j933787l285400m029455m239591l951550
2353H2068660l910946l559337k756637k113344j656224o86811m04009J72340O29001
2344F7782693J124595J572065J989900K416632K975062L579056L994215M557834
2336H9992052N270004N793707M944123L117659J607642L33024n72772j152768
2328A09332671j803068k489082l003445l235174l575586l615075l385240l128144
$$ plain form
2386 37021882 37331812 37777751 38669094 39498519 40403147 41489215 42840621 44321446 46082634
2377 46082634 48073762 50057683 52477087 55181044 58170684 61582131 65551838 69555952
2369 69555952 73747573 78083991 82550006 86998303 91034577 94392810 96766858 98689072
2361 98689072 99962001 100314800 99508443 97574656 94289256 90259801 86020210 82068660
2353 82068660 78157714 74598377 71841740 69728396 68072172 67385361 66981352 67153692 67782693
2344 67782693 68907288 70479353 72469253 74885885 77860947 81440003 85434218 89992052
2336 89992052 95262056 101055763 105999886 109117545 110725187 111058211 110485439 109332671
2328 109332671 107529603 105040521 102037076 98801902 95226316 91611241 88226001 85097857
2320H5097857k513267j483446q54363n11449j72593Q6412L92400R06003J389019
2311H2336573J987004J988066K354519K999548L691518L772593L452206L610306
2303A06192333M060479N789892Q182758J1253072J6208450K1556293J6045451
2296A89288728k524084j5842546k0473490j9323169j4331413r788485p322510
2289I9683031n834425m892996m295097l765230l131533k653302j957353j445082
2281G1708013j019654k54286J94615O70026Q75104J559779J775498K161484K885667
2272H0556246L312069L952997M244465M725099N755661O120915O707667P354909
2264A22730028P934618R600330J1225787J3426618J6079091J9345625K3044648
$$ plain form
2320 85097857 82584590 81101144 80246781 79735332 79562739 79649151 80041551 80947554 82336573
2311 82336573 84323577 86311643 88666162 91665710 95357228 99129821 102582027 106192333
2303 106192333 110252812 116042704 124225462 135478534 151686984 173243277 189288728
2296 189288728 186764644 170922098 150448608 131125439 116794026 107005541 99683031
2289 99683031 93848606 88955610 84660513 80895283 77763750 75110448 73153095 71708013
2281 71708013 70688359 70434073 70628688 71298714 72173818 73733597 75509095 77670579 80556246
2272 80556246 83868315 87821312 92065777 96790876 102546537 108667452 115375119 122730028
2264 122730028 130664646 140264976 151490763 164917381 180996472 200342097 223386745
2257B23386745K7475690L4026607L9691199L2767351M916608k5534590m2731986
2250B93997624m6468686m0777490l1929963k4254680j9089676j5619985j2978216
2243A02878928j0849407q977013p545358o221896n229040m546954l780145l322862
2235E2406253k914001k709604k477163k147975j874496j820451j637256j695045
2227C5130262j517212j492458j034065j301725j018376j221319j064465q33394
2219B5647248q89525p64580p91863p94170p06358p10919n89249p05579o17658
2210A9077347n98771n20238m38630p30344n42605n42802m67359l23184l89305
2201A4524109m04393m50437m13912l51591k79739k15116l40949j66906l96253
$$ plain form
2257 223386745 250862435 284889042 324580241 357347592 362264200 336729610 293997624
2250 293997624 247528938 206751448 174821485 150566805 131477129 115857144 102878928
2243 102878928 92029521 83052508 75507150 69285254 64056214 59509260 55729115 52406253
2235 52406253 49492252 46782648 44305485 42157510 40283014 38462563 36825307 35130262
2227 35130262 33613050 32120592 31086527 29784802 28766426 27545107 26480642 25647248
2219 25647248 24757723 23993143 23201280 22407110 21700752 20989833 20400584 19695005 19077347
2210 19077347 18478576 17958338 17519708 16789364 16246759 15703957 15236598 14913414 14524109
2201 14524109 14119716 13669279 13255367 12903776 12624037 12408921 12067972 11901066 11504813
2192A1504813l98956m38995k12099k22176k29728l49553k34934l53086j57912
2183H907374k02227j51283j01522j33716l57119n162j74680j37501j76579k22556
2173G245029j45021k23299r1784r4544k66997j11008j42034k3370j00701k29545
2163E816726j80964n3981K8509j69696j84859l9826J0295l6923q4420m9781p8486
2152D976594o9744K473R3930r5996l4616j34896j70217M6136m1681k31850M940
2141D345073M1341n6197k01453j07829j58256J14798l4243k05786n0888N9663
2131C746223j26959k48788J19644J06921k3839p0109M136k6160L9149j74889O0777
2120C406106J07769m6460l6364O7596j81893m7369k1929q1864j08256K11890J10503
$$ plain form
2192 11504813 11105857 10666862 10454763 10232587 10002859 9653306 9418372 9065286 8907374
2183 8907374 8705147 8553864 8452342 8318626 7961507 7956345 7781665 7644164 7467585 7245029
2173 7245029 7100008 6876709 6784925 6690381 6423384 6312376 6170342 6146972 6046271 5816726
2163 5816726 5635762 5581781 5610290 5440594 5255735 5215909 5226204 5189281 5104861 5055080 4976594
2152 4976594 4906850 4909323 5003253 4907257 4872641 4737745 4567528 4613664 4571983 4340133 4345073
2141 4345073 4386414 4330217 4128764 4020935 3862679 3977477 3943234 3737448 3686560 3746223
2131 3746223 3619264 3370476 3490120 3597041 3573202 3503093 3507229 3481069 3520218 3345329 3406106
2120 3406106 3513875 3467415 3431051 3498647 3316754 3269385 3247456 3165592 3057336 3269226 3379729
2109C379729j5859k81155m9162m9600J412J01806m4282r7632J077o1083L5236
2098B920487J7216K7868P1830j56388M9191j6141n3657J2222p832o0292M4967
2087B849471J12833R808N0690l3160j18958q0974M4162r1173j96534P4936k69623
2076B351478n1391J824j13484K933J964Q8409q6026L7290j15158r133j25833K3217
2064B006090j34889J340o9928Q0618R3665j24941L5028K0263l105o9330P7993
2053A912804P6451M565J17717j75547O8580J45207J49338J51142o1052J43003
2043B532208L63551J765j28705l760j63845l16796k32547j79500j58977j49613
2033A563781j67101K8164k2745j5616J9484j76408j8830n351L779k0962j93612
$$ plain form
2109 3379729 3363870 3082715 3033553 2983953 2985365 3087171 3042889 2945257 2946334 2885251 2920487
2098 2920487 2937703 2965571 3037401 2881013 2930204 2914063 2860406 2872628 2864796 2804504 2849471
2087 2849471 2962304 2972112 3022802 2989642 2870684 2789710 2833872 2742699 2546165 2621101 2351478
2076 2351478 2300087 2301911 2188427 2191360 2193324 2281733 2195707 2232997 2117839 2108706 1982873 2006090
2064 2006090 1871201 1872541 1802613 1883231 1976896 1851955 1886983 1907246 1904141 1834811 1912804
2053 1912804 1989255 1993820 2111537 1935990 2004570 2149777 2299115 2450257 2389205 2532208
2043 2532208 2895759 2897524 2768819 2765059 2601214 2284418 2051871 1872371 1713394 1563781
2033 1563781 1396680 1424844 1402099 1386483 1405967 1229559 1210729 1205378 1209157 1188195 994583
2022I94583O7399O5902n4910k9274m6778k1597L7904p912p6251J10989o954j35038
2010H98063j24112p7571J82416j84419N3289O5553r4659J9179K624J8198J29397
1999H87958K3904j77292N4839N9047L2220j97289j0687o7582j5844O0763n0279
1988E99758r9909M0659J04721J6719o4023j7504J32000j53283L7903J2879N9592
1977F69512j77424q01k4496M4368N3833J98958r5253j01590j8097l5288n6152
1966D57570K18977r2724j23805l2149O6591M6628o9230N9447n6101J43344l6569
1955E81979j09572k777o892J24690k8975K2982n2938O3084j48830q6547j0165
1944C46039J32776J6223m5106J10904K8109q9767J10164K6573j20748p320k6616
$$ plain form
2022 994583 1061982 1127884 1072974 1043700 996922 975325 1013229 1005317 929066 1040055 1033101 898063
2010 898063 773951 696380 878796 694377 747666 813219 718560 737739 740363 758561 887958
1999 887958 911862 734570 789409 848456 880676 683387 672700 605118 589274 650037 599758
1988 599758 499849 540508 645229 661948 597925 580421 712421 559138 597041 609920 669512
1977 669512 492088 491287 466791 511159 564992 763950 668697 567107 549010 513722 457570
1966 457570 676547 583823 460018 427869 494460 541088 471858 531305 475204 618548 581979
1955 581979 472407 469630 462738 587428 558453 581435 528497 591581 442751 356204 346039
1944 346039 478815 495038 449932 560836 588945 499178 609342 635915 515167 507847 481231
1933D81231O7746o2997m1997J71P7796r1858l7069m2145J25798J9520k8894N0697
1921E17999K8859j75834L5096Q9013m4688n7386J1825O500R6914r689O1953q5898
1909D74664k9784J0253l3704J95669r4449k03771M9018o6012Q7165o9572J5650
1898C35127L5418o882J13403j0461l6508m3449l4094J685M4531o9201j13987J88088
1886D03670O7871k05973J0712J10408l8811r3541J44344J53774k15520l2492M0035
1875C44477L0591j10896j1999N4138k7082M2220N1683m5901j37859J74066K5266
1864C88704j20012q8414Q3058N3955R8002j41600p8115M6730J21643j8392Q9209
1853D34768k02478K4206Q0847l9950j47769N6959M8401j08408N7282O0691J76851
$$ plain form
1933 481231 548977 485980 443983 444154 521950 430092 393023 350878 476676 496196 467302 517999
1921 517999 546858 371024 406120 495133 450445 393059 404884 411384 508298 498609 560562 474664
1909 474664 444880 455133 421429 617098 522649 318878 367896 301884 389049 319477 335127
1898 335127 370545 363663 477066 466605 430097 386648 352554 354239 398770 329569 215582 403670
1886 403670 471541 265568 276280 386688 347877 254336 398680 552454 336934 304442 344477
1875 344477 375068 264172 252173 306311 279229 321449 373132 327231 189372 363438 388704
1864 388704 268692 180278 263336 317291 415293 273693 195578 242308 363951 345559 434768
1853 434768 232290 256496 337343 297393 149624 206583 254984 146576 203858 264549 441400
1842D41400K3101j24346K4185J7926o9874J30549j68191J5435J38890K6196n6697
1831C98574q7310o9874J55896M8424k9323O5835j09794j7151Q2375J0614J6164
1820D64430J07392p2390j13283O4716o2172J0637O3325Q7993r8350p7965m4905
1809C29428J52007Q7362O0843j7646N9572q8545m3354O8976J18557J63861p5549
1798H15512r9735r4167Q3147l2167R411J79573j06037N0715L5972J2932R9458
1787I54614J15847o4498L5587j16223p4534J06799K20942Q3918j53240j9875K04455
1776A293792m5134N5960J05064P4664P5136j6701n2726J83863k7527J3216J80709
1765A840316o6115N1475L23242R5173Q5395Q0451K60206K24910R2220K71176L26228
$$ plain form
1842 441400 464501 340155 364340 382266 312392 442941 274750 290185 429075 455271 398574
1831 398574 311264 241390 397286 445710 416387 482222 372428 355277 437652 448266 464430
1820 464430 571822 499432 386149 450865 388693 399330 462655 550648 452298 374333 329428
1809 329428 481435 568797 629640 611994 671566 583021 539667 608643 727200 891061 815512
1798 815512 715777 621610 704757 672590 682001 861574 755537 806252 842224 855156 954614
1787 954614 1070461 1005963 1041550 925327 850793 957592 1178534 1262452 1109212 1089337 1293792
1776 1293792 1248658 1304618 1409682 1484346 1559482 1542781 1490055 1673918 1646391 1659607 1840316
1765 1840316 1774201 1825676 2148918 2244091 2329486 2409937 2670143 2895053 2987273 3258449 3584677
1754C584677K63690N0551K45225M15830M11524L11393M02609O95083P62596N40270
1744G683448L64610M95352O30684R41400R64204J455624K045442K102294L109577
1735A9792635N026477O763236q18417m710761m997565n175378l403010k331476
1727A0145741j639511j399414q49718p51895k07224m83149n67187m14749m25938
1718C406956m58007k63169j64345k31005j9682k61026j84393p6648q0449n2535
1708A615697k12001j16886n7366j92407j18883J16252k246n6873n0407j3305n4529
1697H57046L1066m0655P788m7993r2546n7057k2921j30486N5413j04828p862O4414
1685E11379m9966M26j3723r1375Q344N6204p1261J586Km8787O744P7360J4600
$$ plain form
1754 3584677 3848367 3898918 4144143 4559973 4971497 5282890 5685499 6380582 7143178 7683448
1744 7683448 8048058 8543410 9174094 10115494 11079698 12535322 14580764 16683058 19792635
1735 19792635 24819112 31582348 30763931 26053170 21055605 15880227 12477217 10145741
1727 10145741 8506230 7106816 6257098 5505203 5297979 4814830 4247643 3832894 3406956
1718 3406956 2948949 2685780 2521435 2290430 2270748 2009722 1825329 1748681 1668232 1615697
1708 1615697 1403696 1286810 1229444 1037037 918154 1034406 1032160 975287 924880 911575 857046
1697 857046 888112 847457 855245 807252 714706 657649 634728 504242 559655 454827 446965 511379
1685 511379 461413 461839 448116 356741 365085 421289 350028 351614 351616 302829 309573 386933 401533
1672D01533l8096O4956n1316J3052J02835j4237j80343p8749J01671R6143m0800
1661C76649k2854o863L4877l7998K6853q362j08616n1587m0526J46769J936k02561
1649A07717J05839O6417l0697p0537o3259o4294O921m4861Q6925K7111M5870K0330
1637A93482K30848L5583k49689J6632p3657k9257K0892m7701R5912Q8575J11285
1626C92905O4480k03915o6102r460m1452p8385l175K7996K2098r1373N1162R442
1614G4221Q6909L4589k296K4589j22197o2918N902L3865q2137Q5319R9773N6710
1602B32329L0954j94069l5249J08356o4122Q1684J35521k63415O6920O8589j33637
1591C3861r1768O4091M0027O5549N2237j9159j51335J48835K0744q1756M5704
$$ plain form
1672 401533 363437 428393 377077 390129 492964 478727 298384 219635 321306 417449 376649
1661 376649 353795 346932 381809 343811 370664 362302 253686 202099 161573 308342 310278 107717
1649 107717 213556 279973 249276 178739 115480 51186 58107 13246 100171 127282 173152 193482
1637 193482 424330 459913 210224 226856 153199 123942 144834 97133 193045 281620 392905
1626 392905 457385 253470 187368 177908 136456 58071 54896 82892 104990 13617 64779 74221
1614 74221 161130 195719 193423 218012 95815 32897 38799 72664 -9473 75846 175619 232329
1602 232329 263283 69214 33965 142321 78199 159883 295404 31989 98909 167498 33861
1591 33861 -57907 6184 46211 111760 163997 144838 -6497 142338 163082 81326 127030
1580A27030k5630k3517k4210k6084P9116k4897n9635P8394o2684K30597o1770
1569B06710k14673l4734J93453j20300r1170O4092m773O1894J70559m9406P33
1558A82385J1812o9618j04360K3704P6029m5808o2009O4421o0259q467r7894L22373
1546B32309J5953j99082L847r5701N8160Q9572M2406j47197L0164n980K1732P9325
1534A25508l5199j2007O8317L071q3743Q4347J706M8303l5021J788L3349j02593
1522I7826j27556j2152j8575p0794K23672l1786M5822j6360p3164J42158q8537
1511G0554K5170m0286k8214o5748l1672J926j5232J01032j63812L4641J9926J13017
1499B1302K3505m3475j2748R954J03493k8097n9937L7907l551P1799P76j42366
$$ plain form
1580 127030 101400 77883 53673 27589 106705 81808 22173 100567 37883 268480 206710
1569 206710 -7963 -42697 150756 30456 -60714 3378 -1395 60499 231058 181652 182385
1558 182385 194197 124579 20219 43923 119952 74144 12135 76556 16297 7830 -90064 232309
1546 232309 248262 49180 53027 -42674 15486 105058 147464 267 30431 24451 46183 125508
1534 125508 90309 78302 146619 149690 65947 150294 152000 200303 165282 167070 200419 97826
1522 97826 -29730 -41882 -60457 -131251 92421 60635 106457 90097 16933 159091 70554
1511 70554 95724 55438 27224 -38524 -70196 -68270 -83502 17530 -146282 -111641 -91715 21302
1499 21302 44807 1332 -11416 -1462 102031 73934 13997 51904 48353 120152 120928 -21438
1487b1438m9355K35334p0421K3417k3661j27486k2757r335j35261N3265P5153
1476g2545O4830j5920K0264k1203k7325n9804N5592l6417N1086J23545j59479
1465g7376J49252j56139l5099J52548O4854L80l1931n732p8846J16731L5608o6651
1453F7599j00129J00843J4718Q651j67514K00820p3209k11674R5110R0062K5166
1442E0443j9199j03188n2993J097J35267p5851o5195J54489J2353j52066Q3044
1431c1799N2812Q173K5536n3537P3213m2841L5699m8911p5063j339Q3915n1653
1419b5795m3652j5748J76300k02432J50319O8912j17928J14892P7726j80818J12958
1408A14734M0776q6320r2047P9552m8097O3664L4481n0833n0082P3902o8326J9479
$$ plain form
1487 -21438 -70793 164541 94120 117537 93876 -33610 -56367 -65702 -200963 -147698 -72545
1476 -72545 -7715 -23635 -3371 -24574 -51899 -111703 -56111 -92528 -41442 82103 -77376
1465 -77376 71876 -84263 -119362 33186 98040 98420 66489 60757 -18089 98642 134250 67599
1453 67599 -32530 68313 83031 91682 -75832 124988 51779 -159895 -64785 25277 50443
1442 50443 31244 -71944 -124937 -123840 11427 -64424 -129619 24870 37223 -114843 -31799
1431 -31799 21013 29186 54722 1185 74398 31557 67256 18345 -56718 -58057 25858 -25795
1419 -25795 -69447 -85195 91105 -111327 38992 107904 -10024 104868 182594 1776 114734
1408 114734 155510 69190 -22857 56695 8598 72262 106743 55910 5828 79730 11404 30883
1396C0883j13880J4455J59584n7438l539q5151J21661r583k0384o98l5279O7736
1384F8367k7525K1998J4089J8098M100J1554j13574m3902k1204L9216L4421M841
1372A0479L3465L9660j06297j1585R7359J192L9334j06493L8321o2835J465Q4373
1360E8438j10337O2175P4178j50923J17786J83683j82410P549K3557j8917p1528
1349f749M7704L9855k6222l7080k1584q8166n1309L3556L6388K5956j64993M8435
1337a64209J3869P5229Q7291j01794j8802J44007j57984j03823J15964m6312J17552
1326c9012P9668m53l6938j40653L0350P4923m3766J2792J5102r5772L8377J171
1314a04211J01602j77289M038M2120J58124n3978l3387K5471J9367j3305J16332
$$ plain form
1396 30883 -82997 -68542 91042 33604 30065 -55086 66575 56992 36608 35910 631 68367
1384 68367 40842 62840 76929 95027 99127 110681 -2893 -46795 -67999 -28783 5638 10479
1372 10479 43944 83604 -22693 -34278 63081 64273 103607 -2886 35435 -27400 -25935 58438
1360 58438 -51899 10276 84454 -66469 51317 235000 52590 60139 83696 64779 -6749
1349 -6749 40955 80810 54588 17508 -4076 -92242 -143551 -109995 -73607 -47651 -212644 -164209
1337 -164209 -150340 -75111 12180 -89614 -108416 35591 -122393 -226216 -110252 -156564 -39012
1326 -39012 40656 40203 3265 -137388 -107038 -32115 -75881 -63089 -47987 -143759 -105382 -104211
1314 -104211 -2609 -179898 -175860 -133740 24384 -29594 -62981 -37510 -18143 -31448 84884
1303H4884J978K9239j18088j15019R7693N4608J1786j89144J23164L4573k5079
1292i405P3577j18398J24664R865l6n5332j2332k3330k3967k5852L5626J44276
1280A19356R6173j38932L4388m9936L5302p8697n7054O3757j02578k1749J4259
1269h5711J46290o841q7458N163J24297m2278j88640R2984k2873J4740J09335
1258E9008j47824K5320O5486J16154l5438N0336p3299J63584j47255p9612J08270
1247A04730l9505j61235l4071J39621k3295m7556K6118o0273O0126J22643M7761
1236A35064q7343k8145m4957L4955k7637K7088n8036R0100K681n7096j21270n9807
1224a94403J15212L7613J18384j08445L4512p2185J9529r809M5274p07k4426J18590
$$ plain form
1303 84884 86862 116101 -1987 -117006 -19313 35295 47081 -142063 -18899 15674 -9405
1292 -9405 64172 -54226 70438 80303 80267 24935 12603 -10727 -34694 -60546 -24920 119356
1280 119356 215529 76597 110985 61049 96351 17654 -39400 24357 -78221 -99970 -85711
1269 -85711 60579 53738 -33720 -28557 95740 53462 -135178 -42194 -65067 -50327 59008
1258 59008 -88816 -63496 1990 118144 82706 133042 59743 223327 76072 -3540 104730
1247 104730 65225 -96010 -130081 9540 -13755 -61311 -35193 -95466 -35340 87303 135064
1236 135064 47721 19576 -25381 9574 -18063 9025 -49011 41089 43770 -13326 -134596 -194403
1224 -194403 -79191 -41578 76806 -31639 2873 -69312 -49783 -59592 -14318 -15025 -39451 79139
1212G9139k47563N2494J19947q6704M6908k1979l9183Q59P6940M3313J6194j32437
1200i2072J49630k2987L179k7629L0394p1655n8570J37257n5852k9792r2381J82548
1188E2070J8370j32353K692N3446O6720J01755q8059o6004K6832P4696p3731r744
1176B6690J10995k35962M4787L1007k7347J41795o8534O0158j20502J28569k3287
1165F8369j10061j07156P3321K7293j50535J77565m5832j2218J52041P3953r0445
1154E6295l6124J64590l0903k30748N144Q0433q6671N329l0958L2318n1710J09318
1142a3687Q1342j27796j36540J49709K0324n2727J11451J10997Q1809j33766R1252
1131A82368l8522q2003M3029j00173O7236K2468n0616L9148j98021n9859J70186
$$ plain form
1212 79139 -168424 -115930 4017 -82687 -35779 -57758 -96941 -96082 -19142 24171 40365 -92072
1200 -92072 57558 34571 37750 10121 40515 -31140 -89710 47547 -8305 -38097 -130478 52070
1188 52070 70440 -61913 -59221 -5775 60945 162700 74641 8637 35469 110165 36434 26690
1176 26690 137685 -98277 -53490 -22483 -49830 91965 23431 83589 -36913 91656 68369
1165 68369 -41692 -148848 -75527 -48234 -198769 -21204 -67036 -79254 72787 146740 56295
1154 56295 20171 184761 153858 -76890 -71746 8687 -77984 -72655 -103613 -71295 -123005 -13687
1142 -13687 67655 -60141 -196681 -46972 -26648 -79375 32076 143073 224882 91116 182368
1131 182368 143846 61843 104872 4699 71935 94403 43787 82935 -115086 -174945 -4759
1120d759k4130q9725J38524N2150J834j02919o6590J05986n0767l889J12857J1011
1108G9583k01776M0543J00188r587K8219j23414m6014P1433N8585O7391j61510
1097i6359k4793k8987P449P9899P2627L0232j28837J12819j27848J36698q1031
1086d8131p7416M3063J30980j7218j36291J35131j1048j43343M7626j60685M1605
1075a95727k7642J45137N65J16398n1375J16522m1607j16462N1520Q4079J17330
1064A98738q9379j65920j73203J25844J30341o0459j03051J09382K7942M4496
1054D4731m7704K0280l0433k1626m7699J14537N4033k60230m3809K3328J15371
1043g9221L2888M5621J10246K0219M1957k6971q031j57157P8625q3341L0589k963
$$ plain form
1120 -4759 -28889 -118614 19910 72060 73894 -29025 -95615 10371 -40396 -44285 68572 79583
1108 79583 -122193 -81650 18538 8951 37170 -86244 -132258 -60825 -2240 65151 -96359
1097 -96359 -121152 -150139 -142690 -62791 9836 40068 -88769 24050 -103798 32900 -48131
1086 -48131 -125547 -82484 48496 31278 -105013 30118 19070 -124273 -76647 -237332 -195727
1075 -195727 -223369 -78232 -77667 38731 -12644 103878 62271 -54191 -2671 81408 198738
1064 198738 109359 -56561 -229764 -103920 26421 -34038 -137089 -27707 235 44731
1054 44731 -2973 17307 -13126 -34752 -82451 32086 86119 -174111 -217920 -194592 -79221
1043 -79221 -46333 -712 109534 129753 171710 144739 136708 -20449 58176 -25165 5424 2461
1031B461N0306J8810L3317p372N7061k78644q9115O5238M4014N5441Q08o0578
1019a08253j61176J7542J44132J20060n3492R8985n8754J38173o6338m5093J8484
1008D4270j53817k3274L6830q071K70283l5121k27473J78277k5329O2980n1382
997F8173m4074M8930K3452K9149l2025m8364L7461j29315j07337k7501k0988J60725
985d1714Q2560O2136o5619K614N0146j08078r0270Q5520K6412O5719p4405r9640
973a04619l3530j485J07278L8187j39820M9283K36455n1222j26083J14328k4817
962F3955m9894k7K5333j8111O3648j49767j73532R7260J35951L8530q4604J39530
950H8272j27930L9007m6465M8945j25192M2699K281M1238O5235Q9385j73928p9976
$$ plain form
1031 2461 52767 71577 104894 97522 154583 -124061 -213176 -147938 -103924 -48483 -47675 -108253
1019 -108253 -269429 -251887 -107755 12305 -41187 57798 -956 137217 70879 25786 44270
1008 44270 -109547 -132821 -95991 -104062 166221 131100 -96373 81904 56575 119555 68173
997 68173 24099 73029 96481 125630 93605 45241 82702 -46613 -153950 -181451 -202439 -41714
985 -41714 40846 102982 37363 39977 90123 -17955 -108225 -22705 3707 69426 -4979 -104619
973 -104619 -138149 -139634 -32356 5831 -133989 -84706 151749 100527 -25556 88772 63955
962 63955 14061 14034 39367 21256 84904 -64863 -238395 -141135 -5184 33346 -51258 88272
950 88272 -39658 -651 -47116 1829 -123363 -80664 -78383 -37145 28090 117475 -56453 -136429
938a36429M7894k6718K03751l9750l7511K5051j17961L3889P008p081N3209l7942
926c2590j3466j8782O3514n3097j04819r764O7021q324J21263o7236j45355J7039
914a84596q3502R4752J16585m4286p6185j4252O8290M6855J02525Q7731n4983
903E8934j01680j32294m1735J50896J27741j0237j6207m467J13095M7835k07406
892a5525m4375j20215P5662R8650n1545l7879L7002J08432R8885j25896K111r6638
880g1331K25959j89871j07245K59287j63709m2440K3675P2893p7650k8648o4075
869a63155L5706L824J8468J3044j322q9641J58349m0947Q0144J57083j42019K8059
857E7593O4062n1108p2308N8517O9830o7079j29993N5694j18137J05362Q0800
$$ plain form
938 -136429 -88535 -115253 88498 48748 11237 36288 -81673 -47784 -40776 -47857 5352 -32590
926 -32590 -46056 -64838 -1324 -54421 -159240 -169004 -101983 -110307 10956 -56280 -201635 -184596
914 -184596 -268098 -173346 -56761 -101047 -177232 -191484 -123194 -76339 26186 113917 58934
903 58934 -42746 -175040 -216775 -65879 61862 51625 35418 30951 144046 191881 -15525
892 -15525 -59900 -180115 -104453 -5803 -57348 -95227 -58225 50207 149092 23196 25307 -71331
880 -71331 154628 -35243 -142488 116799 -46910 -89350 -65675 7218 -70432 -99080 -163155
869 -163155 -127449 -123625 -105157 -92113 -93435 -183076 -24727 -65674 14470 171553 29534 57593
857 57593 121655 70547 -1761 56756 126586 59507 -70486 -14792 -132929 -27567 53233
846E3233M8779n1533r3605j8008M8668O2102J8000j25285j22835L3361J53105
835E982N7838J9415o42n2149M3590r4724j21639M8001K6762l1080R306N5074J38953
822A04687m2553R47j6806j35808N6017N4283J2104j94610K5674J57574n2981j3370
810d4842m8495q2274Q0628J03689j2449k9688K3532K3404n2810J30790o5184q0454
798e4153N3617K9292j1872n7869M0004o6685N5446J36531n0826j06020Q7565Q860
786F3890J7097P1647j01606K0543l1250M438N7073j60147J15240J0423J7904p281
774G7971K5782J9391n8891m2076o2207l4756J9604K3275j26220J41622J99183
763A82678k1322j32984O6740o2945j5696J25108j6962j79813o6241p3413J05208
$$ plain form
846 53233 102012 50479 -43126 -61134 -12466 49636 67636 -57649 -180484 -147123 5982
835 5982 63820 83235 82593 30444 74034 -20690 -142329 -94328 -67566 -98646 -89340 -34266 104687
822 104687 62134 63081 46275 -89533 -33516 20767 32871 -161739 -136065 21509 -31472 -44842
810 -44842 -93337 -175611 -94983 8706 -3743 -33431 -9899 13505 -39305 91485 26301 -54153
798 -54153 -536 28756 16884 -40985 -981 -67666 -12220 124311 73485 -32535 55030 63890
786 63890 80987 152634 51028 71571 40321 44759 101832 -58315 56925 67348 85252 77971
774 77971 103753 123144 64253 22177 -40030 -74786 -55182 -31907 -158127 -16505 182678
763 182678 161356 28372 95112 32167 16471 141579 124617 -55196 -121437 -194850 -89642
752h9642K8366J23273M9227j03174j9413R710m1782L0821p0262j32856J1210L3646
740a70876M2449J37672J21039q7009P6k4109P3267j12827P4258j69578R9046N406
728a1186l8113J15505j4930j09654l9641N6260j02705J56790o087j17071P665
717a03167M4223n0233J45422j7675j736k3805J3895m1858r601M4956l6860R7491
705F1052p788q5599O9591M887j03965O6586k0614J546k8605j4479O5829p1728
693f3287J53087n1425j07234J08416l0814q3668o4602l6922J36628n3569R9289
682E899r8980Q5422n7404L1709n78L5564q1386j1412P6163K206J9483N3890j8087
669D2489M303j85882j30589J62579P8814m8713M7679J27121k02471O0872p9900
$$ plain form
752 -89642 -61276 61997 111224 8050 -11363 -1653 -43435 -12614 -82876 -215732 -204522 -170876
740 -170876 -128427 9245 130284 43275 43351 19242 92509 -20318 53940 -115638 -16592 -11186
728 -11186 -49299 66206 51276 -58378 -98019 -41759 -144464 12326 6239 -110832 -103167
717 -103167 -58944 -109177 36245 18570 16834 -6971 6924 -34934 -44535 421 -36439 61052
705 61052 53264 -32335 37256 42143 -61822 4764 -15850 -14304 -42909 -57388 8441 -63287
693 -63287 89800 38375 -68859 39557 8743 -74925 -139527 -176449 -39821 -93390 5899
682 5899 -93081 -7659 -65063 -33354 -33932 1632 -79754 -91166 -15003 -12797 6686 60576 42489
669 42489 46792 -139090 -269679 -107100 -28286 -76999 -29320 97801 -104670 -43798 -123698
658a23698P8587K7703J87135j95168j05189J81154K8138m1462j02882M8193K7418
647I929M229J15123j01269j76424j2970l560Q7604J20922j32380P255R2249P5100
635H5808l9520j15081Q5497K2465j3178R616j33015n8576J55369r4444K0024m5325
623a20360L7366R9884q824L8672l7725j212o1275P8514o0752O852n8404o7574
611a54838J25362Q275M6453l7914L2854m7590R9273L341R539n0804q1111J04608
599E7448k6009O5933j01669j41162l549J05621r950J22465j22525m1660P0685
588b4372J20948n3945P212O3408k41273L9242K33945L8219o1209o9478j9784j9627
576A3286J3262m3580J11513j36060m041K83977j38202j10665l7405L0503R8904
$$ plain form
658 -123698 -45111 -17408 169727 -25441 -130630 50524 78662 37200 -65682 -17489 9929
647 9929 14158 129281 28012 -148412 -161382 -164942 -77338 43584 -88796 -81541 10708 85808
635 85808 46288 -68793 16704 39169 25991 35607 -97408 -155984 -615 -95059 -75035 -120360
623 -120360 -82994 16890 8066 46738 9013 7801 -53474 25040 -35712 -28860 -87264 -154838
611 -154838 -29476 -21201 25252 -12662 20192 -27398 71875 75216 84755 33951 -47160 57448
599 57448 31439 97372 -4297 -145459 -149008 -43387 -53337 69128 -53397 -95057 -24372
588 -24372 96576 42631 49843 113251 -128022 -88780 145165 183384 122175 52697 32913 13286
576 13286 26548 -17032 94481 -41579 -45620 238357 100155 -10510 -47915 -17412 81492
565H1492j858o5513j10358Q6954j2603m9553k5879N2365J92483q1204r4435N2799
553B4690O3593n2845J32811J3411k14860J41558j17011J66728n0743r6718L9576
542E0190R5334n7205j43831J15560j17391l2287J70711O2289j09746N029L8322
531G6975N5191n9025r3069j48509L4163K1926j20131R9793Q6762J06136o7202
520f990o132J29952K9178l2480j29069K4597k4217Q8631L4366k1104p3706j56343
508a43317J13027j5571J27475Q1383j06487n2125N4744O3446o7095o3169p3872
497h1561Q8108P0712K9969L2844p7185j17322j6297K1517J07807o5660q327m7075
485f2470l1585n3532P3689J12303J42894r9951m7286M2800j8039j1322q1925Q7883
$$ plain form
565 81492 79634 14121 -96237 -9283 -21886 -71439 -97318 -44953 147530 66326 -28109 24690
553 24690 88283 35438 168249 181660 -33200 108358 -8653 158075 107332 10614 50190
542 50190 145524 88319 -55512 60048 -57343 -89630 81081 143370 33624 38653 76975
531 76975 132166 73141 -19928 -168437 -134274 -112348 -232479 -132686 -45924 60212 -6990
520 -6990 -13122 116830 146008 113528 -15541 9056 -15161 73470 107836 86732 13026 -143317
508 -143317 -30290 -45861 81614 162997 56510 4385 59129 122575 55480 -7689 -81561
497 -81561 6547 77259 107228 140072 62887 -54435 -70732 -49215 58592 -7068 -15395 -62470
485 -62470 -94055 -147587 -73898 38405 181299 81348 34062 76862 58823 47501 -34424 53459
473E3459j01269J03549M683k09807K24036M4982o4697p8485J9557j310N6935m2730
461H903L5861j1920M083j4347L4335k9771r3610M1532O6731r7209K4629J17081
449H6298L4879m10M6573j77615p1532j0284L463L3852J54699r9991m0023K2582
437a7509L3125K6491K9612K4332n2295j87426J0535P7801j02478J16029J34935
426I3152k025k4422L9220J53607k75135p2245o6543M6982K17368o6309p1684m2009
414g0043M8272j437L2154j0600J06242q8470J00406j07157o7457L1489J15573
403H8972j01173M0446j68482K39836R4433j22855J3111r4714J01114O893o6409
392C1172n1M8581k7442j56474M2226M3712k2633k1985J26560p5136p1874P2696
$$ plain form
473 53459 -47810 55739 60422 -149385 74651 119633 54936 -23549 -3992 -5302 51633 8903
461 8903 44764 32844 36927 22580 56915 27144 -66466 -24934 41797 -55412 -30783 86298
449 86298 121177 120767 167340 -10275 -81807 -92091 -88628 -54776 99923 -68 -40091 -17509
437 -17509 15616 42107 71719 96051 43756 -143670 -133135 -55334 -157812 -41783 93152
426 93152 91127 66705 105925 259532 -15603 -87848 -154391 -107409 109959 43650 -28034 -70043
414 -70043 -21771 -23208 8946 -1654 104588 16118 116524 9367 -58090 -26601 88972
403 88972 -12201 28245 -140237 99599 194032 71177 84288 -10426 90688 97581 31172
392 31172 31121 79702 52260 -104214 -61988 -18276 -40909 -62894 63666 -11470 -83344 -10648
380a0648m414n0940N6992K59580n7942n2613q6055N248l3447l3189O1101r9020
368d5347J02944k4069o5433n1797j40643P8408k8215p9331K01864k031n0798K049
356a02399K6945L3817J2425Q044K6995j7834K3410j733l3350p1348k1829l682
344a20539M4444R2797J52218j45041k8449k8988J22011Q8224J3883J2587r9778
333A03369j03399M5061m5008m6424m0945p1819J57374J23219r875q6501j13004
322h7952J13014o6753O5919L4217O623m8890K2108k6113p898K6509J20970L0446
310A82200j7332n4695r876n777P3025p5227q8642J23617j88277J27542K7438O78
298I4674j5684j8759P1304q799j45590J13947M111j09284K7327j4593j8631P7617
$$ plain form
380 -10648 -15062 -66002 -9010 250570 192628 140015 53960 59208 25761 -7428 53673 -45347
368 -45347 57597 33528 -31905 -83702 -224345 -145937 -174152 -253483 -51619 -53650 -104448 -102399
356 -102399 -75454 -41637 -29212 -21168 5827 -12007 11403 9670 -23680 -95028 -116857 -120539
344 -120539 -76095 16702 168920 23879 -4570 -33558 88453 176677 190560 203147 103369
333 103369 -30 45031 23 -46401 -87346 -159165 -1791 121428 111553 25052 -87952
322 -87952 25062 -41691 24228 58445 65068 16178 38286 12173 4275 30784 151754 182200
310 182200 164868 110173 100297 94520 167545 92318 3676 127293 -60984 66558 93996 94674
298 94674 78990 60231 131535 122736 -22854 91093 95204 -14080 13247 -1346 -19977 57640
286E7640N5713J08036o8772q8820j78262J0716K4905P509K3825J41973j33470
275c9007O1607n2728K5833j17657L2625l0235P7574P8947l8388J7708K5954l099
263C9134p0907J27139N3003r9190j77184P9235J7012N6510R635K2114r6199N3065
251A3367O2802j41408r195j4586O5996J20961q8625R684K81384j96952n7992K851
239D8287K6107l4021o345N5286j28942k9661O5912p9365J9864J09381R4909j44081
227b669K1498n666K4442r1226O3457n5430L8662L157O5865J40417j47368L1669
215H6808J5163n9438o0162J2185R2880m9026K6168p0328m1990K35240p2878j16354
203a732k0144j8274m3192j2333M3685O5959j9435j0363P7413r6781j14351O50
$$ plain form
286 57640 113353 221389 152617 63797 -114465 -103749 -78844 -71335 -47510 94463 -39007
275 -39007 22600 -30128 -4295 -121952 -89327 -119562 -41988 36959 -1429 16279 42233 39134
263 39134 -31773 95366 148369 49179 -128005 -48770 -31758 24752 34387 56501 -39698 13367
251 13367 76169 -65239 -74434 -89020 -23024 97937 9312 18996 300380 103428 45436 48287
239 48287 74394 40373 34028 89314 -39628 -69289 -3377 -82742 -62878 46503 141412 -2669
227 -2669 18829 13163 37605 -53621 9836 -45594 -6932 -3775 62090 202507 55139 86808
215 86808 101971 42533 -17629 -5444 87436 38410 64578 -5750 -47740 187500 114622 -1732
203 -1732 -21876 -40150 -83342 -95675 -51990 13969 -5466 -15829 61584 -35197 -149548 -148898
191a48898J27862L3907Q7153j7928j2640j0140j01795N9335j04076M3546R2597
180D8923J57804k35228k4899L9149J2382o8794J00836k3544P57n1387K39953r5493
168A00459q6161O4886L4484k4626m9170k1414R2604L6071r9887j57189J51006
157D1063j2436N6147o0543j19417J12902K727p8827n81J09369j09269j3547P5465
145C053j4207j11016R0158L340l9748J34697L0141l5224q3050l5214J0849M9982
133C761J5412L8689M5253R679k6267n0974L2075Q9748k5986n9131J9540Q7185
121A78984p2001n8197p5748j23424O0884K35111J7219j43558J932M2933j02124
110c7989L1167J7911K1205O7532m7047M8476l418p2227j8522O0950P3888L4915
$$ plain form
191 -148898 -21036 12871 100024 82096 69456 59316 -42479 16856 -87220 -43674 48923
180 48923 206727 -28501 -53400 -14251 -1869 -70663 30173 6629 7386 -44001 195952 100459
168 100459 14298 79184 113668 89042 39872 18458 111062 147133 47246 -109943 41063
157 41063 28627 84774 24231 -95186 17716 20443 -58384 -58965 50404 -58865 -72412 3053
145 3053 -11154 -122170 -32012 -28672 -68420 66277 96418 61194 -21856 -57070 -46221 3761
133 3761 19173 57862 103115 112794 86527 35553 67628 157376 131390 72259 91799 178984
121 178984 106983 48786 -26962 -150386 -89502 145609 162828 19270 21202 64135 -37989
110 -37989 -6822 11089 32294 99826 52779 101255 97837 25610 7088 68038 141926 176841
98A76841o3674j26489l9444J6029L3214L2911n8479K9403O7833P7089j49573J29482
86A25143K0155o7182Q4576k7271r2434M4766n5635o5440J015O4885q099N6393
74H0872l7987J144P21q8910K5215P7945q2848J03361l0304o5498o501L6972j53764
61a39582Q1492P7304L2755n2911L2373k540J9192k10J39955j45847j23457J20067
49C8591J7755j2523l5026n7705N8145j3091q642M1588p0834K4327Q3631o694j7634
36D1888m7671O7824P3967j39583J0850r826k9847q755R384o3845J13034M3256
24F0676l3357Q1442m0639o9687K1043m8031J11741N4507p198j97653J49289K1201
12A03334j38751j9793j6922L0152J08946N7545J1205J1940l9747r6989O3522n3228
$$ plain form
98 176841 113167 -13322 -52766 -36737 -3523 29388 -29091 312 68145 145234 -4339 125143
86 125143 145298 78116 162692 135421 42987 87753 32118 -33322 -32307 32578 24479 80872
74 80872 42885 44029 44750 -44160 -18945 59000 -23848 79513 49209 -16289 -22790 14182 -139582
61 -139582 -58090 19214 51969 -942 31431 28891 48083 47873 187828 41981 -81476 38591
49 38591 56346 43823 8797 -48908 9237 -3854 -12496 29092 -41742 -17415 66216 59522 41888
36 41888 -5783 62041 136008 -3575 7275 -2551 -32398 -41153 -31769 -95614 17420 60676
24 60676 27319 108761 68122 -1565 19478 -28553 83188 137695 130497 -67156 82133 103334
12 103334 -35417 -55210 -72132 -41980 66966 124511 135716 147656 107909 10920 74442 21214
0B1214
$$ plain form
0 21214
$$ Imaginary data points
##PAGE= N=2
##DATA TABLE= (X++(I..I)), XYDATA
16383b504492j7093J52508q97N7417O1862l9803N4010P1653o2010q180J8707J69074
16371b047244j12151j7590J33083Q3973q530n3403R3442l8165M4369j9040L6080
16360a905176o0113Q8651J82301L0345j14348P2168K6664J8986L5899J33013J8773
16349a472837o424j7654o1589L2488j0887O4688M6769K6856M5768O7966o5823
16338a350679J01242M9955p0149n4523J83818J3082N3920q4938K7840L1889j5041
16327a113584p6819J72137N1727p0344R8299P5066K7623J16057K8544j14325n4251
16316h59870J06510L582P2850n4552l6682J50943j04695O3501j5547Q7222J5563
16305e71175R6659m2605k344M7032l696J7496J02732O3013n5170O8199o0759P7555
$$ plain form
16383 -2504492 -2521585 -2369077 -2369974 -2312557 -2250695 -2290498 -2236488 -2164835 -2226845 -2235025 -2216318 -2047244
16371 -2047244 -2159395 -2176985 -2043902 -1959929 -1968459 -2021862 -1928420 -1966585 -1922216 -1941256 -1905176
16360 -1905176 -1965289 -1876638 -1694337 -1663992 -1778340 -1706172 -1679508 -1660522 -1624623 -1491610 -1472837
16349 -1472837 -1479261 -1496915 -1558504 -1526016 -1536903 -1472215 -1425446 -1398590 -1352822 -1284856 -1350679
16338 -1350679 -1249437 -1199482 -1269631 -1324154 -1140336 -1127254 -1073334 -1158272 -1130432 -1098543 -1113584
16327 -1113584 -1190403 -1018266 -966539 -1036883 -938584 -863518 -835895 -719838 -691294 -805619 -859870
16316 -859870 -753360 -749778 -676928 -731480 -768162 -617219 -721914 -658413 -673960 -586738 -571175
16305 -571175 -474516 -517121 -519465 -472433 -476129 -458633 -355901 -292888 -348058 -279859 -340618 -263063
16293b63063O9197k9189m1270J19167l2818Q1213P829n5376J2269K2653N6637
16282e2751L6841J4844R1640J499L462k3286K7400K54p8726J317l0344J02912
16270I5062Q2662O9663K7630j20712k73J27681M0621J914k6948j0196K6255J96204
16258E09563r4579o8966J08547J04191j35820k9853R3799M2214M2583O9722P0479
16247G11880j75853j29174J8081J51094p8827K3718l5744P2519J96370L1451j33908
16236F51607j21137J01707K9087K08032n2400p1746J25768n6503O6837O8272j13867
16225H35657P2556O6044j44277M9067q5011N7582n1253J14500N3014R1364O0647
16214A119890r3295J7258J4870j356Q3509P541k30870K7584O9234j6891j4721
$$ plain form
16293 -263063 -193866 -223055 -264325 -145158 -177976 -96763 -88934 -144310 -132041 -109388 -52751
16282 -52751 -15910 -1066 90574 92073 95535 72249 99649 99903 21177 22494 -7850 95062
16270 95062 177724 247387 275017 154305 154032 281713 322334 324248 297300 287104 313359 509563
16258 509563 414984 346018 454565 558756 422936 393083 486882 529096 571679 641401 711880
16247 711880 536027 406853 424934 576028 497201 520919 485175 557694 754064 785515 651607
16236 651607 530470 632177 661264 869296 816896 745150 870918 814415 881252 949524 835657
16225 835657 908213 974257 829980 879047 794036 851618 800365 914865 967879 1059243 1119890
16214 1119890 1026595 1043853 1058723 1057367 1140876 1148417 917547 945131 1014365 997474 982753
16203I82753N8394N082P1319q3817N1860J6065K6563n5996J19160l141k8826o7499
16191A091917J37370m5534j09936J80240M8784l9156l0451k2024j5489N2140r0091
16180A157770O5832R9092p8827R6625J00082j28479q7441J07356l3868l9325J29916
16169A388733O5527r5869k1321K1979K2742o2030J61124m8287J00877l5536J1689
16158A509628K6441J20804j37117j21660N5970K3216j5034Q4193p6136M031L6829
16147A511165o0993K514M0543j3993n3019L2261k1353P4653n4141N9711N7403
16136A574751r0597O900P3732l8493J59685j01353n9342P3883J8389j7201Q6457
16125A686811j67578q9456n7239P1699K6317M8052J27610j30862j21280J30114
$$ plain form
16203 982753 1041147 1046229 1117548 1033731 1085591 1101656 1128219 1072223 1191383 1188242 1159416 1091917
16191 1091917 1229287 1183753 1073817 1254057 1302841 1263685 1233234 1211210 1195721 1247861 1157770
16180 1157770 1223602 1322694 1243867 1340492 1440574 1312095 1224654 1332010 1298142 1258817 1388733
16169 1388733 1454260 1358391 1337070 1359049 1381791 1319761 1480885 1432598 1533475 1497939 1509628
16158 1509628 1536069 1656873 1519756 1398096 1454066 1477282 1462248 1546441 1470305 1474336 1511165
16147 1511165 1450172 1452686 1493229 1479236 1426217 1458478 1437125 1511778 1457637 1517348 1574751
16136 1574751 1484154 1491054 1564786 1526293 1685978 1584625 1525283 1599166 1617555 1600354 1686811
16125 1686811 1519233 1429777 1372538 1444237 1470554 1518606 1646216 1515354 1394074 1524188
16115A524188j3685p5154J75444P5115q4931J62200j37256N4031J17017j70805
16105A626164l2752M5827n1972J62717n0046J04843r1192J2991q5494Q989n2223
16094A597852J03893n3989j7703K07106O4603j12314K9822M7194j01175L0004
16084A795293k6013k4603P2946p5065j56292L564O7783o3951j7100N3354l705
16073A626211k7672N8881M4945j66168P3557P7021J27620q7399j23932J47260
16063A750324J32735j61593j864M2837j52100J69712j8606m9265q0564N8868J72628
16052A863112N1100m7276o8374O9755O7481r2729j37344K198O7484L4993o6900
16041A743500O3779J3812l2033j97469J47328L2859K7705K6115R0131J5742k09346
$$ plain form
16115 1524188 1510503 1435349 1610793 1685908 1600977 1763177 1625921 1679952 1796969 1626164
16105 1626164 1593412 1639239 1587267 1749984 1699938 1804781 1713589 1726580 1641086 1650075 1597852
16094 1597852 1701745 1647756 1630053 1837159 1901762 1789448 1819270 1866464 1765289 1795293
16084 1795293 1769280 1744677 1817623 1742558 1586266 1589830 1657613 1593662 1576562 1629916 1626211
16073 1626211 1598539 1657420 1702365 1536197 1609754 1686775 1814395 1726996 1603064 1750324
16063 1750324 1883059 1721466 1719602 1762439 1610339 1780051 1761445 1712180 1631616 1690484 1863112
16052 1863112 1914212 1866936 1798562 1868317 1935798 1843069 1705725 1707923 1775407 1810400 1743500
16041 1743500 1807279 1821091 1789058 1591589 1738917 1771776 1799481 1825596 1915727 1931469 1722123
16030A722123L9031J10687k09253Q2567J13204J7238j18808k6071o2296O7931
16020A736353J45585j8240M5821j55223N1772N0366j30080q657K5550M5489n7282
16009A731454P4697l2291m091j9301K264l5380j64605K17500j6188K9586J18435
15998A902080j11266N6094n7140J1065n9199K0167L3639J51521j15909M626K9273
15987A864951j61609K366K23574j09242n6120j9622J2371Q3864j9456j37419Q579
15976A692237J7169k484k2846n951r4291J47559J13005j37292P6281K9100O2366
15965A874853o6354r1978N5028N3995n0637J7966J35472r737m2953J06750j97371
15954A785034k8760j5504M0074n9404q003J26746K6354j8469q5761P5483J16805
$$ plain form
16030 1722123 1761154 1871841 1662588 1745155 1858359 1875597 1756789 1730718 1668422 1736353
16020 1736353 1881938 1863698 1909519 1754296 1806068 1856434 1726354 1717697 1743247 1788736 1731454
16009 1731454 1806151 1773860 1769769 1750468 1752732 1717352 1552747 1770247 1754059 1783645 1902080
15998 1902080 1790814 1846908 1789768 1800833 1741634 1761801 1795440 1946961 1831052 1835678 1864951
15987 1864951 1703342 1705708 1929282 1820040 1763920 1744298 1756669 1840533 1821077 1683658 1692237
15976 1692237 1709406 1706922 1684076 1678125 1583834 1731393 1844398 1707106 1783387 1812487 1874853
15965 1874853 1808499 1716521 1771549 1825544 1774907 1792873 1928345 1918608 1875655 1982405 1785034
15954 1785034 1756274 1740770 1780844 1721440 1713437 1840183 1866537 1848068 1762307 1837790 1954595
15943A954595J3879L8128j41107K9739l9842q9927n3868j7111J20844l0298K4053
15932A809085K9937m7551N3592n1878M0861K3621p8847J45704l4278j10015J17543
15921A897774P5102n5774j68323J6669j4470j17922l1355K6678n9634J40147o568
15910A702324r95O8988L2646o4049l5921J05649r8887L9089J95991j13337k6477
15899A805021k3499N3441m5495J08891J1259k47815J31590K6194q8438m9056J71157
15888A853250J75916r4815j37484j8452K2180R314l8902j7106n5501r5212K50417
15877A853605k2254M0040J2647n2760j67552M0510J44666j01876R9868P4986m3138
15866A878742n0487M5765J27712j38738N0954M842m0065O7539j29922j7117n1398
$$ plain form
15943 1954595 1968474 2006602 1865495 1895234 1855392 1765465 1711597 1694486 1815330 1785032 1809085
15932 1809085 1839022 1791471 1845063 1793185 1834046 1857667 1778820 1924524 1890246 1780231 1897774
15921 1897774 1972876 1917102 1748779 1765448 1750978 1633056 1601701 1628379 1568745 1708892 1702324
15910 1702324 1701329 1770317 1802963 1738914 1702993 1808642 1709755 1748844 1944835 1831498 1805021
15899 1805021 1781522 1834963 1789468 1898359 1909618 1661803 1793393 1819587 1731149 1682093 1853250
15888 1853250 2029166 1934351 1796867 1778415 1800595 1809909 1771007 1753901 1698400 1603188 1853605
15877 1853605 1831351 1871391 1884038 1831278 1663726 1704236 1848902 1747026 1846894 1921880 1878742
15866 1878742 1828255 1874020 2001732 1862994 1913948 1918790 1878725 1946264 1816342 1799225 1747827
15855A747827Q1895K2434j26487N9275L1775o0394N2830l5452Q6204m269n4154
15844A801484N8200j0377n5637J18092m2025m6188J10982p7504q176m5799R9560
15833A902612n8422R0669J7675j31026K2922R9929J4102L1222K2937j47178j9303
15822A846139n3346Q9335O8589j08549j37965J07583l6698L9386m8458N1571m4751
15811A772836n6337J43126J50315J12441j52804p4258q0225k9996K345n4140K9959
15800A763262Q0367m955k30688l721J12960O6268J18908Q0859j51917M0268o423
15789A865188O4956j30948J60904k2354j35212Q7118J3943m1187j85487J45840
15779A822761r4042P0470k1506m6284J18222M8385P6022j39012o4109L4107J04745
$$ plain form
15855 1747827 1829722 1852156 1725669 1784944 1816719 1756325 1809155 1773703 1859907 1855638 1801484
15844 1801484 1859684 1849307 1793670 1911762 1869737 1823549 1934531 1857027 1848851 1803052 1902612
15833 1902612 1844190 1934859 1952534 1821508 1844430 1944359 1958461 1989683 2012620 1865442 1846139
15822 1846139 1792793 1882128 1950717 1842168 1704203 1811786 1775088 1814474 1766016 1817587 1772836
15811 1772836 1716499 1859625 2009940 2122381 1969577 1895319 1815094 1785098 1787443 1733303 1763262
15800 1763262 1843629 1838674 1607986 1604265 1717225 1783493 1902401 1983260 1831343 1871611 1865188
15789 1865188 1930144 1799196 1960100 1937746 1802534 1889652 1903595 1862408 1676921 1822761
15779 1822761 1728719 1799189 1777683 1731399 1849621 1898006 1974028 1835016 1770907 1805014 1909759
15768A909759J1283m9448Q2732P495j0912j3179p5146q565r1079L843O9865p2450
15756A764198M0131k182M5907j19293j54374R9032J79453p7013J26788Q8661j84357
15745A806951j9711L000N050L7444M7247j28861J76292R6496p3124n2815M3591
15734A941560O8303j35738q0134O3306m6798q196J48364j61215k2175j565R7435
15723A863147l9346j00953P1516K8007j25129N7671l2790J01848j31102Q6148
15713A779017J04949k9438K9777j44909P2435O810R476j3835L9318j06950J45543
15702A892193j26867P1940P0108p7547J4012M7465j28029J1600J32489q535l2324
15691A866505l2511l9692J06241j17093L742J50730j7097j59321j27813J55105
$$ plain form
15768 1909759 1921042 1871594 1954326 1961821 1950909 1937730 1862584 1854019 1762940 1766783 1836648 1764198
15756 1764198 1804329 1802147 1848054 1728761 1574387 1673419 1852872 1775859 1902647 1991308 1806951
15745 1806951 1787240 1790240 1795290 1832734 1879981 1751120 1927412 2023908 1950784 1897969 1941560
15734 1941560 2009863 1874125 1793991 1857297 1810499 1802303 1950667 1789452 1767277 1765712 1863147
15723 1863147 1823801 1722848 1794364 1822371 1697242 1754913 1722123 1823971 1692869 1779017
15713 1779017 1883966 1854528 1884305 1739396 1811831 1818641 1828117 1814282 1853600 1746650 1892193
15702 1892193 1765326 1837266 1907374 1829827 1843839 1891304 1763275 1774875 1907364 1898829 1866505
15691 1866505 1833994 1794302 1900543 1783450 1787192 1937922 1920825 1761504 1633691 1788796
15681A788796K7052L3180O2508m3925o1989R6651r7498j25742J09123O7638O1703
15670A917497l1330K4501L6648m2743j02380J21924J04347j49726j05465L9790
15660A813063j07244J10402J68678p2550r7242M309r815K9507r3109j7217J76004
15649A904786j64359Q1915n2992P04J18757O3603q2438j78551N1094P4934m5220
15638A772233j15550R945R3048J25817M3262J24083j61978k82297J54593j8305
15628A744851N5903J96823p8695p9021P0582j8636M7786l780j89848j3327J87108
15617A919746o6188n0605m1379j2792Q4779m824k2190L6250l3001k4527k6257
15606A759012K49926p2483M854P0844q4386r9468p16Q03J79185j36618Q0883O6809
$$ plain form
15681 1788796 1815848 1849028 1911536 1867611 1805622 1902273 1804775 1679033 1788156 1855794 1917497
15670 1917497 1886167 1910668 1947316 1904573 1802193 1924117 2028464 1878738 1773273 1813063
15660 1813063 1705819 1816221 1984899 1912349 1815107 1819416 1809601 1839108 1745999 1728782 1904786
15649 1904786 1740427 1822342 1769350 1770054 1888811 1952414 1869976 1691425 1742519 1817453 1772233
15638 1772233 1656683 1666628 1759676 1885493 1928755 2052838 1890860 1608563 1763156 1744851
15628 1744851 1800754 1997577 1918882 1839861 1910443 1891807 1939593 1935813 1745965 1732638 1919746
15617 1919746 1853558 1802953 1761574 1748782 1833561 1828737 1806547 1842797 1809796 1785269 1759012
15606 1759012 2008938 1936455 1941309 2012153 1927767 1828299 1827583 1828386 2007571 1870953 1951836 2018645
15594B018645p172j61993l0766O7217O7241q1273j57109j6861o420J39411N380
15583A836300k9103L5502q621q401p4598J61959k4801m4018r2353o802J7242J55465
15571A917771J7038j48562P3175R8252P7802j633j29499k16637J24812J38785
15561A951304m4024j17688J2301j5655K02858n2834p8482j14651J40148j54559
15551A728718j09703J20566L6611o4403J35383j4172L5851l5229M9596o6022J14364
15540A931560R162o2940J4635O7272j88457L7666J62505j14856l2025L8838r711
15529A853649j04144N184N6630J8580N4340J534J16365j14362j92178J22388O1723
15518A879709J7458M5305j11110r54k9830Q0499J22777j32189m8785m5568K1605
$$ plain form
15594 2018645 2011473 1849480 1818714 1885931 1953172 1871899 1714790 1697929 1691509 1830920 1836300
15583 1836300 1807197 1842699 1834078 1825677 1751079 1913038 1888237 1844219 1751866 1745064 1762306 1917771
15571 1917771 1934809 1786247 1859422 1957674 2035476 2033843 1904344 1687707 1812519 1951304
15561 1951304 1907280 1789592 1801893 1786238 1989096 1936262 1857780 1743129 1883277 1728718
15551 1728718 1619015 1739581 1776192 1711789 1847172 1833000 1868851 1833622 1883218 1817196 1931560
15540 1931560 1940722 1877782 1892417 1959689 1771232 1808898 1971403 1856547 1824522 1863360 1853649
15529 1853649 1749505 1754689 1811319 1829899 1884239 1885773 2002138 1887776 1695598 1817986 1879709
15518 1879709 1897167 1942472 1831362 1830408 1800578 1881077 2003854 1871665 1822880 1777312 1798917
15507A798917Q7223K1985J2460p5881l8808J05823K7482r9362j54631j3029K4310
15496A696489J45562m3501M2408M4926N8448k315n2852K8832J2159j61173P285
15485A776268P1795N5560k4063j00119N7775j6440j8184j0777j308L1390P481
15474A829378p2367k6701J17116K03249r9490L7515K8337j37153P3227l4361q6522
15463A832228L9991m0096M3119p8820L4916R3149J44410j17692o8921K9032r8165
15452A813151j6325L11201j19499O006J21125q9656q3215r3429n1921J3226K5602
15441A836266o3362K8369L0889L7344M7157m5647k66289J36666J85526p5339J35683
15430A987263m8548j61095J05653j33522J78096L1322J3579p7626q0541J26770
$$ plain form
15507 1798917 1886140 1908125 1920585 1844704 1805896 1911719 1939201 1839839 1685208 1672179 1696489
15496 1696489 1842051 1798550 1840958 1885884 1944332 1942017 1889165 1917997 1930156 1768983 1776268
15485 1776268 1848063 1903623 1879560 1779441 1837216 1820776 1802592 1791815 1790507 1821897 1829378
15474 1829378 1757011 1730310 1847426 2050675 1951185 1988700 2017037 1879884 1953111 1918750 1832228
15463 1832228 1872219 1832123 1875242 1796422 1831338 1924487 2068897 1951205 1882284 1911316 1813151
15452 1813151 1796826 2108027 1988528 1994534 2115659 2026003 1942788 1849359 1797438 1810664 1836266
15441 1836266 1772904 1801273 1832162 1869506 1916663 1871016 1604727 1741393 1926919 1851580 1987263
15430 1987263 1938715 1777620 1883273 1749751 1927847 1959169 1972748 1895122 1814581 1941351
$$ [...]
##END NTUPLES=NMR SPECTRUM
##END=
