##TITLE=1H_CG-1209
 CDCl3
 8 sc, 
 5.8.2024
##JCAMPDX= 6.0         $$ Bruker NMR JCAMP-DX V2.0
##DATA TYPE= NMR SPECTRUM
##DATA CLASS= NTUPLES
##ORIGIN= UXNMR, Bruker Analytische Messtechnik GmbH
##OWNER= root
$$ XWIN-NMR		Version 3.5
$$ Mon Aug  5 13:56:28 2024 Russian Standard Time (UT+4h)  she@DPX200
##.OBSERVE FREQUENCY= 200.1313
##.OBSERVE NUCLEUS= ^1H
##.ACQUISITION MODE= SIMULTANEOUS
##.ACQUISITION SCHEME= undefined
##.AVERAGES= 8
##.DIGITISER RES= 18
##SPECTROMETER/DATA SYSTEM= spect
##.PULSE SEQUENCE= zg30
##.SOLVENT NAME= Acetone
##.SHIFT REFERENCE= (INTERNAL, Acetone, 0, 21.4881)
##AUDIT TRAIL= $$ (NUMBER, WHEN, WHO, WHERE, WHAT)
$$ ##TITLE= Audit trail, XWIN-NMR		Version 3.5
$$ ##JCAMPDX= 5.01
$$ ##ORIGIN= Bruker BioSpin GmbH
$$ ##OWNER= she
$$ F:/spectra/data/she/nmr/H-F/1/pdata/1/auditp.txt
$$ ##AUDIT TRAIL=  $$ (NUMBER, WHEN, WHO, WHERE, WHAT)
(   1,<2024-08-05 13:54:22.06 +0400>,<she>,<DPX200>,
      <created by zg, POWCHK disabled, PULCHK disabled
       configuration hash MD5:
       00 E9 B6 7A A2 85 ED C7 34 08 36 98 17 FE 4E 26
       data hash MD5: 16K
       D0 05 AB D4 D9 71 BD 74 F3 8F 43 05 C9 86 74 36>)
(   2,<2024-08-05 13:54:24.92 +0400>,<she>,<DPX200>,
      <Start of raw data processing
       efp BC_mod = 2 LB = 0.24 FT_mod = 6 PKNL = 1 PHC0 = -25641.56 PHC1 = 18.18749 SI = 16K 
       data hash MD5: 16K
       0A EC 04 70 78 6A AE 75 EE 13 EC 3C DA 75 83 92>)
(   3,<2024-08-05 13:54:52.98 +0400>,<she>,<DPX200>,
      <pk PHC0 = 7.096176 PHC1 = -8.199999 
       data hash MD5: 16K
       29 53 48 D7 E6 40 4A D1 BB FD C9 07 D6 05 42 DE>)
(   4,<2024-08-05 13:54:57.42 +0400>,<she>,<DPX200>,
      <abs ABSG = 5 
       data hash MD5: 16K
       D2 E7 54 E7 94 78 20 CF 7F 1E 5B 74 DB B2 AA 31>)
$$ ##END=
$$ 
$$ hash MD5
$$ 79 DE FB C9 07 34 FD C6 A5 D1 33 8E 00 DC A7 9B
##$RELAX= 
##$RELAX= 
##$RELAX= 
##$RELAX= 
##$RELAX= 
##$RELAX= 
$$ Bruker specific parameters
$$ --------------------------
##$DU= <F:/spectra>
##$EXPNO= 1
##$NAME= <H-F>
##$PROCNO= 1
##$TYPE= <nmr>
##$USER= <she>
##$AMP= (0..31)
100 100 100 100 100 100 100 100 100 100 100 100 100 100 100 100 100 100 
100 100 100 100 100 100 100 100 100 100 100 100 100 100 
##$AQSEQ= 0
##$AQ_mod= 1
##$AUNM= <au_zg>
##$AUTOPOS= <>
##$BF1= 200.13
##$BF2= 200.13
##$BF3= 200.13
##$BF4= 200.13
##$BF5= 200.13
##$BF6= 200.13
##$BF7= 200.13
##$BF8= 200.13
##$BYTORDA= 1
##$CFDGTYP= 0
##$CFRGTYP= 5
##$CHEMSTR= <none>
##$CNST= (0..31)
1 1 145 1 1 1 1 1 1 1 1 1 1 1 1 1 1 1 1 1 1 1 1 1 1 1 1 1 1 1 1 1 
##$CPDPRG= <>
##$CPDPRG1= <>
##$CPDPRG2= <>
##$CPDPRG3= <>
##$CPDPRG4= <mlev>
##$CPDPRG5= <mlev>
##$CPDPRG6= <mlev>
##$CPDPRG7= <mlev>
##$CPDPRG8= <mlev>
##$CPDPRGB= <>
##$CPDPRGT= <>
##$D= (0..31)
0 1.2 0 0 0 0 0 0 0 0.06 0 0.03 0 0 0 0 0.0002 0 0 0 0 0 0 0 0 0 0 0 0 
0 0 0 
##$DATE= 1722851661
##$DBL= (0..7)
120 120 120 120 120 120 120 120 
##$DBP= (0..7)
150 150 150 150 150 150 150 150 
##$DBP07= 0
##$DBPNAM0= <>
##$DBPNAM1= <>
##$DBPNAM2= <>
##$DBPNAM3= <>
##$DBPNAM4= <>
$$ [...]
##$SUBNAM3= <"">
##$SUBNAM4= <"">
##$SUBNAM5= <"">
##$SUBNAM6= <"">
##$SUBNAM7= <"">
##$SUBNAM8= <"">
##$SUBNAM9= <"">
##$SW= 24.0689771365484
##$SWIBOX= (0..15)
0 0 2 0 0 0 0 0 0 0 0 0 0 0 0 0 
##$SW_h= 4816.95568400771
##$TD= 16384
##$TD0= 1
##$TE= 0
##$TE2= 300
##$TE3= 300
##$TEG= 300
##$TL= (0..7)
0 120 120 120 120 120 120 120 
##$TP= (0..7)
150 150 150 150 150 150 150 150 
##$TP07= 0
##$TPNAME0= <>
##$TPNAME1= <>
##$TPNAME2= <>
##$TPNAME3= <>
##$TPNAME4= <>
##$TPNAME5= <>
##$TPNAME6= <>
##$TPNAME7= <>
##$TPOAL= (0..7)
0.5 0.5 0.5 0.5 0.5 0.5 0.5 0.5 
##$TPOFFS= (0..7)
0 0 0 0 0 0 0 0 
##$TUNHIN= 0
##$TUNHOUT= 0
##$TUNXOUT= 0
##$USERA1= <user>
##$USERA2= <user>
##$USERA3= <user>
##$USERA4= <user>
##$USERA5= <user>
##$V9= 5
##$VALIST= <valist>
##$VCLIST= <CCCCCCCCCCCCCCC>
##$VD= 0
##$VDLIST= <DDDDDDDDDDDDDDD>
##$VPLIST= <PPPPPPPPPPPPPPP>
##$VTLIST= <TTTTTTTTTTTTTTT>
##$WBST= 1024
##$WBSW= 4
##$XGAIN= (0..3)
0 0 0 0 
##$XL= 0
##$YL= 0
##$YMAX_a= 363420
##$YMIN_a= -279802
##$ZGOPTNS= <>
##$ZL1= 120
##$ZL2= 120
##$ZL3= 120
##$ZL4= 120
##$ABSF1= 21.47317
##$ABSF2= -2.596035
##$ABSG= 5
##$ABSL= 3
##$ALPHA= 0
##$AQORDER= 0
##$ASSFAC= 0
##$ASSFACI= 0
##$ASSFACX= 0
##$ASSWID= 0
##$AUNMP= <proc_1d>
##$AZFE= 0.1
##$AZFW= 0.1
##$BCFW= 0
##$BC_mod= 2
##$BYTORDP= 0
##$COROFFS= 0
##$CY= -3
##$DATMOD= 1
##$DC= 0
##$DFILT= <>
##$DTYPP= 0
##$F1P= 0
##$F2P= 0
##$FCOR= 1
##$FTSIZE= 16384
##$FT_mod= 6
##$GAMMA= 0
##$GB= 0
##$INTBC= 1
##$INTSCL= 3.70164e-10
##$ISEN= 128
##$LB= 0.24
##$LEV0= 0
##$LPBIN= 0
##$MAXI= 10000
##$MC2= 0
##$MEAN= 0
##$ME_mod= 0
##$MI= 1.114404
##$NCOEF= 0
##$NC_proc= -6
##$NLEV= 6
##$NOISF1= 3.799351
##$NOISF2= 2.8
##$NSP= 0
##$NTH_PI= 0
##$NZP= 0
##$OFFSET= 21.48805
##$PC= 1
##$PHC0= -25634.46
##$PHC1= 9.987492
##$PH_mod= 1
##$PKNL= yes
##$PPARMOD= 0
##$PSCAL= 0
##$PSIGN= 0
##$REVERSE= no
##$SF= 200.129408086596
##$SI= 16384
##$SIGF1= 3
##$SIGF2= 2
##$SINO= 5.538805
##$SIOLD= 16384
##$SREGLST= <1H.CDCl3>
##$SSB= 0
##$STSI= 16384
##$STSR= 0
##$SW_p= 4816.95568400771
##$SYMM= 0
##$S_DEV= 0
##$TDeff= 16384
##$TDoff= 0
##$TI= <>
##$TILT= no
##$TM1= 0
##$TM2= 0
##$TOPLEV= 0
##$USERP1= <user>
##$USERP2= <user>
##$USERP3= <user>
##$USERP4= <user>
##$USERP5= <user>
##$WDW= 1
##$XDIM= 16384
##$YMAX_p= 328889099
##$YMIN_p= -510257
$$ End of Bruker specific parameters
$$ ---------------------------------
##NTUPLES= NMR SPECTRUM
##VAR_NAME=  FREQUENCY,     SPECTRUM/REAL,   SPECTRUM/IMAG
##SYMBOL=    X,             R,               I
##VAR_TYPE=  INDEPENDENT,   DEPENDENT,       DEPENDENT
##VAR_FORM=  AFFN,          ASDF,            ASDF
##VAR_DIM=   16384,         16384,           16384
##UNITS=     HZ,            ARBITRARY UNITS, ARBITRARY UNITS
##FACTOR=    0.29402158847633, 1,            1
##FIRST=     4300.3908196579, 0,             0
##LAST=      -516.564864349813, 0,           0
##MIN=       -516.564864349813, -510257,     0
##MAX=       4300.3908196579, 328889099,     0
$$ Real data points
##PAGE= N=1
##DATA TABLE= (X++(R..R)), XYDATA
$$ [...]
5198B55486K7453K1350j20082j7433k9337M508N0252J11497j04172o5228n7647
5187G6647n7201J92620N1261q2905N484N6194j6175j27703J33403n9898J798J15707
5175B89232Q3630m6175J21342j17867k72388J7811J62373P353k7217n7924P7544
5164B37714Q4789m45j06729O3095p2940o3704N3941j1300M2099K3397N7423q7337
5152B20003k7166Q8918m4262o9717J15749q4143n1706J63739l6411Q0505M4117
5141C99626p8649r929j21218J87004K2079J494j01021P5053J8027j01118p208
5130B84140l2039r3250K3465M2070M2903R6071l7248L5675p8652m8785J86980
5119D21330j56798r435Q2797o3590K426J70962j02661M8176O3816q7358m5254
$$ y = [255486, 282939, 304289, 184207, 166774, 137437, 141945, 192197, 303694, 199522, 134294, 76647, 19446, 212066, 263327, 180422, 185906, 242100, 225925, 98222, 231625, 171727, 173525, 289232, 372862, 326687, 448029, 330162, 57774, 75585, 237958, 245311, 218094, 160170, 237714, 322503, 322058, 215329, 278424, 205484, 141780, 195721, 184421, 226520, 249917, 307340, 220003, 192837, 281755, 237493, 167776, 283525, 199382, 147676, 311415, 275004, 355509, 399626, 320977, 311048, 189830, 376834, 398913, 400407, 299386, 374439, 392466, 291348, 284140, 252101, 158851, 182316, 224386, 267289, 363360, 326112, 361787, 283135, 234350, 421330, 264532, 255097, 337894, 274304, 276730, 447692, 345031, 393207, 457023, 369665, 324411]
5108C24411k6109k193L031J23455J0560K7180J7346j06879j89487K0922K64303
5097D66540k1781l6501p9784l4976O5942K8325K0830R524n1660K6383L5254M1779
5085D69875L510k9903O7250k2959J75582j23622j23903O2313q7496J34432J6757
5074E41836n2807O7790J2647j00727J03908k3565O0608K2545O2930m2745L7593
5063F90013Q9829n3039N4234J64717m7243o2610J52698m950r633k76446J46751
5052H44321J73917m6758n9490J34471j3992j6421P0772o83L9650M9178J00099
5041A275064l2263O3365L4195o2117j3861n1839j37158j45366J3563Q5737J0324
5030A039644j9398r148m6392J24335o0164j2545J3852J6832n9029j9039J16147
$$ y = [324411, 298302, 296109, 299140, 422595, 433155, 460335, 477681, 370802, 181315, 202237, 466540, 444759, 408258, 328474, 293498, 359440, 387765, 408595, 418119, 366459, 392842, 428096, 469875, 473385, 443482, 510732, 487773, 663355, 539733, 415830, 478143, 390647, 525079, 541836, 489029, 556819, 569466, 468739, 572647, 549082, 609690, 632235, 695165, 652420, 690013, 779842, 726803, 781037, 945754, 898511, 835901, 988599, 983649, 974016, 697570, 844321, 1018238, 971480, 911990, 1046461, 1032469, 1016048, 1086820, 1086137, 1125787, 1174965, 1275064, 1242801, 1306166, 1340361, 1278244, 1264383, 1212544, 1075386, 930020, 943583, 1029320, 1039644, 1020246, 1011098, 964706, 1089041, 1028877, 1016332, 1030184, 1047016, 987987, 968948, 1085095]
5019A085095o7011m2512p83m1849j93968J6585J7436j0355O477k3823k569p0447
5007F72276K4420N8267j09771N9472J72962n5823K9906j81517q9867O5420J40806
4996G86551J17491r8080L7280M0466N7581L6339r3200L708j8954l7219J17183
4985I49146r393p435O2538p4206J1115N7112n8863j91957J45077P1446K0128Q1998
4973A056706k7634j14374q6166J26066p0145P1034p8852r4J80896J33841n6042
4962A135236j470j31492m5704L0567O1905Q3085j43219J08615N1861j42589O5298
4951A072093r3487m8662J4245m2487M8627l4292Q437J32123r1798L507j24754
4940H43552L6440R2300Q6550p362k1674o2982N3135J24611Q11l5574j03372K5233
$$ y = [1085095, 1018084, 975572, 974789, 932940, 738972, 755557, 772993, 762638, 769115, 745292, 742723, 672276, 696696, 754963, 645192, 704664, 877626, 821803, 851709, 670192, 580325, 645745, 786551, 904042, 805962, 843242, 883708, 941289, 977628, 884428, 888136, 869182, 831963, 949146, 939753, 932318, 994856, 920650, 931765, 988877, 930014, 738057, 883134, 954580, 974708, 1056706, 1029072, 914698, 828532, 954598, 884453, 955487, 876635, 876541, 1057437, 1191278, 1135236, 1133766, 1002274, 956570, 987137, 1049042, 1132127, 988908, 1097523, 1149384, 1006795, 1072093, 978606, 929944, 944189, 901702, 950329, 916037, 924474, 1056597, 964799, 968306, 843552, 879992, 972292, 1058842, 1051480, 1029806, 966824, 1019959, 1144570, 1145381, 1109807, 1006435, 1031668]
4928A031668o8621L5729K1141J128j58831R0647K01734M0521L1232k8525p859
4917A189964l7064p4205J96684k2973m1343K6111N2164O7128r121q5074q1662
4906A180609K1696M8849m7722J09054k1942J59880q0946r7596N0258P4956p9233
4895A317863J87040k6609k7883n4501J37604m8402j87428K32469Q6943k3109K03076
4884A797063r772k23903k322M5266R696r0534J12259O2932j1681J29359j8945
4873A799418J2858j3536l0171J73500j08596K18656J60119j87940P6336J41753
4863B242397n9862J26701j0980l1087Q2307j67526j39714K19652M8821q334j3437
4852B288938J60164J15903j31942K4286J65193N5102l0443m7748K1600P9510m5082
$$ y = [1031668, 963047, 998776, 1019917, 1021045, 862214, 952861, 1154595, 1195116, 1226348, 1197823, 1189964, 1152900, 1078695, 1275379, 1252406, 1211063, 1237174, 1289338, 1356466, 1347345, 1262271, 1180609, 1202305, 1251154, 1203432, 1312486, 1290544, 1450424, 1369478, 1271882, 1322140, 1397096, 1317863, 1504903, 1478294, 1450411, 1395910, 1533514, 1485112, 1297684, 1530153, 1617096, 1593987, 1797063, 1787291, 1563388, 1561066, 1606332, 1616028, 1525494, 1637753, 1700685, 1689004, 1818363, 1799418, 1812276, 1798740, 1768569, 1942069, 1833473, 2052129, 2212248, 2024308, 2100644, 2242397, 2182535, 2309236, 2298256, 2267169, 2349476, 2181950, 2042236, 2261888, 2310709, 2302375, 2288938, 2449102, 2565005, 2433063, 2457349, 2622542, 2677644, 2647201, 2599453, 2621053, 2700563, 2655481]
4841B655481J17611O4035m969J5425O474P8315j3246J36370J74355L8739L1135
4830C299725P1949K994J12988R3748O4144K02490K44213K5046j31605J56003J31469
4819D273164P9350j27702J00208K19854M2656R7744m0444J35414J49382K60931
4809E190557J10145R1306Q3400K19883K62102J8161Q3443K64130K4482K19843
4799F567452N0278J31027P6875L13290K63337J43093K40648L44434L20951O4430
4789H515815M29684M01141L75838J98865K01938K22853L45288M04087J01694M18650
4779A1615853M96153M03314L13560O35375N13474N24997O10840Q76869P32614
4770A6723049P60011J036707J025649R66177R91299R05002R18095J320962J608626
$$ y = [2655481, 2773092, 2837127, 2832158, 2847583, 2854057, 2932372, 2919126, 3055496, 3229851, 3268590, 3299725, 3371674, 3374668, 3487656, 3581404, 3645548, 3848038, 4092251, 4117297, 3985692, 4141695, 4273164, 4352514, 4224812, 4325020, 4544874, 4587530, 4685274, 4644830, 4780244, 4929626, 5190557, 5300702, 5392008, 5475408, 5695291, 5957393, 5975554, 6058997, 6323127, 6347609, 6567452, 6617730, 6748757, 6825632, 7138922, 7402259, 7545352, 7786000, 8130434, 8451385, 8515815, 8945499, 9346640, 9722478, 9921343, 10123281, 10346134, 10691422, 11095509, 11197203, 11615853, 12112006, 12515320, 12828880, 13464255, 13977729, 14502726, 15113566, 15990435, 16723049, 17483060, 18519767, 19545416, 20511593, 21502892, 22407894, 23325989, 24646951, 26255577]
4761B6255577J989362K061991K369557K418328J938860J141885J61442n14342
4753C7822660r56061j025684l83740n5707J91019N13552Q47744J106687J618209
4744C9678679K243051K894414L427224L331356K571683J096699r38593k650967
4736E1653546m074612m276047l893085l490214k616923j788374j287340p26942
4728B9500009l16027J55314O58920P84985J017298Q59732J50468r24194k071711
4719B9814794k808950k880287k978955k600909k039400j868602j425191j232897
4711A1979603r74403j037078p55511q82249n06659l82067k82392n15238l09260
4702F334746j93927j77189l20002k89670p5439k88836j32024j22323l09192j36537
$$ y = [26255577, 28244939, 30306930, 32676487, 35094815, 37033675, 38175560, 38337002, 37822660, 36866599, 35840915, 35457175, 35401468, 35592487, 36106039, 36953783, 38060470, 39678679, 41921730, 44816144, 48243368, 51574724, 54146407, 55243106, 54304513, 51653546, 47578934, 43302887, 39409802, 35919588, 33302665, 31514291, 30226951, 29500009, 29183982, 29339296, 29998216, 30783201, 31800499, 32660231, 32810699, 31886505, 29814794, 27005844, 24125557, 21146602, 18545693, 16506293, 14637691, 13212500, 11979603, 11005200, 9968122, 9212611, 8330362, 7823703, 7441636, 7159244, 6644006, 6334746, 6140819, 5963630, 5643628, 5353958, 5278519, 4989683, 4857659, 4735336, 4426144, 4289607]
4692D289607j65738J1257k59879k2825r1956j35101k5266l4161p6658k16718J05638
4681C378200Q0709J9683K3349k19798k23229p469m108N0433j26956M9109r1655
4670B928268j44250n4863M2021K9299J06962O4082l8317j27850j9913O4232j53251
4659B696420l1810L4290k0410J85015r4125n7934J46269O5295p9354j27208K2695
4648B739143J14053j1480J1677P8604O9104P6201K18533O0635K2135M2097L7028
4637C457730J02199O7381n2169K07429j56907r9892M7619P0105J6622J12730j6776
4626C756071M0116M7212J05663J25699J54774J56516n619K85551K07230J06798
4616D980011k7980m5549m6445j67485P091m9407j31411p6790j56581j70065p8339
$$ y = [4289607, 4123869, 4135126, 3875247, 3852422, 3760466, 3625365, 3600099, 3565938, 3489280, 3272562, 3378200, 3458909, 3478592, 3501941, 3282143, 3058914, 3051445, 3047337, 3097770, 2970814, 3019923, 2928268, 2784018, 2729155, 2771176, 2800475, 2907437, 2971519, 2933202, 2805352, 2785439, 2849671, 2696420, 2664610, 2698900, 2678490, 2863505, 2769380, 2711446, 2857715, 2923010, 2843656, 2716448, 2739143, 2853196, 2841716, 2853393, 2931997, 3001101, 3077302, 3295835, 3356470, 3378605, 3420702, 3457730, 3559929, 3627310, 3575141, 3782570, 3625663, 3525771, 3573390, 3643495, 3660117, 3772847, 3756071, 3796187, 3843399, 3949062, 4074761, 4229535, 4386051, 4380432, 4665983, 4873213, 4980011, 4952031, 4906482, 4860037, 4692552, 4699643, 4650236, 4518825, 4442035, 4285454, 4115389, 4037050]
4605D037050o7900J07873J59631Q3078J8390J8579K19643J10423L6436l6757J15144
4594D801590q4325j35493k04055j60159j97271j53791k33163j30655j27946j46793
4584C227939k07429M8370M4349J403J14833k8265M3599j69980J23930K9251q508
4573C219492q3755l3660n0260j66073j43165j03100r797n9716k03295p0590K3928
4562B320009m0517m6058M8940r5146J2559J16046J09161J38342m6311j9256k5026
4551B472743p236q7690r8127p7582R7029K21115o6700j04245j0196P3173M2692
4540B454976J42668j96963m6194o7681p0625K23500J68242L8090r616m0404M5775
4529B641768K40799O9318K2650K113r7266O6852l8382m2154M8453J24962j90222
$$ y = [4037050, 3969150, 4077023, 4236654, 4319732, 4338122, 4356701, 4576344, 4686767, 4723203, 4686446, 4801590, 4717265, 4581772, 4377717, 4217558, 4020287, 3866496, 3633333, 3502678, 3374732, 3227939, 3020510, 3068880, 3113229, 3114632, 3229465, 3201200, 3244799, 3074819, 3198749, 3228000, 3219492, 3135737, 3102077, 3051817, 2885744, 2742579, 2639479, 2629682, 2569966, 2366671, 2296081, 2320009, 2279492, 2233434, 2282374, 2187228, 2199787, 2315833, 2424994, 2563336, 2517025, 2497769, 2472743, 2465507, 2377817, 2279690, 2202108, 2299137, 2520252, 2453552, 2349307, 2339111, 2412284, 2454976, 2597644, 2400681, 2354487, 2286806, 2216181, 2439681, 2607923, 2646013, 2636397, 2595993, 2641768, 2882567, 2951885, 2974535, 2976648, 2879382, 2946234, 2907852, 2865698, 2914151, 3039113, 2848891]
4518B848891p5249K79065J6700l8786P4036J50836k3170J07838Q4193K45630L14249
4507C984233K57531q293N6811k06757k95334j86316q4987J33739L3567m0872Q1124
4496C724446J9851j34890K69428J25200j03874K03879M05889L17420L70047M38811
4486E636207M70121L49531k79741l14580m14776m49835n11540r4238o2655q0237
4476D248257O397q3226J47760M4219J46449Q7076J98929N77439M42288M11844
4466F227432P13396N50479J05284j07803n83214p76913o42355l82527l31056j64524
4456D608199k14590m1470p0438L1275J2495P5764J34221K91429K53510K78170
4446E358565N95871M42958M43093J12195l20920m93861n99313m19892l15940k85263
$$ y = [2848891, 2773642, 3052707, 3069407, 3030621, 3104657, 3255493, 3232323, 3340161, 3424354, 3669984, 3984233, 4241764, 4233471, 4290282, 4083525, 3788191, 3601875, 3516888, 3650627, 3684194, 3643322, 3724446, 3744297, 3609407, 3878835, 4004035, 3900161, 4104040, 4509929, 4827349, 5197396, 5636207, 6106328, 6455859, 6176118, 5861538, 5446762, 4996927, 4485387, 4391149, 4328494, 4248257, 4254654, 4171428, 4319188, 4363407, 4509856, 4596932, 4795861, 5373300, 5815588, 6227432, 6940828, 7491307, 7596591, 7488788, 6905574, 6128661, 5486306, 5103779, 4772723, 4608199, 4393609, 4352139, 4281701, 4312976, 4325471, 4401235, 4535456, 4826885, 5080395, 5358565, 5954436, 6397394, 6840487, 6952682, 6631762, 6137901, 5538588, 5118696, 4802756, 4517493]
4436D517493q1107j22971K9092P60o4343N2236N0744J05840J03395J30389Q9727
4425D811255K33855K29209J69906J11662j29407n0912k10721r5993p9276j43932
4415D845646P0774J44297j61156j09879O1439L00137j2525j01017O3922K00147
4405E301785K92429J4922P2535n5484J11749J41756L2342R3241J77198N1822J36981
4394F371276J65689J15452K25605J58349L05370l8595J64984J00911K04716J05735
4384G879492J03826K31686J30210K07649K01045K45130N52291L68808J59765M27342
4374A0507244L93142L45346K58838M10643J71311J73014q0446Q4280o990O4966
4364A2321348L37377K11586K92258L27191M37526M19326O89140M49004M34161
$$ y = [4517493, 4436386, 4313415, 4342507, 4343267, 4278924, 4331160, 4381904, 4487744, 4591139, 4721528, 4811255, 5045110, 5274319, 5444225, 5555887, 5426480, 5375568, 5164847, 5068854, 4989578, 4845646, 4916420, 5060717, 4899561, 4789682, 4851121, 5151258, 5138733, 5037716, 5101638, 5301785, 5594214, 5609136, 5681671, 5626187, 5737936, 5879692, 5912034, 6005275, 6182473, 6234295, 6371276, 6536965, 6652417, 6878022, 7036371, 7341741, 7303146, 7468130, 7569041, 7773757, 7879492, 7983318, 8215004, 8345214, 8552863, 8753908, 8999038, 9551329, 9920137, 10079902, 10507244, 10900386, 11245732, 11504570, 11915213, 12086524, 12259538, 12179092, 12263372, 12256382, 12321348, 12658725, 12870311, 13162569, 13489760, 13927286, 14346612, 15035752, 15484756, 15918917]
4355A5918917O85004Q15440O06779N22496J33087L04919J83962K51273N08373
4346A9930250N73101P57302R60392R15384J178678J664283J868989K167203K345516
4337C2361098K725918K801130K553120J791906M91779q46868j779710k040680
4329C8057693j755815j428781p81504o8617L73391R00016J618898K322640L084649
4320D2322570L869828M232330L742277K279961K77461k214350m207177n316681
4312D4986219n104390m187046l141562k362656j806152j100641p80632k27194
4304B6275946M72958P93111Q83674J184496O64314m8608j185176k271953k713542
4295B4055220k716779k505597k124515j673119j438775j104599q97765p82951
$$ y = [15918917, 16603921, 17419361, 18026140, 18548636, 18681723, 18986642, 19170604, 19421877, 19930250, 20503351, 21260653, 22221045, 23136429, 24315107, 25979390, 27848379, 30015582, 32361098, 35087016, 37888146, 40441266, 42233172, 42724951, 41878083, 40098373, 38057693, 36301878, 34873097, 34091593, 34022976, 34396367, 35296383, 36915281, 39237921, 42322570, 46192398, 50424728, 54167005, 56446966, 56724427, 54510077, 50302900, 44986219, 39881829, 35694783, 32553221, 30190565, 28384413, 27283772, 26503140, 26275946, 26748904, 27542015, 28425689, 29610185, 30274499, 30225891, 29040715, 26768762, 24055220, 21338441, 18832844, 16708329, 15035210, 13596435, 12491836, 11594071, 10811120]
4287A0811120o89155o58429m58437m90228l28952j86645k21603m05442j23204
4278G249025j17084j58781k74334k93370o7195j61968k6597j93792o4392K8800
4268E920312n2720j85664J9176O6590l477p5939j1177m3363l8298l570n063j08233
4256E478574J5244K988n6149M1266j42153j15554o2850k111p2668J33377p8400
4245E141564j25752J16810M4216j08001q5725j2142L14223R8512j3969O5528R4684
4234E529948K72836J00338J45100L74728L03453o5379k23990k89895l07202n0135
4224E789802q4868j67275J68702j1974j24444L419p251J18125M6544N9777J64679
4213E955236L19689K04049K24488L05423Q2160J61988K56824m5428j02374l57429
$$ y = [10811120, 10121965, 9463536, 9005099, 8514871, 8185919, 7999274, 7777671, 7372229, 7249025, 7131941, 6973160, 6698826, 6405456, 6338261, 6176293, 6149696, 5955904, 5891512, 5920312, 5867592, 5681928, 5701104, 5767694, 5764217, 5688278, 5677101, 5633738, 5595440, 5591870, 5586807, 5478574, 5493818, 5496806, 5440657, 5481923, 5339770, 5224216, 5161366, 5159255, 5086587, 5219964, 5141564, 5015812, 5132622, 5176838, 5068837, 4983112, 4970970, 5285193, 5383705, 5369736, 5435264, 5529948, 5802784, 5903122, 6048222, 6422950, 6726403, 6661024, 6437034, 6147139, 5839937, 5789802, 5704934, 5537659, 5706361, 5694387, 5569943, 5573362, 5566111, 5684236, 5730780, 5790557, 5955236, 6274925, 6478974, 6703462, 7008885, 7091045, 7253033, 7509857, 7464429, 7362055, 7004626]
4203G004626k16530k24758k17691j97187M8267J23055l8522j06532K68905K43346
4193F686979n319J87548J69680J53687M7257l3798n8735r6910O8671L208N0426
4182G172694R4937J35005J7394J1975o7435J46500P6228K30860K21484K69727
4172H309369K27365k3460o5857j44094j48994p5947j06891j15075M9388q8435
4162G817369J56477J28061J68449k9821K22608J54131J59834J35031J69120L1459
4152I112718J54724n6729r2605K1477j6481l7403J91849M6799K20525J81850J05553
4141I832277J59373J18748O7559L39843J48030N0434K57647L34464K52466L99171
4131A1960012J91416K40376K28148K12133K60157K81775L04570M35039L25840
$$ y = [7004626, 6788096, 6563338, 6345647, 6148460, 6196727, 6319782, 6281260, 6174728, 6443633, 6686979, 6681660, 6869208, 7038888, 7192575, 7239832, 7206034, 7147299, 7050389, 7119060, 7122268, 7172694, 7267631, 7402636, 7420030, 7432005, 7364570, 7511070, 7587298, 7818158, 8039642, 8309369, 8536734, 8513274, 8447417, 8303323, 8154329, 8078382, 7971491, 7856416, 7905804, 7817369, 7973846, 8101907, 8270356, 8240535, 8463143, 8617274, 8777108, 8912139, 9081259, 9112718, 9267442, 9210713, 9118108, 9139585, 9123104, 9085701, 9277550, 9324349, 9544874, 9726724, 9832277, 9991650, 10110398, 10177957, 10517800, 10665830, 10716264, 10973911, 11308375, 11560841, 11960012, 12151428, 12391804, 12619952, 12832085, 13092242, 13374017, 13678587, 14113626, 14439466]
4122A4439466L42706L35999L25252O04806O00140N91119N04851Q47175O89265
4113A9280779N42358P99901P41982Q81740O13015P37233J037717J009160J622658
4104B7266543J711103K080964K334837K814327L147733K698010J619285M57539
4096D4130341p05847j429381j247139r57407n62714j40596J63244N25473J089349
4087D0865323J892022K485816L023367L186843J957552Q82025j75583j238758
4079E2878607j832797k485987k977646l062919k886839k666447j777569j270496
4071C3917907m16607p9842J01831L75769O90203R09536N51792l61495j706465
4062C3982629k945879l331693l295932k834861k407768k027507j604477j463486
$$ y = [14439466, 14782172, 15118171, 15443423, 16048229, 16648369, 17239488, 17744339, 18591514, 19280779, 19823137, 20623038, 21365020, 22246760, 22859775, 23597008, 24634725, 25643885, 27266543, 28977646, 31058610, 33393447, 36207774, 39355507, 42053517, 43672802, 44130341, 43424494, 41995113, 40747974, 39790567, 39227853, 39087257, 39250501, 39775974, 40865323, 42757345, 45243161, 48266528, 51453371, 53410923, 54292948, 54117365, 52878607, 51045810, 48559823, 45582177, 42519258, 39632419, 36965972, 35188403, 33917907, 33501300, 33421458, 33523289, 33899058, 34589261, 35498797, 36050589, 35689094, 33982629, 31036750, 27705057, 24409125, 21574264, 19166496, 17138989, 15534512, 14071026]
4054A4071026j055917r22799q65036p39151o30937n52583p33109n66183m32460
4045G572851m62880m03114l40642l37514k34942k62941k16220k61774j70930j98731
4035D683163j92357J096p4390j46664j84410L019J51968l603q9157j25835J09856
4024D132686j77372k93199l0933j03844j59356o8439L509N1794j44143m6657K3963
4013C188009q6744Q8801K8792k12166k5263j27458M9634l2022j27981L5959M370
4002B783931j60488j10465j28054L8806R2917k09961L885o2928o6261J17449n4748
3991B244083j83211j2162p5916J3965j01886n7204r5507N956L7600J34232j18181
3980A791769J34296j21320q0132k7514j40416m8482J04182Q1507O018j38473L2041
$$ y = [14071026, 13015109, 12092310, 11227274, 10488123, 9857186, 9304603, 8571494, 8005311, 7572851, 7109971, 6706857, 6366215, 6028701, 5793759, 5530818, 5314598, 5052824, 4881894, 4683163, 4490806, 4491902, 4417512, 4270848, 4086438, 4089457, 4241425, 4237822, 4148665, 4022830, 4132686, 3955314, 3662115, 3631182, 3527338, 3367982, 3299543, 3303052, 3354846, 3210703, 3164046, 3188009, 3101265, 3190066, 3218858, 3006692, 2981429, 2853971, 2903605, 2871583, 2743602, 2779561, 2783931, 2623443, 2512978, 2384924, 2423730, 2516647, 2306686, 2310571, 2247643, 2181382, 2298831, 2244083, 2060872, 2048710, 1972794, 1986759, 1884873, 1827669, 1732162, 1738118, 1775718, 1909950, 1791769, 1926065, 1804745, 1724613, 1697099, 1556683, 1508201, 1612383, 1693890, 1699908, 1561435, 1593476]
3969A593476r769N8448O6684l7450J71609M4019r3648N3266J05552j93873j34802
3958A623512n6728m1149j5897o0577p6037k5973n9117L9783p9692j57610M2225
3947A132740J131j12909J6773j5720o4600J8896l3900j04505J59493L3302k2788
3936A007913l4378j14438R6338o9208N7304j09589K1039J11959j20513k4240J8776
3925H40963o3054K614P8217l0478k5858K4223J05808o2501k4259o8590O9255p2351
3913G73989j57074O0910J41079j64660K5327K28480j38352n4464o138N8276q1376
3902F85997P7716J11598N5801N285j88925j7138r3990k2977Q486J55950j37673
3891F40130L5119J83815o3873p0426n0562J25031N6809l3370j68473r36J29603
$$ y = [1593476, 1583707, 1642155, 1708839, 1671389, 1842998, 1887017, 1793369, 1846635, 1952187, 1758314, 1623512, 1566784, 1525635, 1509738, 1449161, 1373124, 1347151, 1288034, 1327817, 1248125, 1090515, 1132740, 1133871, 1020962, 1037735, 1022015, 957415, 976311, 942411, 837906, 997399, 1030701, 1007913, 973535, 859097, 955435, 886227, 943531, 833942, 854981, 966940, 846427, 822187, 840963, 777909, 780523, 858740, 828262, 802404, 826627, 932435, 869934, 845675, 777085, 846340, 773989, 616915, 677825, 818904, 654244, 679571, 908051, 769699, 715235, 709097, 767373, 685997, 763713, 875311, 931112, 936397, 747472, 730334, 636344, 613367, 621853, 777803, 640130, 675249, 859064, 795191, 724765, 674203, 799234, 856043, 822673, 654200, 653264, 782867]
3880G82867J22760j15390l7772L0769J24100J3957j34294n5674n410K6757R2869
3869H45539J15893J5972j14309l7242Q3486r4871m0005M0092J29387j17559R6336
3858I22719O2023R3145n3997j01543q6311n8803l4651J68100Q821o260j1073O0096
3846I62266J47520p5879p9872J8094P3640m8044m2574N7854K5970j1853J07436
3835A134558k5614p0738j51618k7995n056k8322m7089J18229r2793L3815J49570
3824I86947K5500N9939L3770j01923m7715J33190q2321q374k0175j5150R7178
3813A060866j73007l0977J32880P8180J3503l2356p6893J67757j43410L7345q7900
3802I45988Q9003O3268M8832O4451r9452k5772m0912M8908J233Q8450O7498m4387
$$ y = [782867, 905627, 790237, 752465, 783234, 907334, 921291, 786997, 731323, 725913, 752670, 845539, 961432, 977404, 863095, 825853, 909339, 814468, 774463, 814555, 943942, 826383, 922719, 984742, 1077887, 1023890, 922347, 836036, 777233, 742582, 910682, 919503, 913243, 902170, 962266, 1109786, 1033907, 954035, 972129, 1045769, 997725, 955151, 1013005, 1038975, 1027122, 1134558, 1108944, 1038206, 886588, 858593, 853537, 825215, 778126, 896355, 803562, 837377, 986947, 1012447, 1072386, 1106156, 1004233, 956518, 1089708, 1007387, 999013, 978838, 963688, 1060866, 887859, 856882, 989762, 1067942, 1081445, 1049089, 972196, 1139953, 996543, 1033888, 945988, 1034991, 1098259, 1147091, 1211542, 1112090, 1086318, 1045406, 1094314, 1095547, 1183997, 1251495, 1207108]
3790A207108N0158N4457r7415J77776j28955J87942n3239J37485R7906o8695J74497
3779A739025R9539J40398j528J68118j04876j18330m632L005p9335N8564o8259
3768A831689K1342n4417L7814M1339J10605q2940l0676J78754J56096j8136r5946
3757B095524J75476J77700K48450J20734M3942l9449o4997k16703j09009k43826
3747B187842r1634N5112j52590j21682K6676j92309M8429O5771K0777j82786N4684
3736A718290M0368p2465J22969O8264O4333K7423Q998o8480n567o1702j82659
3725A659772j22673j7395p1583l3467r989k9723L5232n2157R5969p8354J7608
3714A393240k48409M3356j4074p9559n1780J8457K7564n4421P2638j3475M6812
$$ y = [1207108, 1257266, 1311723, 1214308, 1392084, 1263129, 1451071, 1397832, 1535317, 1633223, 1564528, 1739025, 1838564, 1978962, 1977434, 2145552, 2040676, 1922346, 1917714, 1920719, 1841384, 1899948, 1831689, 1853031, 1798614, 1836428, 1877767, 1988372, 1905432, 1874756, 2053510, 2209606, 2191470, 2095524, 2271000, 2448700, 2697150, 2817884, 2861826, 2822377, 2757380, 2540677, 2431668, 2187842, 2096208, 2151320, 1998730, 1877048, 1903724, 1711415, 1759844, 1825615, 1846392, 1663606, 1718290, 1758658, 1686193, 1809162, 1877426, 1941759, 1969182, 1978180, 1909700, 1904133, 1842431, 1659772, 1537099, 1519704, 1448121, 1414654, 1404665, 1374942, 1410174, 1358017, 1453986, 1375632, 1393240, 1144831, 1188187, 1174113, 1094554, 1042774, 1061231, 1088795, 1034374, 1107012, 1093537, 1140349]
3703A140349P6522L9092o6628P5065n2708j20135M8559J27080k4339J05099j05812
3692A242144j46116P8749K8640J7889N7775r8372J84686P1320j45610n8244J0138
3681A242999L2125P7394j95092J50928J21704j36202M5886m5688N9107N7754q8122
3670A322793J32939r871J07952n3498j29445n4819R6375q1477N6291J07955q5869
3659A409326l3252q2303J11774l3899k1006j49980J82990N3422l62k4787l9692
3648A372231m8543O03L5246k5657J5337n8540J47867K0021q7236n1352J31343
3637A451320J11605j58091O7628J17005o9143J23060n7634N527J00731k1241o5229
3626A605538J16017j03908P800J31217R951L3414r3940J76970r9336l6670J13394
$$ y = [1140349, 1216871, 1255963, 1189335, 1264400, 1211692, 1091557, 1140116, 1267196, 1242857, 1347956, 1242144, 1096028, 1174777, 1203417, 1221306, 1279081, 1180709, 1365395, 1436715, 1291105, 1232861, 1242999, 1275124, 1352518, 1157426, 1308354, 1430058, 1293856, 1339742, 1294054, 1353161, 1410915, 1322793, 1455732, 1445861, 1553813, 1500315, 1370870, 1316051, 1412426, 1330949, 1387240, 1495195, 1409326, 1376074, 1293771, 1405545, 1371646, 1350640, 1200660, 1383650, 1437072, 1436710, 1411923, 1372231, 1323688, 1324291, 1359537, 1333880, 1349217, 1290677, 1438544, 1458565, 1371329, 1319977, 1451320, 1562925, 1404834, 1472462, 1589467, 1520324, 1643384, 1585750, 1591277, 1692008, 1670767, 1605538, 1721555, 1617647, 1625447, 1756664, 1766615, 1800029, 1706089, 1883059, 1783723, 1747053, 1860447]
3615A860447M30O4563k9303Q5400k40299J04535J69955l8011n223r754L2274j5463
3603A979551Q232P3219K6126r9263Q9719k8112j22959k4572K12938o6625O8645
3592B116899k05q6422N2781J9173N7389J1619J14505m9302n0729q0314K8484J28794
3580B262672m0763r49M656Q7003j44831J04780J1934Q9636J8477p8845P6963j3641
3568B377092p4813J39516N1557N1622J44724J51060o9882n6294J21239K5341P2844
3557B934006O6462J52323p1637J7218Q1002n7129m5504Q6304J41906K1054p4375
3546C251630N9037K05708q7566j63666J45478J00058M7947K45524o8685r6704
3536C638761r5765Q4088L04214L6500P5646j06657N8109L2817J06683R1657N5323
$$ y = [1860447, 1860877, 1925440, 1896137, 1981537, 1741238, 1845773, 2015728, 1977717, 1972494, 1962740, 1995014, 1979551, 1987783, 2061002, 2087128, 1987865, 2077584, 2049472, 1926513, 1901941, 2114879, 2048254, 2116899, 2116694, 2030272, 2083053, 2102226, 2159615, 2171234, 2285739, 2236437, 2185708, 2105394, 2133878, 2262672, 2221909, 2220960, 2225616, 2312619, 2167788, 2272568, 2284502, 2374138, 2392615, 2313770, 2390733, 2377092, 2302279, 2441795, 2493352, 2544974, 2689698, 2840758, 2770876, 2714582, 2835821, 2861162, 2934006, 3000468, 3152791, 3081154, 3098372, 3179374, 3122245, 3076741, 3163045, 3304951, 3326005, 3251630, 3310667, 3516375, 3428809, 3265143, 3410621, 3510679, 3558626, 3804150, 3735465, 3638761, 3542996, 3627084, 3931298, 3967798, 4043444, 3936787, 3994896, 4027713, 4134396, 4226053, 4281376]
3525D281376R7592J78980J05434l6835j05236Q9546Q4318K59603m0427J41591
3515E055942L5267o105P9451K06054K20058L0104R7277J26092J5229J26782J72110
3504F158261J63314J72210J87051K73858q5118K17214L9396K65306L73285J04762
3494G869539J87425N7154K14317M06314K23520K45548M39687J74267M3028L76438
3484A0237237L73653M19286M00683M45959K48964N33896N04555M89080P65497
3475A4418810M93430N84916R76262R11360Q64069R35385J226193J433595J546864
3466B3390884J778584J916374K240776K843239K802006K619051J482736L44413
3458C9418063o33217j468797j100683p23511n41950l30310o5889M24457Q17396
$$ y = [4281376, 4378968, 4557948, 4663382, 4626547, 4521311, 4610857, 4695175, 4954778, 4914351, 5055942, 5091209, 5085104, 5164555, 5370609, 5590667, 5620771, 5718048, 5844140, 5859369, 5986151, 6158261, 6321575, 6493785, 6680836, 6954694, 6869576, 7086790, 7126186, 7391492, 7764777, 7869539, 8056964, 8114118, 8328435, 8734749, 8958269, 9203817, 9643504, 9817771, 9860799, 10237237, 10610890, 11030176, 11430859, 11876818, 12125782, 12659678, 13164233, 13653313, 14418810, 14912240, 15497156, 16473418, 17384778, 18248847, 19184232, 20410425, 21844020, 23390884, 25169468, 27085842, 29326618, 32169857, 34971863, 37590914, 39073650, 39418063, 38784846, 37316049, 36215366, 35491855, 34949905, 34619595, 34553706, 34978163, 35795559]
3449C5795559J580452K023876K344788K357436J903066J400795N92174l98069
3441D7600077j591741k404183l167532l172823l040504k407688j672198j206340
3433B8937068n39359l07866j97814J96913O36963P53163N00925l3437j259085
3424B8687471k256651k608967k817445k676179k143873j735983j509599j406597
3416A1532177q48173q11645q35404n92705o17092l96666k95507l92748j73696
3407F568541k77674m11822p3242k23813k28378j21965j45687j84667k55277m2312
3397D603704r1859J7068q4056r315r868j80922n7027j13896K3564q4851k6800
3386C985742o8064j5729K04026k6939j05419K5964j04225J34023k889L6530R3959
$$ y = [35795559, 37376011, 39399887, 41744675, 44102111, 46005177, 47405972, 47998146, 47600077, 46008336, 43604153, 40436621, 37263798, 34223294, 31815606, 30143408, 28937068, 28397709, 28089843, 27892029, 28088942, 28725905, 29479068, 29979993, 29946556, 28687471, 26430820, 23821853, 21004408, 18328229, 16184356, 14448373, 12938774, 11532177, 10684004, 9872359, 9036955, 8444250, 7827158, 7430492, 7134985, 6742237, 6568541, 6290867, 5879045, 5805803, 5581990, 5353612, 5231647, 5085960, 4901293, 4646016, 4603704, 4511845, 4528913, 4444857, 4435542, 4425674, 4244752, 4187725, 4073829, 4097393, 4012542, 3985742, 3917678, 3901949, 4105975, 4079036, 3973617, 3999581, 3895356, 4029379, 4026490, 4063020, 4156979]
3375D156979k0104j03573l3549l2866j11446P1058j66387j83003K2901J54759
3365C754769p0049j50797J00248K3380M1336J08019R505J93332J9512J9738J15120
3354D164113n431m9126k62261j18647j04380j89693R3905j58016j38531l13912
3344B918021J73926M1183j59263n0187p2645P0738J9099k9771l9428J91744k23270
3333B840147j0793p152O214j38328J74745J8277j90121J4946n9825K1211j97500
3322B471821o9317p0855J1467p7932J4888j92128m8055J36439m6980K1745Q4280
3311B235373j4965n0390P5779K5775j88301l5168J39898Q7258L190N3597l4819
3300B297227r1049O0984l8497q4806q1951J01672J31819L7509N13j01343k2990
$$ y = [4156979, 4136875, 4033302, 3999753, 3966887, 3855441, 3926499, 3760112, 3577109, 3600010, 3754769, 3684720, 3533923, 3634171, 3657551, 3698887, 3806906, 3816411, 4009743, 4029255, 4048993, 4164113, 4158682, 4109556, 3847295, 3728648, 3624268, 3434575, 3528480, 3370464, 3231933, 2918021, 3091947, 3133130, 2973867, 2923680, 2851035, 2921773, 2940872, 2911101, 2871673, 3063417, 2840147, 2829354, 2822202, 2828416, 2690088, 2864833, 2883110, 2692989, 2707935, 2648110, 2669321, 2471821, 2402504, 2331649, 2343116, 2265184, 2280072, 2087944, 2039889, 2176328, 2129348, 2151093, 2235373, 2220408, 2170018, 2245797, 2271572, 2083271, 2048103, 2188001, 2275259, 2278449, 2332046, 2297227, 2206178, 2267162, 2228665, 2143859, 2061908, 2163580, 2295399, 2332908, 2333421, 2232078, 2209088]
3289B209088N6107m1076K3354r5025J56712K2785j74396l7833m2707J36004M5969
3278B258982l5387J00252N2968P846K5777L8716j21794j24450J63015q4103M0193
3267B322015K46858J6866L4946n854j8110J74484j70248J9320o2492M4871J95387
3256B798043K4517j6387j54887L65372l0767k4890l3174N9870k1427j03151Q3290
3245B946409L8403N4220J53251q7981P8437R8284R6908j0236P7450K67773k2315
3234C690603M3954J68702n6126O0781M3967r704K19712m1280J11414J28237j02091
3223D258169J18535R0414P0811L2380J34927K29405P6030J23219P8647R1677J9706
3212E323920J53909P0186O2423J52J43422L03092K91906J35070J5209Q8335L37344
$$ y = [2209088, 2265195, 2224119, 2247473, 2152448, 2309160, 2331945, 2157549, 2119716, 2077009, 2213013, 2258982, 2223595, 2323847, 2376815, 2384661, 2410438, 2449154, 2327360, 2202910, 2365925, 2281822, 2322015, 2568873, 2585739, 2620685, 2614831, 2596721, 2771205, 2600957, 2620277, 2557785, 2602656, 2798043, 2822560, 2806173, 2651286, 3016658, 2985891, 2961001, 2927827, 2987697, 2966270, 2863119, 2946409, 2984812, 3039032, 3192283, 3104302, 3182739, 3281023, 3377931, 3367695, 3445145, 3712918, 3690603, 3734557, 3903259, 3847133, 3907914, 3951881, 3942177, 4161889, 4120609, 4232023, 4360260, 4258169, 4376704, 4467118, 4537929, 4570309, 4705236, 4934641, 5010671, 5133890, 5212537, 5304214, 5323920, 5477829, 5548015, 5610438, 5610590, 5754012, 6057104, 6349010, 6484080, 6499289, 6587624, 6924968]
3201F924968k9720O5659M9419j61093J74335J16025L15061K73481J72477J86291
3191H086903j33231o2971j67065p2714J43005Q2035K15794P4126O3976J79351
3181H409209K24206Q499j04343Q8025R4237J17203J53181K74550K41926K47748
3171I754441L32960K53367J46674K64091N08148M16144N05964O28011O30892N44907
3161A3985599O33104O13335K70507L03762L26807N66002O56717P56564R58742
3152A9071139J134778J068431O22601L22870P0631j65723k26288P4998J53766
3143B2127203N31540P13378R27246O61111K17320k64850p19089r77133j216935
3134B1999791q01289m49263k68859J57435K04876r6645n13291r23365j134394
$$ y = [6924968, 6895248, 6960907, 7010326, 6849233, 7023568, 7139593, 7454654, 7728135, 7900612, 8086903, 7953672, 7890701, 7723636, 7650922, 7793927, 7875962, 8091756, 8165882, 8229858, 8409209, 8633415, 8641914, 8537571, 8625596, 8719833, 8837036, 8990217, 9264767, 9506693, 9754441, 10087401, 10340768, 10487442, 10751533, 11259681, 11675825, 12181789, 12809800, 13440692, 13985599, 14618703, 15232038, 15502545, 15806307, 16133114, 16699116, 17355833, 18112397, 19071139, 20205917, 21274348, 21896949, 22219819, 22290450, 22124727, 21898439, 21973437, 22127203, 22658743, 23372121, 24299367, 24960478, 25177798, 24912948, 24193859, 23216726, 21999791, 21198502, 20749239, 20480380, 20637815, 20842691, 20746046, 20232755, 19309390, 18174996]
3125A8174996j192432j267172j073796o13095n72059m04150m26745k76444m89993
3116A1859110p64490q29984p72527o69129o11639m07224m85572k24769j67834
3107F925942k97049l51687k73952j65652l30336l67745k18053O4494j28134l45913
3097D511915k45131j708p5580m7802q549j34370k11120J4809k4137l9473P2948
3086C811802j53651q1201m5267R822J0107P6134r8493N662m9102M5258q1836J91009
3074C640244o3041q7194R8003j80251K2654M4882M6032l1905J34427r3524l3027
3063C497300J862N7085L4056j35889j7570M5512N462J19662j98882O7040r7525
3052C378113n4254K1039J55173K8882m7751J9859P5669P2823K8643p7672j07936
$$ y = [18174996, 16982564, 15715392, 14641596, 14028501, 13456442, 13052292, 12625547, 12349103, 11859110, 11094620, 10264636, 9492109, 8822980, 8211341, 7804117, 7318545, 7093776, 6925942, 6628893, 6277206, 6003254, 5837602, 5507266, 5139521, 4921468, 4985962, 4857828, 4511915, 4266784, 4265076, 4189496, 4141694, 4133145, 3998775, 3787655, 3802464, 3778327, 3738854, 3811802, 3658151, 3576950, 3531683, 3541505, 3551612, 3627746, 3529253, 3534915, 3485813, 3531071, 3449235, 3640244, 3577203, 3490009, 3588012, 3407761, 3430415, 3475297, 3521329, 3489424, 3623851, 3530327, 3497300, 3499162, 3556247, 3590303, 3454414, 3436844, 3482356, 3487818, 3607480, 3408598, 3475638, 3378113, 3323859, 3344898, 3500071, 3528953, 3481202, 3501061, 3576730, 3649553, 3678196, 3600524, 3492588]
3041C492588J10535j02416K7922J06730n8378l9998M3175K0835O1697R5159m9326
3030C708523R6974l1541r2468J6079M1488J6810O7278j6523J01074J22527j33493
3019C896728M4831O0238K275m4928L9667N0512M5890j15162q7043n1981J45533
3008C986560J44471p5147j42835J9796O4128K12452j37086L9179L4987J7289M0624
2997D204418l699m2086o0916j5825K05493r8764l893o0496J68029P9894N4922
2986D427077j7543J01025K4725N4176j01707j47178K1887J8899O8984L9940q5095
2975D405190R7942P0815q0332J63221J6419o4597J44113J38163j59155J19758
2965D851537k25878K49495K0317P125O774o9147N2678L1638M7130J47115L0574
$$ y = [3492588, 3603123, 3500707, 3528629, 3635359, 3576981, 3536983, 3580158, 3600993, 3662690, 3757849, 3708523, 3805497, 3773956, 3681488, 3697567, 3739055, 3755865, 3823143, 3806620, 3907694, 4030221, 3896728, 3941559, 4001797, 4004072, 3959144, 3998811, 4049323, 4095213, 3980051, 3893008, 3841027, 3986560, 4131031, 4055884, 3913049, 3932845, 3996973, 4209425, 4072339, 4111518, 4146505, 4163794, 4204418, 4200719, 4158633, 4097717, 4081892, 4287385, 4188621, 4184728, 4124232, 4292261, 4372155, 4427077, 4409534, 4510559, 4535284, 4589460, 4487753, 4340575, 4362462, 4381361, 4450345, 4490285, 4405190, 4503132, 4573947, 4493615, 4656836, 4673255, 4608658, 4752771, 4890934, 4731779, 4851537, 4625659, 4875154, 4895471, 4902596, 4909370, 4840223, 4892901, 4924539, 4971669, 5118784, 5149358]
2954E149358J7659r7340J13551R668R549o9568R4909L9100O8688P8633j6165J6495
2942E414537L5800R4234J40346J3244J17019J49740o800J34115j19967K7237p1799
2931E927706J09547J1551l9676J95837k4750J46910M1044q9641J36775N252k0626
2920F399929j39897J10391J46752J24493M3486n448k00104K43788j38884J18801
2910F703307Q948O2737M5275j03120J34569j25806K20946J59400L7884j51760
2900F992380M9121q647o029K31327m4177j7829J85840L5564O1367J44121o5382
2889G557656j18466J07554k3296J58885r314O6772P167L0398K19100K7452r5665
2878G928243J0862K8263P381j2249J32446o3713L0600R0731J23066j03154N4228
$$ y = [5149358, 5167017, 5069677, 5183228, 5192896, 5202445, 5132877, 5227786, 5266886, 5335574, 5414207, 5398042, 5414537, 5450337, 5544571, 5684917, 5698161, 5815180, 5964920, 5958120, 6092235, 5972268, 5999505, 5927706, 6037253, 6048804, 6009128, 6204965, 6180215, 6327125, 6368169, 6278528, 6415303, 6420555, 6399929, 6260032, 6370423, 6517175, 6641668, 6685154, 6679706, 6479602, 6723390, 6584506, 6703307, 6712255, 6774992, 6820267, 6717147, 6851716, 6725910, 6946856, 7106256, 7144140, 6992380, 7041501, 7032854, 7026825, 7258152, 7213975, 7196146, 7381986, 7417550, 7478917, 7623038, 7557656, 7439190, 7546744, 7523448, 7682333, 7673019, 7739791, 7746958, 7777356, 7996456, 8023908, 7928243, 7939105, 7967368, 7974749, 7962500, 8094946, 8031233, 8061833, 8152564, 8275630, 8172476, 8226704]
2867H226704J9967J24921J09571j46990J91026N3888q9607M2166O3358J31697
2857H726701R8201O304P9052r9568J72512J25893P191l5645J0717J08161K05931
2846I405450J55127J3747j02000Q4903J56970J0898J7958j75418J07398K85551
2836I960584K39365J02086j50273L2884J39791j223M906J93747J43733N4355Q8050
2825A0808005O2718R7827J29787L3615J15770J2277O307J96639O4199O0811q159
2814A1579796M25245N7296j38795J91780J52874n0387J97299K59618P4667Q7168
2804A2836561J12846k9869K13847J11517j5285J55380J35392J29418j28078J59435
2794A3681164Q6313J52751J37985P3835R5227K24452J04049n0771J08847P7195
$$ y = [8226704, 8246671, 8371592, 8481163, 8334173, 8525199, 8579087, 8489480, 8531646, 8595004, 8726701, 8824902, 8831206, 8910258, 8810690, 8983202, 9109095, 9116286, 9080641, 9091358, 9199519, 9405450, 9560577, 9574324, 9472324, 9557227, 9714197, 9725095, 9743053, 9567635, 9675033, 9960584, 10199949, 10302035, 10151762, 10184646, 10324437, 10323214, 10328120, 10521867, 10665600, 10719955, 10808005, 10870723, 10968550, 11098337, 11131952, 11247722, 11259999, 11266306, 11462945, 11527144, 11587955, 11579796, 12005041, 12062337, 11923542, 12115322, 12268196, 12217809, 12415108, 12674726, 12749393, 12836561, 12949407, 12919538, 13133385, 13244902, 13229617, 13384997, 13520389, 13649807, 13521729, 13681164, 13767477, 13920228, 14058213, 14132048, 14227275, 14451727, 14555776, 14505005, 14613852, 14691047]
2784A4691047K0034Q9985K32007J24375L6734J84853J38755k5088k9517J22136
2774A5585321m8274l1006J95045J09737J8235J9513P6594J50176J30382J92353
2764A6398076O1320K92249K68054j10695Q2147K68757R6630J37558J88840J61162
2754A7844098K9475J96857J84803J40765o4560L10040K79196K00218J12095K47571
2744A9480558J45046K10904K61950Q9812K53229K43525K17062K55859J31104J71818
2734B1460867L07503L75400L78007K84666K88447L74066L85736N16949O89479
2725B5061120P56071N20640N97476O14085M57323M29074K2536K3134l3942j23772
2715B8323745J16302K31794N3625J82170k0495p2107r7049j1362l15847o01571
$$ y = [14691047, 14711081, 14801066, 15033073, 15157448, 15194182, 15379035, 15517790, 15492702, 15463185, 15585321, 15537047, 15506041, 15701086, 15810823, 15829058, 15848571, 15925165, 16075341, 16205723, 16398076, 16459396, 16751645, 17019699, 16909004, 16991151, 17259908, 17356538, 17494096, 17682936, 17844098, 17873573, 18070430, 18255233, 18395998, 18331438, 18641478, 18920674, 19120892, 19232987, 19480558, 19625604, 19836508, 20098458, 20188270, 20441499, 20685024, 20902086, 21157945, 21289049, 21460867, 21768370, 22143770, 22521777, 22806443, 23094890, 23468956, 23854692, 24371641, 25061120, 25817191, 26337831, 26935307, 27549392, 28006715, 28435789, 28458325, 28481459, 28447517, 28323745, 28440047, 28671841, 28725466, 28907636, 28887141, 28815034, 28717985, 28706623, 28390776, 27789205]
2705B7789205l44130l02549m66633r0129k65656j26674L5001n1533J77417R2176
2695B6446495M8875K4915J58217K01913R5517K34597L26318J32591K16953J45629
2685B8032020L26762L52939J35256L58992K73920L41161L07257K50989L19245
2676C0698541L01151J94600K34116L39941M71800K87639N06000K93635K93302
2667C3620725L72581M31627L54506K40998N00770M34110M11079M42685N08806
2658C7317887M78067N29696M31331N94005O72623O29253O81149N39687Q55745
2649D2729443P43506P38956Q55050P72170O22254R11170Q95563Q13989J134510
2640E0216611R40416J032728J332600J015796J357917J314660J494002J476853
$$ y = [27789205, 27445075, 27142526, 26675893, 26585764, 26320108, 26193434, 26228435, 26176902, 26354319, 26446495, 26495370, 26520285, 26678502, 26880415, 26975932, 27210529, 27536847, 27669438, 27886391, 28032020, 28358782, 28711721, 28846977, 29205969, 29479889, 29821050, 30128307, 30379296, 30698541, 30999692, 31194292, 31428408, 31768349, 32240149, 32527788, 33033788, 33327423, 33620725, 33993306, 34424933, 34779439, 35020437, 35521207, 35955317, 36366396, 36809081, 37317887, 37795954, 38325650, 38756981, 39350986, 40023609, 40652862, 41334011, 41873698, 42729443, 43472949, 44211905, 45066955, 45839125, 46461379, 47372549, 48268112, 49082101, 50216611, 51157027, 52189755, 53522355, 54538151, 55896068, 57210728, 58704730, 60181583]
2632F0181583J558515J685294J813607K038913K295659K533176K623245K749450
2624G7479442K579847K633143K372351K188389K091159K078655K160070K505445
2616I6088501K688293K798870K797464K434351K198774J948233J227553K02570
2608A12384609j094802j636935k350720k051093j751029j140081m64738J93985
2600A02089196Q66209J539837K336369K818064L597377M507980N359561O143063
2592A29257656P140107P798034Q205572P786221O616212N270316L230369J229373
2584A76533860m17019j265923j162142q35577n62427m95740m87497j336800k747287
2575A67223448m153363n801624o365220o687170n286061l249769L5480K142190
$$ y = [60181583, 61740098, 63425392, 65238999, 67277912, 69573571, 72106747, 74729992, 77479442, 80059289, 82692432, 85064783, 87253172, 89344331, 91422986, 93583056, 96088501, 98776794, 101575664, 104373128, 106807479, 109006253, 110954486, 112182039, 112384609, 111289807, 109652872, 107302152, 105251059, 103500030, 102359949, 101895211, 102089196, 102955405, 104495242, 106831611, 109649675, 113247052, 117755032, 123114593, 129257656, 136397763, 144195797, 152401369, 160187590, 166803802, 172074118, 175304487, 176533860, 176116841, 174850918, 173688776, 172853199, 172290772, 171795032, 171307535, 169970735, 167223448, 163070085, 157268461, 150903241, 144216071, 138930010, 135680241, 135715721, 137857911]
2567A37857911L83322q003142j1871870j2003541j1051926p419485n308413l351763
2559G9231093k631010j900546j417762j456989j163709n75403j31656O94370J589000
2550G2237388K992221M820772P267530P885319M243784m975383p839051q897190
2542G7735390p713578m640153k999061j966295j751239q09355o59171k29770n9738
2533E6907030J18853r042Q6795L92952N27162Q41261J116452J534873J897419
2524F3413755K124585K486267L009081L452084L500620L397158L004813K510591
2516H6898954J992072J307941O99947L38374p5560J38840K6050K03261J92191
2507I1722070M31197L20316N8207m08007j199564l746315m986971n353698n219760
$$ y = [137857911, 138241233, 130238091, 118366221, 106362680, 95310754, 87891269, 82582856, 79231093, 76600083, 74699537, 73281775, 71824786, 70661077, 70085674, 69954018, 70648388, 72237388, 75229609, 80050381, 87317911, 95203230, 99447014, 94471631, 86632580, 77735390, 70021812, 65381659, 62382598, 60416303, 58665064, 57855709, 57196538, 56966768, 56907030, 57025883, 57016841, 57103636, 57496588, 58023750, 58865011, 59981463, 61516336, 63413755, 65538340, 68024607, 71033688, 74485772, 77986392, 81383550, 84388363, 86898954, 88891026, 90198967, 90898914, 91237288, 91161728, 91300568, 91326618, 91529879, 91722070, 92153267, 92473583, 92531790, 92123783, 90924219, 87177904, 82190933, 76837235, 71617475]
2498G1617475m390434l770469l035950k431279j896187j781077j420080j235221
2490E1656778j101567r04180r61432n47316k51378K28000Q12006R80160Q23127
2481E0734198q26458j378360j478059r36141l46769L74179O89921J172544J570307
2472D9575362J516306J790743J733747J669696J737759J677948J456587J341625
2464F2499773J124867P1980k82628p43325q03393p13991p49065l05208l87698
2455E9711312N5335N51378N72158N84005K72635j14327q75210j375804j991784
2446E7389698k537240k888280k902723k835222k742229k379083k271489j831614
2438C7001818j388850j406997j106168p28064o03303n73457m05936j46690j08102
$$ y = [71617475, 67227041, 63456572, 60420622, 57989343, 56093156, 54312079, 52891999, 51656778, 50555211, 49651031, 48689599, 48142283, 47890905, 48118905, 48930911, 49911071, 50734198, 49907740, 48529380, 47051321, 46115180, 45768411, 46142590, 46832511, 48005055, 49575362, 51091668, 52882411, 54616158, 56285854, 58023613, 59701561, 61158148, 62499773, 63624640, 63696620, 63413992, 62670667, 61867274, 61153283, 60404218, 60099010, 59711312, 59766647, 60318025, 60890183, 61474188, 61746823, 61632496, 60757286, 59381482, 57389698, 54852458, 51964178, 49061455, 46226233, 43484004, 41104921, 38833432, 37001818, 35612968, 34205971, 33099803, 32371739, 31768436, 31194979, 30789043, 30642353, 30534251]
2429C0534251j31023j28005J55411J86577K16650K14133M56627L56750M97631
2420C2359002N33324M56341O15902R59755J162954J159802J252690J789548J590544
2411D1879862J752889J764035J528932J553066J642526J075652J046264N27719
2403E2770945Q7709j82415l59312o42622j076247j175283j350422j282980j102595
2394D5686778j052696n60090k80155l34303J9028K35264L95056M90663N82816
2385D5182361O36710Q41930Q32096Q13674J225537J341476J402111J524122J658290
2376E5458307K012546K325187K595406K855595L375274L868372M111528M231151
2368H0833366M457318M196205L811742K749940J910594J273490L87086l38148
$$ y = [30534251, 30403228, 30275223, 30430634, 30617211, 30833861, 31047994, 31504621, 31861371, 32359002, 32892326, 33348667, 33964569, 34924324, 36087278, 37247080, 38499770, 40289318, 41879862, 43632751, 45396786, 46925718, 48478784, 50121310, 51196962, 52243226, 52770945, 52858654, 52676239, 52316927, 51674305, 50598058, 49422775, 48072353, 46789373, 45686778, 44634082, 44073992, 43793837, 43459534, 43478562, 43713826, 44108882, 44599545, 45182361, 45819071, 46661001, 47493097, 48306771, 49532308, 50873784, 52275895, 53800017, 55458307, 57470853, 59796040, 62391446, 65247041, 68622315, 72490687, 76602215, 80833366, 85290684, 89486889, 93298631, 96048571, 97959165, 99232655, 99619741, 99281593]
2360I9281593j204329k099161k477734l177242l189640l581520l479358l257793
2352G6814816k935084k379467j807444j283636r34544n98846p5809M71032P52639
2343F8023657Q60575J162554J718420J806071K092232K320682K577037K787643
2335H3348871K953216L227064L318481L553939L770003M117681M606444M966000
2327A13861699N482664O256466O985926P783414Q293456P113931J525663m749922
2319A52553297p856089q816822p627161n914106m390963l493940l014826j927862
2311A09511528q27683J12497J288795K366517L346556M206102N969672P115072
2303A33089056Q927410J0839825J2629548J5190691J9170179K4444185L0252912
$$ y = [99281593, 98077264, 95978103, 93500369, 90323127, 87133487, 83551967, 80072609, 76814816, 73879732, 71500265, 69692821, 68409185, 67474641, 66875795, 66799986, 67271018, 68023657, 68884232, 70046786, 71765206, 73571277, 75663509, 77984191, 80561228, 83348871, 86302087, 89529151, 92847632, 96401571, 100171574, 104289255, 108895699, 113861699, 119344363, 125600829, 132586755, 140370169, 148663625, 155777556, 157303219, 152553297, 144697208, 135880386, 128253225, 122339119, 117948156, 114454216, 111439390, 109511528, 108683845, 108796342, 110085137, 112451654, 115798210, 120004312, 125973984, 133089056, 142016466, 152856291, 165485839, 180676530, 199846709, 224290894, 254543806]
2296B54543806L3948889K9423600J0972804j4966414l2861696l9154426l6309296
2289B05597267k9039126k2127241j7138717j3528163j1317788r863853q650933
2282I3931446p297251o416340n592560m881077m424088m396118m775025m444330
2274E1704657m083196l674707l514497l054350k597288k388746k212556j880845
2266B8298472j726473j418915j302977j422489j109034q84216r44635q79356q78118
2257A7732259o81468q24905o42875n34939m58112m85162m50520n90219l35662
2248A2728397l40093m22853j79805l60856n32319m38927j68416k64527j92939
2239I827662k59682k97826l84011q8299l51055k28594j53924k95156j75236r5106
$$ y = [254543806, 288492695, 317916295, 328889099, 313922685, 281060989, 241906563, 205597267, 176558141, 154430900, 137292183, 123764020, 112446232, 102582379, 93931446, 86634195, 80217855, 74625295, 69744218, 65320130, 60924012, 56148987, 51704657, 47621461, 43946754, 40432257, 37377907, 34780619, 32391873, 30179317, 28298472, 26571999, 25153084, 23850107, 22427618, 21318584, 20434368, 19489733, 18610377, 17732259, 17050791, 16225886, 15583011, 15048072, 14589960, 14104798, 13654278, 13064059, 12728397, 12388304, 11965451, 11785646, 11424790, 10892471, 10453544, 10285128, 10020601, 9827662, 9567980, 9270154, 8886143, 8797844, 8446789, 8218195, 8064271, 7769115, 7593879, 7498773]
2229G498773m20664j51088r6759j68152j43512l195j71023j74530k03506j82107
2219E784237J00670j29902k03805j94313j23988L3408j04730l8918j32450j97648
2209D792561j16410j11643N5216j58105p6712K7153r6569j08636k6092K4996N3322
2198D259081l36817j11489J23269m4564m6888l6733k26158J3700J7374l723j49004
2187C458048l7800m2086j56544Q208j3578P3800j11253j16222J51458n352l07374
2176B901305O9616K4495r015q3945K4770J6108q959r5488j91731o9787m8084N8406
2164B587691j31314J46084L2207j42532p3494K1743k7652J6253M8768K0636l3174
2153B465216K0863k35212J35850Q9093m9862O3923j30556n945K0963j29706N979
$$ y = [7498773, 7078109, 6927021, 6830262, 6662110, 6518598, 6515403, 6344380, 6169850, 5966344, 5784237, 5884907, 5755005, 5551200, 5356887, 5232899, 5266307, 5161577, 5122659, 4990209, 4792561, 4676151, 4564508, 4619724, 4461619, 4384907, 4412060, 4315491, 4206855, 4180763, 4205759, 4259081, 3922264, 3810775, 3934044, 3889480, 3842592, 3805859, 3579701, 3593401, 3610775, 3607052, 3458048, 3420248, 3378162, 3221618, 3229826, 3216248, 3290048, 3178795, 3062573, 3214031, 3208679, 2901305, 2970921, 2995416, 2986401, 2902456, 2927226, 2943334, 2934375, 2838887, 2647156, 2577369, 2529285, 2587691, 2456377, 2602461, 2634668, 2492136, 2418642, 2440385, 2412733, 2428986, 2477754, 2498390, 2465216, 2486079, 2250867, 2386717, 2475810, 2425948, 2489871, 2359315, 2353370, 2374333, 2244627, 2250606]
2142B250606J3664o0249n9357N9874M1485k12699P4240M4632L2594r7864j3161
2131B073765j73794L1932o0191J61209N0618m1796M197n6314j08394N7668J03366
2120B042266l127O8209L1526o005j68626R4210o4147J26890J3504N0282q3090
2109B101892J14179o787m4200j76997Q3968o6381j71683Q9118l6205j15544j7358
2098A754002n8881k545J51957j7630j2285P3084J660O0195k1074k0914J68580
2087B076149Q0113O1664J30786Q0563J9604J62887o0193m6296k86460m9795k71214
2076A897808j02235m9477j38485R5623j07114j53321p6934m9812M293p4960j10083
2065A135303P6797M527q6802J39364J3688o4793P6306k59643l0925Q560j9131
$$ y = [2250606, 2264270, 2204021, 2144664, 2204538, 2246023, 2033324, 2107564, 2152196, 2184790, 2086926, 2073765, 1899971, 1931903, 1871712, 2032921, 2083539, 2041743, 2045940, 1989626, 1881232, 1938900, 2042266, 2039139, 2107348, 2138874, 2132869, 1964243, 2058453, 1994306, 2121196, 2134700, 2184982, 2101892, 2216071, 2209284, 2165084, 1988087, 2072055, 2005674, 1833991, 1923109, 1886904, 1771360, 1754002, 1695121, 1692576, 1844533, 1826903, 1814618, 1887702, 1889362, 1949557, 1928483, 1907569, 2076149, 2156262, 2217926, 2348712, 2429275, 2448879, 2611766, 2551573, 2505277, 2218817, 2169022, 1897808, 1795573, 1746096, 1607611, 1703234, 1596120, 1442799, 1365865, 1316053, 1320346, 1245386, 1135303, 1212100, 1216627, 1129825, 1269189, 1282877, 1218084, 1294390, 1034747, 1003822, 1012382, 993251]
2054I93251J04061j14107O925J47156M1621j16489j01704k8591O3643L2193J09359
2043A137318k61752j66218K28309J709j46407j15059N9271J52377l7306R427k2654
2032H39015q4457J1717J11750j09703m7011l315J10766j23539J0386Q7892n8878
2021G44623n1334N783J3714J5942P8681K4085k7828p6931q1532Q0037O5000n9588
2009G30652N6234M9631j34140K5998k6127J0890m7781L168J19071m8204L5143
1998G74535m8503o0462J29560n464o0311k829j42l9380m6100J68392r3325m8962
1986F67009j64825J61953o647k20360J05047j4187K0021J38775j97066r2986J01765
1975D98499J38475P2143l6053m2452o4781M1730m1321o4588n1463Q0725J66402
$$ y = [993251, 1097312, 983205, 990130, 1137286, 1178907, 1062418, 960714, 932123, 995766, 1027959, 1137318, 875566, 709348, 937657, 939366, 792959, 677900, 737171, 889548, 852242, 861669, 839015, 754558, 766275, 878025, 768322, 721311, 717996, 828762, 705223, 715609, 803501, 744623, 693289, 699072, 712786, 728728, 807409, 831494, 803666, 726735, 645203, 725240, 790240, 730652, 786886, 836517, 702377, 728375, 702248, 713138, 665357, 668525, 787596, 739392, 774535, 726032, 665570, 795130, 789666, 729355, 726526, 726384, 687004, 640904, 809296, 715971, 667009, 502184, 664137, 657490, 437130, 542177, 527990, 548011, 686786, 489720, 396734, 498499, 636974, 709117, 673064, 630612, 565831, 607561, 566240, 501652, 450189, 530914, 697316]
1964F97316j4529r3958l9120O8643m7698O3268j6630J03051o8869r0175j66483
1953C94816J13011O4974j5354J06628l9852l9285j05302L7415J08019J3483o1246
1942E77307K9103Q3804k0260j48134P5521Q3921j02849l7532Q8897j9858k17525
1931C92395M7036R5162K0463P8821M1421r1063n2544n9580j02507J49892q6034
1920D33462q360k7564Q6408k918M4259o5995J3469Q9925m8708O9160n7586M6611
1908E72163J31532n1852k30493N2910O1868k3984J873J55059j01346l3922L5244
1897E69052r2267j1046o8341k069O3709j4055n4093J68286O9452k37466P1534
1886D62696j1332k6401M2993o8922j2954R6788M1343P1675n6083O58L9463n1685
$$ y = [697316, 682787, 588829, 549709, 618352, 570654, 633922, 617292, 720343, 651474, 561299, 394816, 507827, 572801, 557447, 664075, 624223, 584938, 479636, 517051, 625070, 638553, 577307, 606410, 690214, 669954, 521820, 597341, 681262, 578413, 540881, 629778, 609920, 392395, 439431, 534593, 555056, 633877, 675298, 584235, 531691, 472111, 369604, 519496, 433462, 425102, 397538, 483946, 481028, 525287, 459292, 472761, 562686, 513978, 583138, 525552, 572163, 703695, 651843, 421350, 474260, 536128, 512144, 514017, 669076, 567730, 533808, 569052, 476785, 465739, 397398, 395329, 459038, 444983, 390890, 559176, 628628, 391162, 462696, 451364, 424963, 467956, 399034, 386080, 482868, 524211, 595886, 539803, 540461, 579924, 528239]
1874E28239M7609k210o3744j8476P3153J1557m4938N4904O579l817L7581j66703
1862D59734j17437K29360L0887j49907Q1363J29573N44N5611o1249j38394J72102
1851F92187K6863J1174M463J20240j95397P2949l2209j98146P1798P5661L3770
1840F83353k8471J08158n2344J17508R0374j53212J62972Q9703q9465q528m773
1829I15275M0953N9118j69310N0453J46919J80720l1647j4365o6560j43101J45931
1818A114386K8377J0394M328N4805l2285j5178K5078J43585J33368m9756l8761
1807A378341J24397l0943J77807j04688M431N9346o3589N9589J5926K05955L2521
1796A859093j8300o6010J20787O9772J22928N5261j7508J33362K05439L5192Q9878
$$ y = [528239, 575848, 573638, 509894, 491418, 564571, 576128, 531190, 586094, 592673, 588856, 626437, 459734, 342297, 571657, 602544, 452637, 534000, 663573, 664117, 719728, 658479, 520085, 692187, 719050, 730224, 734687, 854927, 659530, 732479, 700270, 502124, 573922, 649583, 683353, 654882, 763040, 710696, 828204, 918578, 765366, 928338, 1018041, 928576, 920048, 915275, 956228, 1015346, 846036, 896489, 1043408, 1224128, 1192481, 1178116, 1111556, 968455, 1114386, 1142763, 1153157, 1157485, 1212290, 1180005, 1164827, 1189905, 1333490, 1466858, 1417102, 1378341, 1502738, 1471795, 1649602, 1544914, 1549345, 1608691, 1545102, 1604691, 1620617, 1826572, 1859093, 1840793, 1774783, 1895570, 1965342, 2088270, 2143531, 2126023, 2259385, 2464824, 2500016, 2589894]
1785B589894P0317R6235J00658J44516K31877q6897J56170K22700K74263J98616
1775C998349J90767J06831K91946K94051M21565M52139M07051L75897K42639P09025
1765G490260O18309Q75471J020760J732908K188936L158015M194450M840099l56534
1756B5762674m203385m465214m211966k671873j950001j310439j231781p49309
1748D968706n72685n04681j35095l89569l57929k96622k66566k07554j97408j82399
1738A858198j43581M4666j82195j78972n7197j33533l0542J9419k91532q835J34142
1727A030038m9552j38777K5114j26435P7046j39082n2414r1966O7946Q1184l3269
1716F49833k23881K9704j5425J32137k24591m2686K4723J28856j15662n779L5500
$$ y = [2589894, 2660211, 2756446, 2857104, 3001620, 3233497, 3146600, 3302770, 3525470, 3799733, 3998349, 4189116, 4295947, 4587893, 4881944, 5303509, 5755648, 6162699, 6538596, 6781235, 7490260, 8108569, 8984040, 10004800, 11737708, 13926644, 17084659, 21279109, 26119208, 25762674, 21559289, 17094075, 12882109, 10210236, 8260235, 6949796, 5718015, 4968706, 4396021, 3891340, 3756245, 3366676, 3008747, 2712125, 2445559, 2238005, 2040597, 1858198, 1714617, 1759283, 1577088, 1398116, 1340919, 1207386, 1176844, 1196263, 904731, 895896, 1030038, 980486, 841709, 866823, 740388, 817434, 678352, 625938, 533972, 601918, 683102, 649833, 425952, 455656, 440231, 572368, 347777, 305091, 329814, 458670, 343008, 337229, 372729]
1705C72729n7830K19559j64975l0996N3859p1542K3360J3106j61489n8575P4628
1694B11834L5250M6625j8559J07081p5163M4425N1864q8033m0253p9179O8438
1683B64330O9684Q1066q5383j23747j10697R1965M8213n5608k2602j04779J04788
1672A57230L1788m1846l02P7513j3605n6544J53740p4966M8892k37009l7643J14326
1660A21574l1422n5691J445R9064j04887P2505Q8910J26087o8113j08425n0658
1649I0389j2762J53652r1950n529J4336q3967P138L1391p0009Q5884p591r0698
1637B0284Q1392J8751J4493J29158q8682o4549m5906R3753J9582J07780k4388
1626B61668j37818L6228k9744L5521m1920J15549k626q8723R0463J05517k22370
$$ y = [372729, 314899, 534458, 369483, 338487, 392346, 320804, 344164, 357270, 195781, 137206, 211834, 247084, 293709, 275150, 382231, 307068, 351493, 403357, 315324, 275071, 195892, 264330, 334014, 415080, 329697, 205950, 95253, 187218, 235431, 179823, 157221, 52442, 157230, 189018, 147172, 146870, 224383, 210778, 154234, 307974, 233008, 281900, 44891, 7248, 121574, 90152, 34461, 35906, 134970, 30083, 102588, 191498, 317585, 249472, 141047, 90389, 77627, 231279, 139329, 133800, 148136, 64169, 71307, 102698, 32689, 118573, 110982, 20284, 101676, 120427, 134920, 264078, 175396, 110847, 64941, 158694, 178276, 286056, 261668, 123850, 160078, 130334, 165855, 123935, 239484, 236858, 148135, 238598, 344115, 121745]
1615A21745q2968M9549Q6286p4947k9154j31973j21360P3757J05187o0634N5568
1604h944L6130R3270j744r2219L1430N4042Q1270j35467K3860n2368J65884r7745
1592I7399K2902J00762j2867L0771p7993L3242L8714k21925n4202J99701m4969
1581A11535o356J90981j06932j32298O551k7235r2964J29445j20719K8534O0351
1570D0893q4085J90045L6207j06706j51058J25035J2899j2089Q5276N3158j76818
1559A2757J04197J14092j8197o0077j23351M7399J1489J26829j6868j23941m9495
1548B4834K7175O72J09511R969k42204q121N2464m1666M9230n540q4927O0322
1536d8281Q1155m8794J72947j52869J6561P6061o623r4610J24797M0408r3623
$$ y = [121745, 38777, 88326, 174612, 99665, 70511, -61462, -182822, -109065, -3878, -64512, -8944, 27186, 120456, 118712, 26493, 57923, 111965, 193235, 57768, 81628, 29260, 195144, 97399, 120301, 221063, 208196, 238967, 160974, 194216, 232930, 11005, -43197, 156504, 111535, 105179, 296160, 189228, 56930, 63481, 36246, -56718, 72727, -47992, -19458, 40893, -43192, 146853, 183060, 76354, -74704, 50331, 63230, 51141, 136417, 189575, 12757, 116954, 231046, 212849, 152772, 29421, 76820, 88309, 215138, 198270, 74329, 24834, 52009, 52681, 162192, 172161, -70043, -78164, -25700, -67366, -18136, -23676, -108603, -48281, 32874, -15920, 157027, 4158, 20719, 96780, 90157, -4453, 120344, 160752, 67129]
1525F7129K03819j17925l04982J12859K11225N3057j26749J1916j42857J06867
1515G4359l2862O2888j22030J9193m6103K3984r104o0506n3318m4551J74512j13478
1503a27016P74J75219Q0625r9218O0162k9439l5473J45506O0600j23683r5518
1492A2539k1324R6997p3423P6712m6565j6918m6246j42724P8620J31341K1091
1481G0100q2017J17258m5372j30029J11292o9597Q349J33389J7619j00199P7234
1470A08027j13483K4579j85873M4063M5522j2210l0423R377L8319P6329J02228
1459A06455j5115j66776J57895j6679l5690m4080n9136J42183J03167j18263k8333
1448B5628L3043k9506o3434O3959m6985j37830P1108J08197n0222o291J25821
$$ y = [67129, 270948, 153023, -151959, -39100, 172125, 225182, 98433, 110349, -32508, 74359, 41497, 104385, -17645, 1548, -44555, -20571, -29675, -90181, -143499, -188050, -13538, -127016, -126242, 48977, 129602, 30384, 90546, 61107, 25634, 171140, 231740, 108057, 12539, -8785, 88212, 14789, 91501, 44936, 28018, -18228, -160952, -82332, 49009, 70100, -11917, 105341, 59969, -70060, 41232, -28365, -20016, 113373, 130992, 30793, 108027, -5456, 19123, -166750, -122687, -77165, -89375, -119798, -110421, -72102, 4227, 106455, 91340, -75436, 82459, 65780, 30090, -13990, -73126, 69057, 172224, 53961, 25628, 58671, 29165, -34269, 29690, -17295, -155125, -84017, 24180, -26042, -32333, 93488]
1437I3488k2923l4285P1950K5030J7490J9266j46070j12934J02805l469j56391
1426a46043J36307K48327p8034k07368j28900N2317l7901J60636J5381o4856M339
1415d5795M195P4152J7237q5479o3548M9025N3042N753j02686n1347J19468j9107
1403d5090N025L4761n2202J2275m9295J27624O7038L2123q6045J4062o9331n7775
1391f6830J23757j7606k26531P3125J37550m8600N3213N6040O7641k4554r5623
1380C1582J15647n7592l5150o346M3529L980j21661m1762O0786j0011j2516J77321
1368A47807r3378k24346P9139O6624p8893q8459j6741J30061L5384p01o6192L0182
1356g9513K5352J52016O6079p3431L8747j12227n9126r1695J56174p8556J32876
$$ y = [93488, 70565, 36280, 108230, 133260, 150750, 170016, 23946, -88988, 13817, 10348, -146043, -9736, 238591, 160557, -46811, -175711, -123394, -161295, -659, 14722, -50134, -45795, -41600, 32552, 49789, -35690, -99238, -50213, 2829, 8582, -94104, -145451, -25983, -45090, -40065, -5304, -57506, -45231, -94526, 33098, 100136, 132259, 46214, 60276, -9055, -66830, 56927, 39321, -187210, -114085, 23465, -25135, 28078, 84118, 151759, 127205, 31582, 147229, 89637, 54487, 48141, 91670, 95650, -26011, -67773, -6987, -16998, -29514, 147807, 54429, -169917, -90778, -24154, -103047, -191506, -208247, -78186, -42802, -43503, -109695, -79513, -54161, 97855, 163934, 90503, 129250, 17023, -42103, -133798, 22376, -56180, 76696]
1345G6696J04732j10547j52105J56394l455L6350j70268k3087R6669j91756J05598
1334g4779q5632m2642J41654O945l182j35855N2443J74046j47440O859J0255K3455
1322g3873R287K6876O5063q0065k7138J43252p8199r1355J06347j25109J20317
1311d597q0875P4170O5241o5344R857o5182Q6331K9588n6863J05919j12888n4758
1299f9401O3003N9499j25481o9636P8424j5864m5943q1150Q9769J65088J8619
1288F6927M9025l3455j50049J07765M5701M730j49533P3683J13285j11211j68865
1277a51997P3243k6038j20954J10936R2994L7299R2497j74173k3180k2597p8650
1266a90620N8050L8334J24616j411J4631P1370K9214j30457q671k8842J2680j27235
$$ y = [76696, 181428, 70881, -81224, 75170, 71715, 108065, -62203, -85290, 11379, -180377, -74779, -160411, -203053, -61399, -54454, -57636, -193491, -141048, 32998, -114442, -107583, -97328, -73873, -64586, -37710, 27353, -52712, -79850, 63402, -14797, -106152, 195, -124914, -4597, -85472, -11302, 53939, -11405, -1548, -66730, 19601, 49189, -7674, 98245, -14643, -69401, -6398, 53101, -72380, -142016, -63592, -79456, -125399, -206549, -116780, 48308, 66927, 115952, 82497, -67552, 40213, 85914, 90644, -58889, 14794, 128079, 16868, -151997, -78754, -104792, -225746, -114810, -21816, 15483, 107980, -66193, -89373, -111970, -190620, -132570, -94236, 30380, 28969, 43600, 114970, 144184, 13727, 5056, -23786, -11106, -138341]
1254a38341j721J92559r2105k3556Q5850j04632Q9489Q5066m5536r3171J0358
1243c5740o9134q8218J68620p3972P1259k2744q8924J83782K5429j48145J01820
1232B4033m3572P5980o9808m7922j51259n7352N7584K10336k105o160J01371n1524
1220C9602j36454o2901N7804k2954M3698Q6908m3397k2604M926J169Q2132P6887
1208A04816j4047j00791n6521k01346O6685N4434O0240J88668j43886j04667j18665
1197b65080J33431P0591J2196l2024q2000K05550J9903J4789m5616k9226N3602
1186E6116j104o1916N492O1159j86428M1037l3675K2907L9063J82730J1899q7557
1174D9723N7442j48840L9332P2934J2723j35553L6206P097l1815J2352L4627l875
$$ y = [-138341, -140062, 52497, -39608, -63164, 22686, -81946, 7543, 92609, 47073, -46098, -35740, -104874, -193092, -24472, -98444, -27185, -49929, -138853, 44929, 70358, -77787, 24033, -19539, 56441, -13367, -61289, -212548, -269900, -212316, -1980, -4085, -10245, 91126, 39602, -96852, -159753, -101949, -124903, -81205, 5703, -37694, -60298, -55372, -54203, 27929, 104816, 90769, -10022, -66543, -267889, -201204, -146770, -86530, 102138, -41748, -146415, -265080, -131649, -61058, -48862, -80886, -162886, 42664, 62567, 77356, 31740, 2514, 56116, 55012, -6904, -1412, 59747, -126681, -85644, -119319, -96412, -57349, 125381, 137280, 49723, 107165, -41675, -2343, 70591, 83314, -52239, -16033, -8936, -40751, -28399, 6228, 2353]
1162B353N6575k7132j02970K5709O6235n3268j15354K16473j22120N0105L7836
1151C4442K1511k865j8043n5555q417k3850J65077K3175j55357q1068l1373O7136
1139f5187j9292J01679p0713K15355j61642P2505m2511j1775J8575k6361m526
1128F107m1985n9188j34748R8996R7561J02919m7575R991n2891j4405J8302j1701
1116b8617J45927o0383k5985j16668n3138K3556m4001J65714p3535q2343K07729
1105E8256j3266o43L1240p9381j843o5654Q1500J06448k0074L1139j4001j11808
1093A913O8896O735j03522J4360N3174k7750N9599j21057L8142n6457o0285P6244
1081e0008j09327N0071Q8233R244r57R698P7384j06427J3090O9711r3186l0526
$$ y = [2353, 58928, 31796, -71174, -45465, 20770, -32498, -147852, 68621, -53499, -3394, 34442, 55953, 53088, 35045, -20510, -28927, -52777, 112300, 135475, -19882, -100950, -132323, -65187, -84479, 17200, -53513, 161842, 200, 72705, 30194, 18419, 36994, 10633, 6107, -35878, -95066, -229814, -130818, -33257, 69662, 22087, 32078, -20813, -35218, -16916, -28617, 117310, 56927, 30942, -85726, -138864, -115308, -159309, 6405, -67130, -149473, 58256, 44990, 44347, 75587, -3794, -5637, -71291, 10209, 116657, 96583, 127722, 113721, 1913, 70809, 77544, -25978, -11618, 41556, 13806, 73405, -47652, -9510, -65967, -126252, -50008, -159335, -109264, -21031, -11787, -12744, -3046, 74338, -32089, -18999, 50712, -42474, -73000]
1069g3000j48676J40274L120j23525O618J42111L909J23651j41464p8465Q1229
1058f4218J54115k01853J1050j41545J60787P3714j3994j0831L2464m0937J26279
1047H5031M8043j77672O7413r2061Q554Q1223j2869k0644J00387J5352j26130
1036b3373K658J23753q5859n4221N3622J05199q1901J34522j32984O1114O2406
1025A64936k03403n5502Q646J2491j6510J4598k1318l8972Q8411L3491O4684r11
1013E0641j23171j228L0897K8637J32950q0051j37200j30892K11251M7050j61957
1002a33073N8265P7183K7803l5445l1253j83k26392J02188O1832J030J82455j60055
990g5645N7814J9265p1923L5813m3123J19402M6320j02573o8603l1917r1002Q5072
$$ y = [-73000, -221676, -81402, -78282, -201807, -195189, -53078, -49169, 74482, -66982, -145447, -64218, 89897, -111956, -100906, -242451, -81664, -7950, -21944, -32775, -311, -41248, 85031, 133074, -44598, 22815, -69246, -60692, 20531, 7662, -12982, 87405, 102757, -23373, -20715, 103038, 17179, -37042, 16580, 121779, 39878, 174400, 41416, 102530, 164936, -38467, -93969, -85323, -72832, -89342, -74744, -96062, -135034, -46623, -13132, 51552, 50641, -72530, -73758, -42861, -14224, 118726, 38675, -98525, -229417, -18166, 28884, -133073, -74808, 2375, 30178, -5267, -36520, -36703, -263095, -160907, -99075, -98045, 84410, -75645, -17831, 1434, -70489, -34676, -77799, 41603, 87923, -14650, -83253, -115170, -206172, -121100]
978a21100l2219L0713M4535O7861J88495j36803K6130q8940o6434M5346P3806
967C1390k03758Q9840J68968k5595n0746O8123K5892j56408N7233q6677J35744
956E4006M6406j18789m657J33437j20534l9458r2994K24525o2737j33270r7036
945b11101R7976J96545j18373J83479j61523o7810R7560j3230o3629J69947N0708
934A60549q4709p9240Q1667m4711J8887N5669K2087k22573o0433J34171j21082
923a39718J75157j46411r601N7623N3820m4038R5375j6916Q2906j95638j6881
912a04322P6946o894P8241j86553Q501J13749Q6482j05842J9346L5710q8493K8178
900d4951j63713P1851K15946N6357q0951m2617l9574J01953n3006o4079P3148
$$ y = [-121100, -153319, -122606, -78071, -10210, 178285, 41482, 67612, -21328, -87762, -42416, 31390, -172368, -82528, 86440, 60845, 10099, 78222, 104114, -52294, 4939, -81738, 54006, 100412, -18377, -23034, 110403, -10131, -49589, -142583, 81942, 19205, -114065, -211101, -113125, 83420, -34953, 148526, -12997, -80807, 16753, 3523, -60106, 109841, 160549, 75840, -3400, 78267, 33556, 52443, 108112, 130199, -92374, -152807, -18636, -139718, 35439, -110972, -120573, -62950, -9130, -53168, 42207, 25291, 108197, -87441, -104322, -27376, -34270, 43971, -142582, -134081, -20332, 66150, -39692, -20346, 15364, -73129, -44951, -208664, -136813, 79133, 135490, 54539, 11922, -27652, 74301, 21295, -42784, 30364]
889C0364l1951l0018k4063j04645J08038R9054o212l3653N8293m5041l640J38039
877A54565r6441J9552n6881r0144q2400J52413N5061m8329k6986J92079r0297
866H2192M9296j50925M6290m960J7686J66469k24574j76350M0283N1019J99744
855I6170K9712p3144j53302p5315O2692J15300Q4657N6004o2463j28954J06208
844E7565k89l9833J7053n8n23r9900k1382J02658j49385r608J33997r0920O0823
831c9802K48399j61834n3784O4006j18536N5809m2865m8222O9319k1195Q4862
820C6157l507q3868N1481K344j1557N4927M3002j35847M9356M0219m1451j38007
808a36751R3629o6293L3427J1159M4967M4745N3643n1021k26478R6704Q1369L2565
$$ y = [30364, -1587, -31605, -55668, -160313, -52275, 46779, 40567, 6914, 65207, 20166, 16526, 154565, 58124, 77676, 20795, -69349, -151749, 664, 55725, 7396, -19590, 172489, 82192, 131488, -19437, 26853, 21893, 39579, 206048, -18526, -194876, -154593, -103574, 96170, 125882, 52738, -100564, -175879, -113187, 2113, 86770, 142774, 80311, -48643, 57565, 57276, 17443, 34496, 34438, 33915, -65985, -87367, 15291, -134094, -143702, -9705, -100625, -39802, 208597, 46763, -7021, 56985, -61551, -5742, -48607, -96829, -27510, -48705, 36157, 32650, -51218, 263, 2607, -8950, 45977, 88979, -46868, 2488, 42707, 1256, -136751, -43122, -109415, -75988, -64829, -19862, 24883, 78526, 27505, -198973, -102269, -20900, 11665]
796A1665K37385q9061j73325j14131P2125M747j14560R0449N3273J18565M1536
785A38668k9981k9804K9374N1764N3743k91131p6093J89466J20815j29266m130
774B3425J00939j9013l0163j08643N3892k840J01316j52802o2632R7773j49924
763a48672M6407R2748M7901m3551m3608o0461Q1397L0943L2307j8073J0645L4061
751F2044o0455L0151M5644m0012K9335J0894j02261N2851l1206k9916P8016M7406
739I2491M1782r3890k1538M3987P322m692q3805k5702J00524o0301j5990K9228
727I416N9504q1622o5224j4526K9545J7697O6613n9665J00823q8258j25554L909
715a47342J15103m8179J2894J32507r9781j2933m5769J6355j8076J31212P3114
$$ y = [11665, 249050, 159989, -13336, -127467, -55342, -50595, -165155, -74706, -21433, 97132, 138668, 108687, 78883, 108257, 160021, 213764, -77367, -153460, 36006, 156821, 27555, 23425, 124364, 105351, 75188, -33455, 20437, 17597, 118913, -33889, -96521, 1252, -148672, -102265, -9517, 38384, -5167, -48775, -109236, -27839, 3104, 35411, 17338, 27983, 62044, 1589, 31740, 77384, 37372, 66707, 77601, -24660, 28191, -3015, -32931, 45085, 92491, 134273, 40383, 18845, 62832, 70154, 65462, -18343, -44045, 56479, -3822, -19812, 9416, 68920, -12702, -77926, -92452, -62907, -45210, 21403, -38262, 62561, -25697, -151251, -147342, -32239, -80418, -67524, 64983, -34798, -47731, -93500, -77145, -95221, 35991, 109105]
704A09105j89651l0843J34526l0812J86082j48232q2006J05790m5627m7570n0196
693h9434j1222R4125Q6690j38736J64967L7550j62765j52362J6205J97118J15036
682A57172j30999J23628j22272o1943Q9843j08343m5315O7981k1727Q7088m4278
671i165O4801r1498Q2245j3997o6515J30545j24419j2894p9451O4634O7428N9481
659G1195o7208o5483J18801L6460l7567j3360J896o0898J05814o7334Q145J84855
647B15316j50845k0310J10392j2729j19996j50585O6195K991L2860p5243Q0711
636b1243M6550j13880J37978j9886N6694l7313j39454l6415L8684P9709j00220
625a08796l3623J51341l5910M1347o7774m270O0078J34306j58084L9253p5703
$$ y = [109105, -80546, -111389, 23137, -7675, 178407, 30175, -51831, 53959, 8332, -39238, -89434, -100656, -6531, 80159, -58577, 106390, 143940, -18825, -171187, -154982, 42136, 157172, 26173, 149801, 27529, -34414, 55429, -52914, -98229, -30248, -51975, 35113, -9165, 55636, -35862, 46383, 32386, -34129, 96416, -28003, -40897, -120348, -55714, 11714, 71195, 3987, -61496, 57305, 93765, 56198, 42838, 44734, -16164, 89650, 22316, 30461, 215316, 64471, 44161, 154553, 141824, 21828, -128757, -62562, -59571, -26711, -101954, -21243, 25307, -88573, 49405, 29519, 86213, 48900, -90554, -126969, -88285, -8576, -108796, -142419, 8922, -26988, 14359, -53415, -57685, 2393, 136699, -21385, 17868, -57835]
614e7835j18034Q7023K8802N9718J3375J4155J16555q9963o7961j17586M6257
603h5494K3212J5535R1542Q3842k5652m4700R3384q6962m3384j6149L7449N5969
591I8592o0780n798P0548o0668l4630J43147k01240J11764O5081j5191p8823j41957
579a09955J72802J7144j00612J43025n6241L1721R9701n2335o2036j8209j2237
568E2768J0128N3200O233J05914n978j66360j17382J35412K4842n9795j00316
557f1334n0829J05180Q9948p0662Q2390K3119r2657o3330K5388J27590J0752R2542
545B18097p7697p3575j9265J31775J5401l4207J02194j65652j8741J20767m0933
534A58164N0880j29214o8161j7782j6728J65602o8222j0246o0919O8357m7124
$$ y = [-57835, -175869, -88846, -60044, -326, 13049, 27204, 143759, 53796, -14165, -131751, -85494, -62282, -46747, 44795, 128637, 102985, 58285, 151669, 64707, 21323, 5174, 42623, 98592, 37812, 32014, 102562, 41894, 7264, 150411, -50829, 60935, 126016, 110825, 32002, -109955, 62847, 79991, -20621, 122404, 66163, 97884, 197585, 145250, 83214, 65005, 52768, 62896, 116096, 122329, 228243, 222265, 55905, -61477, 73935, 98777, 38982, -61334, -112163, -6983, 82965, 12303, 94693, 117812, 25155, -38175, -12787, 114803, 125555, 218097, 140400, 66825, 47560, 179335, 194736, 160529, 262723, 97071, 78330, 199097, 158164, 209044, 79830, 11669, -6113, -22841, 142761, 74539, 64293, 3374, 71731, 24607]
523B4607k2981j3678J77380m4694q0190K8348j80626K7782J23022j19770N9838
512b0962k1817L4961J35229j05550J412L6875k6370p6893r5755J42709o5823J17231
500E5247O0331j06865j83751J45592K09245j60854j363j32564L6467R1278n4141
489d1378L7400L3584p8944o5255M2359Q9686j8077L9141j9308J6938j15469k4630
477a03953J53128j32914p2954R7635J4811K2027K0482k9562R61p0238L8912R2444
465C0779k5313L4920P7078o6390k0376j8360n6556N9530R6777o8649M3758o4943
453B2255j22913R4001Q577J12363o7165r7935K4437J076k3038K3970P8143m8385
441E386M3672l1962J6419r0840j44866j8538J36143J74159q5145k1077J11260
$$ y = [24607, 1626, -12052, 165328, 120634, 40444, 68792, -111834, -84052, 38970, -80800, -20962, -42779, -7818, 127411, 21861, 23273, 60148, 33778, -43115, -138870, 3839, -61984, 55247, 115578, 8713, -175038, -29446, 179799, 18945, 17582, -114982, -78515, 12763, -41378, -3978, 29606, -49338, -114593, -72234, 17452, -625, 38516, 19208, 36146, -79323, -103953, 49175, -83739, -156693, -59058, -44247, -22220, -1738, -31300, -30339, -100577, -61665, 30779, 5466, 40386, 117464, 51074, 30698, 12338, -44218, 15312, 112089, 43440, 87198, 22255, -100658, -6657, 1920, 114283, 47118, -50817, -26380, -25304, -48342, -24372, 53771, 5386, 49058, 17096, 33515, -57325, -202191, -220729, -84586, 89573, 4428, -16649, 94611]
430I4611K67j00193J78564r7095j70158j00883L32972M5212j91726N520q0046
419h2955Q8976O3324k9321k3883p0976M2311P9080j37322j2107q3943J80736l4282
407b0362m4253P6845r8184M5579Q5679p9915j4097J9529J9945l2758J948q446
395d8490o7139J57733J00694l759j42777J6172j69551o4295J51303m7398P2684
384d4823M8885n1024K9526K49n5103J5550K1386j1799L7618J60928m7988j21454
372a8049l6325j35399O8172N7207j7376J14918P1652k1316j86521l983r5929l5833
360b38782J36781J69313j18727n8175J23238k8261P945J05623k7011j5964o4271
349h291P4636j4400j72320K5634J08379Q099j37722J66124o5491l551j12260M6701
$$ y = [94611, 94878, -5315, 173249, 76154, -94004, -194887, 138085, 183297, -8429, -2909, -82955, 6021, 69345, 40024, 16141, -54835, -12524, 66556, -70766, -82873, -166816, 13920, -20362, -64615, 12230, -85954, -40375, 45304, -34611, -48708, -29179, -9234, -41992, -40044, -48490, -115629, 42104, 142798, 139039, -3738, 12434, -157117, -221412, -70109, -117507, -44823, 4062, -46962, -17436, -17187, -72290, -56740, -35354, -47153, -9535, 151393, 103405, -18049, -54374, -189773, -121601, -64394, -81770, 33148, 104800, 83484, -103037, -107020, -202949, -238782, -102001, 67312, -51415, -109590, 13648, -14613, -6668, 98955, 71944, 55980, -8291, 66345, 51945, -120375, -94741, 13638, 21737, -115985, 50139, -15352, -18903, -131163, -84462]
337h4462J02893l0191l3816J67N7670l5043K0895r3146N4727j74484N9322m5829
325b01297M0678R1324Q7890M8344j5845q2161j8869J50429j47302j6804l3181
314i6794k7557R7626R5860r3998M8786p3042J808R963R204Q7405l7027m3411m870
301b6047n6697Q3315O576J48695j03890j05002m4177J49275o8776p3768P3412
290a7084q7133k5935J59618o8298J7963J9704J9831n2663p6741K2475J26463l6762
278A438j20957k5467L1318N870l3500R7835M6000n1533k961J3402M4364r981O2576
265E8404l3631j3461K3704j13343K17866j42243m888l0483p9803j279L5463R4306
253A0612k1709J9652M4023m4322J23053q4960k9242J63041k9018j12670J7006
$$ y = [-84462, 18431, -11760, -45576, -45409, 12261, -22782, -1887, -95033, -40306, -214790, -155468, -201297, -160619, -69295, 18595, 66939, 51094, -31067, -49936, 100493, -46809, -63613, -96794, -124351, -26725, 69135, -24863, 23923, -49119, -47311, -37348, -28144, 59261, 22234, -21177, -26047, -82744, 571, 7147, 155842, 51952, -53050, -97227, 52048, -16728, -90496, -17084, -104217, -130152, 29466, -38832, -20869, -1165, 18666, -33997, -110738, -88263, 38200, 1438, -119519, -144986, -113668, -107798, -141298, -43463, 2537, -48996, -51957, -38555, 5809, -4172, 58404, 24773, 11312, 35016, -78327, 139539, -2704, -7592, -38075, -117878, -119157, -83694, 10612, -11097, 8555, 52578, 8256, 131309, 46349, 17107, 180148, 151130, 38460, 55466]
242E5466N2472m957j02054Q2902J1373j06941j3737l2211j18721J46621l2056
231f1843P9l4160o2267O6089O131q1347P5581M5271J53762j67701P3374r3405
219h0436j40387J71581p0014N9421J23717r272O37j19711o4180J03618j33681
208a58707N0066R4792J24007r5060o2312O3151L9497O636j19799m8800K3596p6109
196a59042J05021j34528J32185O3047m773J01934l8166j08138M7926q1568J47169
185G1067j17011l2734L2726q4151N3231j20843J133O5777P5632Q2780n9135q111
173c9639M8496m1348Q193L67Q223j1845J78780j36340L5575j53689m9411J12521
161d0117Q346m8954J26824j30334O7154O0488J04517m8156j15793m7292n940K8287
$$ y = [55466, 107938, 102981, 927, 83829, 95202, -11739, -25476, -57687, -176408, -29787, -61843, -61764, -95924, -158191, -92102, -85971, -167318, -91737, -46466, 107296, -60405, 12969, -80436, -220823, -49242, -119256, -59835, 63882, 54610, 55247, -64464, -128644, -25026, -158707, -108641, -13849, 110158, 15098, -47214, 15937, 55434, 62070, -57729, -106529, -82933, -159042, -54021, -188549, -56364, 6683, 1910, 103844, 65678, -42460, 5466, -76102, 71067, -45944, -78678, -45952, -130103, -76872, -197715, -196582, -130805, -55173, 27607, -31528, -39639, 8857, -32491, -24298, -23931, -15708, -27553, 151227, 14887, 50462, -103227, -152638, -40117, -31771, -80725, 46099, -84235, -17081, 43407, 147924, 99768, -16025, -63317, -69257, -40970]
149d0970J7149N2665m836j14514N8417L7692l493L3563j4299O0448N8978o1929
137G8871j04126n844j906M1454l6456J3762j30170N6991N5882p7597K6586J05211
125B2658j6832K5039j16224J6372l8889J8805L4136J8932o4641M968m5961Q30
113a40807J10004o4183j5012k2388J40668Q5416j51418j3054P8423m5825M6429
102H253J4283r2333J50425q7248M4396O5354j18330L5108k4081J9895j9639j15020
90a18937R6957r0390J15152J2921p1912p203K6744P6874l615k7889L8218k2423
78B4497l3876N3035l2183J0455o2650L8218p9372n7800R0410P5710K0449J5885
66F2778K6252l1789m4352k4603m9127K7652N722q8985O8688L4845j06824J2550
$$ y = [-40970, -23821, 28844, 24008, -90506, -32089, 5603, 2110, 35673, 21374, 81822, 140800, 78871, -25255, -31099, -33005, 8449, -28007, -14245, -144415, -87424, -31542, -109139, -82553, 22658, 5826, 30865, -85359, -68987, -107876, -89071, -54935, -36003, -100644, -95676, -141637, -140807, -30803, -94986, -109998, -132386, 8282, 93698, -57720, -70774, 7649, -38176, 8253, 22536, -69797, 80628, -6620, 37776, 103130, -15200, 19908, -4173, 15722, -3917, -118937, -21980, -112370, 2782, 15703, -56209, -63412, -36668, 40206, 36591, 8702, 46920, 24497, -9379, 43656, 11473, 21928, -40722, -2504, -81876, -139676, -49266, 26444, 46893, 62778, 89030, 57241, 12889, -11714, -60841, -33189, -27467, -116452, -47764, -12919, -119743, -107193]
54a07193M809L8168K10876j02617r0492n0352O3850L9879k1143R7998m9170j86999
42a52386L9439j5211J4911M5563J05255J11161n2213j19570n8704M5453m0620
31g6922L3829o6662R3011m4025j6148N8485K8747j10792Q0520n1646K6186M8334
19B917L9131L4100j08707J43670J6700r4391p6510k0941K7820p9350P332O6771
7d1458Q533O1N8665m2934k0717k831K4682
0a5999
$$ y = [-107193, -102384, -64216, 146660, 44043, -46449, -96801, -32951, 6928, -14215, 83783, 34613, -152386, -112947, -128158, -113247, -67684, 37571, 148732, 96519, -23051, -81755, -36302, -76922, -43093, -109755, -16744, -60769, -76917, -18432, 10315, -100477, -19957, -71603, -45417, 2917, 42048, 76148, -32559, 111111, 127811, 33420, -43090, -64031, -36211, -115561, -108229, -41458, -32925, -32864, 25801, -17133, -37850, -40681, -15999]
$$ Imaginary data points
##PAGE= N=2
##DATA TABLE= (X++(I..I)), XYDATA
16383b428883J0759l572L3190m3538J05268m6772N1433Q4310P3020P1152q9536
16372b183169L9812n250k574J03696J8028o2893n7093Q6009L4096J0435O726J87683
16360a824494P36N1267j5654j275L3089O9880M0085l1893Q4053k690J2834J4178
16348a569884M6656j1396k3942P4809M2142k4250K4330O3293P684L6042r404Q9673
16336a254247j8324l428J6023R1268Q9129m9880N3233L0563j4902j10679J25582
16325a045662m6090n8343J64426Q2921j4625l2979J7714R5026n9592J25181Q2393
16314f89630n9702o5926n4887Q4276M5262L7169M9168K2856J8896o810K3461J0761
16302e85106L9042O5138Q9595r5726Q9719O5357n2850q069R2555L1739m9465q891
$$ y = [-2428883, -2418124, -2421696, -2388506, -2432044, -2326776, -2373548, -2322115, -2237805, -2164785, -2093633, -2183169, -2143357, -2148607, -2151181, -2047485, -2029457, -2092350, -2149443, -2063434, -2029338, -2018903, -2012177, -1824494, -1823758, -1772491, -1788145, -1789420, -1756331, -1686451, -1646366, -1678259, -1594206, -1596896, -1584062, -1569884, -1523228, -1534624, -1558566, -1483757, -1441615, -1465865, -1441535, -1378242, -1370558, -1334516, -1343920, -1254247, -1272571, -1275999, -1259976, -1168708, -1079579, -1129459, -1076226, -1045663, -1060565, -1171244, -1045662, -1091752, -1150095, -985669, -902748, -917373, -950352, -932638, -837612, -897204, -772023, -689630, -749332, -815258, -870145, -785869, -740607, -703438, -654270, -631414, -612518, -619328, -595867, -585106, -546064, -480926, -391331, -487057, -397338, -331981, -384831, -392900, -300345, -268606, -318071, -326962]
16290c26962K9683o0240l0429J07125P5259R699J67310j12708M452M9233k2514
16279a10092K7412M0205M7494P482k7906M0732K337J47927J20552q9151M5632
16268B52624q9192J12081r2770M5736M0488L3170o9416l6252J21580J15186j07390
16257C25845L0001N6320K9301p8549m3282J26560j3593J29515n1542J03826n8892
16246E55510m556p2012J6045K06798p033L2951O1006o2117K6473n1155p7523j08426
16234E15961L3713K69752M6572j12971q1243M8446O9006J6482k70l5365r6022
16223F74061L17689o5981q0092k6627N168m0867R5242l4113J44030n1414K6202
16212I63298m9675k994O6351o5245M6035Q1095o8948N9951J15621O542q1353J9325
$$ y = [-326962, -297279, -357519, -387948, -280823, -205564, -195865, -28555, -141263, -136811, -87578, -110092, -82680, -42475, 5019, 12501, -15405, 25327, 27664, 175591, 296143, 206992, 252624, 163432, 275513, 182743, 228479, 268967, 302137, 232721, 196469, 318049, 433235, 325845, 355846, 412166, 441467, 362918, 319636, 446196, 432603, 562118, 510576, 614402, 555510, 550954, 478942, 494987, 701785, 694752, 727703, 788709, 726592, 753065, 701910, 624387, 515961, 549674, 819426, 865998, 753027, 671784, 720230, 789236, 805718, 805448, 770083, 674061, 991750, 925769, 845677, 819050, 824218, 783351, 878593, 844480, 988510, 937096, 963298, 913623, 910629, 976980, 911735, 957770, 1038865, 969917, 1029868, 1145489, 1152031, 1070678, 1090003]
16200A090003R2336J6085K7096J012o3060k5495P9514n6491Q2813m1200l0056
16189A172557k5689o0589J43202P318o8174J05044n2099r7667L8611J58700l2706
16178A288508K3499n406j17023p6529L3423J19088J9423j9004J18498J0724R7240
16167A492441j04943K5484J3373l0719J8706q6904l5001K2446N1687O4584o4419
16156A366735O2990O5347o560j2501j30224O2648O2506K7867p0505K5639l7731
16145A416211k4133K00182o3652j4753l0216r4824R2143R9024q1883q5796L925
16134A416228n150O6876K4015M7809O4556j17742O4407l1799L4723k7912o2719
16123A473292M7109K4575n8376n0424J17891J44203j8770p3747M2553J37125p3812
$$ y = [1090003, 1182339, 1198424, 1225520, 1226532, 1163472, 1137977, 1217491, 1161000, 1243813, 1202613, 1172557, 1146868, 1086279, 1229481, 1236799, 1168625, 1273669, 1221570, 1123903, 1162514, 1321214, 1288508, 1312007, 1306601, 1189578, 1113049, 1146472, 1265560, 1284983, 1265979, 1384477, 1395201, 1492441, 1387498, 1412982, 1426355, 1395636, 1414342, 1327438, 1292437, 1314883, 1366570, 1431154, 1366735, 1429725, 1495072, 1488512, 1476011, 1345787, 1408435, 1470941, 1498808, 1428303, 1453942, 1416211, 1392078, 1592260, 1528608, 1513855, 1483639, 1388815, 1480958, 1579982, 1498099, 1412303, 1416228, 1411078, 1477954, 1501969, 1549778, 1614334, 1496592, 1560999, 1529200, 1563923, 1536011, 1473292, 1520401, 1544976, 1486600, 1436176, 1554067, 1698270, 1679500, 1605753, 1648306, 1785431, 1711619]
16112A711619p3556J12852j02755r6883J2447Q2669m4908q5817P5680J08410m157
16101A695601j09643J10831K8428L6667n7481K358l8703m7484O2301J64235j84977
16090A662133p8402o901L811R3516n2792L5845l1560R9732M6616J997k9712J06532
16078A850815q6893q614j15972j3222P1284j51132R3439J50410j00706m7778K01508
16067A843139l2829n1858j940n1595J01172j35917J78370R250k4793O2743j06127
16056A789615j38084J02148n1496m7014K0463k8678M0481L3229R8133k3190j20234
16045A675373m0885K992k0749J36368N6308n1287J694K80r1963O2507M4645m2946
16033A732337O781o3945L6123Q3120p44j1726l1668l0754q0811o299M2572L4332
$$ y = [1711619, 1638063, 1750915, 1648160, 1551277, 1563724, 1646393, 1601485, 1515668, 1591348, 1699758, 1695601, 1585958, 1696789, 1725217, 1761884, 1704403, 1706761, 1668058, 1620574, 1682875, 1847110, 1662133, 1583731, 1576830, 1580641, 1674157, 1621365, 1657210, 1625650, 1725382, 1771998, 1773995, 1744283, 1850815, 1763922, 1755308, 1639336, 1626114, 1697398, 1546266, 1639705, 1790115, 1689409, 1641631, 1843139, 1810310, 1758452, 1756512, 1704917, 1806089, 1670172, 1848542, 1857792, 1832999, 1895742, 1789615, 1651531, 1753679, 1702183, 1655169, 1675632, 1646954, 1687435, 1720664, 1818797, 1795607, 1675373, 1634488, 1637480, 1616731, 1753099, 1809407, 1758120, 1759814, 1760094, 1668131, 1730638, 1775283, 1732337, 1739118, 1675173, 1711296, 1794416, 1793672, 1781946, 1750278, 1719524, 1638713, 1632414, 1674986, 1709318]
16021A709318K479J3717o8902J25464N6928R5551j16620j49082J2565J44934p6381
16010A749971m3971j40N2316K5620j0072m060n5092m0882J11883N4683q6246L2132
15998A786142l8711J15292n9948j1705m4969L3570K4975r6056N6159p5089p2801
15987A616859M2128N7901j6190K2954m1032r7218R2499k7604p644j4509O6704
15976A694848j6350l3804J81900l2499n9896R1506n127n8859J02952n9163p0841
15965A734667R2889n9028q2016j3353J70560j25999J4721J5363n3438O1353o6197
15954A689522p51m512J8217J70335L8567M0852j29733L4592j26311J28739j36702
15943A722815j77668K376J77123J1237j6965O5941O36K5593L0646r3928J12225
$$ y = [1709318, 1711797, 1725514, 1656612, 1782076, 1839004, 1934555, 1817935, 1668853, 1681418, 1826352, 1749971, 1706000, 1705860, 1758176, 1783796, 1773724, 1769664, 1714572, 1673690, 1785573, 1840256, 1754010, 1786142, 1747431, 1862723, 1802775, 1791070, 1746101, 1779671, 1804646, 1708590, 1764749, 1689660, 1616859, 1658987, 1716888, 1700698, 1723652, 1682620, 1585402, 1677901, 1650297, 1642653, 1628144, 1694848, 1678498, 1644694, 1826594, 1794095, 1734199, 1825705, 1820578, 1761719, 1864671, 1805508, 1734667, 1827556, 1768528, 1686512, 1673159, 1843719, 1717720, 1732441, 1747804, 1694366, 1755719, 1689522, 1688771, 1684259, 1702476, 1872811, 1911378, 1952230, 1822497, 1857089, 1730778, 1859517, 1722815, 1545147, 1547523, 1724646, 1735883, 1718918, 1784859, 1785495, 1811088, 1841734, 1747806, 1860031]
15932A860031q6810j0204O7537r7178J44540r0706J7718M0599M0067j22569M1353
15921A804378K4378m72j17088Q4792K4381Q8883k7287l6893J0372r0702Q5630
15910A850372K7645L407j23330n2744J03746l5689r1575M4965K5386J126j10469
15899A642840K3186J43365l1878j66063P4596O5213j7360N4616P11l2946o1413
15888A694867J8438R4637j329p1145J50368l9640N6136j50478N0812j34499M2329
15877A710496J41053L7553o4509l7864K722N4050q3159l2021J45530n74N0057
15866A923334j04561p727P3096j32001m0370J8075M3086J7727L5882m2467l016
15855A781058q2831m9038M7591L7937l9185J42663M5429j93505L0633J05769O3208
$$ y = [1860031, 1773221, 1763017, 1830554, 1733376, 1877916, 1787210, 1804928, 1845527, 1885594, 1763025, 1804378, 1828756, 1828284, 1711196, 1795988, 1820369, 1909252, 1881965, 1845072, 1855444, 1764742, 1850372, 1878017, 1881424, 1758094, 1705350, 1809096, 1773407, 1681832, 1726797, 1752183, 1753309, 1642840, 1666026, 1809391, 1777513, 1611450, 1686046, 1751259, 1733899, 1788515, 1789226, 1756280, 1694867, 1713305, 1807942, 1806613, 1735468, 1885836, 1846196, 1902332, 1751854, 1802666, 1668167, 1710496, 1851549, 1889102, 1824593, 1786729, 1789451, 1843501, 1760342, 1728321, 1873851, 1873277, 1923334, 1818773, 1811046, 1884142, 1752141, 1711771, 1729846, 1772932, 1790659, 1826541, 1784074, 1781058, 1698227, 1649189, 1696780, 1734717, 1695532, 1838195, 1883624, 1690119, 1720752, 1826521, 1889729]
15844A889729m4347j5748j6964j90736J66462m7656j03743o1460M0676O7882j03978
15833A580117J65125P9543L1033o2042l703J77642j06796j55620k5110J04838
15823A785027j323J14365r2302m4855Q5392k71148J09424Q9469j36542J87391
15813A824898J62507j40948K3048Q395j00330j15228K321J07764K01120j90824
15803A782723l870M3579R505O5880o4758r171J19694j96289Q05N597J51618k4081
15791A881232j35835p7105J29044J26110r6694R171o7307k3181k9686j3256P2625
15780A775118j0471O7450n486j00833N7139P36j42018N6026j6284o084M1169m699
15768A711763l3389K21243q9412P0808q27K2611j36860q1828J01439J14696n8506
$$ y = [1889729, 1845382, 1829634, 1812670, 1621934, 1788396, 1740740, 1636997, 1575537, 1616213, 1684095, 1580117, 1745242, 1824785, 1855818, 1793776, 1790073, 1967715, 1860919, 1705299, 1680189, 1785027, 1783704, 1898069, 1805767, 1760912, 1846304, 1575156, 1684580, 1774049, 1637507, 1824898, 1987405, 1846457, 1869505, 1877900, 1777570, 1662342, 1664663, 1772427, 1973547, 1782723, 1778853, 1822432, 1831937, 1897817, 1833059, 1823888, 1943582, 1747293, 1748098, 1753695, 1905313, 1881232, 1745397, 1668292, 1797336, 1923446, 1826752, 1835923, 1768616, 1745435, 1715749, 1702493, 1775118, 1764647, 1832097, 1826611, 1725778, 1782917, 1783653, 1641635, 1697661, 1681377, 1675293, 1716462, 1711763, 1678374, 1899617, 1810205, 1881013, 1880186, 1902797, 1765937, 1684109, 1785548, 1900244, 1841738]
15757A841738p8477Q6743k45028l3990J92434J40920j50889K00916J01201j47134
15747A908434k54894J8539l7730J21996J29606K4869j32404o743J50506k5738
15737A896441j85897M0740J76974p9470k7695N526P9363r7424K6896j2278q4286
15726A738890J13767l6229j373k2131j26792J36939N9266j79924J43525k021Q5014
15715A908931l5973Q3074o3071j38563M9998j1116p8319K2220J95928n5336o4150
15704A813623J17752K2250j70899j53939P4917n7461R0129J57053J37273n0917
15694A979781k38334K2641n2212N6257n9366N9661o2393J03302J09629k7423k8801
15683A862742m2109K6994l4750l1611k5985l0632M0345m5067m0617J32197J27286
$$ y = [1841738, 1763261, 1850004, 1604976, 1570986, 1763420, 1904340, 1753451, 1954367, 2055568, 1908434, 1653540, 1672079, 1634349, 1756345, 1885951, 1910820, 1778416, 1771673, 1922179, 1896441, 1710544, 1751284, 1928258, 1848788, 1821093, 1826619, 1905982, 1808558, 1835454, 1823176, 1738890, 1852657, 1816428, 1815055, 1792924, 1666132, 1803071, 1862337, 1682413, 1825938, 1823917, 1908931, 1872958, 1956032, 1892961, 1754398, 1804396, 1793280, 1714961, 1737181, 1933109, 1877773, 1813623, 1931375, 1953625, 1782726, 1628787, 1703704, 1646243, 1736372, 1893425, 2030698, 1979781, 1741447, 1764088, 1711876, 1768133, 1708767, 1768428, 1706035, 1809337, 1918966, 1891543, 1862742, 1820633, 1847627, 1812877, 1781266, 1755281, 1724649, 1764994, 1719927, 1679310, 1811507, 1938793]
15672A938793j81263j04689K28060K2203l8071l8860r0888N0372P7805R3090o8723
15661A887829j54182J6429j1462J4511M3663J41228j4889q2228j28730k1698l4286
15650A656185J75744q5132N2543J42458k6767k7251J04148p0915j05278M0902
15640A856637j8001J6092q0880k866o7668J45112M7123N6685j861j12090k8832
15629A809451P0442n0349m5474J7833j0985j1937n3860J52780P1559j67046Q1446
15618A863860l4648p4338j07380K19925L9332l2773l7223r207R8101k6500P1886
15607A971035n6068L005k19k22433J7848L3586m2627J36413k21665J11512K44693
15596A975080r3763k523J2822r8991q7215L1310Q0932j37102L608J47693M5709
$$ y = [1938793, 1757530, 1652841, 1880901, 1903104, 1865033, 1826173, 1735285, 1785657, 1863462, 1956552, 1887829, 1733647, 1750076, 1738614, 1753125, 1796788, 1938016, 1923127, 1840899, 1712169, 1690471, 1656185, 1831929, 1746797, 1799340, 1941798, 1915031, 1887780, 1991928, 1921013, 1815735, 1856637, 1838636, 1854728, 1773848, 1770982, 1703314, 1848426, 1895549, 1952234, 1950373, 1838283, 1809451, 1879893, 1829544, 1784070, 1801903, 1790918, 1778981, 1725121, 1877901, 1949460, 1782414, 1863860, 1829212, 1754874, 1647494, 1867419, 1906751, 1873978, 1836755, 1827548, 1925649, 1899149, 1971035, 1914967, 1917972, 1917753, 1695320, 1713168, 1746754, 1704127, 1840540, 1618875, 1730387, 1975080, 1881317, 1878794, 1891616, 1792625, 1705410, 1736720, 1817652, 1680550, 1684158, 1831851, 1877560]
15585A877560m0520j39390J33003m8459Q849J25681j56797J04444L7661q0154
15575A821878K2046L4533L3299j47516o5741J45264l778N4626l039j01126L1106
15564A821552p6954j1501J14069m6582l6427Q0401J5093j48305M900J29995M5979
15553A892220o6201j4240k6024j44293L9420R3258N3075l6096m2343P2353j266
15542A819863o0276j2773O0658n7532O2886J59982k17356J5614R9770m4168l1458
15531A795210j08449J28563J00257j95141p6736J02460J60367o8497n0253O7641
15521A855422j97964J58412l4274l2213R4839j02178k6592Q8489O864j2336M005
15510A802474M2988n2548M8960J0459q1556J20241k8572o2922J1737K11870k25659
$$ y = [1877560, 1837040, 1697650, 1830653, 1782194, 1791043, 1916724, 1759927, 1864371, 1902032, 1821878, 1843924, 1878457, 1911756, 1764240, 1698499, 1843763, 1839985, 1894611, 1891572, 1790446, 1821552, 1744598, 1733097, 1847166, 1800584, 1764157, 1844558, 1859651, 1711346, 1716246, 1846241, 1892220, 1826019, 1811779, 1785755, 1641462, 1680882, 1774140, 1827215, 1791119, 1748776, 1821129, 1819863, 1759587, 1746814, 1807472, 1749940, 1812826, 1972808, 1755452, 1771066, 1870836, 1826668, 1795210, 1686761, 1815324, 1915581, 1720440, 1643704, 1746164, 1906531, 1838034, 1787781, 1855422, 1657458, 1815870, 1781596, 1749383, 1844222, 1742044, 1715452, 1803941, 1810805, 1798469, 1802474, 1845462, 1792914, 1841874, 1852333, 1770777, 1891018, 1862446, 1799524, 1811261, 2023131, 1797472]
15499A797472L4967M7281q3279J26906k3452J6121j8794q8046N9399R1466j30787
$$ y = [1797472, 1832439, 1879720, 1796441, 1923347, 1899895, 1916016, 1897222, 1809176, 1868575, 1960041, 1829254]
$$ [...]
##END NTUPLES=NMR SPECTRUM
##END=
