##TITLE=1H_CG-1209-xy
 DMSO-d6
 8 sc, 
 7.8.2024
##JCAMPDX= 6.0         $$ Bruker NMR JCAMP-DX V2.0
##DATA TYPE= NMR SPECTRUM
##DATA CLASS= NTUPLES
##ORIGIN= UXNMR, Bruker Analytische Messtechnik GmbH
##OWNER= root
$$ XWIN-NMR		Version 3.5
$$ Wed Aug  7 13:44:31 2024 Russian Standard Time (UT+4h)  she@DPX200
##.OBSERVE FREQUENCY= 200.1313
##.OBSERVE NUCLEUS= ^1H
##.ACQUISITION MODE= SIMULTANEOUS
##.ACQUISITION SCHEME= undefined
##.AVERAGES= 8
##.DIGITISER RES= 18
##SPECTROMETER/DATA SYSTEM= spect
##.PULSE SEQUENCE= zg30
##.SOLVENT NAME= Acetone
##.SHIFT REFERENCE= (INTERNAL, Acetone, 0, 21.0591)
##AUDIT TRAIL= $$ (NUMBER, WHEN, WHO, WHERE, WHAT)
$$ ##TITLE= Audit trail, XWIN-NMR		Version 3.5
$$ ##JCAMPDX= 5.01
$$ ##ORIGIN= Bruker BioSpin GmbH
$$ ##OWNER= she
$$ F:/spectra/data/she/nmr/H-F/1/pdata/1/auditp.txt
$$ ##AUDIT TRAIL=  $$ (NUMBER, WHEN, WHO, WHERE, WHAT)
(   1,<2024-08-07 13:43:10.01 +0400>,<she>,<DPX200>,
      <created by zg, POWCHK disabled, PULCHK disabled
       configuration hash MD5:
       00 E9 B6 7A A2 85 ED C7 34 08 36 98 17 FE 4E 26
       data hash MD5: 16K
       8E BF E9 37 6E 72 BA 8C 09 6E 03 A3 75 10 21 8F>)
(   2,<2024-08-07 13:43:12.64 +0400>,<she>,<DPX200>,
      <Start of raw data processing
       efp BC_mod = 2 LB = 0.24 FT_mod = 6 PKNL = 1 PHC0 = -25637.89 PHC1 = 9.587492 SI = 16K 
       data hash MD5: 16K
       C2 B8 F8 2F EC 2D 4E B5 E2 D8 7B D6 8E 76 A6 6D>)
(   3,<2024-08-07 13:43:36.21 +0400>,<she>,<DPX200>,
      <pk PHC0 = -0.743754 PHC1 = 0.6 
       data hash MD5: 16K
       12 5B 0C D3 EF 92 CA 3C 2E 30 29 B8 97 22 E3 AC>)
(   4,<2024-08-07 13:43:39.68 +0400>,<she>,<DPX200>,
      <abs ABSG = 5 
       data hash MD5: 16K
       38 AB FA CD 93 73 CB F6 29 0C 06 9D 21 AC 0D 83>)
$$ ##END=
$$ 
$$ hash MD5
$$ 77 0E E1 78 E9 F3 89 2A D4 D7 3D 57 2A 5A 0B 38
##$RELAX= 
##$RELAX= 
##$RELAX= 
##$RELAX= 
##$RELAX= 
##$RELAX= 
$$ Bruker specific parameters
$$ --------------------------
##$DU= <F:/spectra>
##$EXPNO= 1
##$NAME= <H-F>
##$PROCNO= 1
##$TYPE= <nmr>
##$USER= <she>
##$AMP= (0..31)
100 100 100 100 100 100 100 100 100 100 100 100 100 100 100 100 100 100 
100 100 100 100 100 100 100 100 100 100 100 100 100 100 
##$AQSEQ= 0
##$AQ_mod= 1
##$AUNM= <au_zg>
##$AUTOPOS= <>
##$BF1= 200.13
##$BF2= 200.13
##$BF3= 200.13
##$BF4= 200.13
##$BF5= 200.13
##$BF6= 200.13
##$BF7= 200.13
##$BF8= 200.13
##$BYTORDA= 1
##$CFDGTYP= 0
##$CFRGTYP= 5
##$CHEMSTR= <none>
##$CNST= (0..31)
1 1 145 1 1 1 1 1 1 1 1 1 1 1 1 1 1 1 1 1 1 1 1 1 1 1 1 1 1 1 1 1 
##$CPDPRG= <>
##$CPDPRG1= <>
##$CPDPRG2= <>
##$CPDPRG3= <>
##$CPDPRG4= <mlev>
##$CPDPRG5= <mlev>
##$CPDPRG6= <mlev>
##$CPDPRG7= <mlev>
##$CPDPRG8= <mlev>
##$CPDPRGB= <>
##$CPDPRGT= <>
##$D= (0..31)
0 1.2 0 0 0 0 0 0 0 0.06 0 0.03 0 0 0 0 0.0002 0 0 0 0 0 0 0 0 0 0 0 0 
0 0 0 
##$DATE= 1723023789
##$DBL= (0..7)
120 120 120 120 120 120 120 120 
##$DBP= (0..7)
150 150 150 150 150 150 150 150 
##$DBP07= 0
##$DBPNAM0= <>
##$DBPNAM1= <>
##$DBPNAM2= <>
##$DBPNAM3= <>
##$DBPNAM4= <>
$$ [...]
##$SUBNAM3= <"">
##$SUBNAM4= <"">
##$SUBNAM5= <"">
##$SUBNAM6= <"">
##$SUBNAM7= <"">
##$SUBNAM8= <"">
##$SUBNAM9= <"">
##$SW= 24.0689771365484
##$SWIBOX= (0..15)
0 0 2 0 0 0 0 0 0 0 0 0 0 0 0 0 
##$SW_h= 4816.95568400771
##$TD= 16384
##$TD0= 1
##$TE= 0
##$TE2= 300
##$TE3= 300
##$TEG= 300
##$TL= (0..7)
0 120 120 120 120 120 120 120 
##$TP= (0..7)
150 150 150 150 150 150 150 150 
##$TP07= 0
##$TPNAME0= <>
##$TPNAME1= <>
##$TPNAME2= <>
##$TPNAME3= <>
##$TPNAME4= <>
##$TPNAME5= <>
##$TPNAME6= <>
##$TPNAME7= <>
##$TPOAL= (0..7)
0.5 0.5 0.5 0.5 0.5 0.5 0.5 0.5 
##$TPOFFS= (0..7)
0 0 0 0 0 0 0 0 
##$TUNHIN= 0
##$TUNHOUT= 0
##$TUNXOUT= 0
##$USERA1= <user>
##$USERA2= <user>
##$USERA3= <user>
##$USERA4= <user>
##$USERA5= <user>
##$V9= 5
##$VALIST= <valist>
##$VCLIST= <CCCCCCCCCCCCCCC>
##$VD= 0
##$VDLIST= <DDDDDDDDDDDDDDD>
##$VPLIST= <PPPPPPPPPPPPPPP>
##$VTLIST= <TTTTTTTTTTTTTTT>
##$WBST= 1024
##$WBSW= 4
##$XGAIN= (0..3)
0 0 0 0 
##$XL= 0
##$YL= 0
##$YMAX_a= 395566
##$YMIN_a= -325657
##$ZGOPTNS= <>
##$ZL1= 120
##$ZL2= 120
##$ZL3= 120
##$ZL4= 120
##$ABSF1= 21.02235
##$ABSF2= -3.046843
##$ABSG= 5
##$ABSL= 3
##$ALPHA= 0
##$AQORDER= 0
##$ASSFAC= 0
##$ASSFACI= 0
##$ASSFACX= 0
##$ASSWID= 0
##$AUNMP= <proc_1d>
##$AZFE= 0.1
##$AZFW= 0.1
##$BCFW= 0
##$BC_mod= 2
##$BYTORDP= 0
##$COROFFS= 0
##$CY= -3
##$DATMOD= 1
##$DC= 0
##$DFILT= <>
##$DTYPP= 0
##$F1P= 0
##$F2P= 0
##$FCOR= 1
##$FTSIZE= 16384
##$FT_mod= 6
##$GAMMA= 0
##$GB= 0
##$INTBC= 1
##$INTSCL= 3.70164e-10
##$ISEN= 128
##$LB= 0.24
##$LEV0= 0
##$LPBIN= 0
##$MAXI= 10000
##$MC2= 0
##$MEAN= 0
##$ME_mod= 0
##$MI= 1.114404
##$NCOEF= 0
##$NC_proc= -4
##$NLEV= 6
##$NOISF1= 3.799351
##$NOISF2= 2.8
##$NSP= 0
##$NTH_PI= 0
##$NZP= 0
##$OFFSET= 21.05908
##$PC= 1
##$PHC0= -25638.63
##$PHC1= 10.18749
##$PH_mod= 1
##$PKNL= yes
##$PPARMOD= 0
##$PSCAL= 0
##$PSIGN= 0
##$REVERSE= no
##$SF= 200.129493935115
##$SI= 16384
##$SIGF1= 3
##$SIGF2= 2
##$SINO= 5.538805
##$SIOLD= 16384
##$SREGLST= <1H.CDCl3>
##$SSB= 0
##$STSI= 16384
##$STSR= 0
##$SW_p= 4816.95568400771
##$SYMM= 0
##$S_DEV= 0
##$TDeff= 16384
##$TDoff= 0
##$TI= <>
##$TILT= no
##$TM1= 0
##$TM2= 0
##$TOPLEV= 0
##$USERP1= <user>
##$USERP2= <user>
##$USERP3= <user>
##$USERP4= <user>
##$USERP5= <user>
##$WDW= 1
##$XDIM= 16384
##$YMAX_p= 277082933
##$YMIN_p= -98548
$$ End of Bruker specific parameters
$$ ---------------------------------
##NTUPLES= NMR SPECTRUM
##VAR_NAME=  FREQUENCY,     SPECTRUM/REAL,   SPECTRUM/IMAG
##SYMBOL=    X,             R,               I
##VAR_TYPE=  INDEPENDENT,   DEPENDENT,       DEPENDENT
##VAR_FORM=  AFFN,          ASDF,            ASDF
##VAR_DIM=   16384,         16384,           16384
##UNITS=     HZ,            ARBITRARY UNITS, ARBITRARY UNITS
##FACTOR=    0.29402158847633, 1,            1
##FIRST=     4214.54304793542, 0,            0
##LAST=      -602.412636072291, 0,           0
##MIN=       -602.412636072291, -98548,      0
##MAX=       4214.54304793542, 277082933,    0
$$ Real data points
##PAGE= N=1
##DATA TABLE= (X++(R..R)), XYDATA
$$ [...]
13723 -18665 -6164 -8023 12902 2217 23741 13778 17095 9711 -7647 -34305 558 -3378 4067
13710 4067 -1904 -30764 -36321 12549 13894 4718 27063 15526 29136 21857 14514 -2626 -23262
13697 -23262 19298 -8307 -51474 11616 -3894 26893 27622 -7830 5818 19618 12981 -11693
13685 -11693 11156 -7658 20974 31649 5007 2310 10525 -5975 -21725 -12643 -3253 -14836
13673 -14836 29849 -8552 10292 40733 47712 24058 2767 2643 24550 -3114 -16653 20123
13661 20123 19819 8542 34156 -12266 -434 8092 -4456 26715 21442 -9149 -46680 -6203
13649 -6203 18579 -1299 -26891 -43658 -17370 -5875 31103 -13942 -19481 -2503 -31260 -6516
13637 -6516 9013 20504 -1305 -8590 -32354 13698 10500 -21890 -4790 12909 -46074 -4742
13625 -4742 687 -36734 -791 15670 4225 31665 81609 24928 -9685 3270 29644 49330
13613 49330 7329 -25327 -15057 -12194 -9060 40773 36888 19055 26853 43018 49827 -9421 -17151
13600 -17151 -11499 -12042 -5112 18901 29227 58865 60415 32555 23511 -844 14196 20088 3410
13587 3410 -35454 -39489 -16877 -7677 10631 18539 4458 -7621 50580 16723 2772 2762 -16849
13574 -16849 33194 -7471 11217 9668 18519 42582 32193 25118 -1479 25712 -6025 1455
13562 1455 -32431 5083 -3020 -4281 30064 16771 1665 -35920 -34528 -52174 -27210 13565
13550 13565 5538 -15336 7397 9397 27688 17790 6593 -25014 -21422 -6625 -9901 -39479 -35142
13537 -35142 -57363 22631 34247 14856 50927 12848 -24547 -11766 -23122 -5153 -3894 5605
13525 5605 19830 15105 25770 30162 15018 14414 -63429 -4150 16989 34905 16110 12264 49927
13512 49927 32357 8308 6111 14216 6749 3245 16683 9151 -34280 24317 22467 10794 3446
13499 3446 -4405 -14804 28195 -13241 15726 14678 13391 -2242 -34452 -13624 -10762 22263 40259
13486 40259 45087 42193 -9847 32405 14064 6975 -23915 -29716 10050 2546 4886 14183 8029
13473 8029 -9634 -2878 10556 -31014 -8341 35817 16685 2407 -8699 16031 16500 -11406
13461 -11406 5692 -17980 14030 14407 4585 -9831 -11077 153 -49783 -27927 -13512 282
13449 282 11318 30535 26096 17245 415 10435 14307 -10659 25281 25039 31667 34374 3950
13436 3950 -1417 9046 -17296 13853 18582 -3922 29439 21005 15493 -5635 -20615 -21643 -14730
13423 -14730 -7015 -24806 -1067 30945 30437 28856 19462 6597 10529 -5804 -33148 -27443 20369
13410 20369 14651 2531 -16336 -20705 26220 -20464 -9831 24839 25145 36494 16796 7956 7521
13397 7521 -16675 -35057 -60792 -24067 19573 31120 44847 29203 13493 -8008 -4914 22398
13385 22398 4268 -280 23983 17586 6931 1013 26806 12939 -36228 -20337 -19426 -10341 6038
13372 6038 7843 -34020 -43004 -13786 762 42613 5727 -2957 36500 51647 -7717 -10060 -9656
13359 -9656 -63353 -56223 -60654 -19941 -23970 4599 39321 40131 -14724 -18997 -9084 -28472 -11152
13346 -11152 9513 -21080 36271 34419 45395 14863 -5828 26960 37659 24216 -32204 1398
13334 1398 14525 3721 -9028 -6504 -6393 -17822 25054 19088 -13490 -26490 -5743 12995 -33609
13321 -33609 26384 29675 2180 18662 -20750 -8471 -15287 -22652 -20244 20795 9717 19283 792
13308 792 -3692 27673 -12686 3615 -17586 -18084 -4318 43791 8700 10297 -8807 -12513 -15605
13295 -15605 -11050 -12200 -92 9089 -8907 7456 32950 13693 -9689 -6341 8966 15689 20382
13282 20382 -16620 -31526 -12747 -19258 2984 5562 -26913 -40869 -19023 -13006 8501 38658
13270 38658 10419 -9203 -21056 10990 48797 -529 19737 -15297 -9643 -7398 -8567 -32314
13258 -32314 -47361 -22304 25248 -7147 -9859 12136 -19371 -14225 -14476 8753 -25695 -20069 -24637
13245 -24637 8294 -5462 13555 38528 11009 -31313 -34388 -17791 -44675 -34501 -21719 -14694
13233 -14694 7675 -10346 69105 59583 12869 9884 -13880 -31011 -40412 -26951 -29879 -26951 -4842
13220 -4842 11059 18153 7283 -2524 43652 34730 -15259 -13549 13881 -5510 13348 2606 -1437
13207 -1437 -30143 -3173 26636 28269 -4607 31479 39830 6390 14726 17812 25766 -19889 -371
13194 -371 14290 12134 16483 5746 -16987 5493 -21610 7525 25089 -4959 15718 68882
13182 68882 44170 31212 15880 7936 9321 -41195 -56389 -28420 -37611 -30283 -16816 25744
13170 25744 7485 -7988 9050 -1680 21721 4168 13185 23583 37155 6312 -5918 8504
13158 8504 -24174 -13907 22004 -28277 -34092 -10733 32645 32575 24833 9245 8375 -37604 24360
13145 24360 33060 -1046 -18134 379 -8534 -32280 -46981 -26093 -10157 -24386 -31994 17078
13133 17078 55050 4973 -45598 -7589 8715 3472 10195 -6186 -23933 -6721 1980 -1336
13121 -1336 -35464 -51929 -28172 -2777 7451 10331 -7350 -1073 -5313 16487 17838 -932 -26104
13108 -26104 -16077 43191 11593 5460 -2001 5153 5207 48977 48301 10875 19123 39342 21487
13095 21487 -20520 -5311 37792 17124 14281 -1853 25793 4753 -11227 11108 30691 30438
13083 30438 13723 -36890 -7423 -27591 3775 2322 14672 -6184 24090 -2326 10142 30649
13071 30649 26145 2570 18220 -71 -5622 -33662 -25577 6318 37994 45296 10350 -9305
13059 -9305 -17222 -16195 -19667 -14768 3414 26524 -16319 -10392 3244 -29891 -36202 -17408 -31964
13046 -31964 3844 13588 11279 -5172 -8564 -33038 9875 -16552 -10117 -5693 -29299 -45028 -35271
13033 -35271 1457 -2083 -32094 11140 25759 27135 16739 12463 47755 65059 31384 13207
13021 13207 16246 26534 26530 4718 -10040 4923 -8247 24635 29293 -30202 -13485 8897 21106
13008 21106 12504 5738 -2870 -31079 -12796 -18817 8329 21447 -23122 -27953 10059 44202 -5596
12995 -5596 -28565 16342 16899 2702 8275 -12720 -8415 -394 -13995 -24124 -21083 13864 6380
12982 6380 26425 -20014 5460 20126 35239 18266 33541 3670 -35337 1621 43368 17267
12970 17267 32306 43527 10420 1247 4019 -12294 -7922 -2003 -5797 8597 13396 9245 -606
12957 -606 5129 -17650 -26151 -21715 -36563 -47972 -36742 -10747 6024 -2115 30578 70714 32478
12944 32478 -8384 1717 23684 25087 1175 51771 17736 28203 -47253 -10304 15185 13150
12932 13150 -9273 -23608 1666 -3167 20284 50764 22823 12071 -90 -1921 8698 -11371
12920 -11371 -12211 -36731 -25160 -17784 3473 -20934 -14349 -9684 6957 4501 -5151 11362 -57032
12907 -57032 3279 -5142 -14502 -50046 -22460 -110 -22591 -18826 1075 40260 13311 -3716
12895 -3716 2274 13422 -37634 -16471 -22943 10632 18011 -11946 3547 3924 3071 38461 28563
12882 28563 -4260 -32112 -13515 -12309 -19887 -4601 -21064 -12217 -25744 -42920 -29750 -33175
12870 -33175 -18291 3459 -33687 -18875 25008 21010 10142 -3332 -13791 -25099 -17410 4411
12858 4411 -366 -7822 -8128 11489 19346 29750 5113 -13157 8233 1743 -11285 -10641 -34806
12845 -34806 -32902 -8552 -3234 -13669 14218 -44082 -4071 -11943 5209 16563 -11732 27869
12833 27869 13905 19033 28007 11391 4366 -3372 4177 -3212 29961 53017 3947 -8676 -10937
12820 -10937 -2892 14546 17403 -16289 2985 -33374 -15473 524 10418 51090 6498 29304
12808 29304 34764 19264 31810 45714 31186 36792 -4968 -60507 22917 -7655 -23164 -2475
12796 -2475 33629 49361 41130 -8484 -5811 13158 16898 29499 -23713 876 10962 -12221
12784 -12221 34779 -1158 15966 28442 424 10021 25907 -42375 -10843 18685 13992 68
12772 68 -1587 15443 33011 20686 13196 -7512 -12854 -17486 16942 -4400 -2798 23497 21318
12759 21318 3775 4171 -11004 -21996 24509 49145 16370 -1158 5225 29753 56965 7117
12747 7117 -24620 -24838 32564 -10923 19272 39939 23775 -7222 -14599 1489 10827 25571 -41067
12734 -41067 -9966 9713 13191 7636 -5757 5494 10527 50626 16565 -12971 -24246 14810
12722 14810 11843 5860 -6603 6190 37481 22447 15079 -5278 -1705 -6160 -48 -3427 -30593
12709 -30593 -5360 4340 -10894 17681 -27717 -13581 52547 10927 -34222 -6768 13202 19978
12697 19978 23514 5074 -973 12867 31605 -9031 -15113 -17290 -11758 -8660 2127 -16597 -7203
12684 -7203 -35878 -644 5365 -19939 -15081 12804 -22780 5095 1977 7996 2270 -13518 32157
12671 32157 26588 39747 54728 -30963 -23942 3134 -1861 -10504 7086 31292 12476 25489
12659 25489 29550 22118 59868 33571 41505 11570 -25117 -21996 -17269 -6617 -17773 27313 45559
12646 45559 35901 36185 11393 -6254 -1155 1058 -9574 -35910 -13287 29135 42705 10461 -3358
12633 -3358 -23929 -19427 -24809 1364 -1935 -10722 -27641 -18276 -510 16423 -2747 4367 10170
12620 10170 -40969 -19118 -12922 -13919 -17822 -17148 -19920 -23484 -24997 -4752 50732 28048 -9536
12607 -9536 -12844 7907 7287 39952 8133 10163 -23728 -36197 -34142 6165 1521 1163 -1637 3973
12593 3973 16116 14310 -13590 -15262 11917 -1846 -3075 -15549 45795 21765 -21784 -3518
12581 -3518 32586 12254 -15558 14877 23269 -3731 -55262 -61285 -31402 6280 20478 31847
12569 31847 15872 3946 -12534 2556 23282 -8707 -46667 -37184 -28413 9545 29213 6573
12557 6573 15281 26525 24209 10966 10569 12309 -29601 -13031 -26114 3985 19023 -5002 -12767
12544 -12767 -4176 -37340 -37242 1175 33615 27608 -11467 -10447 20314 27683 -8154 -8746 7032
12531 7032 23369 10071 -5419 27903 45844 -7608 -9249 10156 3576 3189 -13969 -18952 5241
12518 5241 12449 23000 4292 35053 20982 23693 -4612 11881 -11008 12535 5697 -9260
12506 -9260 21544 -7109 885 20927 22300 -42344 -17337 7624 12452 222 10227 -10273
12494 -10273 -28810 -15226 -39906 -18187 9411 -15584 -9470 9035 12476 44988 -5838 -4536
12482 -4536 -18777 17277 -38606 -23899 -14643 -12077 -17199 -26106 -15171 -24516 -2062 -32668 -14090
12469 -14090 12107 3601 -10417 -21429 -49323 -47530 -36298 -31856 -40762 -38781 -38 8903 16061
12456 16061 -6097 -20610 512 -17873 -2178 40012 12827 -4568 24546 26459 24111 860
12444 860 -219 -22210 -15699 27976 17014 -13639 -12410 -16997 -18949 -13915 -3643 3086 -17233
12431 -17233 -14328 14963 4236 21163 -2171 -25639 10389 2889 -32025 -3429 20321 12311
12419 12311 -15074 -39938 -59462 -45545 -43414 -38935 -5069 14006 23418 -39495 -12224 29002
12407 29002 -3545 -31167 -30563 -26662 -14073 -2060 -12219 -17207 31501 40697 8132 25261 11549
12394 11549 -2551 18909 40185 30631 21975 -1472 -26248 34515 60545 54011 27870 9401
12382 9401 1937 -9875 -10628 -16334 1779 25824 24243 9555 10940 20377 28049 53027 36826
12369 36826 -8238 -33197 17579 3329 -4947 -9198 -9736 8613 14602 11783 -16363 -25186 -8888
12356 -8888 -18049 -32224 -21028 -16930 114 -46512 -22359 -17771 -401 -26345 -17884 3251 28195
12343 28195 11054 -7498 8278 25790 22864 34360 60071 33356 16492 -18407 -2286 14880
12331 14880 -16966 2077 5666 27417 33420 16853 21526 22185 22770 -3585 16367 29424 30014
12318 30014 43020 -10458 -15975 -11539 -36875 1765 -20772 -10277 14825 11765 19082 -1581
12306 -1581 19837 12946 -19142 -25584 -9811 21875 -9066 -17783 22920 6196 10502 -33569 6046
12293 6046 10629 29275 29378 7277 -22133 -21927 -16609 14655 -25847 -2765 18608 22762 67313
12280 67313 19594 -6377 -26484 -21959 -34776 -14372 -40 -30923 -1930 14044 -8655 -29726
12268 -29726 -27014 -28617 -36559 32967 37955 40626 3177 10807 8943 4847 -2943 -467 8430 25496
12254 25496 8671 -23366 -6483 -23294 -41175 12554 51319 27981 8336 -6299 -14297 4489
12242 4489 15755 913 -30617 -1208 18888 34646 -29331 -15330 -970 34929 17163 -25530
12230 -25530 207 2794 -7009 6847 -6716 -29395 -8372 -59608 -56320 -43290 -6927 23988
12218 23988 22765 12830 5288 19533 -19543 -13581 2466 -6810 5259 1030 -24220 -1175 18093
12205 18093 14607 -5249 -14044 -10634 9356 33039 25828 36296 32338 35885 -15437 -31453 -27315
12192 -27315 -33661 11021 10779 36109 22638 20272 23753 26360 7651 18063 -4918 19815 1218
12179 1218 -14889 -49950 -19408 20910 33640 -3064 -4583 -9462 -45504 -27356 4980 10914
12167 10914 -6134 -15190 -7769 7131 -485 65339 30383 35213 6402 -9347 -35447 22107
12155 22107 52853 6055 -26186 -7012 15802 5124 -5287 35622 24460 10150 -41714 -28342
12143 -28342 11915 9304 13841 47061 18573 34173 47388 -2947 -16476 2654 23516 14579
12131 14579 19212 -13764 -29728 -6134 -11229 -34892 -42201 -35935 -31234 -29750 19109 35401 4095
12118 4095 19433 11470 29296 28423 -19359 -16011 -10252 7378 14882 28804 12669 -5090 -17763
12105 -17763 33002 26746 11508 -685 -25012 794 38546 43969 -14638 -26183 -37206 -13475
12093 -13475 701 -35779 -15819 11021 2222 -20256 -15239 19178 16999 3575 -21914 -54112
12081 -54112 -36721 -29303 -24231 3078 -11319 7322 752 35096 30322 36118 25322 -14200 -23780
12068 -23780 -26910 5746 45559 14311 8232 14878 39944 19146 -20705 3205 20867 15664
12056 15664 27340 18450 24386 -9341 -47020 4634 -28971 -6587 -42548 -46818 -31807 -15254
12044 -15254 -4822 -39448 -28012 -3322 29258 -27902 -20055 11203 30294 23573 6077 15074
12032 15074 4524 8344 -10017 -7511 -6055 1445 4103 18884 22484 6812 -15238 1050 7378
12019 7378 27140 -11005 -8702 13285 -4196 818 -3001 40796 31575 -3986 -21120 2834 -2905
12006 -2905 -12238 -2403 21160 19721 -9638 7608 12164 -41265 -15388 -22099 -41554 -29415 10061
11993 10061 19219 5701 -1297 -3819 3321 3961 -27467 -56126 -21273 6325 16582 11949 57637
11980 57637 -6359 -30046 -20611 -3686 422 -3203 -39959 29358 3668 -10725 -7664 -13063 -4065
11967 -4065 39365 41661 -11257 -3682 3788 -40951 6080 -9475 -26363 25277 -1866 -30646
11955 -30646 -15234 4736 35872 23122 -27670 -35441 -33688 159 -4132 5467 24628 8516
11943 8516 30021 53463 -10795 -20363 -19165 -21518 -51905 -53488 -7928 -16394 -37 14867 20264
11930 20264 23513 12392 22750 16430 31727 30347 -12669 -8834 4257 -6615 20510 -2814
11918 -2814 -1628 11101 34106 34367 61914 42611 5838 -17551 -31695 -11191 -19389 -15678 -10080
11905 -10080 -6669 18343 -14730 -11393 -324 31241 36709 -138 20815 32674 41197 33951 19635
11892 19635 17618 38705 26852 -21939 -10681 -17918 -34289 -29592 -38258 -22615 -3648 7316
11880 7316 -18526 -32485 -9155 248 -25228 -11990 -20738 -36483 -7378 12077 20676 4466
11868 4466 -12741 19079 27245 21894 -13303 -25523 -29117 -9796 21592 22304 33183 -4533 -6218
11855 -6218 4762 5826 -34143 -20514 3590 -27919 -22737 17324 -5548 9839 -29845 -26331
11843 -26331 -7042 18658 42131 -21478 -1920 -9661 5310 47272 -16193 -14564 -970 -14723
11831 -14723 19110 -14417 -1590 6012 -497 20945 2567 4239 -20781 -6998 -25661 -19584
11819 -19584 -3845 -3384 -8581 -9151 -3565 17049 -2328 4248 20428 17515 -14484 -11380 -32958
11806 -32958 -20393 22539 3513 -11694 -20240 26230 10661 3579 -5800 -6103 -21006 -24319 -30731
11793 -30731 -3244 -25972 -46458 -44252 -8460 39535 67591 14711 -10774 15383 -17221 -28499
11781 -28499 -1012 -16686 -2518 2870 -3025 1543 18899 -112 7039 5681 -3705 6427 16961
11768 16961 7298 18818 22510 4213 44044 41744 36372 -12245 -31377 -12920 268 -6045 47896
11755 47896 -5170 -52175 -31113 -6302 13454 -8878 11088 4382 11007 20268 -6047 7686
11743 7686 9933 -12578 -12758 -4733 14637 23893 6499 -3810 9053 4047 2810 1757 9029 12894
11729 12894 2790 -8953 -25461 22928 14687 -13409 -14137 -1932 9951 3974 26698 33220 31759
11716 31759 -3802 -13767 19127 -10962 -1830 -10763 -33303 11178 383 -14796 -74432 -23288
11704 -23288 -24430 -34508 -6053 22207 -12493 -12423 2232 -10998 8642 19743 -15141 16749
11692 16749 -3309 -19350 7034 -37373 -51426 -42320 -20661 -2943 -30488 10753 39335 -18671
11680 -18671 -1974 14097 -4844 -23683 -7334 -11518 -18727 -15961 11277 14569 -22402 23032
11668 23032 15856 6314 -430 -42614 8225 9495 2914 -1002 15561 20713 20735 -4450 -11283 9188
11654 9188 -5112 17498 25786 9105 -52678 -24948 4842 -18577 15538 24773 40858 19756
11642 19756 4645 3254 18059 -2983 -26306 -57786 -35195 -5970 -3392 -16586 -45402 -18069
11630 -18069 -31552 -18112 -22215 -26229 -21992 -58521 -25750 6988 -1268 -14102 -59145 -59198 -32498
11617 -32498 -1582 27423 11081 27861 45928 6193 12272 3495 -14891 -19873 -56355 -24429
11605 -24429 -16663 -15230 -37603 -8169 -14766 1596 -14390 -14885 16748 8333 23286 -2132 -14540
11592 -14540 -18678 -22905 -14176 -2476 23274 3828 14274 8492 45865 24878 -5317 1242 2070
11579 2070 17301 31482 10029 22397 17075 -733 18713 7473 -794 -40724 -34630 -38871 -38802
11566 -38802 -23919 -61516 -30066 450 -1789 -9365 -18141 -23315 -20324 -30681 -51797 -22114 -38708
11553 -38708 7154 -52849 -29919 12799 10064 -4606 -16716 31460 17682 12474 -47500 -70157
11541 -70157 -23179 -2306 -34714 -15545 -18281 -11429 1402 -9790 1512 3387 47454 23944
11529 23944 -12321 -45231 -92060 -53818 -16268 -1074 33878 47446 19098 2971 48135 48764
11517 48764 25291 -18557 -10023 -21341 -6221 -6767 -29040 -51260 -4178 17101 -30259 26382
11505 26382 2911 20261 -12696 -29471 -33930 -17216 -13367 -19232 -5944 23058 32976 -32476
11493 -32476 35576 51349 28141 34652 44334 -11696 -41662 -41404 -17535 -3160 -25021 -33756 -14462
11480 -14462 1076 -8725 -21271 -10406 -27011 13535 -10725 -14959 -24864 -10290 -19036 -45662
11468 -45662 15460 29172 57843 -19220 -11875 -10268 11871 25125 -21493 -16678 -27067 -34818
11456 -34818 -29790 -13761 -23571 -16567 -16232 -15189 -5248 -16995 6091 32096 40622 34851 4530
11443 4530 -10500 8766 13068 -3909 -4668 -32345 16646 14560 27841 32257 55543 38027 18023
11430 18023 10313 37178 -719 -33782 -14017 -30048 -20595 -17885 5184 -40849 -3279 12185
11418 12185 -23939 20663 -213 -5243 20094 16322 24848 -1776 -21849 -28889 -42125 -36469 -1659
11405 -1659 9264 -1884 -16988 43026 41654 25937 16920 -35256 -40690 -54183 -32717 -4000
11393 -4000 -17050 2160 -33173 -26546 -7886 2718 11861 8350 -42607 18431 72531 20190
11381 20190 -1993 4907 70362 42994 12691 13486 3685 -21732 -41078 164 5868 -34874 -34206
11368 -34206 5430 26949 33226 18162 5172 -5141 28984 -4986 -10129 424 -17727 -25518
11356 -25518 -23184 -34317 -10062 36811 16281 8477 -12706 -19632 -252 2497 32825 18285
11344 18285 6875 4889 21814 26128 -8405 -22266 -9115 -17087 27536 -12643 -16594 -12781 -28104
11331 -28104 -8276 -7486 -47755 -13125 14931 22168 35946 661 9219 9201 23649 -361 27800
11318 27800 1111 -15692 3744 16848 304 447 9483 -16347 -42051 -3551 -7574 30029
11306 30029 16938 -30710 -42232 3399 30870 36395 37715 31429 66480 22526 35239 39231
11294 39231 12399 -21359 -11281 6434 -30875 -30530 -10458 35205 29909 22544 -2024 -26510
11282 -26510 -964 8604 -2833 -32426 -11492 -17313 -40607 -11412 22575 20639 7504 -12577
11270 -12577 -46687 -13291 4749 -34633 2977 5038 -4735 -45789 -66202 -36660 -20890 -14267
11258 -14267 -17513 -14408 -26189 -40919 -998 2191 -3711 11540 33175 22750 5728 12861 -39324
11245 -39324 -29554 -22897 -7739 13336 13575 11162 6570 -3805 -8966 -4070 27824 -12354 -32616
11232 -32616 4419 5802 11487 -24661 -24645 -9705 20539 32587 6721 -1899 3198 2688 -28933
11219 -28933 -24248 7142 21284 -11092 -38812 -12870 15629 -1924 -3769 -546 -1822 -17021
11207 -17021 19160 30684 25060 -11227 -23102 -8733 -9247 -28723 -37122 2152 4515 6382 13415
11194 13415 -13723 26769 41830 16543 -19016 12658 14833 -33837 -53126 -10763 -20766 940
11182 940 -26367 -54766 -22642 -22819 -7142 -25180 -31874 10168 4715 -484 24392 13404 -23248
11169 -23248 -13305 -16684 -44193 -33414 -5988 -14619 -31434 -18600 -18765 10087 30773 34278 -15137
11156 -15137 -8788 -961 5300 -47153 -50397 -1555 -21158 -8727 177 -16089 2039 -4166 -4519
11143 -4519 -190 10913 -32034 -11230 -3578 -32073 -49078 -11452 3685 -10869 -14909 -4270
11131 -4270 17542 -17164 -52432 -47462 -40449 -2460 34918 14345 9752 -21532 9241 18176 -8945
11118 -8945 21970 50545 40366 -26273 21219 25466 33228 8167 -19091 18263 9130 -3109
11106 -3109 -20866 -37216 -22383 11073 -436 22669 28259 -12625 14888 -16469 15271 5150
11094 5150 3178 62073 4266 -23171 -37848 -19582 -9667 -35461 -21989 6057 21102 -11258
11082 -11258 3698 15706 10176 -21181 -8760 -13426 -43250 -25459 -14364 -18360 -18483 12077 -20023
11069 -20023 -8177 -40113 -24600 20891 5512 -4052 -31954 -45639 13440 24504 -22965 -31331
11057 -31331 -37050 -37351 2281 -11837 -11821 -19214 28510 30652 10033 -6584 9798 17368 -11148
11044 -11148 6603 -31529 23372 6204 19503 20146 34980 17311 -12598 -33435 332 7893
11032 7893 -37579 -42364 -49495 -17778 15125 12952 25357 33072 -31253 -54694 -34956 -28742 -11397
11019 -11397 -9115 -17355 30176 12048 -4384 4754 -21411 -47821 -18860 -43415 -31971 -34694
11007 -34694 -46248 -40043 -29886 15279 -24010 -15131 -24842 -12293 45586 24375 8761 -11976
10995 -11976 -42634 -17344 -14226 -13230 -17903 -18182 -1815 -3368 1468 16363 -15579 -25754 -10569
10982 -10569 -11336 9816 -13714 -13530 -10369 9267 9641 -18484 -38193 3767 -12672 44466 -3896
10969 -3896 1506 -21804 -46287 -8004 -6654 -3481 -16139 -22295 -21142 18621 26172 -6455 13648
10956 13648 19529 30067 11246 -10638 -29526 -45629 12500 8295 19910 27318 17965 15542 737
10943 737 2135 -27668 -56621 -23647 -7283 -20281 724 -924 26429 16973 27545 37700 5534
10930 5534 1977 -8162 -5584 -21009 6018 8949 23109 19085 6017 -22107 -24790 -877 -10369
10917 -10369 -7638 20360 8618 -20033 -17096 -9683 -816 10160 25657 54081 -19269 -17983 -6805
10904 -6805 -4815 -6759 -7840 -2755 -16906 -12935 -24187 24462 11975 20239 -3681 -29093 -13751
10891 -13751 -710 -31761 -51588 -793 -32313 -24437 -19101 23617 17843 -20276 -15057 -9865 8631
10878 8631 2035 -10472 -39747 -59029 -59161 -43074 27413 -9813 -12709 -11235 -12450 -12221 -26329
10865 -26329 -2316 35001 -4465 -21007 -19892 -35340 -14695 -2879 16530 4012 -1158 -7270
10853 -7270 -6194 36974 8304 6338 9665 15459 6291 -32896 47434 34490 18968 -1962 -11021
10840 -11021 -14567 -21380 -47760 -58571 -11295 -177 42318 66820 5432 -5704 23412 -605
10828 -605 -27240 -26335 10628 2803 -23479 -4710 -12461 -14356 -4355 -24075 -13552 12213 10370
10815 10370 -16350 -9997 -15787 37187 11476 -23912 -52573 -29285 9288 2338 -21026 -31771
10803 -31771 42845 47074 -8289 -25805 -7971 32643 -8939 -26236 37016 30570 13065 14918
10791 14918 17037 -261 6957 -5960 -8470 -20905 -91 -10010 -13456 -27522 -17679 -20565 -16288
10778 -16288 8495 -40488 -12616 -28182 -9108 12295 11758 -6228 11211 20861 -678 33153
10766 33153 -35652 -41861 -33414 -45056 -20819 6585 18664 11957 7844 -3532 4040 -26694 -30420
10753 -30420 -17205 -18276 -22674 -24653 2827 2117 56485 14739 -38103 -5498 -14253 -21074 -41194
10740 -41194 -33251 27200 66910 49395 13319 36448 18256 33669 -10877 14937 14173 -3371
10728 -3371 -1314 7585 26031 13542 -1024 -9224 21681 -9925 499 -32036 -45579 24112
10716 24112 10699 24090 -4580 35357 2894 -14018 -52926 -13856 -40658 -67108 -50148 -5254
10704 -5254 20048 434 -1519 -13190 25557 -2164 -1580 -21676 -5237 15594 2722 -23438
10692 -23438 7558 18345 28262 -5165 -19296 -24253 -51807 -36056 11585 -36419 -928 6846
10680 6846 6205 17230 14030 -31229 -37300 -46117 -60235 -26774 15548 35747 -14064 16862 857
10667 857 -12741 -21319 -29454 -22816 -58281 -27415 -18337 18610 13855 10217 25988 10998 -5086
10654 -5086 -5125 -40801 -35782 21308 25208 -6785 627 11956 -29853 5754 -4772 -10526 -20285
10641 -20285 -19221 5468 -16124 32088 8451 -14891 -5703 17479 -40864 -36623 -28643 -2128
10629 -2128 -9568 -13693 -10341 -24238 -43433 -7219 -21206 -28303 -29052 -43636 -33829 -96913 -98548
10616 -98548 -62696 -64535 -83283 -57824 -13486 5630 -13358 7300 16515 -18251 -13513 -15513
10604 -15513 -6181 3266 22222 3961 -2635 14643 -1621 1609 16195 60545 23233 18414 -50531
10591 -50531 -6551 -30232 -20209 -20155 -13664 35989 46990 32973 -21215 -17739 -8425 25017 -14448
10578 -14448 -14484 20605 870 -38721 -20783 -2432 6584 22669 -17509 -40806 287 24756
10566 24756 26238 12565 11912 10613 34347 23483 -22469 8167 1805 21169 -4606 -25569 -56723
10553 -56723 -20329 -19253 -22572 -1761 -2109 9750 -26616 -10295 -4420 12839 -10270 -6251 -13880
10540 -13880 16909 14564 -34268 -41060 -37068 1091 -16322 -37675 -46219 -23773 -8461 7053
10528 7053 5061 -3944 19067 12257 4799 -54862 -53279 -37604 -20691 -5489 -47790 -35498 -8000
10515 -8000 43387 36683 21748 -10578 -7499 -36899 -8245 -14080 -27845 -8012 -7090 -9672 -12486
10502 -12486 -5518 -14266 -12459 41724 46143 33647 26192 9664 -11156 18129 -13126 -49605 -4284
10489 -4284 -27411 -9506 7927 24963 25709 22864 -27739 -25302 -34324 -32077 5351 19947 -25029
10476 -25029 -54250 -18933 -35619 -25175 -19445 -6752 -12457 -14521 -26048 -47882 -18787 -27404
10464 -27404 -25570 -21116 11470 17919 776 -30867 -49352 19217 -21210 5205 -11924 1350
10452 1350 -1685 -43129 -18242 -37940 -39577 -54025 20665 12028 -869 -3639 -5459 -28702 -5208
10439 -5208 -5620 342 23237 10876 -3899 16372 11626 23888 -27909 -15006 -41991 -21233 19437
10426 19437 -26354 -82693 -47194 -56158 -45895 -3384 38567 7651 -27129 -69 10249 -21696
10414 -21696 -46272 4768 -2470 -9442 -44407 -12717 8390 4518 22912 29677 -11543 -30727
10402 -30727 12573 -9925 -23498 -7546 -16920 33023 23045 21436 -6335 -2053 -35107 -42456 -1960
10389 -1960 2421 18289 16140 12406 -23899 -2090 10402 -2223 5505 14000 4740 1663 -28323
10376 -28323 -11742 451 -30488 -11584 -48153 -41387 -18832 -479 -13876 -25168 -37257 -35198
10364 -35198 -2550 -4570 -9104 -20756 -28123 -16102 -20962 13307 -21262 -5264 -33210 -24933 -7400
10351 -7400 -15897 -15475 -7711 -8441 21263 -3987 -69800 -11236 -9882 -37288 -45680 -16733 2082
10338 2082 17515 14383 -5119 16553 39807 19131 3497 7788 -532 -8223 -3265 8938 9850
10325 9850 -1012 -3243 -6901 -35371 2953 34927 -830 -771 -4336 -33071 -19399 -46911 10909
10312 10909 36955 30190 36979 30670 36475 -4104 -58169 -20360 10707 -7070 -28720 781
10300 781 -20534 4071 17369 16723 13782 -3078 -34388 -27626 54764 34129 32758 8642 12547
10287 12547 -12427 -8596 -32844 4222 35901 2073 -2801 -41098 2005 13265 19136 21693
10275 21693 14384 13551 24582 22060 -8998 3574 18010 -24677 -10876 23835 11476 14855 7053
10262 7053 47949 28417 4926 5036 -7473 6820 -22937 -14560 -23169 -15526 3786 14485 14112
10249 14112 -14459 20796 -29559 1206 -24215 -11670 -24248 -22893 -10505 5101 -24784 -1723
10237 -1723 12146 -14439 -8686 -20696 -41084 -22476 -10320 -25809 -33804 -14532 11208 21072
10225 21072 14550 30896 -5352 3208 8324 -11748 -18762 -11958 3226 20087 -13574 -1407 -598
10212 -598 -5903 -9767 -9126 919 1414 -21506 9284 -43802 -46117 -10007 -18526 -19984 -20646 -11145
10198 -11145 -24903 5061 33882 36225 -5916 -18424 -43597 -30710 -30452 -35897 -55744 -10800
10186 -10800 3018 2932 -26581 725 22359 31537 -11794 -22014 -18683 -19660 -36226 -25252 17174
10173 17174 24454 -13580 33282 3674 1930 -8562 -8928 6995 -14495 -5986 -34929 -10468 5360
10160 5360 -17137 12927 -30020 -34181 -46555 -27265 6147 -6995 -20012 -4081 -28366 -37304
10148 -37304 12341 31607 -10429 -19143 -11530 16128 12461 24324 6456 -534 -12120 -6122 -8365
10135 -8365 -4881 -21972 -30848 12475 -18253 -9419 5249 44179 57861 16082 21020 27405 25457
10122 25457 15098 -19379 10180 1715 -31546 -6905 27145 9628 -18975 -54442 -22788 13998
10110 13998 5181 -7740 23714 20189 39615 -12800 -33681 4632 -35045 -38980 -35587 -20594
10098 -20594 32989 22510 5611 8428 15722 49539 32056 -2558 8384 -23402 -2832 28781
10086 28781 13409 4857 -1932 -6811 18271 10662 16136 26433 30588 9895 36378 32877 27982
10073 27982 33227 24285 15301 1225 -6384 33881 -16363 -45638 -16400 -33929 2651 20739
10061 20739 32065 31242 42711 21494 33434 13737 -21459 -28950 -21625 18199 20870 -824 3816
10048 3816 -23977 -26941 7817 32043 -7278 13520 3447 8264 2092 13606 16385 -5784 -12180
10035 -12180 -36389 -27095 -11547 -14750 -1458 -24404 -12162 25710 -5433 8408 -29948 7683
10023 7683 8505 37647 12173 34397 23441 6058 5613 3005 -3922 19276 73200 31430 15742
10010 15742 36051 35175 58043 19647 24095 44369 48691 26140 33317 54636 32396 14759 45969
9997 45969 24953 490 10521 16238 -16555 -10433 9832 -16755 9787 20315 7123 -11749
9985 -11749 19231 66185 19234 -46306 13503 18625 -21682 -7565 25901 -15816 1357 1055
9973 1055 13746 18790 17877 -9285 19454 -4920 21220 -9559 -20922 -14233 -32715 -29216 -2140
9960 -2140 38087 46120 29451 -6025 43 11236 4068 -14381 -1100 -29575 -25161 5876 9700
9947 9700 15341 -10354 3099 -19006 -12608 -1137 3545 13594 -10042 -590 -210 25696 35442
9934 35442 22979 -14900 11178 13765 12516 10123 -25002 -25064 -18707 -13481 -313 6724 5883 -8265
9920 -8265 -15719 -17107 -2810 -441 25052 -44893 -36785 8975 2323 31990 19751 27824 -5499
9907 -5499 -25516 -12193 27778 15225 -4655 -10766 -32279 2612 -3704 6595 43484 24392
9895 24392 -22315 -12942 1318 -27425 -32425 -19741 20205 -4588 -29977 361 -21282 -14320
9883 -14320 -40811 -63639 -58020 -32290 -12435 -15259 -9061 -14957 -9246 1881 -35 -41419 -40235
9870 -40235 -29248 -15038 2236 -8675 -10407 3738 25501 35108 -6000 -18946 -15079 -21172 -12856
9857 -12856 -36503 -35813 -15998 7637 6045 -11861 -19767 -60898 -13418 -29852 -13562 -22465 -33831
9844 -33831 -4085 22262 32281 -14339 -50474 -49254 18360 -2518 907 10002 -4104 -10645 -12493
9831 -12493 13265 29952 18700 46567 36988 -26093 -8669 -10527 -23714 -30059 -17675 20410
9819 20410 6721 -6410 -9114 5666 -34963 -44138 -19158 -11829 -2191 -59227 -23133 10971 19457
9806 19457 -11744 1965 -2240 -27717 -26419 -9666 14115 -12311 -32718 -6540 4023 35212
9794 35212 25846 21666 22662 50387 63973 10650 -6093 983 -28923 -41437 2094 16198 3742
9781 3742 -7313 10984 1163 5894 -39949 -30446 -23341 -5762 3556 951 13628 25776 5017
9768 5017 13398 -16179 -23340 -50047 -19807 -22815 25107 -1634 19033 2757 17632 41670 -10323
9755 -10323 -7090 13807 21389 22609 8815 -2936 19698 14297 2376 -36393 -21990 13809 23156
9742 23156 -24827 -62750 -69682 -76464 -59962 -38527 -26728 24581 -1162 -341 -27424 7017 28424
9729 28424 21370 -3014 -2969 25848 -20669 9817 -15841 -24405 -29220 -21887 -18010 -7824 -4682 -28823
9715 -28823 4926 3352 -1575 -47911 -18826 8072 -24457 -16697 -2311 13545 25767 9440
9703 9440 31713 17661 24195 -8168 14277 37383 12871 -29897 -3399 1721 -28853 -32444 4465
9690 4465 4925 -34126 -20579 -19333 -14532 14187 52534 15794 -26286 -16167 -29228 -47781 -31326
9677 -31326 6938 3131 19965 18374 -31721 -35064 14020 22444 -4071 -7993 -23835 -29511 17819
9664 17819 -12941 -20848 -29734 30557 45390 38417 26700 5097 38181 35607 8422 -43040 -913
9651 -913 -16652 -55449 -6507 42689 36530 1983 -47067 -1150 14721 22034 17220 27681 -5637
9638 -5637 -17850 -29620 -27775 -26563 -17268 -3839 16995 20482 996 -9591 -21488 -10614 -11351
9625 -11351 -35611 -63588 -33419 -17525 -30771 -7894 5864 1115 30717 50875 23294 -5340
9613 -5340 -7695 -6371 7319 15516 -28792 329 -11153 -17195 31311 10425 4103 -1561 -16311
9600 -16311 -26982 -29890 -30744 -15240 -6116 -39120 -43666 -1185 -11463 -29296 -22351 -11193 -21677
9587 -21677 -28594 -17966 -24022 -4150 -40022 5596 7453 41588 1552 -34311 -57038 -66016 -32046
9574 -32046 -45086 16389 -33000 -4217 -13975 -16491 17915 -895 16263 -12561 -13030 -6077 -6270
9561 -6270 -26237 -49706 -21176 -13141 15589 -18448 34639 6121 -12501 -3600 -13245 -7462 -16230
9548 -16230 -19013 -23188 27652 30890 -1354 27685 23206 -14520 -63649 -54211 -6212 -25960 -53502
9535 -53502 -1049 13592 20337 -4412 16314 18178 7662 -11192 -37064 -39040 -50551 -16624
9523 -16624 5359 13683 10227 32153 41254 25879 12342 4088 38232 32610 -5715 -1001 5461
9510 5461 20018 -3810 -4729 -3448 -11143 -8207 -11656 10639 -34321 -36447 -12057 -30671 43748
9497 43748 21059 -8347 -1817 -8886 -144 -3785 -27963 -15612 5137 -20825 -72797 -15091 -4715
9484 -4715 -12192 -9232 25933 -10907 -1038 11364 28156 40815 3342 27893 10021 -2289 -8106
9471 -8106 713 -10052 2599 22806 11782 -20637 8338 -4707 9610 17619 -3317 -6530 -23020
9458 -23020 9557 20257 33780 35471 2791 -14188 -16296 -23438 4610 28753 66871 29092
9446 29092 809 7826 -15587 -15333 12446 26969 3454 252 -24485 -21608 -18240 -3499 1409
9433 1409 -24610 24138 36216 34185 42205 27621 -13405 -17577 -19472 -21325 -53111 -30025 20846
9420 20846 47170 57213 70326 34640 26666 20763 -17034 -12063 2666 623 22191 6559 -19576
9407 -19576 18021 25223 17424 -8460 -24644 -39146 -39262 7903 21089 18767 23991 -1035 9545
9394 9545 16928 9089 -7663 -11432 -10425 -13929 -22147 27776 62092 9757 -4421 -4942 -17503 11569
9380 11569 -2170 -5626 18090 54493 15699 29836 25529 35087 39994 -26526 -63709 -31422 -17041
9367 -17041 -11979 -21258 -24405 -4842 -22297 4134 27092 -11670 -13014 -9764 -138 234 -34553
9354 -34553 -42897 -42109 -43586 -31590 -49728 -15203 2624 13236 -14881 23362 43454 21420 -962
9341 -962 -23140 -4597 -9356 11180 10394 -7651 11464 1577 -17411 -5316 -6315 -9272 6300 9349
9327 9349 6747 13722 -7192 -24131 338 3760 -8236 3266 78918 31623 -42205 -35004 -61583
9314 -61583 -26438 -17264 -2737 -23165 -16323 -3855 -14818 -12744 -33541 1308 26564 -6408
9302 -6408 -34238 -27732 -73 -9999 4373 42336 62153 48343 31722 -21271 -19886 -1379 20622
9289 20622 45120 -5826 -12530 -41351 16245 6095 -17207 -19978 -21759 -23081 -2697 -18894 -37979
9276 -37979 4169 -13118 3079 -23623 -31497 -31679 8188 -3873 26241 5791 -15996 -25901 -20081
9263 -20081 14470 -1698 -17203 -32060 -30781 12168 -6750 22209 22542 25269 -4472 11047 4464
9250 4464 -25335 -12480 -18715 19246 15942 16051 25685 28553 -1837 23957 26549 -17643 2556
9237 2556 -32388 -6153 -37832 -21197 -26131 4778 16109 -6420 10075 -3636 11067 37962
9225 37962 50828 -34127 33886 17337 -8830 -42859 -12917 30160 38126 15935 -16941 -9245
9213 -9245 15842 21812 -21939 -15083 -23838 -7467 -5674 -29643 -36347 -7571 36816 -33681 3609
9200 3609 25581 146 17248 -648 20722 -30502 -13463 -9448 -34344 -18846 -58132 -25364
9188 -25364 -2655 -10711 18921 -22913 -5698 -27844 6552 -6388 825 25267 -9618 -35335
9176 -35335 -24354 12126 19180 12012 -2831 14512 -29213 4993 1899 -23547 -21643 -18105 26319
9163 26319 27569 -15626 -9934 -15674 -24926 -31016 -4360 -12970 -5994 39528 37478 57060 28550
9150 28550 4682 8938 34600 -22524 -12537 -33949 -50082 -34331 -57599 -14473 -10883 -15139 -34660
9137 -34660 -11981 -20626 36881 16954 4904 -18987 -50317 -41137 12900 12621 -19973 -38122 -44475
9124 -44475 -2516 9198 -23117 -6278 18039 -6811 -9955 17041 17556 32727 53345 28797
9112 28797 -426 -20572 -33090 -4468 -18581 -34852 -30255 -7266 27518 -15668 6303 -4821
9100 -4821 -905 13321 32757 15527 15521 9722 -27506 -26140 -18359 -12632 -13339 20403 32012 -2279
9086 -2279 31167 27500 1111 -8324 -17423 -27685 -9070 9547 12915 42359 10200 14471 -18029
9073 -18029 -5895 -1582 -13290 -11090 2266 19930 45566 45325 51800 30159 33496 57689 12295
9060 12295 8551 26802 14187 -25828 -39685 5878 -30121 -27740 25012 3945 8939 6708 10427
9047 10427 30275 28285 22493 1534 -11512 9656 11709 -2611 -5694 16830 19063 413 27532
9034 27532 16598 9958 -6017 -26686 -37071 -40890 -14361 7229 26937 -15684 9308 18972
9022 18972 29772 -952 -11363 -9102 6376 -11474 -26078 -15718 4975 37891 3867 11404
9010 11404 -10122 -8327 6917 -10942 2053 6221 12863 8341 10947 -2856 -21221 5743 11347
8997 11347 -31304 -28163 -5591 35733 21090 37151 36279 26632 51993 35477 -12731 5895 -9959
8984 -9959 5524 12465 6313 3685 -29288 7340 -9436 -5112 766 39394 20374 14129 29564
8971 29564 12368 23057 9332 35373 1818 22817 5968 24204 30551 21380 14194 20356 42351
8958 42351 53931 85945 39268 53244 25655 -11987 -63167 -54457 -20769 34098 55731 3644
8946 3644 13023 35072 38893 -979 -25175 12338 7728 42433 -6545 17325 48096 64548 29848
8933 29848 2704 36129 29739 7299 -34627 12042 32037 39308 47228 50117 515 -12583 13956
8920 13956 -8663 -5727 -6647 -1391 29463 29591 -7725 -3061 621 -31820 33115 13094 -12795
8907 -12795 -10545 16349 22069 34789 26558 21230 32204 13881 27199 28159 9563 24240 20420
8894 20420 6623 2971 -4432 -2248 9995 -14793 -13583 -22627 -12694 -27076 1404 22353 -13062
8881 -13062 -5347 -6966 16933 -5732 -31752 10928 29824 -6262 36785 44378 2986 5537 4286
8868 4286 2464 -8112 -25008 2290 -28862 -22788 -28203 3296 -30591 -37423 2621 1742 -340
8855 -340 -56635 -53338 824 5725 -32079 20625 28569 4293 32819 185 -13801 -9883 6749
8842 6749 15612 40354 15755 -6601 -13988 -35895 -33129 3728 25449 39972 15982 10409 31981
8829 31981 39507 26590 40093 -8542 8800 -11892 -2296 12669 -7352 -11242 8078 41873
8817 41873 23281 11364 13083 23665 15905 -17715 -3020 -2045 18476 25615 48060 49854 14918
8804 14918 -12928 13609 -219 2810 35371 8641 61124 70805 64716 21130 5572 -3718 33211
8791 33211 24122 43455 53695 21144 19242 3634 9831 22668 22933 -40626 -50416 -10728 715
8778 715 30478 25279 10658 10639 15051 33275 21509 23971 -18019 -15724 -874 -10581 -21673 3136
8764 3136 5898 38629 8102 -7646 20064 -2922 12099 18828 64138 38883 16397 -34828
8752 -34828 29619 21277 14034 -323 5227 12320 16342 45168 51653 21135 21136 -16968 -10367 -42245
8738 -42245 8869 -545 13960 -4363 -19648 -11005 7169 5657 25356 24652 32482 18574 -26157
8725 -26157 -3545 8410 12791 -20550 -28381 9904 8299 17822 -5645 -12569 9953 18853 28559
8712 28559 6938 18989 23346 -2917 -29847 15542 -15501 14693 8418 16082 -21302 -7603
8700 -7603 -1900 -9462 -9194 -8830 8769 6219 -5450 5050 -6919 14283 -22525 -41485 6068
8687 6068 32630 24806 51019 29094 6117 21712 -7270 4108 5422 -19683 9526 6336 14306
8674 14306 49547 2132 14195 -31507 -19121 20346 3266 36761 12122 -13178 -34413 -18389
8662 -18389 5730 2381 11752 4049 2142 40328 26056 8169 43577 7902 -12001 -39350 -4119
8649 -4119 5026 -5511 -3036 -4898 34606 16735 5491 5462 -2036 54244 40163 24117 -7527
8636 -7527 -7699 22611 34512 48174 6657 12913 31366 19285 1363 -36712 -23049 -4343 -10324
8623 -10324 5463 5985 -2945 -9461 -862 -6712 14746 11803 36684 31188 37411 4213 4956 5151
8609 5151 60811 33174 17452 17800 -7636 22075 32830 12489 15977 -2665 12326 22129 -9154
8596 -9154 10900 9822 2699 35476 -5422 -13813 -2266 -1691 6046 21470 23520 18377 19784 39926
8582 39926 24824 16119 44197 39931 33723 30451 19590 30730 5913 22126 6743 1966 3699
8569 3699 33060 -4032 -12233 51321 19369 -14177 -2032 10904 26427 78733 52599 42287
8557 42287 48309 60875 62995 48206 32178 43168 26542 63704 47303 52439 33821 45950
8545 45950 60506 38091 19507 27064 4887 19674 20921 44775 8731 31325 47276 29508
8533 29508 37688 25434 37064 -5257 17850 21690 30257 33516 13609 10646 11767 55288 14999
8520 14999 13870 24141 52865 63908 59380 65037 44113 10960 27375 15195 31700 45733
8508 45733 48316 74033 52198 31423 52486 22660 10357 47148 57212 62001 -4882 21534
8496 21534 41044 15060 17377 27831 -6424 7733 41104 56862 60875 63648 29877 57300
8484 57300 57789 8981 36678 62686 79089 46164 12456 -5998 6983 23914 40755 63802
8472 63802 94618 32731 23862 1509 5849 26192 40090 25979 43157 65142 35096 23009
8460 23009 28711 35861 14724 -9375 32663 18938 38238 60089 60731 31833 32036 68213 53660
8447 53660 75849 19366 5458 48748 68325 66496 30095 37902 23896 24316 45217 32413 42561
8434 42561 53931 63674 52861 113499 93525 56917 -29805 17299 88658 62197 72302 28806
8422 28806 51372 76340 48507 23408 6856 52221 27735 24934 2598 27865 46348 45389
8410 45389 41061 51317 41190 28491 42611 27910 38548 17172 -19496 10683 17136 33035
8398 33035 16972 63575 75751 60070 60634 38723 16629 34049 71411 65771 45271 32034
8386 32034 48209 32742 85179 49473 -6883 -16466 9902 1662 11344 38873 48488 52184 62652
8373 62652 67646 32591 53749 44600 55083 66172 66291 30230 56008 72347 90435 108038 73693
8360 73693 45296 59319 85518 116050 61785 31679 3010 56348 71634 44821 33637 66325
8348 66325 77354 67281 75390 53848 24220 45287 71246 44554 56824 78056 39748 25951
8336 25951 64733 82718 54901 10870 36728 50192 108732 36478 63705 59258 82733 92443
8324 92443 67252 74065 57909 42699 22489 34811 52318 65703 106860 78371 63443 64980
8312 64980 31635 37079 22056 22566 63893 23913 57272 67840 79888 70236 38998 9485 16167
8299 16167 59483 55234 38735 64147 67748 83245 76322 51486 76301 79841 64822 74558 28246
8286 28246 45124 49230 15983 14625 41055 84504 63793 69052 65526 58067 12642 6147 51084
8273 51084 26078 46531 65107 52052 48495 40644 91744 106402 115323 96065 79414 32717
8261 32717 29090 70013 59726 51910 42515 91195 95298 55666 70291 73121 86276 64411 36346
8248 36346 63987 73651 63709 61109 33707 58545 57119 92978 105396 80368 63710 42240 75909
8235 75909 103587 85752 53759 53599 91762 53355 78879 69802 91734 94567 45954 29074 34708
8222 34708 15333 46822 61552 25531 35336 78153 54741 66494 66193 50895 76284 39106
8210 39106 79631 77546 62153 60127 85530 83524 98548 127620 73906 77080 70156 56716 73074
8197 73074 108930 82443 45812 88644 156570 450664 251858 111346 135942 117761 140282
8186 140282 134715 122637 78996 91702 131913 117305 19975 17738 50507 104398 73044 82719
8174 82719 92122 99851 84282 103801 97624 99248 65881 66547 79986 87477 85276 81891 97584 93731
8160 93731 83295 99532 96972 84700 58008 86434 88653 58908 57457 60739 87357 69320 61231
8147 61231 47334 63818 103398 111048 94480 82685 67124 104525 81790 90107 60339 47321
8135 47321 56177 85340 103783 73860 101322 94142 112757 130674 137195 125016 109319 111924 119779
8122 119779 108147 127016 93939 59112 84118 79805 87633 116514 79545 97397 125026 149849
8110 149849 136156 143789 111220 88056 104433 139216 148308 96085 109941 115834 135028 99360
8098 99360 96044 138244 152057 157890 107965 98969 65542 60961 102461 118186 91154 152951 154101
8085 154101 116320 102241 103921 142121 112151 128378 93656 89280 127242 119455 114491 117612 109772
8072 109772 132043 153905 152586 100200 106640 106802 77878 45919 78962 76738 106414 122112 118423
8059 118423 77948 117175 149580 144236 87691 80111 126645 119772 103378 112423 85639 119530
8047 119530 156349 161165 121677 104389 109479 127425 114414 115269 114835 110045 142026 127855 134905
8034 134905 171684 197491 165916 174783 145373 124670 113417 123837 124807 155409 132107 118914
8022 118914 114683 156551 153708 118066 131156 135062 146430 187430 162731 145297 147088 123282
8010 123282 105469 135929 139473 157914 142939 177520 177237 160738 138276 135335 146447 130283
7998 130283 134338 162096 163915 112827 112208 151590 181673 197244 187107 178604 182763 175423 130752
7985 130752 182484 183499 145219 179511 190693 179511 164537 184263 151252 171009 162038 120187
7973 120187 136871 157305 168862 174714 161122 174422 153881 165338 196757 176117 186528 228714
7961 228714 193742 194214 184870 194266 218240 188401 192591 169429 164216 181702 196436 212904 217172
7948 217172 206679 220417 190505 196179 234126 239605 262710 232045 243575 249840 231169 207008
7936 207008 209530 211961 200095 228805 252164 233118 248831 243696 214482 210845 270222 265460 214407
7923 214407 171325 205554 231155 246554 260023 250092 227688 207147 271506 255092 232605 275567
7911 275567 334440 307489 283153 276463 253253 258404 260419 299117 290026 265438 245343 252077 299311
7898 299311 326299 318709 293450 320124 337516 309092 250212 269011 283074 326483 357093 334910
7886 334910 350705 330276 354346 386606 379910 394401 396520 384933 347743 386166 353767 414967
7874 414967 429905 431640 454428 450973 501557 507893 531265 504679 501008 564233 595906 560959
7862 560959 563398 599176 636209 617612 620884 625675 658383 630987 650124 704584 748843 785421
7850 785421 802910 864511 926401 952681 1004478 1011799 1093337 1140617 1205263 1273668 1322364 1438432
7838 1438432 1479782 1542941 1644660 1747671 1840970 1962061 2125265 2315598 2498306 2743007
7828 2743007 3066504 3469256 3936942 4399190 4866680 5130926 5212036 5188144 5095575 5106175
7818 5106175 5129371 5084411 4808892 4351847 3812247 3327988 2906508 2585285 2350123 2116494
7808 2116494 1952877 1844132 1703249 1568112 1472340 1449690 1361342 1284267 1220399 1160057 1124676
7797 1124676 1096544 1070235 1030329 970026 943207 952538 928066 905948 911016 926018 902196 899305
7785 899305 882420 874061 871137 887962 883837 853339 884106 886047 899168 904546 926897 921369 897407
7772 897407 902799 885671 924255 937389 969958 972548 975193 990284 1010686 1017397 1054562 1099827
7760 1099827 1112332 1138563 1125523 1139359 1150959 1214203 1262642 1302462 1296628 1305441 1369825 1348385
7748 1348385 1396489 1469354 1564972 1596945 1623126 1634299 1659089 1688536 1677063 1735872 1777393
7737 1777393 1808373 1846523 1874594 1874147 1857638 1873449 1926444 1962636 1994570 1981956 2010263 2021137
7725 2021137 2004933 1997863 1998692 1991673 2006230 2008813 1989341 2016123 2018469 2041217 2021213 1974539 2004340
7712 2004340 2008481 1982520 1997592 1955036 1919411 1933116 1958058 1923853 1887008 1854690 1824203 1839987
7700 1839987 1824423 1829039 1767183 1740427 1703964 1661212 1607130 1526042 1517496 1473825 1433840 1383876
7688 1383876 1355406 1378827 1370882 1348377 1261919 1271413 1238649 1198797 1187348 1170082 1143193 1106892
7676 1106892 1098892 1056612 1065170 1006027 1029948 1061834 1072009 1007231 1009540 1037837 1032130 987533
7664 987533 973708 948975 953981 974296 961582 985365 959941 965726 983278 978505 976300 964907
7652 964907 912204 921559 932496 912308 947973 932683 921319 955143 960905 953572 964711 978418
7640 978418 958747 987541 959255 947543 952579 982390 982874 1010508 1021326 1002573 1043193 1040043
7628 1040043 1014227 1013376 1051113 1072985 1082420 1056932 1036450 1046631 1104757 1108977 1098656 1080153
7616 1080153 1078299 1099053 1082318 1088876 1083674 1079678 1103012 1097622 1129785 1162450 1172217 1193015 1161114
7603 1161114 1142495 1157581 1148549 1176744 1214900 1233186 1252858 1258635 1223424 1239890 1222654 1235023
7591 1235023 1249701 1245011 1290271 1311244 1307059 1286631 1316253 1321345 1337121 1394462 1402358 1404525
7579 1404525 1395830 1403129 1432840 1436124 1476831 1517588 1520280 1505276 1494135 1559944 1559343 1555677 1579003
7566 1579003 1595499 1610677 1610349 1653114 1623791 1684131 1686102 1742548 1807103 1782591 1789239 1822536
7554 1822536 1815582 1851931 1877990 1899502 1918336 1931735 1966915 2017984 2037158 2020291 2066300 2122450
7542 2122450 2089827 2104179 2168576 2219532 2248079 2274265 2292903 2330535 2360857 2404391 2421108
7531 2421108 2448197 2506037 2547641 2565442 2579423 2651498 2672575 2718546 2762485 2794323 2842064
7520 2842064 2889095 2923682 2976512 3011858 3029300 3045675 3064628 3106914 3155807 3190194 3260765
7509 3260765 3298011 3331916 3371619 3436452 3444409 3522068 3570142 3626514 3642214 3673784 3797817
7498 3797817 3859558 3955271 4006897 4089914 4166810 4196757 4262129 4341345 4390510 4476871 4595071
7487 4595071 4677371 4753980 4849535 4988768 5064839 5130254 5217259 5314058 5396360 5501972 5630134
7476 5630134 5715292 5828077 5946498 6104329 6276838 6408799 6553290 6693459 6813457 6991960
7466 6991960 7152179 7288449 7409446 7593949 7790582 7992886 8169245 8381655 8606803 8799486
7456 8799486 9053642 9318971 9564623 9831349 10103069 10440576 10768960 11085834 11401188 11750883
7446 11750883 12187439 12557176 12998613 13501084 14016313 14526215 15066974 15590677 16225679
7437 16225679 16883082 17542662 18250452 19058171 19911256 20803478 21741128 22765660 23848794
7428 23848794 25039317 26345996 27690688 29178950 30756698 32443340 34309439 36332909
7420 36332909 38467902 40750084 43265603 46007277 48880404 51960466 55287854 58853838
7412 58853838 62630173 66578328 70780731 75200322 79768340 84606524 89604313 94989643
7404 94989643 100749969 106986753 113846381 121431298 129767941 138957112 149074677 160248469
7396 160248469 172489323 185785004 200085618 215170616 230507131 245283331 258527314
7389 258527314 268909090 275388669 277082933 273664266 265520239 253572551 238967127 222890676
7381 222890676 206373687 190289562 174988954 160837951 147884975 136100664 125483130
7374 125483130 115971984 107387027 99600435 92709163 86440098 80765048 75600552 70913199
7366 70913199 66653444 62748159 59201241 55900683 52865690 50033807 47423754 45050397
7358 45050397 42821205 40747352 38823397 36975122 35267420 33683578 32176716 30804298
7350 30804298 29451189 28228563 27085966 25987346 24934224 23917445 22969861 22094946
7342 22094946 21291684 20538503 19795348 19108119 18462427 17821621 17207159 16613513 16069467
7333 16069467 15581458 15097524 14670524 14266419 13852952 13446067 13029091 12654453 12302706
7324 12302706 11952197 11630201 11351338 11062300 10777852 10535867 10335583 10146565 9932280
7315 9932280 9734669 9569911 9443701 9347637 9253191 9238913 9207672 9252046 9171707 9003710 8773392
7304 8773392 8514528 8226214 7956637 7710665 7509527 7313897 7149145 7012459 6834112 6710245
7294 6710245 6608014 6534145 6470219 6416157 6384935 6367054 6357308 6370973 6401315 6504575 6594823
7283 6594823 6716310 6945333 7227799 7555230 7946519 8255967 8444427 8364135 8080459 7620476
7273 7620476 7055772 6636637 6199565 5817590 5544864 5338717 5159740 5023022 4865712 4745296
7263 4745296 4646356 4582425 4526499 4477626 4436763 4427225 4415224 4470780 4531718 4642617 4801278
7252 4801278 5022665 5251096 5570743 5851512 6013682 6050356 5952392 5897535 5821999 5813380 5751380
7241 5751380 5619817 5332263 4912800 4535962 4237022 3932257 3767324 3585425 3407398 3289525
7231 3289525 3177970 3099071 3044761 2938178 2935134 2875130 2851932 2839717 2860887 2856755 2948135
7220 2948135 3001537 3056142 3080005 3053481 3031398 2931005 2915568 2898958 2876359 2808694 2632108
7209 2632108 2448692 2250637 2111591 2056515 1994946 1879449 1796909 1701961 1658168 1622994 1603661
7198 1603661 1548744 1499211 1436516 1398630 1401363 1379643 1359210 1321979 1303878 1296086 1306605 1285088
7186 1285088 1233308 1239296 1225694 1224284 1199987 1176970 1150364 1104660 1128030 1120571 1076415 1035784
7174 1035784 1049781 1020837 1044879 1002088 979034 976418 987463 963105 983781 934043 898997 879451
7162 879451 860745 805551 819949 792460 785787 822764 833019 798954 775074 760110 757112 746715
7150 746715 726935 727687 707565 702715 698289 684381 653740 652826 654953 626915 637405 638023 681908
7137 681908 676203 673544 616824 584760 607971 610548 601439 582413 562908 593061 600421 582860 578742
7124 578742 530101 563305 529359 524413 508594 482261 478770 512963 508974 495591 511598 488054
7112 488054 502552 535637 508251 502114 487888 500028 492343 474427 452794 451192 491757 470841
7100 470841 484159 440709 438717 450536 438149 389980 387044 389204 368668 368636 388445 360878 351107
7087 351107 389801 399314 429891 368402 358397 410994 392731 362946 354009 347296 351385 337833
7075 337833 334817 306808 295364 337153 326818 354272 370964 368848 372621 337828 350267 313900
7063 313900 325042 302881 284118 280059 266036 260794 314476 313597 279701 309101 309605 277803 290510
7050 290510 283637 313906 290925 264959 245926 266331 270819 224044 194758 184226 221291 212806
7038 212806 224545 203591 207620 231037 247928 264643 257131 244436 239080 227300 242528 247356
7026 247356 205857 203340 217482 252837 284923 212289 205421 186263 218170 227032 242195 255748
7014 255748 204691 195176 172710 219115 194594 183179 149888 145754 180950 200670 197396 131026
7002 131026 172959 194751 191543 176759 136845 144062 167044 196255 164810 134998 181848 196093
6990 196093 208321 233658 207125 176031 150932 134576 155266 156238 131688 114159 123583 166950
6978 166950 185034 162767 134650 126856 129865 136556 120601 134345 123955 128817 129145 137028 131279
6965 131279 148434 150350 141054 152428 162370 138590 130383 122019 115861 138698 137039 162625 169250
6952 169250 158881 127797 145120 158395 149064 130133 106453 75795 127113 125714 106965 117679
6940 117679 97178 123145 98985 122359 104190 121448 97406 130310 111938 76412 124358 99465
6928 99465 147777 137884 108579 62618 105674 87782 64196 59721 61980 80764 116213 159403
6916 159403 135950 167188 133068 83879 82601 70804 41004 63413 34905 36415 78840 53832
6904 53832 46820 39616 84662 109784 114926 83134 83667 128400 109345 100526 85051 80495 69245
6891 69245 52305 86372 106399 96619 79897 96652 88797 56165 56625 53768 60303 95843 82545
6878 82545 85353 68725 80062 82244 104270 87753 44177 49448 48549 65732 81856 50596 27107
6865 27107 43962 19188 24507 32791 56345 44588 30697 64109 65236 80583 83601 50650 43112
6852 43112 54092 48709 71917 66841 74768 58730 28735 39598 61453 70547 88998 48336 39067
6839 39067 34992 27603 31116 28966 58489 76001 84001 61918 54094 9001 12138 56976 89648
6826 89648 58763 24043 3699 49013 56754 8512 37071 55117 45033 24030 21809 21194 22623
6813 22623 15967 27022 11303 23184 18344 25746 36407 6843 -13664 -12379 -10842 4110 64725
6800 64725 38044 30537 65321 54093 47123 43262 -15754 15269 4375 9207 53406 73593 50393
6787 50393 22785 29743 39994 26849 5609 21011 9181 24233 24364 17491 33103 28049 4555
6774 4555 28823 -2336 19214 -2456 19563 29649 14216 -9720 -5184 11356 945 11583
6762 11583 -5674 26110 48255 35941 20082 68151 57441 27907 11073 27301 31252 60661
6750 60661 56278 32010 25027 -24538 2199 -3692 -28579 8874 -31212 11381 -9065 28072
6738 28072 28380 42606 71143 77806 52876 31849 39434 20296 44615 13633 -3978 -2339 28527
6725 28527 39451 47357 19825 13078 60207 23045 -15102 -16243 7494 -695 -25028 -22811 3594
6712 3594 6435 -4585 29534 24467 44600 36270 5312 -3716 -20003 1440 8549 12708 -17802
6699 -17802 16121 18062 6205 26409 29105 27673 -8360 5224 -36308 -48310 -37872 -6937
6687 -6937 -3275 -13605 15614 37820 50263 19810 -14905 -27104 -6536 -31492 -22686 -14142 -20636
6674 -20636 11531 27251 -7227 1040 45059 14237 29886 26331 -7356 -28194 -2748 -9952
6662 -9952 18048 42945 -10445 -14065 -12548 14440 30216 19378 -1714 -2027 26437 13498 15193
6649 15193 17015 21922 13166 3221 -4214 -34032 3306 26563 -2220 -32999 -21576 8155 -27118
6636 -27118 -44832 -46555 -28277 4585 47999 42193 18986 40453 11508 19917 13791 23784 -200
6623 -200 -10883 7238 1099 132 -22960 -22491 -43314 2126 -4336 9356 -16212 -27194 11132
6610 11132 31939 38077 6188 1350 14761 -18743 23715 40123 17427 -2275 21402 2512
6598 2512 6859 -1782 37233 -2277 20268 22997 4389 23042 10581 -16236 -7339 1584 -45035
6585 -45035 2878 -12767 -15981 555 248 -6141 2796 21717 14003 28104 -4476 4403 5791
6572 5791 9121 -22974 -20601 -11794 -50015 -45176 -45391 -8528 -7420 -2034 -10773 5401 -39698 -42174
6558 -42174 22860 47493 -12268 -7868 -14705 -526 -34636 -35007 11340 30105 16943 44733 70617
6545 70617 51103 10473 16691 -433 16671 -10176 9384 22560 -34861 -21769 -25967 7477
6533 7477 12488 -3164 8886 -35945 -33589 14819 5045 8349 3609 -12285 7336 -2771 -11374
6520 -11374 12206 29310 19673 -21789 -27206 -22734 -20946 -26277 -21992 -5869 -32493 74 19915
6507 19915 2060 -27259 1512 14858 16095 -5989 -31620 -3401 -10385 9328 5143 7398 9813
6494 9813 6244 -22023 -58255 -26575 -9861 4995 -30942 -12622 -20270 13846 10592 -12988 -33465
6481 -33465 -28075 16390 -10065 -11908 8515 17413 -11270 -18574 -27683 -15739 -5025 4509 -21387
6468 -21387 -19773 -30535 -30912 11816 -8711 -24600 -26904 -458 -17917 -23961 -21180 -43170 10801
6455 10801 14883 -20501 -39477 -84127 -62765 -55431 -48814 -25572 -764 20371 -49745 -21036
6443 -21036 -17365 -46637 -70864 -14356 25739 26527 36781 10980 -6104 -14962 -35401 -33658 -40105
6430 -40105 -29717 -39758 -14092 -2934 22007 -2223 -22344 -663 17117 33727 -14649 -82927
6418 -82927 -36812 9842 -1891 4784 11799 -32000 -25914 -12838 -25780 -31379 -17896 -28058 -52181
6405 -52181 -62086 -21496 -12855 -21851 -30392 -31742 -18730 -30679 -4594 -19538 -2032 -39876 -50180
6392 -50180 -22585 853 12062 -1728 -5866 -9987 -15499 -40344 -64576 -68411 -27139 -38197 -61814
6379 -61814 -50016 -49331 -20442 -48234 -24530 -49198 -26735 -13196 -23604 -13611 -35050 -30121 -45434
6366 -45434 -8499 -26041 -49736 -61534 -65218 -24363 38296 16937 -19983 11842 -36412 -72991
6354 -72991 -66217 -45065 -52499 -54085 -52749 -36794 -60789 -42453 -47984 -42327 -15137 -18081 -930
6341 -930 -31499 -41763 -66246 -54684 -45524 -27839 -14442 7700 2775 -28377 -29795 -40185 -34755
6328 -34755 -55102 -38705 -27296 -8053 1861 -10224 -25996 -49138 11939 -1563 -31320 -58073
6316 -58073 -35820 -8344 -8845 24407 38770 -5503 -13666 -2832 -4305 -25605 -12685 3456 -36982
6303 -36982 -44150 -55950 -55748 -5411 259 -18116 -42109 -11677 -719 -32855 -27557 -36670 -33913
6290 -33913 -6408 36356 -4875 -21254 -8844 29538 -5183 -32050 -12522 -10234 -27774 -78677
6278 -78677 -57495 -4417 -4964 -13716 11560 -27962 -46168 2105 -3023 -23595 -31992 -21524 -19477
6265 -19477 -7996 -5120 -15709 -6345 -16473 -3090 -19210 -42656 -60850 -57728 -28650 -32092 -13866
6252 -13866 -35766 -24120 -49653 -34126 -51971 -56574 -26955 -27315 -29322 -428 29769 4067 21220
6239 21220 26834 13719 -5474 -13235 10479 -7331 6351 -37953 -39225 3902 9593 -5666 -42913
6226 -42913 -29482 7752 11771 -31476 -14053 -2865 -39974 -39714 -30185 -33292 -43183 -24457 -38978
6213 -38978 -40179 -26176 -6896 4348 -11517 -39934 -64798 -21275 10830 16344 -16942 -25905
6201 -25905 15304 20850 -16215 -45282 -54821 -56842 -39295 -7310 -34949 -34985 -38898 -56323 -57818
6188 -57818 -17494 22836 17606 -19728 -15323 -46336 -61056 -38877 -10431 -13801 -13068 -42878 -34609
6175 -34609 4319 -34573 -30996 6702 9909 10336 -22945 12962 -11590 -14296 -18317 -39639 -55603
6162 -55603 -45614 -21033 -7796 -16284 -18921 -507 -26602 2726 5724 -20193 2646 -255 -13406
6149 -13406 -31270 -21708 -23994 -35167 -22619 8894 -29426 -41452 2299 -22116 23796 -58420
6137 -58420 -33272 -11073 -27101 -17776 -29700 -65610 -40779 -66636 -79457 -53905 -58710 -11672
6125 -11672 1626 -5655 -27617 -536 -23464 -4457 15664 10804 -64540 -65231 -34978 -16987 4591
6112 4591 -32129 -39594 -60090 -58792 -29874 -22516 -29228 18867 10751 -2628 -8065 -12396 -16147 1461
6098 1461 30826 7204 -37193 -23105 -22424 -22128 -14404 -32656 -24482 -24051 -27920 -12144 -25328 -38018
6084 -38018 -45517 -20674 -24000 -37851 -16900 -15560 -11552 -5552 2436 2128 -16847 -25028 5913 30338
6070 30338 3562 -1018 -922 -31138 -11865 -9154 -11387 -2905 23140 32675 4641 15996 -24177
6057 -24177 -14084 -7818 -9250 34705 -52371 -79065 -14161 -7114 -20155 -23995 555 30894 28452
6044 28452 12817 -67073 -48068 32431 6932 19967 4089 24712 5348 -29637 -43583 -23144
6032 -23144 -17276 -58364 -40497 -43653 -41344 -42138 -52547 -39408 18613 41001 811 -19579 -12840
6019 -12840 -8455 -28799 -16460 20413 -19124 -19060 -33451 -12598 -19307 -45723 -63692 -28480 -14442
6006 -14442 -14489 -52067 -25290 -8455 12545 22627 26234 20128 2074 -11795 -25323 2094 -17574
5993 -17574 -27749 -33591 -20412 -2619 24510 24865 -7935 -19259 -44290 -2405 -20019 -52071
5981 -52071 36784 10557 -3252 -7349 -4724 -21009 2019 11655 -19582 -29621 6218 -10121
5969 -10121 -40509 -27339 -16320 -30462 -10057 13651 -27611 -53800 4142 -26620 -53526 -32300
5957 -32300 -24528 -33270 -28428 -34157 -17818 -9195 -14878 -4748 -22228 3679 13516 9717 16686 -24200
5943 -24200 -35583 -27604 -17797 -6456 -306 -3328 -23906 -34570 -22626 -21039 -27570 -51881 -25107
5930 -25107 -39116 -61751 -80574 -83763 -42086 -34334 -11409 -639 -5005 2572 6193 -19289 -42160
5917 -42160 -71342 -30854 -45289 -72403 -30772 2895 -19179 -31392 -92578 -61522 -7670 -4531
5905 -4531 -3801 -31149 -23064 -12091 -27893 -36322 -28289 5693 -32820 -51163 -42874 -27135 -35824
5892 -35824 6632 16870 -38004 -5910 -2309 -24939 30363 -630 -8816 -20643 361 1349 -23320
5879 -23320 -27036 -21802 -9946 -16995 -20486 -42449 -51826 -45216 -51177 7498 43134 -2039 -21574
5866 -21574 -6708 -19570 11857 13615 -12490 -22105 -52078 -47540 -35761 -13003 -12541 2635 5394
5853 5394 40098 -2510 -46814 -53471 -45507 -44178 -23049 -23370 -9036 -34365 -7962 -13528 -15614
5840 -15614 -11656 2878 18503 -5704 -41035 -38081 -21047 -39538 -9383 -368 -21162 3180
5828 3180 -16253 23500 11351 1508 14255 -6593 5050 -10139 -6645 35569 11747 1550
5816 1550 -22501 -8979 -21411 10156 12397 3720 -35076 -41481 9971 -16611 -42674 -44826 -41569
5803 -41569 -24009 -2847 -9615 -25114 -30729 -9267 14963 6538 2534 23396 10783 -58515 -31639
5790 -31639 -10562 -37352 -30994 -35319 4255 -33163 -43831 -8015 -14995 -56349 -24427 -18328 -15465
5777 -15465 -30325 -84138 -63942 16227 32654 -26886 -44848 -36033 -34774 85 -42800 -45043
5765 -45043 -56188 -20559 -24798 -21765 -37254 -417 -50031 -61923 -7837 -10692 10306 -7207
5753 -7207 -58624 -8196 -42487 -3552 -25757 -62381 -15079 1079 13987 -4917 -31598 -15916
5741 -15916 -15101 -29943 -47993 -17430 -14229 -37482 1105 16848 -14842 -29981 13610 -7880
5729 -7880 -27958 -17463 -34059 -60289 -72797 -19463 -30293 -20611 26621 31290 2318 16965
5717 16965 -2406 -38955 -14569 11901 8577 -29039 4327 6294 -15423 -25464 11111 6165
5705 6165 30959 21391 -16638 -28307 -31800 -44092 -30136 -50770 -26119 -5529 -2094 -5971 -17892
5692 -17892 -34923 -965 2585 7533 -36392 -60876 -57828 -1390 -27416 -23714 -25228 -13292 -16774
5679 -16774 16933 22718 -60 -18764 -31188 -43931 -51120 -46576 -59887 -5869 5896 -23988
5667 -23988 1891 -7563 10583 -14553 -22524 -31139 -40689 -81634 -60070 -12997 -16984 880 -29467
5654 -29467 -5747 -25228 -27711 -49901 -40472 -11195 -4465 3890 25342 52474 16521 2397 -8918
5641 -8918 -39836 -11848 -17587 -5766 -52240 -4285 -9962 -28270 -40838 -42566 7383 5862 -6491
5628 -6491 -4052 -254 -34306 -56238 -48756 -8204 -19069 -32549 -41622 -61631 -24185 3041 -11969
5615 -11969 -17661 -46487 -8323 -627 31763 6340 -9874 -770 -11077 -9978 -37101 -43876 -42900
5602 -42900 -29855 -29869 -27201 -37106 -5605 -2849 27745 -30909 -54930 -7486 -45020 -41304 -39466
5589 -39466 -45692 -34774 -20747 -5155 -4336 16015 -32848 -31297 -7520 33045 -19663 -50745 -70941
5576 -70941 -23455 -18455 -18045 -1322 -39382 -17103 -65925 -19304 22073 29145 -12829 -24645 -686
5563 -686 -33873 -6987 -40647 -47754 -19439 31204 10382 -17273 -30837 -41946 6619 -23432
5551 -23432 -16634 -24028 12901 -16772 2063 -16108 -23153 34133 -19631 -13306 -1931 11834 138
5538 138 8539 -7683 5653 14460 14565 7932 -16333 -1411 -422 -26001 -135 -12926 -9803 17996
5524 17996 -4358 -23368 7215 11622 -14066 25814 38761 14558 1578 13125 40429 14362
5512 14362 19268 23095 15981 30063 20180 3006 12784 -10435 24520 27570 -23475 -50839 -29809
5499 -29809 -28761 -42228 -41323 -36064 16922 17973 53286 34110 9507 -23081 -57025 -27804 -37904
5486 -37904 -19132 -14334 -15669 -8396 1677 15968 29018 -827 6829 8081 -1916 16907 -34139
5473 -34139 16233 -26477 7701 25487 25616 27060 -6902 -24993 6012 13225 -19033 -15777 -13436
5460 -13436 2144 -6218 25661 44254 18262 17838 34006 56635 32464 12926 14906 23042 45766
5447 45766 52831 39685 45223 70250 111382 85469 21701 13761 31112 26928 33601 30292 65683
5434 65683 60918 29374 71349 58311 46354 43014 -22686 5965 16065 39091 84116 82778
5422 82778 17031 44773 44329 29459 33565 19466 32971 22827 30040 57818 54906 39703 49832
5409 49832 30954 28346 8479 17477 31723 46058 43392 47899 2491 -13877 -5937 -48469 -16175
5396 -16175 32109 24876 11897 11884 27272 34266 50877 26982 11036 -20848 -3433 -5661 15105
5383 15105 -5960 -19995 -40487 -11628 28607 24011 -19740 -12407 36504 11591 38734 19984
5371 19984 27426 11785 15778 -15688 -17454 -22555 7415 44568 46738 70827 45681 25976 50997
5358 50997 59618 12621 11468 6997 9126 16359 1600 8047 6837 35862 39596 -16727 5961
5345 5961 3690 -20447 12422 -10338 12457 43279 28312 31891 31378 35700 42993 31634 46567
5332 46567 48845 24789 23500 21377 12934 26776 19603 26904 47180 29780 34409 56657 49614
5319 49614 65150 106984 4683 16401 29446 8806 30849 4435 9252 34641 20543 39547
5307 39547 22685 15791 16717 53594 42244 24215 12158 76725 65050 68001 95854 62101 69052
5294 69052 67268 77265 27073 29722 36180 63884 82434 107948 108049 129521 124555 42560 92457
5281 92457 80100 66234 49513 68233 78819 79665 89897 96763 87728 100216 118255 114909 126020
5268 126020 123811 144760 135061 107335 130931 154171 149868 171644 180080 173435 189447 215966 179468
5255 179468 196521 198942 243489 273275 266862 232323 263058 295449 350513 352937 330455 340040
5243 340040 373505 419391 443323 456246 503681 558796 566664 577222 619146 636095 672801 736751
5231 736751 787739 848782 914287 962767 1025389 1070109 1162312 1265774 1328526 1379077 1474165
5220 1474165 1547322 1613931 1714682 1737538 1762570 1779499 1797000 1842979 1874582 1895774 1940624
5209 1940624 2016239 2094758 2166215 2227577 2304787 2360520 2390474 2413865 2419925 2393060 2381090 2338789
5197 2338789 2232459 2136591 2065597 1992142 1910278 1913816 1870837 1780189 1763030 1731841 1720908
5186 1720908 1700902 1639765 1552527 1544765 1462492 1421043 1330772 1236905 1182957 1054940 990395
5175 990395 888026 813780 774847 727172 698585 678107 634930 631106 625295 561110 505592 481977
5163 481977 440552 448864 432109 392739 401540 411384 406921 388562 365515 367652 299966 285162 268189
5150 268189 274124 294722 270725 251003 228837 204056 215400 234097 222435 173932 189137 222536
5138 222536 192499 172688 159402 143534 174649 170288 141940 150820 92233 105855 133879 136485
5126 136485 134478 138186 131902 141979 157195 129130 107605 97828 112834 84764 59662 80891
5114 80891 113554 131692 121152 124942 96372 88271 57101 51112 96013 87761 82932 67622 72868
5101 72868 86190 76224 82064 40377 39311 45978 44841 40000 27947 44137 57398 82901 67132
5088 67132 41550 3896 33240 54778 25685 1654 41503 75860 41401 14549 40802 49853
5076 49853 73245 64946 38902 39301 66947 50840 71950 52852 47346 56509 56283 67516 59678
5063 59678 15969 17416 47971 65442 71747 -2177 46298 50965 24874 -4306 -3652 40636 29489
5050 29489 25879 67455 73740 43044 33141 41078 70434 51794 24045 -4469 29958 56487 64799
5037 64799 42914 51087 34862 63333 72182 48027 29400 10964 53945 57732 59198 28455 18580
5024 18580 -6299 -9428 26080 44297 33292 20512 -3877 26350 -6792 11060 373 -12544
5012 -12544 -10201 -12523 16607 53607 23360 15586 3441 22246 17184 4009 38703 41273 20282
4999 20282 8479 15283 36977 73317 5051 22347 47568 12191 41385 16651 31189 24123
4987 24123 -17037 13583 11197 18698 -6544 -1238 39372 48896 6350 30469 24648 12455 -15796
4974 -15796 -23015 -7438 547 -10767 10372 31065 35088 38754 11573 19652 23241 45387 25182
4961 25182 13941 42569 15594 -10413 -12929 29962 45787 50340 13072 1192 10324 10320 -1493
4948 -1493 -664 28137 1254 46576 7307 26458 10194 14402 2397 -27155 -9083 -41756 -37582
4935 -37582 43249 23328 4802 -9046 24106 22546 8805 -2186 -24296 -9700 -16330 17216
4923 17216 16947 -9927 -7642 28028 31120 6851 -3171 38856 36184 19581 24585 -1846 26911
4910 26911 21852 30103 31972 1406 -1139 25674 41833 9388 43198 38004 8685 13481 30319
4897 30319 -11371 8664 22538 23514 -1552 -38299 -610 23401 38088 2597 -11867 6464
4885 6464 16515 24900 -27140 2465 13902 44295 20542 -16675 -5157 32484 -1491 19038
4873 19038 13834 20664 28097 48221 67740 2463 19739 -1418 20812 32520 20378 26332 37095
4860 37095 27671 19164 16473 -867 9329 -13088 -21343 40799 35503 17130 20701 28200 23759
4847 23759 -27735 -40868 -11697 31826 13894 -9352 -18532 -915 -7673 10981 7371 32064
4835 32064 44751 27266 20903 -28438 -15750 -17362 -22773 8352 -10336 3651 23964 3405
4823 3405 22467 45651 49933 28626 20654 39028 25432 34830 67126 60191 23606 17131 37546
4810 37546 23879 50700 15926 -454 -14306 27640 35434 22116 18783 10539 18627 6551 20091
4797 20091 30571 38642 55664 50440 31442 847 -9050 29897 37087 17681 60205 71548 83007
4784 83007 51759 58981 65881 89676 20768 -10360 29243 29663 26066 51592 85045 99960 87800
4771 87800 93134 89055 89347 90372 73468 95988 106349 86348 74918 97029 96572 89980 100890
4758 100890 96397 88602 101741 101495 120640 95640 109310 116339 130808 143372 115842 122604 120651
4745 120651 194966 139953 92164 167823 169555 195204 175899 169554 156393 155601 178707 197637
4733 197637 223834 198886 202549 186044 196057 231568 241086 258999 295623 318046 319454 364937
4721 364937 299245 309012 352795 371748 350531 382385 415056 430536 489955 504755 496219 488416
4709 488416 534980 606236 619956 648715 669575 742328 741810 796445 821955 888588 967431 1026618
4697 1026618 1074225 1163720 1313941 1390499 1450530 1513094 1621820 1693133 1774524 1824196 1840003
4686 1840003 1885578 1965476 1961699 1952754 2007952 2032507 2065991 2117751 2183869 2280695 2360777 2418585
4674 2418585 2500755 2604867 2585534 2575247 2629708 2560115 2456703 2354206 2251172 2105038
4664 2105038 2032007 1947955 1903865 1858170 1802463 1749721 1719676 1691351 1633354 1607479 1531582
4653 1531582 1497778 1454589 1387446 1285027 1213030 1134924 1053095 968953 923595 873356 790985
4642 790985 727961 681775 641580 636372 586184 570818 554164 505393 496882 480743 450847 436752
4630 436752 392526 363940 386737 389770 352985 352685 317116 297747 309572 282702 275556 285892
4618 285892 247168 223309 215302 240533 233665 259550 250840 247739 182116 188018 193872 189585 198035
4605 198035 172572 192923 168078 180309 179624 176460 207143 187915 198790 185126 154193 122922
4593 122922 149374 140203 142870 153366 136251 154339 206525 205475 138718 142314 141745 155349 188543
4580 188543 163612 146089 147311 161993 161500 134523 169852 180391 190313 112334 102306 149607
4568 149607 155579 143187 176919 180403 160776 133045 149467 149098 120099 103856 120806 146875
4556 146875 141686 115616 135370 156571 152030 129708 118903 169781 178602 172386 148413 163462
4544 163462 175824 152194 165896 174414 182665 171500 136221 158109 193832 192806 215464 204343
4532 204343 212011 221217 224178 222295 239775 264724 260342 264559 318005 313800 320127 346889 329537
4519 329537 335705 347692 324750 326331 382168 425741 481704 517142 539329 576454 556341 569980
4507 569980 621681 678200 695791 716689 764239 808228 832880 887735 962506 1037210 1129623 1166454
4495 1166454 1251783 1341069 1418830 1508898 1559918 1672134 1731598 1774187 1838558 1867782 1909227
4484 1909227 1932685 1955939 1972047 2018781 2078717 2151758 2194398 2258857 2330876 2423647 2523493
4473 2523493 2570007 2626045 2628249 2582064 2525402 2437808 2342440 2246103 2189125 2093746 2065686 1983798
4461 1983798 1949691 1918504 1857759 1855216 1774515 1759772 1759203 1716869 1638619 1561102 1477730 1407397
4449 1407397 1308363 1214120 1114638 1052834 989418 906347 867680 788185 699372 669737 619840
4438 619840 578553 539999 525460 505305 480551 440517 429228 417581 380167 339549 368184 323803
4426 323803 322862 295279 292508 296556 312982 307896 267698 230898 205214 221119 187409 223081 178205
4413 178205 190179 193397 208398 214735 192058 169096 191224 165231 189998 188200 154478 142784
4401 142784 143844 135095 159948 149838 153773 136508 151527 125480 115202 120872 126945 127046 136062
4388 136062 143694 116903 118478 121399 126020 140658 116455 105140 105316 101377 105533 106018 79990 74464
4374 74464 88637 108595 80730 62142 92128 98965 104764 101886 116710 117292 107840 104692 106205
4361 106205 83331 98279 35358 84867 71112 101705 105753 133045 124861 87123 74189 67410
4349 67410 93545 97811 105700 105319 102867 145198 164639 117207 116111 122198 109957 79035 82484
4336 82484 75250 103050 82150 99033 98299 85971 101815 75474 47947 60768 37997 20858
4324 20858 42768 60070 90976 98531 75136 110473 63031 30557 63185 73934 46277 45642
4312 45642 51299 70751 94942 79977 116432 95993 61348 54366 64260 77337 86971 85437 62133
4299 62133 29207 46294 114587 111944 95334 111032 109885 107976 112078 118524 82649 100997 114543
4286 114543 105538 133236 110904 89049 90267 72528 93680 99927 101350 122504 135537 123938
4274 123938 158076 116433 84489 69549 79258 85320 76919 117796 119300 94554 86453 105082 86896
4261 86896 83036 72202 34820 96381 60511 56288 62787 70107 101162 49196 62975 58026 57056
4248 57056 64326 52655 42378 86789 78249 63677 68095 83698 94829 62861 50697 29397
4236 29397 29136 76798 67115 48660 85232 54522 25637 59679 87882 74235 74817 51113 93716
4223 93716 92901 57791 93789 122347 82847 55780 68406 91657 91680 68053 89160 105674 113215
4210 113215 77517 97736 113748 116476 36903 60592 103264 72440 62713 46736 56358 68975
4198 68975 90711 73432 84957 88921 67981 65475 48561 73611 42863 51292 38731 30293 80571
4185 80571 53882 84701 83463 75935 51634 41176 51482 66941 42694 99017 64813 45111
4173 45111 46095 58525 88546 70857 94815 100413 93026 57726 52658 73448 86947 100344 67450
4160 67450 69492 115981 117190 100334 66363 65865 73527 89681 64876 78782 32196 33849 46504
4147 46504 92157 113043 47195 7404 56068 71820 81364 101745 121038 81152 58280 76964
4135 76964 84451 92312 110485 80755 76667 99791 115758 100875 101831 62550 61608 88686 110013
4122 110013 111379 90842 80784 106141 124405 83468 81847 86275 110267 162481 133001 94783
4110 94783 97902 100200 69935 63318 69499 86817 85241 89249 119007 69215 131718 116984 125195
4097 125195 111361 83313 68707 85069 126129 164307 140590 119162 138146 91443 81003 84168
4085 84168 120061 122941 109296 168140 136025 138280 120019 151779 120997 121757 132345 106048 76671
4072 76671 69102 114890 137941 131324 91118 120820 184712 184825 207679 165053 173580 175578 180569
4059 180569 162084 122744 102947 125408 165738 175726 165229 168797 187248 177217 214173 207705
4047 207705 186249 180381 202366 193702 162601 194147 207972 230610 238215 254477 258820 254782 263207
4034 263207 226378 272850 246109 274369 241506 291020 332961 339524 381819 401158 412834 426313
4022 426313 408121 457578 493043 443788 492142 531097 547759 603804 614157 644004 626949 672229
4010 672229 685615 712691 738767 780139 828384 833144 806254 828181 913668 946828 955232 986069
3998 986069 1030441 1048127 1053854 1116761 1169511 1208295 1254246 1276814 1333830 1376658 1409642 1430172
3986 1430172 1479083 1513416 1529106 1541287 1592811 1644808 1643624 1635507 1660944 1670201 1711826 1726711
3974 1726711 1716526 1741624 1763676 1784045 1797560 1798266 1798272 1812733 1834299 1853989 1823657 1823790 1832840
3961 1832840 1798784 1792683 1781953 1734981 1697621 1740368 1722737 1702275 1608911 1584514 1570493 1544485
3949 1544485 1536385 1484100 1459036 1424056 1371678 1339237 1322809 1274835 1255978 1246254 1198796 1150490
3937 1150490 1103413 1086233 1020356 984370 947288 931710 903344 900577 811471 754559 759596 748789
3925 748789 711728 710649 666604 638964 637801 592774 592967 588080 574651 546038 526212 497251 469464
3912 469464 406414 399920 400348 399595 392986 425631 401439 392455 378607 370247 323010 308184 317169
3899 317169 340778 323721 343447 285375 277060 307406 313440 312257 301359 330132 297463 273185
3887 273185 260435 309816 329754 338644 321847 337850 318117 292950 278182 321175 292301 296114
3875 296114 316045 317893 320548 295638 311915 285557 308442 323670 294407 275442 320878 338769
3863 338769 349562 368442 361445 412010 407955 366977 350246 353435 380495 356775 353736 397258
3851 397258 426266 425512 436171 422243 448740 470036 466637 485966 509107 511506 545803 584495
3839 584495 562651 566056 595624 622607 647975 688299 694689 707377 771798 788911 842627 895738
3827 895738 959670 1035989 1094988 1130637 1192595 1291483 1398521 1505599 1560775 1714956 1864168
3816 1864168 2031979 2147104 2261466 2482009 2645416 2783441 2978944 3207913 3443754 3686928
3806 3686928 3976030 4308319 4642678 4974797 5399348 5892162 6464663 7152171 7900512 8661661
3796 8661661 9375147 10074490 10750135 11418150 12183180 13077069 13947525 14556492 14833677 15059805
3786 15059805 15400324 15898536 16357455 16565898 16231608 15569714 14857462 14278157 13861652
3777 13861652 13353337 12687617 11725079 10702868 9831447 9078040 8409253 7729530 6915850
3768 6915850 6110936 5386050 4769947 4229369 3779347 3455163 3147855 2920368 2693654 2498842
3758 2498842 2284136 2154398 2016653 1916875 1775595 1618200 1561862 1497660 1446173 1368259
3748 1368259 1284683 1201576 1164648 1118206 1077990 1037631 977457 933057 905206 870172 796617
3737 796617 779845 748429 755430 728193 669368 662418 591551 541957 549136 584529 562421 552475
3725 552475 523303 492221 496007 465811 439442 406913 430813 438571 357899 324689 341427 348382
3713 348382 342795 358511 290736 291889 298924 299212 298874 329958 306845 288598 277304 252845 229364
3700 229364 209443 235221 223299 206269 194408 230179 251924 209602 176441 102065 121050 163643
3688 163643 183410 177825 158318 208096 173113 196828 154186 160086 170897 122823 178974 162904
3676 162904 144415 141724 120328 89808 114643 124273 153184 151244 118648 119168 130086 168331 146760
3663 146760 120852 98012 108551 95167 61168 90795 113955 137520 91171 151615 104859 94127
3651 94127 75789 56360 96586 87696 119036 99423 81037 106955 101670 52927 77712 45371
3639 45371 55463 49719 35712 45389 69532 88945 106208 102630 64676 62878 57193 51860 33682
3626 33682 39275 60655 91215 107138 114499 81338 59331 39757 61615 31619 47535 10928
3614 10928 18735 67617 57669 92795 72702 89862 41858 88403 39134 48399 102256 80680
3602 80680 80620 96588 124668 138699 160753 82785 91427 95888 122193 113913 115595 135325 124802
3589 124802 98912 106922 113715 81539 144103 107122 88835 91893 125929 94381 117748 141949
3577 141949 136175 82642 126715 149616 161724 172738 168743 161074 167848 172458 208897 215159 219044
3564 219044 203633 253553 256174 289870 304597 289119 329368 343653 366335 382627 427357 480419
3552 480419 479629 494870 556484 588819 581217 604626 640516 655796 686085 702937 748596 821470
3540 821470 836606 845938 891075 898358 941450 979964 1065609 1086988 1132612 1182260 1229781 1240298
3528 1240298 1263147 1290453 1326356 1357301 1388772 1391660 1418876 1403044 1398813 1413594 1430274 1396412
3516 1396412 1370402 1359227 1347618 1344493 1290246 1235304 1232201 1224829 1136855 1071397 1062085 1022883
3504 1022883 1042896 992504 949324 966841 922159 935374 895123 889137 875356 808658 741042 754575
3492 754575 753093 732788 671727 702293 788838 829184 859238 866507 950466 1037305 1105170 1199421
3480 1199421 1438680 1678987 1965602 2093835 1941907 1609042 1284336 1087980 905394 752587
3470 752587 668940 586538 495799 467894 459557 425785 356819 318914 334414 320674 318949 256255
3458 256255 225593 261885 249010 199885 173967 181947 223100 242721 215788 190771 191893 181697
3446 181697 183073 119102 148824 122634 80357 82582 107204 123087 124772 122341 141104 116246
3434 116246 108521 102368 74389 94425 57837 56341 43043 81625 51885 60659 45537 55640
3422 55640 69919 46449 17126 32751 49406 62193 36673 72564 78784 86220 83013 62836
3410 62836 51400 56200 108389 94839 53213 37532 22308 35806 39149 14894 14554 57795 57781
3397 57781 30759 62164 23085 14820 43847 50477 58458 44037 21209 57378 48219 64773 73593
3384 73593 70435 71981 69796 64561 41016 40604 69227 47779 37342 78276 99542 123125 142885
3371 142885 125694 74827 77185 82860 97102 109042 127194 176150 153923 170279 131625 93133
3359 93133 103572 117431 72067 89421 98279 77920 76228 91223 99411 77622 69059 60667 60754
3346 60754 69058 99609 84060 115579 67109 65806 87315 81689 69652 93967 71699 88830
3334 88830 110947 81140 65033 50177 39812 80380 94509 73375 51163 40594 40465 30239
3322 30239 49430 35631 28454 50426 93284 100520 73621 82001 83937 74201 54954 47662 34463
3309 34463 36023 39021 81284 86316 60401 82688 83815 68037 78590 75396 92145 59376 54685
3296 54685 54441 40563 43840 77507 94852 73358 72746 58468 96749 102861 73163 75877 52048
3283 52048 74798 91504 46085 61624 85299 103177 103560 90357 97533 97401 53359 75205 127680
3270 127680 90968 67489 81731 110039 82642 115046 123838 136915 122307 122092 62778 23235
3258 23235 80270 92046 53597 70342 75196 84996 117482 75803 63490 78446 116426 115115
3246 115115 92078 113735 80215 74965 90107 69961 83506 47139 91303 83619 114631 93843
3234 93843 91854 54810 69527 112422 137240 57108 79411 116561 94375 133831 134259 107397
3222 107397 98733 144675 162635 146488 137296 126624 189066 194054 162885 200687 166109 129309
3210 129309 169869 155860 152244 108315 136126 206649 195173 211300 200742 161872 189902 182927
3198 182927 203563 219934 224620 252809 244849 224287 222087 220408 207235 234567 257999 222022
3186 222022 193845 221118 221949 277038 298289 293552 301412 327788 348269 344609 298202 300756 320222
3173 320222 314835 346253 328206 374072 409608 411316 367440 412032 446505 441492 456081 454301
3161 454301 496818 502068 521105 549197 543638 603774 624847 644107 737576 791627 837598 814695
3149 814695 828006 879509 923568 960388 1003671 1055664 1135569 1213867 1289129 1317540 1405627 1494717
3137 1494717 1588958 1697131 1781494 1943998 2069571 2157825 2285316 2376353 2522724 2663852
3127 2663852 2813217 2921032 3034974 3072583 3103170 3135047 3146359 3122645 3102071 3088310 3088779
3116 3088779 3052768 2984435 2899138 2775185 2640412 2529020 2392392 2258511 2127699 1988066
3106 1988066 1863883 1760198 1599207 1484452 1410727 1343000 1243724 1131778 1050338 1017568
3096 1017568 1015300 944487 894596 859032 829812 798451 757327 732448 685452 685452 710761 682208
3084 682208 685271 664419 636775 609557 608256 591065 573088 533394 531896 567996 565961 550227
3072 550227 528840 529561 527220 521767 527299 532108 496774 522780 485185 477914 505089 487940 556425
3059 556425 549743 573929 549571 549580 560192 569307 565928 588988 622023 624872 616567 630021 640748
3046 640748 646244 692019 739440 781454 802114 799563 848218 887526 891401 867749 937946 1004549
3034 1004549 1043792 1082583 1090372 1163149 1213617 1238929 1296435 1314978 1332792 1343304 1384001 1375077
3022 1375077 1364998 1369896 1421359 1460930 1478465 1520848 1592711 1611666 1645731 1706748 1779673 1898930
3010 1898930 1975294 2080082 2162022 2278355 2392748 2558164 2689532 2802739 2950703 3092416
3000 3092416 3281790 3503968 3707686 3926059 4152356 4421384 4656284 4890285 5163796 5374501
2990 5374501 5584080 5743552 5866805 5956576 5996958 6033447 6005058 5980427 5930721 5847139 5746858
2979 5746858 5576874 5383913 5214059 4968279 4785236 4557450 4336810 4117225 3908369 3728396
2969 3728396 3580717 3427139 3343758 3218895 3133281 3080708 3012870 3000449 2918482 2907930 2915927
2958 2915927 2952189 2995818 3009229 3071503 3157891 3255642 3328102 3419867 3539242 3690589 3873652
2947 3873652 4018732 4188632 4399060 4622283 4876108 5148972 5390669 5655017 5954845 6229940
2937 6229940 6438733 6630460 6785626 6902953 6998190 6967679 6906533 6879215 6831312 6739351 6608961
2926 6608961 6485607 6348861 6139449 5858701 5634740 5340662 5006865 4707328 4382556 4094586
2916 4094586 3839219 3576602 3318609 3103340 2920288 2742416 2570706 2412138 2309406 2224696
2906 2224696 2125142 2024494 1937708 1852011 1792171 1698907 1670154 1621835 1599623 1552261 1509894
2895 1509894 1465014 1435978 1427636 1363267 1300047 1286563 1228735 1196504 1149910 1101177 1090373 1095906
2883 1095906 1072128 1074481 1016253 1018259 998625 996698 1010907 990242 997901 953651 951369 1004044
2871 1004044 1014356 1014185 1019290 1033374 1010414 1010272 1015566 1018908 1042236 1044449 1035357 1023429 1020036
2858 1020036 1003101 1010200 1009130 1037109 1011341 980096 986437 1001331 1049931 1036544 1064385 1101799
2846 1101799 1090595 1155989 1163718 1124797 1139621 1220486 1212083 1277685 1297735 1383392 1431315 1499444
2834 1499444 1525260 1597729 1687051 1788063 1844972 1920297 2034424 2177527 2237836 2340876 2470863
2823 2470863 2491346 2598335 2654039 2674627 2670036 2698861 2687116 2665604 2655587 2595383 2564585
2812 2564585 2574156 2568846 2559485 2549883 2515322 2465636 2412090 2349850 2245067 2126808 1987542 1888968
2800 1888968 1783231 1691973 1601621 1471556 1356495 1268605 1195657 1129742 1073673 1052107 979847
2789 979847 905550 846838 817489 787894 772049 745390 742031 718443 712075 708932 687575 660159
2777 660159 701401 702709 653440 595756 579190 655804 660359 686179 681904 713079 692391 705748
2765 705748 694884 679470 635513 629866 631399 582259 557869 547604 536191 529242 505385 460332
2753 460332 455217 484026 482976 438748 435914 413755 381908 378879 369685 365532 338275 327177 342315
2740 342315 394914 414369 399346 391668 382968 355012 361181 335682 366097 353366 372652 371911 367036
2727 367036 394332 376070 354765 360558 348249 357140 385469 337701 344743 335056 379585 424043
2715 424043 410236 365144 373676 421631 403349 399985 427683 435948 448762 453903 457214 479276 458992
2702 458992 464542 451657 427715 466757 480632 477181 514943 548998 529442 534904 602679 625643
2690 625643 623091 650272 688650 723252 767401 787558 832071 865754 880808 867811 901791 910898
2678 910898 960092 972067 1006490 1072920 1101323 1221861 1274453 1313578 1422508 1537329 1612823
2667 1612823 1703928 1836753 1964922 2127521 2227001 2387372 2528991 2695193 2825705 2970111
2657 2970111 3166773 3329913 3515942 3713756 3933429 4151929 4430403 4700141 4975715 5351117
2647 5351117 5787919 6257004 6812282 7382237 8026320 8757172 9580529 10510070 11522163
2638 11522163 12507346 13409611 14048085 14286661 13985087 13241965 12177035 11006026 9888057
2629 9888057 8836974 7930440 7129856 6407949 5827301 5297996 4834538 4399664 4032725
2620 4032725 3699457 3412212 3177801 2965810 2747956 2570046 2431934 2291739 2232518 2069785
2610 2069785 1923068 1796000 1707870 1645781 1557847 1496998 1399098 1359296 1324075 1260857 1182801
2599 1182801 1125025 1084672 1035505 940474 909362 892702 860602 850281 834267 793529 757979
2588 757979 731226 700232 682836 660413 653424 601562 540767 551917 513571 542736 499270 501818
2576 501818 491819 432576 432024 454193 422700 402457 376730 381656 398254 362813 364899 363248 365194
2563 365194 329887 315390 310225 281465 287825 316447 302934 273258 264053 289616 281113 279011 261884
2550 261884 277390 245086 210637 212752 219134 229544 250240 224406 196320 178618 179543 154552
2538 154552 183540 162623 144757 171230 147565 149600 166807 151384 141866 187220 183185 159873
2526 159873 109046 113232 108725 116491 99071 88413 115757 127528 90000 75617 91609 80668
2514 80668 49633 46811 89421 57313 116896 116356 94825 58979 81410 70991 73318 68973 52912
2501 52912 35684 43796 65687 88727 86477 93078 92960 69761 62230 59356 81882 88214 61348
2488 61348 74683 97865 64979 70915 74312 44888 9062 30362 65981 73316 59686 31741
2476 31741 27079 88371 52371 11119 52685 56057 48846 56132 53229 57147 19183 51802 62442
2463 62442 59642 69481 67294 75278 22792 -1771 10153 33429 43899 56670 18801 4659 14875
2450 14875 24219 59309 34870 38224 23927 49879 42874 38492 67016 36107 44811 67908 60575
2437 60575 51466 73746 51541 32386 43001 56423 62333 24555 76737 84245 66599 96326
2425 96326 112235 86262 68667 107668 86342 66393 52663 37096 30984 23383 22655 20697 32671
2412 32671 53811 68535 47700 35505 52369 62425 27852 16054 13287 41400 5459 -6393
2400 -6393 18218 41935 28419 31937 49212 19190 14143 14148 -2693 56626 18576 -4892 46544
2387 46544 16368 9318 6164 32417 -10191 -24027 -3358 -13386 4348 21896 13446 -13999
2375 -13999 -45644 -899 -50411 -27907 -11683 4781 -11559 20079 37180 4799 -7550 8614
2363 8614 10480 -16398 31160 25022 14466 -10393 12268 14345 9562 -11021 -12634 -19433 -42811
2350 -42811 -34845 -23761 -40342 -26664 -46320 -19380 -14532 -17532 41781 37373 49976 -23986 19877
2337 19877 52894 483 5422 -2339 -19298 -4441 -2659 23649 17468 15865 35870 -1960 11775
2324 11775 23437 -15306 -29025 -30874 -71197 -40968 -19679 -6075 -10263 -42296 -31266 -3972
2312 -3972 4930 -13950 11824 4274 -42618 -4369 -14659 -22110 5516 20164 10860 -35389 -51174
2299 -51174 -29693 -14921 -15048 -1523 -4342 27757 6919 -11336 -12607 -3790 -18922 -3064 -9802
2286 -9802 15436 -22525 -25545 20437 -13220 11344 327 -4947 -40112 -20500 -28356 -49047 -3105
2273 -3105 43431 -9435 -6831 -7933 7692 1469 -26021 -4143 -3666 16143 42690 47545 -2166
2260 -2166 -18140 3685 -9586 -18905 -16721 17315 -5555 -25799 11578 18725 9910 7865 -3261
2247 -3261 5480 -27836 -28091 -18862 -24063 16230 -40515 -24687 -622 8529 3903 27433 41976
2234 41976 7613 -28983 -22520 -15334 4348 9592 25046 -23598 -33037 24980 -35102 -15096 -22940
2221 -22940 -50847 -59561 -10139 7931 27820 -11179 -29425 14984 -12734 -14173 -13365 -29432 -26066
2208 -26066 -29382 2965 1900 4394 18471 21644 16993 -9338 -27971 -29197 -20525 -2675 -9947
2195 -9947 -1839 -5005 -32241 -23870 -24853 7226 20193 82 -29916 -31185 3787 -23340 -2994
2182 -2994 2634 -10647 -25169 -16435 -27645 -17276 -14431 -39207 -1433 2589 29819 -2447 -4707
2169 -4707 22255 717 -28510 -14521 -16370 15339 22076 -6891 -24062 8990 27542 24707 10735
2156 10735 -24956 -16760 -9638 -23322 10069 10171 -15547 -11258 -19698 -5956 46251 42598 37981
2143 37981 473 -13706 -5789 -8472 -10573 -1630 -676 1011 -17405 7123 20763 17847 3157
2130 3157 3033 -16150 -31426 29158 -40390 -18624 17147 -1416 -7848 -22895 17440 26398 -25251
2117 -25251 -63115 -47584 -22377 -14522 21946 31897 20653 15339 25160 12031 -11270 -36802 -27493
2104 -27493 -19269 -14029 7345 15309 13413 35229 69854 60856 15876 -27737 -26470 8188 51027
2091 51027 41124 27650 34009 6079 10266 42351 22493 13661 -33846 -14356 20460 29521 38523
2078 38523 28513 -9862 -18837 17251 47319 35379 17057 9226 29934 53348 55915 60731 84401
2065 84401 64323 68800 66054 78322 74076 99220 88425 83370 137236 151434 198117 231166 287769
2052 287769 318686 368433 391782 386116 313036 229544 199878 163041 152333 70287 77016 100168
2040 100168 111680 112547 69836 70434 57887 58936 2365 32840 3162 42364 63292 10890 -20188
2027 -20188 -35224 16205 10129 -9269 -6513 22422 13667 24548 13864 7180 11755 12022 -2239
2014 -2239 -10979 -26509 -50487 13212 -13157 -27498 -20502 -22064 -58071 -20967 -23190 -18089 22319
2001 22319 53775 31050 33207 1324 8494 -12460 -10819 -14185 -55114 -47241 -24059 28828 28583
1988 28583 14743 25603 5459 18288 5440 14787 6208 11314 -32915 -34223 -43737 -10964 -984
1975 -984 -16847 -4822 -7519 22976 -13728 -11453 -20262 -9099 2305 -1859 -13721 2128 -18880
1962 -18880 -25619 -10462 -30313 -13922 -3900 -4870 24327 6457 -11814 -4156 3443 -6184 2694
1949 2694 -22681 -40942 -34909 -28841 -34851 -33184 -35617 22857 4369 -3921 -44342 -46853 -33749
1936 -33749 -31626 -61430 -34196 -25858 -56030 -43799 -13909 27612 7926 -32173 -49034 -16258
1924 -16258 -17568 -27248 -28433 -27387 -7166 -7164 -14845 -22961 -20478 -19378 -11142 -30001 -27078 -9388 -4675
1909 -4675 -21313 -4020 13048 43745 15377 2629 -28136 -16648 -44477 -18441 -17800 -39547
1897 -39547 -17389 -16947 14982 18107 -5000 20492 -1563 -37732 -45870 -27027 -2326 2903 36497
1884 36497 12908 23233 -19670 -21708 4381 -27582 -46939 -29141 -19334 24353 36076 -27132
1872 -27132 -49349 -40443 -24109 5189 42415 -5986 11225 -11052 -45918 -41595 -29925 -58607
1860 -58607 -29919 23567 -28962 23329 6260 9410 -15313 -50727 -35905 -10294 -40044 -1809
1848 -1809 -13445 -5836 2607 3286 3819 -20495 -6031 536 -7052 21567 -5031 -14840 -6514 -37537
1834 -37537 -52939 -51194 -20440 18280 8529 21089 -11040 -19954 35063 36863 24006 -16201 3131
1821 3131 -23837 -3576 -15404 -39314 -30848 -30897 -19814 3456 32560 40158 -10934 7919 4551
1808 4551 -22255 -25465 -61780 -62537 -53642 -4836 -675 -36761 -27566 -24037 -20108 -29388 -22667 3044
1794 3044 -2224 -1917 -28104 -8593 12612 4544 3810 8810 9865 8180 -4108 -28728 -42901 -8432
1780 -8432 17795 1002 -779 4846 -27973 -8906 -11347 -5456 -36112 -28163 -55675 6484 -19944
1767 -19944 -28449 -68529 -50060 -30762 -23034 -36600 -32791 -6238 -15600 1308 -25042 -6012 -2199
1754 -2199 12794 2606 34556 4518 -37136 -42189 -30298 -6929 488 -12679 -3251 -18807 -24307
1741 -24307 -17672 -16229 -9544 -27522 -54892 -34245 -27772 -31413 -22831 18805 4174 -31209 -25572
1728 -25572 12596 -24645 -14638 28469 22837 -9715 6297 -34890 -35066 -18128 -7480 -31766
1716 -31766 -10751 35441 40285 4267 -10035 -30863 -27336 -23453 -19638 20989 -582 -9261 -50202
1703 -50202 -52987 -18851 -31148 -24024 -18828 2851 -12558 -21555 5794 12248 26280 -12242 -40389
1690 -40389 -31286 -4393 633 -23350 -40246 -17113 6211 22507 24890 2810 -7200 -23689
1678 -23689 -11776 323 -27197 -9323 -13417 8540 -497 2611 -23027 -22831 -23929 -24137 -9633
1665 -9633 -16843 8265 -11789 9948 -23927 -9185 -12241 20200 71099 33523 3265 -6976
1653 -6976 15416 -31994 -52090 -23948 -303 -29063 -23450 -9732 -5268 -13388 -21973 -10217 -23220
1640 -23220 -40266 7165 14638 -9977 19760 15143 -22191 -13648 -8504 30157 25576 -23268 -9293
1627 -9293 -26913 -19286 -3173 -25242 -50462 -28965 -5444 -2321 -19780 -20397 -36780 -46756 -54196
1614 -54196 -1150 -2725 5828 21232 14404 -17274 -39384 -20158 -61218 -53170 17885 -2461 -4901
1601 -4901 -2992 -11196 3001 -4470 49985 -11106 -36761 -20163 -2413 -137 -7807 -53596 -32536
1588 -32536 5984 -10991 24701 -9265 9022 19142 8287 -14555 -28441 -24447 -28334 -1720
1576 -1720 9090 -28096 -8772 -41908 -21558 14293 33627 2396 -5947 -1874 -6922 -10735 -40445
1563 -40445 -10897 6111 -21168 -2003 3778 16173 3254 2834 -902 -13187 8078 -23391 26728
1550 26728 19941 -3871 -4770 -292 -7220 8692 29729 41592 3090 -955 -14371 -931 -8065
1537 -8065 -6164 25672 28629 -27419 33294 24455 19821 37956 -17601 -18647 2577 -6683 8486
1524 8486 17562 -2137 20596 13191 -28468 -27430 -18041 -39121 -63496 -18890 9717 24623 1780
1511 1780 -8425 1582 -11323 -50284 -16869 -5060 -4784 -9831 -10441 48421 27582 -18588 -10068
1498 -10068 -16120 -18307 14060 -209 -22281 -13930 237 32572 10173 -16346 -25813 -1665 23462
1485 23462 -15082 -35017 -48078 -38052 -22344 11426 -20682 -27976 -35751 -32898 23932 7935
1473 7935 -4829 -22131 -23252 -4123 -35447 5321 1155 46429 34766 -33606 -54076 -43265
1461 -43265 -65851 -13115 -27614 -26652 11737 4143 26743 13571 8911 1097 9314 3453 -17725
1448 -17725 -9569 -17660 -12139 -4976 13792 -709 -3553 8145 23713 12474 -51418 4320 -976
1435 -976 -36378 -22254 7465 -7130 -2908 29159 27627 23588 -38098 -18671 -22390 -2841 -13975
1422 -13975 545 -57134 -39269 -25323 -20774 10476 -34827 -45322 -52036 -14361 -3631 11523
1410 11523 41108 41356 -19832 -54419 -34198 -35455 -11887 -4727 -8568 -1794 -19052 22887 37430
1397 37430 4943 -32489 -23823 -23820 21420 -4968 -4846 -7922 -57644 -36003 -19315 -24420 19595 27288
1383 27288 -12088 -21769 1580 39524 59769 36806 -28253 -26716 -56955 -14108 -13359 477 -20417
1370 -20417 -22874 -12594 18593 34762 36272 -143 -20319 11911 6903 -10110 -46956 -5928
1358 -5928 9410 15531 4750 5396 -2507 35256 -8552 -32806 18239 17688 -7020 -5664 5120
1345 5120 9217 -21446 4864 7849 -8397 -37845 -55763 -9278 43981 20007 3272 -27542
1333 -27542 -25713 27350 13502 -6605 10620 27298 -16040 -31534 -32527 -19206 7546 31481
1321 31481 -8393 -39110 -8498 -8371 14015 8570 46145 10942 29893 15161 38190 12825
1309 12825 -35847 -54143 -45658 -18072 631 7129 -17872 -2633 -2544 -14960 -4470 -8248 -16042
1296 -16042 -1667 -46919 -31506 -23943 -24175 3943 16430 -4229 -16781 -42224 -43372 -55309 7193
1283 7193 -7907 -12288 -7331 -17607 -29648 -29425 -28559 -70508 -43930 1698 -44417 -21590 -9138
1270 -9138 -27005 -29736 -19829 12239 11475 -30746 -24525 -812 15249 -33704 -58936 -14718 -13738
1257 -13738 -8918 -2788 2474 14736 -498 20017 36008 -11166 -3476 -30361 -8870 21759 3252
1244 3252 15922 -1647 -31336 20443 -2975 -980 5243 -27789 -16825 21069 -9788 -19549 22931
1231 22931 17041 14073 -5401 -35523 -29909 -3605 -11007 -13946 -13637 3507 4970 -12819 -3801 -1657
1217 -1657 -4763 -33009 -17819 -3252 7793 1554 39369 36237 32928 18657 11321 2428 17021
1204 17021 14770 -8243 3059 -24302 43370 72475 34073 -14343 -16335 -11290 -4082 -21565 8087
1191 8087 -14081 -32170 -33043 -24101 -11678 -11554 37316 5706 14804 5298 29455 28300 -16514 -11369
1177 -11369 -44762 -53330 -29934 -25319 14876 17949 162 19975 -21676 17711 9348 27052 41496
1164 41496 19725 6048 -8482 -8292 -12094 -25320 -48650 -33035 -17029 1986 -25787 -23443 -44229
1151 -44229 -5386 10161 -20541 -23865 -21804 1312 16262 5716 -40212 -20391 -6076 -1898
1139 -1898 -12376 -17432 7493 23275 24476 22656 2137 11235 -11865 -25507 -18108 3964 20112
$$ [...]
##END NTUPLES=NMR SPECTRUM
##END=
