##TITLE=1H_CG-1209-x
 DMSO
 8 sc, 
 6.8.2024
##JCAMPDX= 6.0         $$ Bruker NMR JCAMP-DX V2.0
##DATA TYPE= NMR SPECTRUM
##DATA CLASS= NTUPLES
##ORIGIN= UXNMR, Bruker Analytische Messtechnik GmbH
##OWNER= root
$$ XWIN-NMR		Version 3.5
$$ Tue Aug  6 14:18:16 2024 Russian Standard Time (UT+4h)  she@DPX200
##.OBSERVE FREQUENCY= 200.1313
##.OBSERVE NUCLEUS= ^1H
##.ACQUISITION MODE= SIMULTANEOUS
##.ACQUISITION SCHEME= undefined
##.AVERAGES= 8
##.DIGITISER RES= 18
##SPECTROMETER/DATA SYSTEM= spect
##.PULSE SEQUENCE= zg30
##.SOLVENT NAME= Acetone
##.SHIFT REFERENCE= (INTERNAL, Acetone, 0, 20.9841)
##AUDIT TRAIL= $$ (NUMBER, WHEN, WHO, WHERE, WHAT)
$$ ##TITLE= Audit trail, XWIN-NMR		Version 3.5
$$ ##JCAMPDX= 5.01
$$ ##ORIGIN= Bruker BioSpin GmbH
$$ ##OWNER= she
$$ F:/spectra/data/she/nmr/H-F/1/pdata/1/auditp.txt
$$ ##AUDIT TRAIL=  $$ (NUMBER, WHEN, WHO, WHERE, WHAT)
(   1,<2024-08-06 14:17:02.76 +0400>,<she>,<DPX200>,
      <created by zg, POWCHK disabled, PULCHK disabled
       configuration hash MD5:
       00 E9 B6 7A A2 85 ED C7 34 08 36 98 17 FE 4E 26
       data hash MD5: 16K
       8A C8 4C C3 8D CB D8 34 93 68 A5 C3 0E 0F A5 E1>)
(   2,<2024-08-06 14:17:05.37 +0400>,<she>,<DPX200>,
      <Start of raw data processing
       efp BC_mod = 2 LB = 0.24 FT_mod = 6 PKNL = 1 PHC0 = -25639.71 PHC1 = 10.58749 SI = 16K 
       data hash MD5: 16K
       5B 35 D4 13 80 41 D7 7B 2F 7A 95 EB EF 41 A0 35>)
(   3,<2024-08-06 14:17:23.62 +0400>,<she>,<DPX200>,
      <pk PHC0 = 3.032791 PHC1 = -2.4 
       data hash MD5: 16K
       BC A3 B9 9A D1 1E 04 AB 42 7E 74 2A 65 BD 92 A1>)
(   4,<2024-08-06 14:17:27.01 +0400>,<she>,<DPX200>,
      <abs ABSG = 5 
       data hash MD5: 16K
       D8 6F F3 EE 5B F9 4E F9 6A 83 1D 8D 4E 1C 26 3A>)
$$ ##END=
$$ 
$$ hash MD5
$$ 26 90 EF 80 85 82 64 F6 3C 7E 9E B1 47 52 C6 A4
##$RELAX= 
##$RELAX= 
##$RELAX= 
##$RELAX= 
##$RELAX= 
##$RELAX= 
$$ Bruker specific parameters
$$ --------------------------
##$DU= <F:/spectra>
##$EXPNO= 1
##$NAME= <H-F>
##$PROCNO= 1
##$TYPE= <nmr>
##$USER= <she>
##$AMP= (0..31)
100 100 100 100 100 100 100 100 100 100 100 100 100 100 100 100 100 100 
100 100 100 100 100 100 100 100 100 100 100 100 100 100 
##$AQSEQ= 0
##$AQ_mod= 1
##$AUNM= <au_zg>
##$AUTOPOS= <>
##$BF1= 200.13
##$BF2= 200.13
##$BF3= 200.13
##$BF4= 200.13
##$BF5= 200.13
##$BF6= 200.13
##$BF7= 200.13
##$BF8= 200.13
##$BYTORDA= 1
##$CFDGTYP= 0
##$CFRGTYP= 5
##$CHEMSTR= <none>
##$CNST= (0..31)
1 1 145 1 1 1 1 1 1 1 1 1 1 1 1 1 1 1 1 1 1 1 1 1 1 1 1 1 1 1 1 1 
##$CPDPRG= <>
##$CPDPRG1= <>
##$CPDPRG2= <>
##$CPDPRG3= <>
##$CPDPRG4= <mlev>
##$CPDPRG5= <mlev>
##$CPDPRG6= <mlev>
##$CPDPRG7= <mlev>
##$CPDPRG8= <mlev>
##$CPDPRGB= <>
##$CPDPRGT= <>
##$D= (0..31)
0 1.2 0 0 0 0 0 0 0 0.06 0 0.03 0 0 0 0 0.0002 0 0 0 0 0 0 0 0 0 0 0 0 
0 0 0 
##$DATE= 1722939422
##$DBL= (0..7)
120 120 120 120 120 120 120 120 
##$DBP= (0..7)
150 150 150 150 150 150 150 150 
##$DBP07= 0
##$DBPNAM0= <>
##$DBPNAM1= <>
##$DBPNAM2= <>
##$DBPNAM3= <>
##$DBPNAM4= <>
$$ [...]
##$SUBNAM3= <"">
##$SUBNAM4= <"">
##$SUBNAM5= <"">
##$SUBNAM6= <"">
##$SUBNAM7= <"">
##$SUBNAM8= <"">
##$SUBNAM9= <"">
##$SW= 24.0689771365484
##$SWIBOX= (0..15)
0 0 2 0 0 0 0 0 0 0 0 0 0 0 0 0 
##$SW_h= 4816.95568400771
##$TD= 16384
##$TD0= 1
##$TE= 0
##$TE2= 300
##$TE3= 300
##$TEG= 300
##$TL= (0..7)
0 120 120 120 120 120 120 120 
##$TP= (0..7)
150 150 150 150 150 150 150 150 
##$TP07= 0
##$TPNAME0= <>
##$TPNAME1= <>
##$TPNAME2= <>
##$TPNAME3= <>
##$TPNAME4= <>
##$TPNAME5= <>
##$TPNAME6= <>
##$TPNAME7= <>
##$TPOAL= (0..7)
0.5 0.5 0.5 0.5 0.5 0.5 0.5 0.5 
##$TPOFFS= (0..7)
0 0 0 0 0 0 0 0 
##$TUNHIN= 0
##$TUNHOUT= 0
##$TUNXOUT= 0
##$USERA1= <user>
##$USERA2= <user>
##$USERA3= <user>
##$USERA4= <user>
##$USERA5= <user>
##$V9= 5
##$VALIST= <valist>
##$VCLIST= <CCCCCCCCCCCCCCC>
##$VD= 0
##$VDLIST= <DDDDDDDDDDDDDDD>
##$VPLIST= <PPPPPPPPPPPPPPP>
##$VTLIST= <TTTTTTTTTTTTTTT>
##$WBST= 1024
##$WBSW= 4
##$XGAIN= (0..3)
0 0 0 0 
##$XL= 0
##$YL= 0
##$YMAX_a= 157747
##$YMIN_a= -145009
##$ZGOPTNS= <>
##$ZL1= 120
##$ZL2= 120
##$ZL3= 120
##$ZL4= 120
##$ABSF1= 21.54388
##$ABSF2= -2.525326
##$ABSG= 5
##$ABSL= 3
##$ALPHA= 0
##$AQORDER= 0
##$ASSFAC= 0
##$ASSFACI= 0
##$ASSFACX= 0
##$ASSWID= 0
##$AUNMP= <proc_1d>
##$AZFE= 0.1
##$AZFW= 0.1
##$BCFW= 0
##$BC_mod= 2
##$BYTORDP= 0
##$COROFFS= 0
##$CY= -3
##$DATMOD= 1
##$DC= 0
##$DFILT= <>
##$DTYPP= 0
##$F1P= 0
##$F2P= 0
##$FCOR= 1
##$FTSIZE= 16384
##$FT_mod= 6
##$GAMMA= 0
##$GB= 0
##$INTBC= 1
##$INTSCL= 3.70164e-10
##$ISEN= 128
##$LB= 0.24
##$LEV0= 0
##$LPBIN= 0
##$MAXI= 10000
##$MC2= 0
##$MEAN= 0
##$ME_mod= 0
##$MI= 1.114404
##$NCOEF= 0
##$NC_proc= -6
##$NLEV= 6
##$NOISF1= 3.799351
##$NOISF2= 2.8
##$NSP= 0
##$NTH_PI= 0
##$NZP= 0
##$OFFSET= 20.98415
##$PC= 1
##$PHC0= -25636.68
##$PHC1= 8.18749
##$PH_mod= 1
##$PKNL= yes
##$PPARMOD= 0
##$PSCAL= 0
##$PSIGN= 0
##$REVERSE= no
##$SF= 200.129508930061
##$SI= 16384
##$SIGF1= 3
##$SIGF2= 2
##$SINO= 5.538805
##$SIOLD= 16384
##$SREGLST= <1H.CDCl3>
##$SSB= 0
##$STSI= 16384
##$STSR= 0
##$SW_p= 4816.95568400771
##$SYMM= 0
##$S_DEV= 0
##$TDeff= 16384
##$TDoff= 0
##$TI= <>
##$TILT= no
##$TM1= 0
##$TM2= 0
##$TOPLEV= 0
##$USERP1= <user>
##$USERP2= <user>
##$USERP3= <user>
##$USERP4= <user>
##$USERP5= <user>
##$WDW= 1
##$XDIM= 16384
##$YMAX_p= 525740866
##$YMIN_p= -355746
$$ End of Bruker specific parameters
$$ ---------------------------------
##NTUPLES= NMR SPECTRUM
##VAR_NAME=  FREQUENCY,     SPECTRUM/REAL,   SPECTRUM/IMAG
##SYMBOL=    X,             R,               I
##VAR_TYPE=  INDEPENDENT,   DEPENDENT,       DEPENDENT
##VAR_FORM=  AFFN,          ASDF,            ASDF
##VAR_DIM=   16384,         16384,           16384
##UNITS=     HZ,            ARBITRARY UNITS, ARBITRARY UNITS
##FACTOR=    0.29402158847633, 1,            1
##FIRST=     4199.54762137831, 0,            0
##LAST=      -617.4080626294, 0,             0
##MIN=       -617.4080626294, -355746,       0
##MAX=       4199.54762137831, 525740866,    0
$$ Real data points
##PAGE= N=1
##DATA TABLE= (X++(R..R)), XYDATA
$$ [...]
10172 -70198 -12011 -1195 -34096 76277 115888 28346 -8332 99379 44332 -57461 -2975
10161 -2975 -6818 -61827 -48881 -110739 -145473 -50966 -109581 -5846 -49057 -119797 -117291 -74269
10149 -74269 -51750 94697 33961 77577 139102 97377 77533 -22724 -179703 -134185 -108684
10138 -108684 -167711 -69727 -117181 24229 12370 -19502 -94807 -170419 -113338 65429 114527
10127 114527 127443 -103255 -57277 -133210 98155 175448 158758 80647 -60866 -148410 61084
10116 61084 -24068 -87372 -23291 -31655 -94588 -175353 -21926 16608 -69904 -95340 21371
10105 21371 -96713 -1145 81390 54734 -43322 29357 40434 76644 62061 18495 -73466
10094 -73466 -79009 -37822 35624 2016 -84280 1932 -12997 27449 18120 556 212244 103083
10082 103083 142487 12036 -62727 -54168 65679 121838 55123 80463 -1405 -53729 153319
10071 153319 248614 178945 57670 167110 298570 165957 60352 114292 72959 145462
10061 145462 166764 75881 68858 118364 -12002 158284 137541 41672 52782 19343 -55010
10050 -55010 7347 31073 -747 144084 67613 21475 56611 66581 57184 -58375 -136352 -71618
10038 -71618 81595 266539 163925 110911 48983 32225 -14856 -136125 -176449 5615 -39444
10027 -39444 -67845 -7867 -39656 -86361 -11475 -60575 -63266 -30731 -52783 -80411 -29811 55349
10015 55349 -83239 -119566 -105594 50401 92274 75697 -45113 -77125 82976 -103508 -41935
10004 -41935 11048 70999 84166 53081 -122301 -164990 -102497 19950 16748 -112254 -34015
9993 -34015 21166 -32372 -81427 -13505 -66792 -131838 -7929 139914 60554 8738 -37544
9982 -37544 -143940 -35933 -8230 -23990 129797 95101 127949 -1041 -21211 -3205 -72079
9971 -72079 22714 -182005 -94521 -1703 -79113 38389 159058 14680 -42022 -121485 -144620
9960 -144620 -190711 -124683 -82975 -12410 -74861 30732 50761 -170033 -92401 54510 30061
9949 30061 46607 77051 -127921 -132800 -160148 -86892 -68498 -22597 13635 90727 48013 27495
9937 27495 61277 109380 47384 139474 159640 54498 105590 68134 -13576 -25481 -45957 -131687
9925 -131687 -221056 -98174 -65315 -93642 -140303 -125261 -20950 -1602 -226469 -35095 -36701
9914 -36701 -939 -9938 -234350 -249889 -111690 -35163 -37780 -164687 -128167 43313 107770
9903 107770 94950 -161396 -115342 -167886 -68528 -56764 -64911 35810 126444 -177899 -180349
9892 -180349 -19570 -78802 -25359 -115775 -38320 -62352 -173992 -65117 -60975 -56102 -99114
9881 -99114 -15188 9730 31519 -109710 -10789 -72833 -213320 -23649 -61677 -53713 -542
9870 -542 -76296 -56283 27822 -77651 162 -44604 -168862 83089 35549 57717 47193 7328
9858 7328 70316 129792 86955 31692 52679 -68093 3427 13135 -46317 7767 -38757 34326
9846 34326 122054 17287 10391 62523 18162 -29079 56058 34210 53432 40719 -67684 -22834
9834 -22834 116157 -30202 -64947 106112 62422 -90305 18618 132500 91638 41136 7880
9823 7880 42108 59602 7978 -42048 -101896 85939 6805 61776 -35097 -58592 -92725 -101723
9811 -101723 -123630 -11692 52809 -16910 173717 119098 127962 173236 -67250 -125802 -76461
9800 -76461 -58143 -97193 -74546 -18362 99138 101267 180108 147551 117977 12803 -45509 2726
9788 2726 67189 48802 56935 196807 117181 166147 505 48366 792 7470 -97418 -57867
9776 -57867 -114264 -116067 10355 -134634 -131633 54677 -6803 -90539 -68450 -107013 10201
9765 10201 -8393 115465 78757 -142591 7169 -117989 -169191 -105042 -25307 -74851 -102393
9754 -102393 -63102 8267 25262 5351 -85466 71305 -40119 -39113 -20933 82609 74833
9743 74833 80388 23659 -84634 -167200 -111056 68333 146145 71515 -94587 -116126 -80847
9732 -80847 -11608 -17248 19403 -66078 -37173 -108644 -149264 2225 -78417 -11757 55615 76721
9720 76721 113938 79190 100442 -27985 -10107 -71109 -88765 -43898 -61265 -213468 -81269
9709 -81269 -82957 -90023 91085 -50361 -207678 -8698 29442 -14137 89199 102398 -23949
9698 -23949 125607 -11515 -91112 62253 37963 -44952 -28556 97241 9788 -131564 -155033
9687 -155033 -119945 -63148 -68830 -26922 67694 84443 -91407 -150320 -235234 -93610 18030
9676 18030 62270 -74090 -97284 -50402 -114207 -88175 77558 -22283 -13293 37236 52550 -64333
9664 -64333 -27266 8795 -64587 110937 -49753 -55429 24374 63405 41635 5962 75602 -98313
9652 -98313 -97702 -64969 -121964 159380 52687 84785 37514 -78526 25999 -6944 105124
9641 105124 141183 -19652 -20342 -4553 67294 -25297 -182243 -234820 -47207 -76835 -28831
9630 -28831 18442 -19879 -118326 -33796 -24494 -147576 -161832 -30197 9772 63397 66183 39732
9618 39732 70779 -47508 -78716 -29305 135133 82637 63367 -123537 -222353 -91992 -81403
9607 -81403 -58246 -87914 -82595 697 -30651 41015 -117214 -131812 -156160 -183939 -89544 -56581
9595 -56581 -95799 -50219 -87997 -76864 -179510 -3232 69567 38559 90586 -4379 18414
9584 18414 16533 -67763 -142118 -92391 -38687 -71902 -99860 -100009 -26139 -23131 -131538 -128330 -68849
9571 -68849 98313 61779 57362 -110377 -68215 -62705 -161273 -277844 -221284 -141658 -28292
9560 -28292 -85612 31865 28820 -49607 6271 106609 51275 -51021 -108444 -72420 7914
9549 7914 -59035 25017 -59373 -27769 40232 -154291 -198986 -214232 40954 -6653 55624 -63686
9537 -63686 -101053 43673 -9141 -96232 -62882 -59082 -253364 -33812 2390 -35855 49157
9526 49157 101716 -50528 -20805 90555 32627 -56203 -159186 -225434 -182332 -33635 -47314
9515 -47314 -127606 -15503 64650 23287 29958 -41011 -52311 -45720 44667 85292 3320 -82744
9503 -82744 -116156 115234 139889 140935 -39400 37680 200175 90900 25795 -25303 -19393
9492 -19393 -21546 -115589 14055 -90364 -111644 2443 -126682 47469 0 -125164 -112909
9481 -112909 -98217 -11282 -45269 -37385 -71879 235357 119539 -35271 -15637 61482 131889
9470 131889 7214 -164809 58650 53477 6129 -37698 -80751 -75277 -85620 -57283 -64548 21591
9458 21591 100737 17187 42033 80994 -4125 40189 49416 -70887 -28014 -135337 -135881 22023
9446 22023 -21941 -108004 -137471 -68072 61529 -12900 -196566 -179493 -216982 32559 61292
9435 61292 -89142 -167671 -148895 -112505 21361 33890 -28172 -41215 -107180 67245 112601
9424 112601 135372 -17062 147551 24122 -9260 85154 12295 1392 -108503 10 -38077
9413 -38077 98084 44329 -46118 83536 19613 53912 26414 -1563 13180 6359 73945 74100
9401 74100 125895 -13327 -105696 -84771 26970 837 65423 7734 -43344 -82383 74456
9390 74456 54170 59335 -11397 93853 -46475 -71314 -28364 10046 14509 -120271 -32896 -87193
9378 -87193 -15914 104852 7742 41546 98226 -67042 -124946 -110306 -49461 -69875 -122225
9367 -122225 48565 -23632 -36636 -49106 6673 -148810 -161635 -25206 10260 -50853 32047
9356 32047 10803 7989 -59657 24157 49409 -148179 -86936 -174353 16760 -41831 -168689
9345 -168689 -87353 85303 106829 8009 75583 -18043 -20604 84194 112577 -41243 -233801
9334 -233801 -131536 63001 -102831 -162617 -61925 -56426 -30113 -18312 -4200 -110648 -137326
9323 -137326 -31545 -163197 -7345 102916 -453 39446 -11032 -31988 -15710 77770 -61356
9312 -61356 16477 90134 33596 -71910 24119 2879 -14185 29286 83617 -31607 -20578
9301 -20578 37580 -127490 -201926 -31303 -82730 -12509 -56630 -75475 -137297 41359 48456
9290 48456 -102214 -190412 -146515 -42961 -86108 -126411 -217644 -61664 -28871 -35803 36892
9279 36892 85097 84457 -60276 -48608 -51622 -52143 7178 93411 -63568 -54376 -20302 -129718
9267 -129718 -74672 -35098 -119908 -83049 14563 -60860 -55214 50877 -37717 -14720 20673 142857
9255 142857 54353 9260 96389 21121 62465 -38808 -72203 72160 136090 131524 61836
9244 61836 -17051 -53709 -120052 -74324 -100803 61034 -12080 -126005 -161169 -89306 -98198 -75612
9232 -75612 453 103608 138539 -14546 -86077 -67218 -49801 60486 162112 102303 -23533
9221 -23533 -114506 -46971 9472 -190100 -138499 48875 3016 -16727 -44611 162391 83425
9210 83425 56451 48562 -5277 38120 -8064 -35359 -10266 26506 -132836 -27565 -8775 65232
9198 65232 -154955 -67230 -33736 -77014 -112077 -148107 -109527 -87236 21437 138337 62880
9187 62880 133845 -22053 -121455 -27257 -11689 110623 -10103 -123867 -143981 -138742 -118809
9176 -118809 36089 67018 103160 113335 66019 44641 115551 -68406 -131476 -47378 81309
9165 81309 36825 -26301 -120563 -74133 45939 -35224 31595 -36216 2504 -103337 -21801
9154 -21801 684 69688 49221 -57842 -48361 -51238 -213741 -207315 -90212 -218436 -140174 29212
9142 29212 -36431 90226 11997 15364 -3539 -16535 135930 73455 -50376 -220293 -102667
9131 -102667 -66871 112997 55515 -72568 -168447 -156740 -119432 -101239 131627 -64175 8979
9120 8979 6866 -110826 -102389 -130961 -25792 -75945 70904 36708 105745 47900 -25785 13748
9108 13748 -46796 -92064 83811 110632 96389 27734 -107196 -190966 -137669 -2398 -48313
9097 -48313 -160712 -245552 -149921 24889 26604 -105071 -27616 18683 40938 -140940 -108620
9086 -108620 -9391 -82132 -57301 -96873 -38484 -94175 -60244 -65177 -21446 24792 49724 24719
9074 24719 27654 107801 149652 -26070 -62659 20841 65425 143534 77198 -18181 -86280 -143220
9062 -143220 -388 25861 17458 53877 248081 173182 192695 115729 75438 82705 109529 123603
9050 123603 -83011 -50060 -21228 32502 65430 48089 -9473 13063 -23863 -25001 -46299 -55174
9038 -55174 35264 23390 17420 51731 45218 -43956 -112422 -79321 -93128 -41678 -101371 -124541
9026 -124541 -112015 3337 -69620 13268 -18084 -21553 -51304 -68170 75350 77386 15704 97782
9014 97782 133674 81175 177816 32109 -71081 -66480 -144208 31453 47838 113191 118448 -2338
9002 -2338 79990 272282 116488 -89569 27404 -55973 -8221 85811 -50119 -6688 2632
8991 2632 -35976 576 30822 126279 7480 -183276 -7431 -100649 -209974 -177107 -98045
8980 -98045 -28027 -49048 -153463 -174894 -39602 -34005 -155074 -164198 29440 52788 -55104
8969 -55104 -21326 8357 -27696 55428 111391 64007 -88287 -206359 -126080 -123525 -169255 44363
8957 44363 -32357 -14553 -236680 -7996 -45871 -104541 92976 -33804 -79931 -27423 -89743
8946 -89743 -139850 -78838 -33718 76471 6626 -14493 -82772 9077 6623 63482 74895 69620
8934 69620 4733 -80524 -82224 -109069 -32640 30696 35837 -129766 -234370 -21366 -45239 -152056
8922 -152056 -181045 -9448 -93739 -34445 -28269 -110749 -114063 -122529 -39364 -72006 -94480 -54379
8910 -54379 16853 -130319 -242748 -221009 -11358 3474 30367 151005 39894 -105345 -43638
8899 -43638 -108999 -12515 -117256 -188678 -78672 41121 -21329 -64760 -45442 547 -42060
8888 -42060 -84913 22593 -41204 -62046 -69959 -124423 -9521 11487 -146326 -90130 -47384
8877 -47384 -119623 -119890 -142113 -131967 -88301 -110663 -72098 87055 59643 -3326 21763 15646
8865 15646 -44468 -33844 -46015 -163519 -98964 -16291 55772 -61383 88592 62952 -39222
8854 -39222 57678 50941 96831 -6535 62688 105355 58837 -16616 214808 199323 54545
8843 54545 86291 79937 -90729 -20215 92580 -4854 161473 38484 -45823 -204773 -116158
8832 -116158 -90223 -56743 -133963 -55951 -63678 -135951 -11352 24331 32295 -20225 -16366 4103
8820 4103 -64949 -38557 119921 169722 56724 -83359 -4099 19365 -79333 -28336 -52572
8809 -52572 -56782 2750 110282 -48202 -72608 74219 -59796 -39280 -34028 152860 94446
8798 94446 49142 -131281 -167450 -34847 -79964 -49700 18201 28769 -33641 -48112 18837
8787 18837 -42469 36903 -11590 19942 152311 -100894 -40429 19953 124879 -19757 100177
8776 100177 37847 -3440 -34709 -77569 23686 -40442 -114808 -43750 -53034 -45774 -81365 -3056
8764 -3056 16750 51056 -3691 -28393 -32423 -208151 -99732 -119228 29737 140811 117883
8753 117883 107388 49699 -34219 145939 13983 -108917 -55633 33315 23043 -80171 -85496
8742 -85496 -14143 -11331 125989 74878 -96549 -126515 -32793 -151780 -50855 -51443 -181264
8731 -181264 -231224 -102196 -6437 -40041 -91509 -12347 23568 -74324 -89644 -77044 -96850
8720 -96850 7186 -50517 -8797 -27642 -61290 50239 68411 137979 88799 4093 -33687
8709 -33687 -97795 -101308 111724 85397 -24481 -75079 -48939 -15362 63105 -33167 35665 127965
8697 127965 24578 56474 105963 -11304 -139285 6990 9222 -55000 -116391 -39731 67839
8686 67839 17308 -34994 -112647 -20944 -22923 40259 -72780 -165505 -140554 -28721 -120753 -86669
8674 -86669 39098 50425 9453 56054 46847 23974 -57152 182601 97795 34590 44079 58141
8662 58141 110587 -45847 63600 -11444 -12314 -17742 -86851 -66234 -21182 -83746 -70897 -23175
8650 -23175 -58971 29654 -19481 -120808 -13375 16325 -78542 -104057 3970 -21798 14244
8639 14244 29948 43777 82174 32202 18915 73803 85491 77291 71454 122975 10434 24541
8627 24541 -44329 -62186 102285 11105 10302 -36458 70164 79398 -36353 82342 57886 -57596
8615 -57596 67027 -51496 -169564 -113372 -37295 124 -71691 108151 38111 40975 49193
8604 49193 -13594 -14380 67677 81633 -35309 48448 17621 119871 81873 28729 40288 -72614
8592 -72614 -7966 -26626 1019 -142598 32886 12734 -9060 -67756 28096 30378 11327 40182
8580 40182 -16082 -26013 -108892 -9288 8406 11377 -41746 -76846 -84206 1471 97925 53521
8568 53521 -140530 -104443 -80110 -11814 40391 30670 89209 116478 100988 85003 4253 41013
8556 41013 -10878 54784 -18432 39256 -21220 25583 101134 9441 224944 119011 105522
8545 105522 59064 70806 -80788 -8204 61975 2894 -7795 -54805 -16203 -126215 -38578
8534 -38578 -31843 40505 35316 18944 -6444 31562 -14210 -15370 3163 3036 116481 42889 -34623
8521 -34623 -36376 -2387 -7187 -135533 139494 196851 102865 27956 41350 95406 -37449 -93789
8509 -93789 68790 9931 1398 -128059 -74686 -108809 -45340 13564 -102503 -137718 -68465
8498 -68465 -78543 -138283 -9440 -38555 28299 -41146 44962 19622 2279 -29438 -150155
8487 -150155 5012 -8163 31566 -321927 -346031 2999 -23450 54046 -63716 38323 -711
8476 -711 96120 7850 124052 123569 259393 92506 115351 46793 27122 96823 112945 134607
8464 134607 105093 240905 145854 -65758 -86825 -21686 -41911 83558 51869 100587 -54180
8453 -54180 -62092 -23741 -179214 -24488 87832 -24777 -59780 -61364 -22769 -78161 -136047
8442 -136047 -76220 9510 144944 20679 -26387 -17407 -21057 -18693 -2518 77282 -56617 -84427
8430 -84427 -69704 102864 74748 -71084 -41086 -133858 -86947 -11043 -7445 -30123 -119756 -106379
8418 -106379 -18950 -19180 -28951 -48687 56812 32098 -13398 88161 37110 -118375 -172745 -78456
8406 -78456 -45496 88567 49262 60714 5985 157778 122058 -26078 87002 77304 35611
8395 35611 -78750 -20101 -131408 -60194 -43753 -12122 124107 123131 8840 -98837 -94491
8384 -94491 -15339 -79095 18896 63700 17187 -43804 -182041 -99873 34975 45650 50032 75789
8372 75789 96976 60916 47566 126114 97295 38347 -95766 126841 40661 235248 300626
8361 300626 286120 116620 80031 99361 26822 -57210 36988 17758 -8920 24295 196677
8350 196677 235646 121702 90744 116234 122680 96983 118335 74311 75585 -24145 185905 158593
8338 158593 175823 146521 74076 124261 218472 203145 148913 151886 200284 163238 13480 -26947
8326 -26947 59426 50393 59494 -119923 -129319 29219 138825 110717 44445 60434 246894 296344
8314 296344 193192 190828 227552 246694 113388 90154 10667 -13887 96168 49297 34168
8303 34168 163644 47968 25092 96451 130157 124268 107564 162314 66765 34096 135452
8292 135452 206449 164038 111573 166950 231445 123774 159445 232841 110517 77280 -56288
8281 -56288 101672 248264 214648 141932 64278 243997 177686 272203 343156 256974 316281
8270 316281 260937 291686 261408 189453 208760 219230 161372 98894 168058 255396 352660 372926
8258 372926 156660 48495 167038 344269 262170 269989 326357 196258 129687 179626 219985
8247 219985 408934 392296 269412 296785 383817 367673 220770 366002 213888 297355 268674
8236 268674 372641 434608 395059 304704 328613 249439 293146 227556 252141 455070 397377
8225 397377 342865 210909 278793 299364 223926 285525 272166 257623 284603 418121 535208
8214 535208 297514 337009 455899 516403 372233 234605 303788 367809 130230 208110 310551
8203 310551 400596 372863 451105 327521 421425 358683 339270 368057 534764 555125 776992
8192 776992 788748 121023 330340 112698 287747 349391 301405 244540 379855 335557 433035
8181 433035 488600 441964 503740 439859 543166 514113 599202 553990 437688 450606 571543
8170 571543 506285 529568 549773 494312 598848 583712 518822 640327 591381 720438 784559
8159 784559 751610 695593 654022 818791 769862 671297 659710 626872 622017 720036 732218 727014
8147 727014 837549 692386 653895 664954 759525 768446 742866 805959 866149 854346 919203
8136 919203 906988 861144 889018 898057 1072016 932905 987271 986707 1028516 1000827 1003393 1101397
8124 1101397 1259120 1133703 1129076 1249536 1160147 1217519 1056524 1120404 1124610 1235103 1326021
8113 1326021 1288768 1349168 1337836 1553742 1715600 1569162 1568631 1519613 1529800 1610324 1665885
8102 1665885 1824504 1834687 1755317 1854987 2014601 1967819 1907887 2050040 2264221 2225400 2111302
8091 2111302 2254365 2232047 2360121 2319000 2375347 2440592 2595283 2692846 2788637 2959853 2920838
8080 2920838 3095883 3161292 3211389 3383484 3596385 3752899 3656189 3765964 4003523 4007835
8070 4007835 4143478 4285935 4541263 4617963 4869844 5039979 5271549 5403513 5642945 5785582
8060 5785582 6037833 6364587 6512678 6891619 6948269 7211068 7378107 7593330 7747978 7897169
8050 7897169 8161388 8365649 8367417 8452760 8605165 8821996 8957013 9195730 9300327 9207014
8040 9207014 9308395 9324818 9369879 9377527 9555639 9532082 9600143 9540487 9628712 9534278 9345912
8029 9345912 9422539 9427937 9242540 9302128 9407126 9225492 9122851 9253839 9142090 9061271
8019 9061271 9143373 9011951 8757953 8568009 8504789 8371124 8292949 8104822 7825559 7680158
8009 7680158 7714402 7427219 7181753 7004771 6806863 6544746 6489493 6173031 5925528 5708875
7999 5708875 5485181 5204780 4904543 4690296 4587321 4318085 4174960 3994599 3878387 3861206
7989 3861206 3687664 3563482 3439088 3150619 3054094 2905004 2621529 2654047 2667223 2569728
7979 2569728 2488819 2481728 2315310 2312787 2368199 2401481 2235040 2229826 2213499 2075040 2043063
7968 2043063 2024348 1971630 1856127 1766832 1896511 1953172 2045506 1821292 1867063 1846437 1758066
7957 1758066 1826254 1710231 1887241 1989342 1994282 1922193 1879927 2098868 2012011 1983550 2012689
7946 2012689 2059971 2100020 2068279 1998432 1906932 2003540 2184927 2121537 2187818 2208516 2178316
7935 2178316 2224030 2231058 2353526 2348718 2409868 2456709 2487211 2519928 2429243 2650575 2678017
7924 2678017 2713804 2694838 2781984 2850454 2884942 2906862 2951136 2992911 2936841 2972311 2978101 3037833
7912 3037833 3305218 3502278 3627741 3630504 3619279 3849828 4122108 4450885 4653927 4838934
7902 4838934 4987880 5182082 5417693 6042234 6213074 6470872 6842193 7146929 7461839 7812740
7892 7812740 8107422 8640381 9139029 9476735 9872809 10503815 11384104 12186984 13039544 14145610
7882 14145610 15463950 17165519 19466874 22343103 25665721 28565222 29510652 28902795
7874 28902795 27483087 26705953 27035524 27729561 27537145 25442814 22159859 18679347 15513564
7865 15513564 12930765 11100100 9715264 8532697 7561948 6751501 6201167 5647584 5078976
7856 5078976 4853153 4376006 3974548 3666235 3553544 3317549 2986437 2728595 2675108 2619829
7846 2619829 2529160 2339550 2312008 2198514 2108088 2116588 2124218 2050297 1840497 1907053 1748074
7835 1748074 1730317 1833662 1771819 1626597 1403480 1272947 1477598 1344106 1237032 1292135
7825 1292135 1081001 1120681 1044492 1190193 1139909 1234330 1014168 794092 845258 1018139
7815 1018139 987316 813695 857687 747634 567492 539931 667110 566275 641191 570511
7805 570511 741368 744175 551570 555688 679746 460060 541797 501429 499403 648204 594319
7794 594319 587236 562801 469316 504992 505008 521122 462388 362613 489399 597514 368089 282351
7782 282351 508225 552130 555870 490005 694246 684527 735060 731962 585428 573607 483637 336996
7770 336996 378206 467667 208850 233602 293740 395230 478352 336742 241106 206892 259627
7759 259627 327065 309606 266338 267444 291191 298982 251180 237308 193730 306724 245996 278753
7747 278753 302114 167054 256493 325845 398592 352841 310757 231068 190240 190877 217260 243686
7735 243686 61377 195720 304692 252442 113489 226612 158499 277349 306810 293277
7725 293277 325021 314749 311319 185821 207290 248084 227056 277354 346684 263075 197858 147457
7713 147457 149759 240743 276063 275943 331472 154885 142062 250113 268460 212115 189276 197814
7701 197814 244229 212728 110393 318071 238922 188677 140923 262681 62254 101800 350337
7690 350337 267381 311336 334304 323387 64343 -7579 205228 277341 182518 235764 311761
7679 311761 340713 225593 199738 270679 309091 255430 217317 90437 72204 241180 421973
7668 421973 425196 393396 394779 360693 214832 318078 253400 303400 329261 213863 214329 263729
7656 263729 198824 298001 198486 287802 342227 188236 208231 274789 285103 222474 292893
7645 292893 337304 404332 419662 348855 354960 297093 365180 411180 362790 611694 599940 409110
7633 409110 463714 423187 407302 473841 421532 360957 267805 373487 380544 184548 198594
7622 198594 364027 399314 325058 243060 308414 387705 303321 241222 385695 445682 369750
7611 369750 404958 495381 458271 445294 381301 363525 383180 343912 328615 410041 245137
7600 245137 395273 375094 374051 268162 235944 263621 315947 213034 343728 429877 552129
7589 552129 510105 358439 391452 470368 515182 275896 370262 497838 427812 336393 372673
7578 372673 373194 419231 315543 396758 359495 302020 207018 339326 430886 406418 374442 357841
7566 357841 388226 256787 281770 482670 408645 484545 650048 513589 322149 403611 375523
7555 375523 377440 294633 127230 245077 345269 240831 431507 426687 278562 352584 294961
7544 294961 467340 351248 400339 352673 410819 585565 559760 388406 502573 350482
7534 350482 250287 309794 367965 489663 493903 409422 272015 343869 283269 271273 471358
7523 471358 339754 296679 437177 290651 274841 348719 398635 411162 358917 292268 440763
7512 440763 528838 522834 457494 437153 430786 480536 457827 479919 464042 530555 457419 505528
7500 505528 523185 469816 530269 608166 537362 519753 561115 541150 537717 712824 557883
7489 557883 626964 620474 800124 669994 628039 712868 728057 780858 893921 873107 820178
7478 820178 784386 914030 901899 1005377 1126215 1032239 1104475 1034396 1104733 1122823 1123433
7467 1123433 875639 976155 954075 946693 845806 804842 787304 868669 936933 941603 830767
7456 830767 898948 1017196 1146162 1010058 1100720 1011653 1039017 1200694 1131442 1046824 870611
7445 870611 927724 960676 971602 1054669 1176670 1231089 1140195 1164711 1126101 1145079 1174128
7434 1174128 1240459 1178580 1155030 1145912 1063943 1182644 1188043 1264188 1365141 1438410 1367139
7423 1367139 1452813 1406204 1404270 1472552 1550627 1568442 1518607 1599736 1563547 1588614 1764150
7412 1764150 1958250 2047291 1955962 1863575 2088460 2122957 2088625 2040580 2245658 2320658 2251618
7401 2251618 2429786 2680125 2786282 2887841 2893067 3076973 3258616 3360567 3624778 3678749
7391 3678749 3761589 3905143 4100452 4233238 4434382 4657777 4829847 4901361 5003618 5199902
7381 5199902 5537476 5791337 6208406 6807694 7217584 7721285 8401645 9209858 10197053 11605357
7371 11605357 13177890 14592380 15452123 15350075 14488834 13135358 11806760 10751994 9970271
7362 9970271 9470227 8885332 8795749 8609938 8606200 8648085 8652254 8873283 9034564 9206563 9457736
7351 9457736 9793909 10296774 10793432 11372318 12129124 13159021 14369653 15888027 17723821
7342 17723821 20001295 22641595 24986369 26065915 25205910 22793303 19666329 16801935
7334 16801935 14192919 12358995 10772244 9560005 8568274 7889626 7282399 6759845 6581476
7325 6581476 6285894 6012507 5830651 5695327 5526039 5531645 5439454 5229788 5307292 5407295
7315 5407295 5337302 5483222 5568442 5582948 5704122 5678747 5816849 6062026 6307582 6428833
7305 6428833 6676235 6891542 7081472 7452139 7728350 7928434 8167226 8538202 8969204 9453717
7295 9453717 10122625 10808926 11774650 12821256 14112566 15782796 17777672 20000205 21538086
7286 21538086 21496390 20674163 19899701 19664215 19939420 20499412 20030569 18402919 16195750
7277 16195750 14151896 12385788 11280532 10253924 9278903 8668734 8322601 7894682 7691699
7268 7691699 7499349 7447113 7516386 7440638 7605326 7900868 8277452 8683902 9310119 10140601
7258 10140601 11259762 11682962 11314656 10745000 10305230 10278355 10380206 10420550 9930982 8945204
7248 8945204 7773678 6564116 5700058 4914134 4329929 3879181 3533118 3328056 3069885
7239 3069885 2876280 2614771 2529373 2547984 2524022 2460859 2395453 2388677 2145826 2139899 2025574
7228 2025574 1980680 1855889 1649515 1648071 1552911 1522676 1430936 1244808 1221415 1278436 1268604
7217 1268604 1160167 1077024 908704 974040 1100839 946812 897201 820613 817204 989419 852301
7206 852301 894858 878749 966940 854093 559828 618090 711938 703318 615046 579155 555566
7195 555566 639000 831241 676796 605069 630328 661316 576775 579093 511797 565362 455419
7184 455419 552037 562277 595036 305737 363844 354801 470284 445570 375881 290317 260254
7173 260254 342276 441036 491455 528933 374087 508955 564170 491987 517533 446940 511096
7162 511096 408426 459968 475563 374512 363487 470202 528970 580838 597736 417570 357004
7151 357004 363688 289093 217960 179745 323374 247635 132873 155622 255740 177426 132332
7140 132332 160669 332075 258082 382241 294080 338977 328978 306814 133245 128619 172190
7129 172190 318640 170583 300098 243939 341588 431531 363472 210861 252855 227928 374692
7118 374692 253785 280344 234469 183435 376140 238505 329832 251522 241556 133585 149657
7107 149657 135235 185797 222363 252427 248210 251939 233832 256883 275273 360549 243660 181391
7095 181391 221630 253668 204471 121377 180650 192706 235851 174861 104682 210354 238847
7084 238847 271102 303591 255969 375558 309355 173726 195598 100990 93263 137158 164091
7073 164091 136912 100692 180117 35023 23550 219315 221786 123924 117785 113491 74334 179450
7061 179450 234378 146658 183145 95569 224401 188293 99575 80828 51972 200083 173570
7050 173570 61317 184877 259771 54978 25362 -48993 -91268 138187 108298 137621 157388
7039 157388 65511 131071 162671 11414 17545 102908 201728 192559 17091 -49341 54539
7028 54539 21746 41772 181795 180509 212651 108158 97938 7551 5063 149897 233201 23255
7016 23255 119770 181197 178406 267747 164746 142115 150726 216762 233180 53642 140814 158856
7004 158856 133584 160708 151771 164794 258848 243534 234091 140828 167186 49264 -2909 220177
6992 220177 -9453 -19777 40685 120081 27636 -9337 -159289 -214260 -1752 48014 175663
6981 175663 243453 148355 54152 197383 21285 -10972 82797 142439 158083 -50299 11344
6970 11344 73309 194458 173339 -45815 116316 92948 69738 81031 -9256 -37772 -2150
6959 -2150 73059 188680 23738 141098 118917 50579 100353 151789 38108 44420 33441
6948 33441 14974 75456 72736 -12357 -99817 45786 71706 71779 -26346 62060 96750 53058
6936 53058 -1167 -2186 103972 54932 -4153 10709 12402 -20399 -29896 42578 2393 -17688
6924 -17688 -68978 -9960 -46186 3492 14978 8325 -1710 44674 -69744 12214 53625 -99460
6912 -99460 -53218 -138300 45520 78189 11950 -64886 31493 70534 84679 -4643 35259 -37511
6900 -37511 -124402 -61608 10388 -12774 -81647 -32624 96067 -10363 20368 68696 -47315
6889 -47315 62981 -22799 -54233 50314 -12574 -23219 -73532 -87819 40125 32171 3652
6878 3652 -34911 -5099 -88481 1520 -19214 26886 -86430 -168662 -144563 -63844 -39336 -13307
6866 -13307 96835 94351 3330 -101119 -78772 66633 103080 102210 41624 80816 2239 241937
6854 241937 70111 -29364 70391 62924 -163726 -65074 27903 69279 87758 -1872 104795
6843 104795 195682 268167 165643 101258 167331 205841 18919 33604 -11403 25577 27947
6832 27947 5303 -52688 -48215 134939 -107019 -202425 -14820 -4955 -79495 -45439 156660
6821 156660 177512 166012 104589 93420 -1437 -40297 -87528 -79857 -33139 -52928 -86306 -31978
6809 -31978 71004 -11838 -90383 -130936 -46370 47756 95366 -33754 -191036 -180635 19210
6798 19210 47317 -52348 83983 136058 -49031 -182464 12393 10385 -43755 -37690 -138693
6787 -138693 -27078 77679 83308 18755 57932 -73830 -133226 -137220 -126434 -92098 -90139 47358
6775 47358 -8972 49351 -51969 26435 -23924 -117014 -37717 -79942 -32917 241 -34070 -24043
6763 -24043 -23335 105974 115814 121501 84445 55274 -151854 -119559 -3896 -10053 73730 105915
6751 105915 -8642 23073 119841 132744 53221 60408 121452 90566 42783 -75780 -80989 -58079
6739 -58079 -21837 74756 2334 109027 95334 -130170 -67332 28142 1178 18602 28449 113580
6727 113580 9935 -179190 33236 8233 -48070 130536 61742 -65248 -39843 37291 39487
6716 39487 113508 -97697 -155001 74402 109640 -80496 -81487 -54446 -48381 79292 25366 -75391
6704 -75391 -74773 45858 -17421 68132 86701 12066 -117267 -141624 -121657 -45090 -13244 74469
6692 74469 86288 -46595 -160723 -47795 -127369 -78341 -255949 -198296 72949 -52840 57843
6681 57843 102724 -91737 -138111 -16712 -45841 -64961 -82087 68757 131658 93690 1014
6670 1014 -28362 -177510 -129010 -197346 -117969 69613 -40367 -185473 -113374 -41457 -93305
6659 -93305 -37943 -17497 38214 -4418 -14950 19745 -47262 -62496 78686 28117 17732 -36619
6647 -36619 111954 144931 20080 -42910 -48631 -37534 122913 93192 49556 -51527 -126744
6636 -126744 -146502 -84899 -30077 -31709 5930 -115060 -29214 -40288 -110366 -19872 -44621 86546
6624 86546 -67881 -265678 -122255 -221501 -26963 82853 90744 169927 55735 115968 207565
6613 207565 83242 28274 103317 87756 -75221 -73411 -35462 110153 -23781 -106995 35012
6602 35012 103196 44417 -22893 -28536 -58191 -59648 -39023 -33172 -131661 -46116 63915 11275
6590 11275 -164275 -113857 39215 100934 120723 3202 -10406 -1994 26762 96477 163462
6579 163462 50914 98365 77213 -31688 -86489 42063 178569 -121378 36902 168293
6569 168293 166496 6181 31384 -26144 -61313 -84910 47689 59289 108997 175648 50965
6558 50965 91667 16673 -60356 -70355 131968 182472 88225 45405 61000 125718 54050 -45750
6546 -45750 -42279 -10344 2677 138151 41140 -41872 8007 -5419 -135958 -101474 37058
6535 37058 20203 117860 -168293 -148931 -88802 -98013 -26853 -77042 -39171 175795 48673
6524 48673 -50979 -10825 -38917 -112125 16329 26372 -52280 -9934 15619 -27640 -132202
6513 -132202 -6348 38695 29687 61595 -53361 -1850 -23656 2155 26677 120419 -45296
6502 -45296 -31203 -38095 107779 117839 42063 4756 -50504 -52543 -79338 37590 -14179 -10230
6490 -10230 -167532 409 46745 45766 -75380 2652 5751 6656 65285 11222 -131864 -14977
6478 -14977 -68383 -81697 119361 100824 81468 97263 75154 31204 -67763 16771 48383 -89798
6466 -89798 -73803 -122483 -52057 -92003 52255 41168 11084 74868 -81441 -211481 -116927
6455 -116927 -120974 -81380 53887 10355 24827 -32780 -30367 23822 -127513 -138297 -148849 -190522
6443 -190522 -160977 -1902 -50701 -75235 -14803 91011 76341 -62362 -97193 -101277 -152570
6432 -152570 -121514 -34653 -164567 -143618 -46328 -26689 -19989 -93186 -70882 -17459 -92857 -37941
6420 -37941 -24816 67788 20621 -50212 84142 20044 43619 158372 -8747 -28716 -18140
6409 -18140 -81017 50719 60980 -18766 -56496 -80002 -93825 -31247 33565 -13744 -66980 -49542
6397 -49542 159432 134870 -91161 -99002 -4409 6230 40688 78820 52551 7476 118604
6386 118604 98096 70139 -23004 -46020 16249 94373 111255 108522 -97173 -68192 -7788 -38499
6374 -38499 88576 114525 -95137 -70112 -44454 -40487 -67746 -46463 3593 -102789 -49157
6363 -49157 80497 80910 135068 237908 208502 78306 -39031 32022 -61851 -110531 -15503
6352 -15503 136045 71607 -47010 124243 146460 83844 9630 19417 52359 96687 25989
6341 25989 -25331 141626 -2299 91883 92559 117056 53358 -152036 -32027 32473 -20139
6330 -20139 -41595 -69469 37757 55364 -20008 23730 52662 5341 49623 5117 121406
6319 121406 14436 -102417 23379 -76060 -161731 50973 11613 -91569 -79575 -75586 2649
6308 2649 9209 -36131 63193 84490 130066 58662 27055 54313 86364 26532 99873 10103
6296 10103 -25414 148669 27880 124623 47166 86915 13170 -111679 -123511 -5439 20474
6285 20474 29300 145319 -61202 -24646 4875 11015 43221 -145782 -176936 -40965 -36416 -172479
6273 -172479 -79960 -52979 -18493 88243 -84696 74584 101363 111600 109828 12433 -48138
6262 -48138 24570 99515 136663 18658 -23261 -13959 -108228 45145 48533 58752 418 163474
6250 163474 71230 37169 -52232 -14757 34872 -48343 3164 -153199 -131707 -56512 -61957 -58702
6238 -58702 -29134 -34586 -26143 113394 11707 37524 24265 66003 72067 61570 18626 27178
6226 27178 -122952 22059 158109 34362 -58667 -8787 -36969 -102795 23598 107287 -11920
6215 -11920 -108866 -157108 -121806 -127208 -80196 -43517 -56593 126907 -42754 -154577 -142372
6204 -142372 -45727 -94429 -25241 31375 41830 -17821 -52028 62698 147241 106868 -121613
6193 -121613 -212547 -42382 21031 6340 9465 103347 -106122 -123470 18648 63112 -1200
6182 -1200 -44620 -136327 -31125 -24351 77617 -5771 131636 107769 54383 47353 17262 142343
6170 142343 133463 86600 -39461 151652 29903 16033 -12681 59836 69470 147775 150070 12330
6158 12330 5951 115855 128951 -15617 -41923 -17170 134523 172392 64129 72627 134802
6147 134802 33993 -105373 -26183 104016 134041 28538 53304 97351 38370 67373 73502
6136 73502 44316 160360 35507 88456 32866 -44183 -47462 2868 14819 -72542 11234 6302
6124 6302 -50873 -139529 13224 27204 7832 224400 130662 51631 42407 28009 44623 18401
6112 18401 59260 50174 136921 -13646 -205561 -92804 -22919 -134064 -67904 22068 -7566
6101 -7566 11370 118245 -44618 -90352 -92646 -53144 23757 55994 -77589 -116793 -138644 -145073
6089 -145073 129859 69730 -11130 136315 58967 -8240 73568 85331 92003 48389 246903
6078 246903 194882 163206 206881 123371 89308 87080 -72641 42717 33825 -45526 -106462 -128740
6066 -128740 29243 54180 63397 -67398 34606 115895 143019 134288 166323 225064 5531
6055 5531 95129 78111 62249 -28847 -104506 89857 -21869 -64975 84546 96576 108214
6044 108214 42448 6695 -37567 -121274 84668 185020 12896 53158 99875 36307 -29246
6033 -29246 -71119 104702 71235 84755 -2024 -110556 -85094 1446 -69793 -63757 76131
6022 76131 30445 -17143 -4488 -96660 14397 -61327 -47521 -23818 82684 4545 -25355
6011 -25355 -48612 -56518 -6166 117769 99245 -36205 239666 56613 -64768 -60076 104381
6000 104381 130684 -26308 -177505 -40385 31152 45990 -22370 81872 39759 14394 22902
5989 22902 21455 115342 165877 252102 242415 137892 117630 31632 92287 150004 -122179 -44226
5977 -44226 73262 -89 -12530 -59571 -21895 63436 46447 51007 59363 73346 -54113 -61807
5965 -61807 58064 186488 81498 54472 27048 -61711 -59358 37636 49918 34896 29261 149074
5953 149074 6735 -69915 102040 209275 178925 74515 50230 257814 66410 60691 7654
5942 7654 -101076 71261 111792 25622 -20565 89815 25258 3972 56255 83398 -46454
5931 -46454 -142409 -64333 -53366 -46302 -90606 -223922 16872 64131 49071 34885 33070 124346
5919 124346 185702 229250 163726 103080 9775 -21770 -19784 -28037 26569 100645 46437 -10670
5907 -10670 -49689 170359 118999 72732 38116 -2656 63557 -44064 -64777 -111218 648
5896 648 -31096 99763 200883 180341 -147979 -176779 -3663 69548 51988 -54471 -34458
5885 -34458 157872 196731 86250 103644 116655 -20766 -46693 -39115 80659 109009 167723
5874 167723 76655 -76360 -42201 73330 -14355 -96349 10554 56614 33832 42485 19210
5863 19210 29678 -82026 -86413 19579 26126 16794 64818 15976 30283 185835 162933 146167
5851 146167 -63637 24982 72614 3394 24408 -23817 62280 51922 113815 3959 -81460
5840 -81460 161629 15800 3402 84876 131255 119782 52621 48615 -104998 -127414 -16260
5829 -16260 -13422 -21280 8527 117267 127630 177748 88129 115625 8663 30560 31272 7801
5817 7801 149393 201506 35350 -57161 -69622 -110191 -158820 -55039 -136137 -179751 43838
5806 43838 -5884 84763 150650 111549 33317 -14917 12940 33330 -1473 -49391 35378 30214
5794 30214 -26059 22552 -33339 -137469 144100 234939 196201 108198 107516 227395 29751
5783 29751 26585 26027 48545 -27371 -57838 27600 94348 29444 24546 -52314 35735 74716 -18910
5770 -18910 -53977 71614 143218 -19149 -85224 -50450 -24014 -10841 -65942 -39890 64830
5759 64830 42016 -19213 -76093 68103 98864 19310 11901 67831 38739 -52690 39522 60260
5747 60260 -64044 -67629 31718 -48426 -27924 165861 165280 -21451 93281 144663 26155
5736 26155 188910 80380 25556 45993 -46710 170023 218425 86265 92564 31973 87843
5725 87843 57771 -1419 82123 146563 74166 181210 43952 76371 56895 33455 -19346
5714 -19346 83522 243006 242807 112082 131183 20380 74289 138855 172752 171643 205835 157437
5702 157437 41936 138026 22371 112509 -29832 -25646 -37293 90301 14770 65568 59580
5691 59580 111342 113015 12711 94869 68567 17883 39715 -15585 114514 114085 145846 172094
5679 172094 211988 295044 161374 108609 135214 81910 4816 -3245 64648 -42379 69973
5668 69973 -31716 157501 137486 70302 146848 160502 99132 15407 -77364 5340 269289
5657 269289 -32317 37714 278785 152114 33353 126337 112886 211839 318903 160528
5647 160528 3243 82161 161273 140881 100521 84608 15353 23183 67000 58517 130366 113303
5635 113303 -18482 -53565 63860 201783 69070 113594 51252 75711 -77157 60605
5625 60605 174008 191740 49991 -10673 62458 134805 86134 156061 145370 113386 105416 64517
5613 64517 155228 168686 167913 68391 153879 173682 93982 77752 -64871 95611 226417 195974
5601 195974 35419 -25249 -7312 -48497 16344 11918 110399 200128 275043 208662 222105 140616
5589 140616 182119 261788 216724 10912 -34881 -16901 106494 32654 162082 148026 213433
5578 213433 91495 33881 131767 85523 3043 48385 190972 26137 172198 350527 389127
5567 389127 309209 277227 298065 269863 311783 266265 318117 217665 156136 187301 226773
5556 226773 151743 77454 -55903 39074 339294 248328 214633 176518 173651 178446 232101 196990
5544 196990 76534 78402 140215 138083 148629 186161 178324 150500 78057 108450 62660 144093
5532 144093 172163 123113 160077 162746 255335 295253 260641 222707 258121 217805 307297 341973
5520 341973 348493 298665 256543 310687 291386 142971 222078 254922 323092 162628 105903
5509 105903 369448 362055 329641 268168 258151 488421 392708 370143 383846 407148 343317
5498 343317 366826 353500 437960 383789 307763 342620 367479 318082 261048 509109 350681
5487 350681 522596 405275 485634 415921 460485 596740 359543 284187 453503 660561
5477 660561 616526 530151 433631 411850 514995 537627 576171 472955 378259 519011 419566
5466 419566 382914 317055 356619 354869 505315 403406 259105 330764 315356 413980 410260
5455 410260 312136 391312 461821 128475 85499 105629 205415 266879 298963 315379 332744
5444 332744 334477 394474 388090 392137 464279 286958 280676 362637 412446 389915 403131 341096
5432 341096 216676 184347 343630 398031 320000 335860 353499 407856 389120 342226 306433
5421 306433 186950 268852 460951 459556 367780 291222 197810 164408 283176 318580 327323
5410 327323 395519 277451 349454 320216 297178 370827 406556 441276 403619 375156 414224
5399 414224 375248 494711 500687 443729 535121 459947 413885 484455 503006 437487 429785 309337
5387 309337 446186 565751 414420 437135 575176 395826 313656 511694 530276 628936
5377 628936 549581 468774 419047 623145 556906 460063 460866 519353 604374 534316 681458 694184
5365 694184 554214 649847 767374 664862 582341 477100 568571 583681 581712 438914 674216
5354 674216 689528 552219 687699 623553 557886 643179 728926 761188 989411 1068123 1042088
5343 1042088 880765 833227 905382 1073923 1067421 1032487 1108900 1049043 1105124 977980 1111340
5332 1111340 1071716 1051642 1039105 1183293 1279430 1222249 1222992 1326150 1139160 1170645 1177212
5321 1177212 1269108 1334798 1309769 1568502 1579382 1555721 1538889 1676526 1568563 1765590 1933396
5310 1933396 1834659 1940178 2123020 2216804 2190586 2061601 1965764 2228535 2299570 2230654 2328508
5299 2328508 2376447 2450395 2653560 2768959 2843704 3012897 3175655 3324267 3403433 3527006
5289 3527006 3491378 3580843 3876960 3932415 4123984 4436415 4603146 4824356 4961614 5213235
5279 5213235 5593107 5792411 6068571 6483222 6875989 7423494 7802148 8196631 8506353 8854932
5269 8854932 9244243 9708873 10013642 10417268 10748260 11066357 11314454 11302614 11342358 11413135
5259 11413135 11659070 11948538 11944302 12256249 12723053 13194565 13543927 13833752 14100577 14464702
5249 14464702 14741938 14614860 14419051 14005801 13693178 13081308 12489020 11892740 11415650
5240 11415650 10929424 10616158 10367049 10161110 9977074 9806637 9511915 9350778 9097324
5231 9097324 8942786 8544132 8130283 7663470 7096722 6677927 6284186 5741908 5394859 4991859
5221 4991859 4615232 4479690 4033707 3784748 3562461 3367463 3286976 2990067 2768479 2607656
5211 2607656 2513369 2574003 2425203 2275017 2143818 2146402 1979787 2005944 1804078 1745359 1897871
5200 1897871 1754891 1760538 1727873 1630511 1639796 1522776 1419798 1377693 1400940 1172843 1234204
5189 1234204 1146065 1148205 1274106 1250534 1071127 1007637 1089742 1013008 955602 963434 928142
5178 928142 960585 990432 868868 821090 869074 762317 804964 678708 721556 856569 769840
5167 769840 689422 621592 701080 687238 576691 733740 611548 867164 897879 825820 802494
5156 802494 769414 788046 833662 788921 651595 759853 826061 670424 627670 769586 696349
5145 696349 560709 467372 487719 432778 402550 379937 387822 480023 549393 438797 402041
5134 402041 351171 358685 392729 532158 411244 530935 524120 500438 341966 406265 555468
5123 555468 550973 520946 482551 461229 495563 379234 436574 321945 371041 474152 398539
5112 398539 423577 437928 564476 594722 506941 480256 401773 364824 271057 443643 618714
5101 618714 727170 608203 381987 485254 555492 454369 432678 526100 558784 435544
5091 435544 351018 344306 484121 642809 670029 452600 459398 363165 448353 476304 479683 558208
5079 558208 464104 485302 387584 542813 429367 405295 425713 382095 431912 366023 379564
5068 379564 409742 366357 364775 289119 435002 375159 383706 512902 551598 461949 362931 332005
5056 332005 236291 401094 428710 414810 451034 433213 366075 507401 515294 449360 629619
5045 629619 605826 497949 519598 390145 405605 357118 451041 559600 635694 568943 632072
5034 632072 522727 446684 407282 377149 403637 500048 558346 492237 433127 373013 447414
5023 447414 426961 366161 413123 587378 478973 413964 327969 417264 341733 425315 362546
5012 362546 520096 652658 564165 425942 341187 275654 302817 530057 578124 332089 358448
5001 358448 487126 553353 430123 509026 246685 341497 325909 416967 331760 318900 412751
4990 412751 376448 405636 404987 485944 509993 393997 424608 413883 469349 456523 475829 533160
4978 533160 527947 516256 399219 599906 418849 365850 380797 452461 515701 409684 285934
4967 285934 433530 410167 441057 509859 615109 507044 490899 621491 419874 504251 591008
4956 591008 419818 514559 538572 624760 491483 423293 468595 584516 655177 585371 491522
4945 491522 438159 524736 375474 471642 437479 396431 501606 610576 710949 620714 540870
4934 540870 545601 432959 398300 448283 427407 526113 645754 700057 574554 469255 563088
4923 563088 569576 600483 652127 561385 375143 441839 652047 479642 457888 599324 627760
4912 627760 603921 671058 605142 543526 644615 684113 747093 739937 733569 629692 540524 635322
4900 635322 613775 519526 710756 718882 628856 643092 492258 592770 737375 638499 718545
4889 718545 657842 580118 653631 717080 679567 670656 664906 651972 634798 557633 607064 589543
4877 589543 757556 756387 693238 682660 659882 667240 726749 795313 905668 889928 778943
4866 778943 741887 629461 700621 801967 845680 810610 714213 785968 850400 700656 578600
4855 578600 782135 902194 961899 832843 808165 766898 989697 1034098 948056 870671 931614
4844 931614 886350 747316 796514 905628 816276 793630 965650 1067903 987934 1034625 886023
4833 886023 886665 893789 1038534 1082201 1054633 1014591 1153204 1193575 928436 956264 1143191
4822 1143191 1163983 1129474 984099 992452 1216544 1203620 1061403 1071610 1123668 1181119 1232946
4811 1232946 1278629 1240155 1320809 1355120 1244763 1212526 1249807 1398476 1382812 1456294 1528332
4800 1528332 1368281 1403989 1527360 1397699 1537065 1512213 1716661 1707861 1653037 1667284 1654304
4789 1654304 1579729 1697751 1579431 1657900 1812480 1888669 1905583 1915050 1885491 1890223 1954775
4778 1954775 2057902 1933329 1837540 1917943 2048757 2048295 2100556 2093241 2279033 2146594 2297926
4767 2297926 2546776 2482674 2497305 2590633 2577031 2681574 2715299 2873093 2646882 2694574 2833373
4756 2833373 2761044 2852515 3027037 3264156 3192916 3225745 3352250 3393288 3457815 3640363 3687113
4745 3687113 3753292 3869355 3975346 4160718 4339667 4389315 4698378 4655106 4759116 4918689
4735 4918689 5227837 5431219 5462012 5733908 5967892 6146469 6386384 6717094 7040949 7276089
4725 7276089 7694956 8089186 8335154 8650386 9063930 9483374 10052034 10416703 10948322 11510415
4715 11510415 12032961 12416662 12538962 12819973 13176860 13197262 13236061 13245668 13194504 13405149
4705 13405149 13689046 13984957 14374912 14771986 15229581 15742869 16079449 16326830 16672262
4696 16672262 16727628 16431842 15938401 15476547 14748064 14085460 13485397 12944081 12476841 12015468
4686 12015468 11860658 11329149 11184730 10975444 10740376 10457970 10249185 10114522 9916610
4677 9916610 9411649 9027329 8656970 8061937 7655937 7224012 6628957 6343119 6073926 5804873
4667 5804873 5660855 5313523 5123463 5096383 5028150 4942153 4766928 4483144 4356089 4232438
4657 4232438 4258908 4195700 4041967 4025747 3950310 3812174 3763927 3763300 3748500 3563616 3347577
4646 3347577 3544039 3546314 3490216 3686892 3569802 3509746 3387449 3538981 3520608 3484167 3302682
4635 3302682 3268227 3275670 3328294 3394135 3412158 3584642 3562829 3557261 3571818 3542559 3509032 3616840
4623 3616840 3540740 3462114 3436032 3444656 3540676 3767182 3694643 3863428 3809569 3738935 3884421
4612 3884421 3863598 4009318 4047573 3980582 4044215 4048732 4014170 4164274 4027494 4238285 4316500
4601 4316500 4339526 4378508 4482282 4584407 4665767 4627533 4760859 4835959 4954130 4962985 4957694
4590 4957694 5131397 5224913 5327527 5425259 5630749 5799285 5813826 5970321 6113682 6328439
4580 6328439 6440428 6490142 6700117 6944897 7266089 7470166 7591887 7685969 7891690 8277583
4570 8277583 8470507 8673757 9009368 9377564 9649422 9976538 10313217 10850526 11307682 11663156
4560 11663156 12213062 12799144 13204884 13588134 14207162 14844455 15339241 15573028 15906235
4551 15906235 16037252 16195596 16513295 16763060 16828546 17022903 17358220 17670036 17921781 18428400
4541 18428400 19069206 19546653 20030521 20500704 20771637 20901465 20932133 20711052 20367536 19985260
4531 19985260 19368113 18765761 18282116 17704627 17334586 16999265 16654467 16382283 16379273 16377925
4521 16377925 16272607 16367032 16218314 16076141 15962052 15782402 15266385 14896469 14518736 14124126
4511 14124126 13748251 13519484 13363195 13016608 12862830 12739306 12485214 12658030 12528365
4502 12528365 12544220 12756553 12710223 12938631 13089473 13153882 13370307 13552808 13600558 13817604
4492 13817604 14167341 14502922 14858294 15116404 15516677 15912780 16240418 16677381 16915626
4483 16915626 17202177 17770496 17939046 18205390 18698148 19122213 19314196 19748943 20132868
4474 20132868 20521258 20978843 21502621 22034126 22609911 23311656 23930039 24580925 25299109
4465 25299109 26182497 27292754 28476834 29473100 30722159 32138560 33300577 34881957
4457 34881957 36798716 38862986 41182820 43593865 46318145 49398984 52740169 56853601
4449 56853601 60883318 64659250 68168361 71652356 74832266 78123198 81699518 85788503
4441 85788503 90472872 95260115 99599569 103938533 108274475 113154107 118892375 125310548
4433 125310548 132277206 141044681 152027248 166251180 182502819 199939273 221060743
4426 221060743 249654694 286796805 337519843 405706101 485691165 525740866 485605902
4419 485605902 406395041 324968242 257793040 208550029 172069216 143594694 121673851
4412 121673851 104617981 91390250 80705871 72142058 65067690 58824456 53642227 49351043
4404 49351043 45543695 42229951 39241666 36676578 34334183 32092803 29967611 28169789
4396 28169789 26411152 24954909 23688914 22179952 21130104 20043908 19021514 18055311
4388 18055311 17180261 16351053 15646087 15032100 14402166 13875132 13076548 12617890 12097175
4379 12097175 11540850 11182428 10665500 10215480 9846033 9519316 9120115 8868420 8570261
4370 8570261 8374250 8082169 7784731 7419923 7216630 7039872 6730140 6553143 6383127 6280413
4360 6280413 6063408 5719338 5632625 5541656 5407459 5343539 5224326 4886208 4830174 4823484 4637174
4349 4637174 4414674 4394927 4369595 4171443 4094244 4165874 3966277 3874076 3857590 3902880 3822842
4338 3822842 3692306 3647607 3606115 3584280 3419297 3323256 3149607 3219996 3243973 3090488 2976449
4327 2976449 2871908 2880396 2801607 2825991 2717455 2844256 2746154 2786916 2759847 2692073 2598431
4316 2598431 2574815 2630339 2348850 2348094 2407539 2295864 2256603 2101881 2080475 2185791 2248632
4305 2248632 2109478 2092760 2205643 2069728 1927941 1815649 1722313 2003221 1969645 1817666
4295 1817666 1660876 1470015 1584129 1463405 1404179 1510382 1403488 1448040 1648891 1587932
4285 1587932 1514254 1488608 1552316 1567380 1359495 1405581 1326831 1433137 1365464 1335494 1300093
4274 1300093 1260710 1370870 1393039 1253493 1257740 1191461 1174039 1284809 1131444 1201986 1126862
4263 1126862 1165010 1194950 1112750 1191695 1149222 1057784 1131434 1090279 1070327 942993 1038976
4252 1038976 1245391 1228097 1087816 1100718 1109781 1012871 981569 932633 1022586 975524 1044788
4241 1044788 1091805 1030457 1046935 1004221 963593 985729 945617 932281 1040385 1042446 1018530
4230 1018530 1094989 985042 901289 1021956 1029086 952854 1035296 996759 1039561 917506 846223
4219 846223 924286 1010324 1117121 934086 929836 969870 921184 872948 941306 900645 983053
4208 983053 948969 983731 803150 803219 957242 967081 1028990 1037083 976225 921977 948087 988009
4196 988009 766452 793526 830294 1008571 987101 841297 1040497 959278 856874 914530 690580
4185 690580 823611 984754 837768 833755 847874 824182 763069 862590 942267 853611 824652
4174 824652 906758 898027 854938 895436 863228 752711 850860 923965 900735 792054 856194
4163 856194 702752 752536 895367 848561 769884 716835 609174 840565 912704 1001282 919839
4152 919839 807773 842322 776663 901826 781389 772120 695322 722451 862246 983949 844927
4141 844927 800975 880501 943505 935212 865069 959525 1052168 1011790 942279 926627 821340 879300
4129 879300 1072461 968508 833130 779818 858604 755148 961275 992113 925432 847948 895503
4118 895503 1024349 998540 1073945 914622 894565 1056126 1010970 888796 913631 922167 942110
4107 942110 963612 972342 974136 982479 1111720 932335 905507 914324 802033 974372 902732 1037634
4095 1037634 1084643 1085003 1097997 1113862 867064 972126 1037081 999242 1108903 1254059 987913
4084 987913 1008915 1071216 942771 1067797 1087452 1058874 1089550 1172778 1170890 1150079 1273068
4073 1273068 1305896 1266859 1367960 1329872 1397343 1470301 1503262 1486745 1660015 1618338 1495285
4062 1495285 1540346 1569869 1604020 1617122 1541046 1594839 1698802 1751567 1841304 1715999 1697092
4051 1697092 1751533 1771310 1874414 2060016 2083418 2020634 2050637 2195123 2199818 2140606 2136343
4040 2136343 2195151 2279168 2266094 2405462 2402522 2393506 2460921 2511726 2342657 2633009 2640147
4029 2640147 2722896 2855374 2911078 2915209 2945958 2910256 2984490 3288244 3367772 3379749 3410803
4018 3410803 3436692 3715021 3817744 3752126 4001473 4113590 4165362 4301232 4531691 4675147
4008 4675147 4677248 4926284 5245658 5367470 5626577 5982555 6062297 6190746 6382078 6674619
3998 6674619 6794829 6946464 7074277 7146308 7438069 7614128 7985419 8247414 8337693 8560592
3988 8560592 8743983 8921545 9058607 9241742 9558856 9586126 9779163 9865463 10074669 10169408
3978 10169408 10308946 10504993 10588073 10709409 10800026 10880281 10946250 10884028 10883466 11050726 10972894
3967 10972894 10941048 11051969 10988267 10942939 10871034 11060740 10895732 10639994 10722708 10735074
3957 10735074 10436053 10359003 10218119 10103657 9866197 9844646 9769660 9605620 9444373 9268015
3947 9268015 9080026 8920979 8603824 8474810 8366606 8223729 7931880 7568804 7472164 7329488
3937 7329488 7234930 6837958 6635262 6516302 6203295 5931961 5691856 5629005 5540392 5276612
3927 5276612 5128608 4994865 4794863 4653398 4617059 4496053 4476673 4404311 4235700 3981082
3917 3981082 3824586 3827248 3730002 3525401 3512464 3458162 3239003 3361069 3348616 3179504 3176755
3906 3176755 3075344 3103127 3078784 2963491 2875217 2910333 2934938 2916150 3012329 3050590 2978152
3895 2978152 3070895 3009241 3118474 3098819 3171969 3139184 3048712 3100155 3189980 3343602 3269707
3884 3269707 3347190 3463765 3485614 3527223 3541072 3687285 3709879 3761323 3896923 4017229 4106807
3873 4106807 4184184 4167079 4149560 4360021 4367543 4370560 4667226 4570233 4625805 4721056 4768541
3862 4768541 4941619 5201725 5286280 5540210 5692844 5884308 6023999 6166935 6431131 6686521
3852 6686521 7034937 7288099 7507968 7934568 8309834 8675888 9196346 9586276 10054132 10704988
3842 10704988 11247489 11758992 12431123 13198914 13944755 14579508 15360144 16235648 17143548
3833 17143548 18137392 18884532 19974618 21129559 22678553 24184683 25690214 27841198
3825 27841198 30143964 33167265 36279272 38888495 40683740 42326191 44474607 47520031
3817 47520031 51327952 54544828 55865835 55697894 55715332 57168281 59379224 61820947 61685592
3808 61685592 58632513 54686401 51554487 49843363 49092546 47442667 43824937 39179388
3800 39179388 35034555 31851839 29505750 27371240 24725772 21733626 18673732 16028594
3792 16028594 13861307 12139449 10860397 9852865 9002540 8109597 7290413 6926036 6417996
3783 6417996 6019934 5667966 5264932 5056659 4682699 4384522 4161649 4029669 3866426 3625068
3773 3625068 3540216 3435486 3255845 3043967 2930769 2781879 2660731 2594544 2635400 2605922
3763 2605922 2433941 2231077 2296088 2093866 2129684 2155917 2023953 1899799 1729432 1730140 1647576
3752 1647576 1672506 1498828 1438923 1428746 1363792 1463244 1371572 1340512 1204554 1184826 1240110
3741 1240110 1281508 1241173 1229412 1232374 1223572 1242460 1232103 1200601 1230289 1249718 1145428 1124676
3729 1124676 1073882 951031 1076744 978697 928526 1002041 998684 1011504 873557 881584 959063
3718 959063 977969 884713 960625 871666 762917 710985 682135 796619 801747 857705 867816
3707 867816 827639 798220 687678 796445 901524 751870 795000 767292 674958 714771 802329
3696 802329 737232 730917 759684 781364 684929 642606 826044 606812 636849 675409 700796
3685 700796 667560 698382 658814 650647 537579 788417 694708 671423 582866 658231 619669
3674 619669 557962 563294 673175 591450 605144 711935 615455 651441 734162 683827 672560
3663 672560 624224 617074 754260 745778 723446 662878 709968 687132 732455 810660 852773 696594
3651 696594 727115 758004 744188 744215 816678 751225 878132 886907 964274 860941 905911 890551
3639 890551 913813 880658 834472 793669 680099 740815 822775 854035 730956 830144 1043738
3628 1043738 1017079 949430 976324 1063341 1089722 1104390 1218818 1222660 1102322 1117888 1207513
3617 1207513 1168290 1237756 1184770 1345866 1247843 1184174 1293662 1491404 1463054 1545571 1632884
3606 1632884 1550213 1658433 1671091 1583798 1600211 1768390 1704775 1912817 2116036 2129303 2117608
3595 2117608 2324015 2445966 2424481 2619607 2728968 2760790 2873229 2955531 3117352 3355271
3585 3355271 3561763 3791490 3987166 3966009 4152283 4263928 4439699 4651138 4959496 5152951
3575 5152951 5362508 5466482 5830251 5935739 6061335 6311233 6589444 6907508 7201147 7426602
3565 7426602 7665712 7844547 7994209 8276124 8477106 8223380 8372863 8439397 8649948 8866567
3555 8866567 9011128 9030536 9197330 9107475 9305265 9313003 9083338 9103618 8987870 8691628
3545 8691628 8570097 8680274 8509321 8384548 8021214 7935428 7751385 7579111 7561939 7509782
3535 7509782 7411815 7282031 7360042 7601031 7836686 7863208 8165872 8831427 9757699 11268441
3525 11268441 14119750 16070576 14260331 11609397 9107429 7275896 5881386 5125970
3517 5125970 4440463 3768040 3416575 3080325 2782329 2602970 2297013 2024959 1960293 1899335
3507 1899335 1779830 1753668 1682540 1540381 1417654 1432670 1412879 1247108 1205873 1101381
3497 1101381 1100830 1187640 1089592 1039517 996117 928677 1001577 909110 797463 828842 706424
3486 706424 863429 877267 827493 622304 717280 672930 739972 831773 819138 668651 686145
3475 686145 616894 683471 654582 634596 661929 645559 639708 641179 656462 626301 623042 579077
3463 579077 566119 616786 672665 607087 656695 572916 423659 642612 745947 730347 714888
3452 714888 674091 612143 538696 558584 563617 501020 498095 434974 450676 538766 652594 654679
3440 654679 599776 597161 590691 632468 473948 420708 405974 592422 670194 602520 513542 606729
3428 606729 543877 693457 630187 511482 683582 793763 585443 530533 594751 606462 553213
3417 553213 651187 717056 584561 607061 538468 537668 710607 714667 707458 585511 561612 625612
3405 625612 709538 647340 596788 595251 572218 631752 636292 587694 630644 597857 570871 599772
3393 599772 668278 698993 618714 576339 547220 632611 683486 400005 557103 604765 476281
3382 476281 507509 539882 546898 628675 462603 509625 605660 597274 503993 520743 486117 557291
3370 557291 580145 492794 535416 540210 566150 574796 663015 520560 626846 726595 680323 675765
3358 675765 676168 678870 775400 715202 777998 712532 686591 791551 845339 786258 817384 738863
3346 738863 696269 813956 846628 935337 765127 643829 768449 800767 701030 804300 882937
3335 882937 1026706 918296 804199 751077 916012 987050 942658 1003026 929543 792200 814530
3324 814530 909267 932898 929596 1009845 926985 891892 917798 938525 839342 881589 1122566 1074729
3312 1074729 1103722 1050474 1078819 1059116 1016305 1176009 1188240 1269348 1166385 1128560 1302751
3301 1302751 1182724 1207408 1168106 1163568 1197970 1245564 1133655 1293308 1284748 1416584 1343460
3290 1343460 1284006 1294769 1292051 1326573 1305844 1398749 1377007 1302218 1311687 1357871 1415409 1401409
3278 1401409 1433193 1552534 1567761 1640625 1856891 1830521 1696065 1616839 1632881 1669001 1640367
3267 1640367 1826573 1854720 1936024 1911969 1971038 1985348 1921946 1939589 2004384 2029956 2084760
3256 2084760 2107695 2015180 2016582 2263759 2202681 2077829 2360984 2403081 2404912 2472084 2434064
3245 2434064 2495261 2494655 2537434 2603313 2658721 2713651 2887007 2931733 2879695 2985601 3038158
3234 3038158 2969619 3066738 3126077 3268151 3469282 3501440 3529182 3617133 3908275 4114712 4149742
3223 4149742 4255316 4399088 4690208 4844779 4900014 5257490 5466503 5677230 5885155 5979360
3213 5979360 6174638 6497534 6687768 7002089 7260291 7570754 7839758 8014816 8501124 9053427
3203 9053427 9474445 9801756 10092099 10727128 11148248 11800438 12182949 13070893 13848712 14578256
3193 14578256 15316379 16084243 16814310 17424998 17897665 18280476 18596732 18813372 18935149
3184 18935149 18848263 18928007 18659821 18497130 18137446 17696209 17439716 16923680 16334004 15759030
3174 15759030 15035924 14193837 13326204 12458305 11688490 10834619 10042379 9454881 8874203
3165 8874203 8295102 7661653 7307597 6886228 6622799 6247819 6069491 5767204 5486901 5292146
3155 5292146 5122252 4934414 4862671 4626364 4498496 4475613 4394554 4343849 4161126 4169187 4151949
3144 4151949 4330919 4302489 4113236 3990412 4098559 4173192 4091057 3954914 3931768 4034839
3134 4034839 4060169 3927892 3894076 3972997 4068796 4064077 3993374 4240702 4138536 4200443 4373046
3123 4373046 4499970 4469236 4454619 4585616 4581752 4686534 4660297 4786831 4902589 4974627 5172055
3112 5172055 5381042 5490006 5530322 5831220 5748473 5961113 6029706 6296694 6470284 6717380
3102 6717380 6853202 7102832 7433863 7783138 8034530 8268255 8538126 8650216 8848013 9107468
3092 9107468 9413432 9463695 9608892 9891243 9895286 10019878 10065171 10206763 10412006 10458268
3082 10458268 10627093 10980746 11438332 11673057 12023665 12340977 12669064 13091682 13643334
3073 13643334 14213479 14808353 15398259 15899746 16594592 17359036 18111174 18882733 19546386
3064 19546386 20473501 21532457 22614975 23646928 24787121 25947384 27317150 28626040
3056 28626040 29616965 30783012 31626837 32214714 32858205 33255985 33446259 33275067 32987814
3047 32987814 32709428 32381746 31779477 31371420 30704498 30085890 29095315 27966556 26675813
3038 26675813 25298201 23952688 22550927 21251596 19969210 18897763 17651352 16670050
3030 16670050 15768117 14825512 14362214 13832024 13086834 12628093 12206116 11864330 11583243
3021 11583243 11171245 11006966 11015685 10958319 10838214 10637698 10630489 10710484 10800984 10807698 10929735
3010 10929735 11028969 11175595 11413887 11751137 12166630 12275595 12417176 12643853 12899614 13132210
3000 13132210 13391817 13612582 13955058 14116676 14392551 14490032 14683174 14943644 15197056 15555086
2990 15555086 15953889 16549223 17079854 17635258 18294819 18975131 19714480 20483951 21214082
2981 21214082 22150175 23123498 24417192 25615071 26907064 28243869 29611486 31069973
2973 31069973 32540315 33965202 35154556 36271334 37076211 37667182 37821000 37816988 37658647
2964 37658647 37289522 36968246 36444083 35819456 34907743 33836573 32662265 31221702 29510430
2955 29510430 27718096 25758152 23873604 22228365 20594574 19129363 17669126 16429142
2947 16429142 15323080 14313375 13377791 12457403 11644696 11029557 10590829 10198669 9759932
2938 9759932 9389606 9049419 8656752 8454558 8073128 7832354 7679824 7410968 7235153 7059390
2928 7059390 6783726 6487047 6418221 6268135 6259753 6069414 6049822 6044846 5991844 5946826 5895802
2917 5895802 5738802 5748394 5785934 5773232 5943925 6004576 5865211 5973077 6068491 6092866 6229096
2906 6229096 6384432 6415163 6396700 6427370 6601448 6566495 6618721 6625730 6598071 6647396 6488340
2895 6488340 6617595 6427527 6351825 6182117 6407535 6533074 6515617 6648488 6560215 6717982
2885 6717982 6928280 7017170 7138884 7160505 7292824 7513500 7658680 7718796 7958289 8171141
2875 8171141 8423038 8658162 8951722 9108090 9370412 9662324 10122945 10546165 11098434 11717871
2865 11717871 12281624 12755640 13297185 13999153 14500086 14979649 15325093 15588080 15684966 15609343
2855 15609343 15603166 15401888 15218457 14998898 14911759 14697542 14391089 14343536 14245001 14231157
2845 14231157 14104114 14083495 14144377 13684028 13396621 12881979 12387087 11823692 11148440 10414380
2835 10414380 9895024 9302815 8550465 8015760 7451596 7126325 6523381 6277124 6158412
2826 6158412 5694975 5356741 5229624 4933567 4925927 4867571 4711952 4378095 4474106 4471204 4275834
2815 4275834 4169148 4077393 4111350 4041702 4051633 4039216 4090867 3935197 3837949 3998690 4081429
2804 4081429 4215378 4346632 4506415 4582539 4628162 4524125 4334363 4287517 4243715 4072666
2794 4072666 4051552 3721832 3688304 3646852 3410626 3441896 3287121 3380110 3356501 3093363 2948569
2783 2948569 3019249 3041388 3079765 2851323 2874262 3086585 2977803 2964620 3060605 2823401 2912589
2772 2912589 3027182 3016355 3071671 3231697 3223140 3214793 3075288 3096970 3308259 3416887 3634276
2761 3634276 3452381 3445781 3543588 3517869 3456804 3605672 3832623 3869624 3807951 3735219 3799808
2750 3799808 3854872 3961665 4013547 4181417 4367432 4442650 4510562 4646102 4673675 4662542 4828462
2739 4828462 4833323 5082986 5008899 5150532 5347378 5579865 5591271 5638471 5855981 6110278
2729 6110278 6236149 6403087 6627903 6818738 7269235 7337855 7382401 7515199 7738445 7845241
2719 7845241 7957613 8143367 8420757 8923776 9194330 9589782 9978055 10391636 10675838 11239607
2709 11239607 11786483 12403271 13181831 13868322 14741474 15565338 16251482 17006197 17772765
2700 17772765 18620786 19602134 20511460 21204272 22230628 23323679 24359904 25525311 26855374
2691 26855374 28114307 29525482 31126476 32527289 34461883 36764925 39185989 41827375
2683 41827375 44900325 48416052 52420225 57012458 62100519 67573607 73347283 78588188
2675 78588188 82338767 83199952 80684168 75380175 68179770 60766514 53556396 47130445
2667 47130445 41742783 36770658 32573935 29172595 26191001 23669761 21473508 19597284
2659 19597284 17799525 16231614 15052807 13835164 12862950 12190764 11456628 10683681 9959291
2650 9959291 9391836 8954643 8392434 7982380 7584783 7022941 6653744 6484828 6011128 5719278
2640 5719278 5557285 5343504 5029228 4998681 4664219 4491000 4356234 4180401 4025914 3764067
2630 3764067 3634036 3710131 3480227 3267770 3212733 3044642 2951971 2909816 2777198 2723487
2620 2723487 2454386 2471858 2520753 2361462 2393254 2280715 2313089 2353945 2143832 2063530 1922531
2609 1922531 1897370 1878142 1726125 1779434 1729882 1618042 1667820 1636828 1558889 1456002 1504025
2598 1504025 1418590 1292423 1428482 1418410 1660457 1573226 1360613 1403421 1510069 1397536
2588 1397536 1427893 1396360 1145016 1065145 1251532 1097262 1070920 1076859 925169 921594 999140
2577 999140 999223 857024 808353 914126 910651 813092 826475 800505 751679 568118 593958 671558
2565 671558 558565 662666 673169 710736 698339 635182 658114 540842 559595 641653 637107
2554 637107 510507 389844 470268 528240 462031 403603 507049 495457 511732 458932 478939
2543 478939 379465 324045 436282 344191 458396 389747 455998 242569 280836 334260 265750
2532 265750 348472 345852 338053 292631 329278 272020 310857 337736 378116 430406 410228 324754
2520 324754 447578 348734 261099 367593 382056 247962 470877 410233 279956 281657 357661
2509 357661 425214 336201 240020 223023 265511 200586 260651 337134 218587 96436 186626
2498 186626 273993 241251 306315 298016 167544 313958 243951 272171 379815 323075 352446
2487 352446 528270 400732 304846 405248 349065 284409 220635 298856 347732 339083 278843
2476 278843 407594 407666 300159 368693 330318 378472 282349 394580 557910 473339 547046
2465 547046 663226 423123 450697 553289 490887 471129 294953 378254 377660 470034 516133
2454 516133 386343 332232 274475 212207 73692 141065 178658 115579 213567 170930 286880
2443 286880 230529 39434 83419 98932 176524 153118 49561 65330 265753 145203 111238
2432 111238 239167 123296 122511 108819 96174 17997 -6022 72143 10049 28041 68095 -44163
2420 -44163 125952 70646 -38157 14836 26226 -15868 -60162 76290 206530 223481 175900
2409 175900 156445 261791 99213 77719 31956 33470 106985 86194 83467 97567 257358
2398 257358 222639 26690 68465 21967 -51982 -2019 -16724 75205 60633 -47758 12764
2387 12764 131316 56744 29957 10998 77697 -68529 92073 12137 110820 85381 -12602
2376 -12602 47525 48184 -5074 57167 29273 14220 229110 212612 -8741 -148359 -97941 -37903
2364 -37903 3104 128998 143891 -122634 -57619 -61065 -67700 52370 1457 68948 69845 3222
2352 3222 5035 -162330 -116676 -69469 -137523 -128113 48707 72569 1230 -120290 -155211 -12354
2340 -12354 -39585 -80596 -34995 72099 216285 129281 45217 84974 48286 -195318 -248875
2329 -248875 -190874 -183393 -1598 27632 -21465 -71924 -96315 -46236 114506 96113 119878
2318 119878 71475 -157697 -118192 58104 9569 27226 33839 20832 75411 11906 -146725
2307 -146725 24012 117554 198614 25285 -54338 36010 208765 248069 83633 116440 163078
2296 163078 152260 78131 55240 -25921 2428 13527 -104618 -44549 19962 44923 -109890
2285 -109890 3638 160373 153016 136649 35635 -111776 -40828 -28830 -73824 9168 -29719
2274 -29719 49554 501 -123303 -115668 15057 -27913 18168 -167412 -127675 -76244 -116859
2263 -116859 -108152 94879 59814 -45844 -29180 7983 -24844 -9838 -132311 -55236 -93006
2252 -93006 -85960 125337 94537 -870 -1663 21451 -24578 -139924 -71089 -76045 -65154 -8532
2240 -8532 125573 69193 162068 136113 113540 -17049 123931 -34511 -42946 44616 59221
2229 59221 80644 -27385 -55045 -2726 26144 -2976 103559 -21132 -47503 10070 189511
2218 189511 116624 42769 77875 162866 -80277 102941 -11327 52311 63180 119237 135234
2207 135234 -90810 -107850 40943 86350 -76506 -35925 -19356 -56371 2512 -18218 -44370
2196 -44370 -69636 -187536 -162323 -16742 99968 137894 -2115 51992 97767 58089 39269
2185 39269 93853 120435 27826 -70409 78518 107087 148840 181852 161502 86067 169699 161132
2173 161132 -131479 -20644 129345 104323 74272 90647 108942 99756 65421 37595 66104
2162 66104 27508 9308 -72055 -52826 58169 39072 38173 120828 9335 134353 74524 -91724
2150 -91724 -4496 3331 131523 57368 -24909 88235 39963 137446 202756 -24541 -33233 9740
2138 9740 60297 88994 119961 156075 -15913 -33660 110261 189266 147496 353394 320929
2127 320929 368823 404591 421289 419818 252205 316209 322656 255296 180821 332313 459472
2116 459472 356202 383177 365056 361954 530615 439520 449796 593422 702442 667858 763181
2105 763181 1006775 1187082 1569211 1871666 1846828 1538477 1335275 1032428 784159 560824
2095 560824 281108 280808 217729 199218 246928 361658 242423 187722 130045 171658 162411 23697
2083 23697 -142807 -97961 -20435 83932 -12443 33761 -8986 10206 -2851 128856 84665
2072 84665 -145498 -6646 89733 21826 118420 58774 -90116 6551 84289 39255 100346
2061 100346 114901 154890 39893 192505 202567 58725 50569 70898 40704 48961 -58095
2050 -58095 -44822 -66870 -110722 -107523 -23807 -26078 -3535 23758 -97378 -41981 -74231 -108834
2038 -108834 -28278 86502 -28943 -52226 7449 -45251 -74441 -30955 1593 51686 15209
2027 15209 40061 7541 16378 23913 62389 -80348 37855 -35374 -64365 -67266 -93946 -155284
2015 -155284 50754 17839 -4144 -39155 -87159 -155108 45813 131880 -23918 20761 71645
2004 71645 124279 57512 154089 68075 17458 10967 14436 -47270 -147240 -124258 -53774 -143677
1992 -143677 -34959 81604 26989 133742 19996 -142732 -199841 -79875 58272 183863
1982 183863 -94713 -13021 -25849 -76796 -50325 -109280 -129005 -34433 -202839 -197469 17900
1971 17900 -17046 -30300 -140947 -90557 15360 -36350 -11328 26807 59420 32881 48956
1960 48956 107545 17209 -107064 -188042 -171561 -109044 2291 -67764 48074 92855 -60105
1949 -60105 34286 -2914 10571 2794 -49113 -27612 -12181 -3484 -38282 45585 -9212 52106
1937 52106 21230 -64501 -121153 -59360 8233 -87917 65359 10218 51118 75656 21695 72861
1925 72861 -136518 -159515 19766 46116 -84871 -142991 -213366 -245101 -140039 -16738 -113213
1914 -113213 -36186 4311 -67014 -70021 76394 24913 -59367 -60079 -33026 55825 109483 -4567
1902 -4567 6471 -34336 78006 -230 -27619 -83489 -68462 57649 2960 53377 -32829 -9291
1890 -9291 -44391 18972 85466 -88726 -113445 -74743 -68452 -95908 129442 60132 73509 -51698
1878 -51698 -11950 -3390 12215 6633 -56473 -113465 -57672 -59662 -112792 -68850 -71583 -1272 122969
1865 122969 3306 -9101 109625 45554 -15345 -61710 -57414 -137621 -31885 -41291 -130097
1854 -130097 -116647 -161069 -31985 -103382 -110323 -17162 -48653 51274 16625 -85438 -53184
1843 -53184 33547 -69642 -66424 -184494 -83045 -18771 -153398 -65564 59670 45985 18151
1832 18151 7855 27047 -109577 38122 -18912 -11076 12987 52467 180686 38011 -21215
1821 -21215 159960 68273 -22045 -18276 6253 -55566 -69220 -177826 -83898 19529 88051
1810 88051 55401 -8395 -102158 -59554 -51451 42026 66971 -11819 -13108 68795 -26845 11148
1798 11148 -27973 -68717 -66902 -257730 -4176 56131 15769 -61894 -101150 -194303 -95986 -78362
1786 -78362 -141488 20769 -33128 -240330 -47793 -100903 -188743 -37408 54510 71962 137169
1775 137169 -187470 -155127 -73971 -6081 14956 114622 202411 7490 -85507 -114314 -103276
1764 -103276 -62146 7303 -110519 -42802 46281 -19066 -269112 -144924 -66873 -188158 -86450
1753 -86450 49607 -31012 -62832 120793 258334 66338 1043 -18749 -11933 74154 67545
1742 67545 -25986 8567 -65723 97086 164146 63197 -17784 -70745 -141528 -166892 -29622
1731 -29622 1509 -36922 -65235 5987 -110686 -70772 118125 17763 160580 83269 -165755
1720 -165755 -59800 -75681 -32099 41013 -58962 -1674 71081 2656 7649 -26295 -63610 57328
1708 57328 -37675 -39527 -107158 -199586 -90082 -88919 -86033 -79944 58589 10083 20294 94069
1696 94069 102359 76676 34581 105126 6140 -72847 -154 -58586 -44514 -32477 131265 146650
1684 146650 107108 87033 16032 50576 98772 22727 85539 4880 -118738 -221948 6274
1673 6274 104530 33666 -117693 -130707 -149408 -52991 -33973 -48829 8952 60151 -101503 -197263
1661 -197263 8405 -35254 -148804 -167803 -119933 -131595 44511 89333 74460 152935 25563
1650 25563 10174 -1084 -248362 -117434 -125843 -20724 -94860 -144554 22697 32038 -41232
1639 -41232 -96907 90013 144016 97384 22008 -8912 -41566 -89579 -5600 -47269 -149363
1628 -149363 -90136 36663 -102611 -117653 125017 61117 26669 -4643 -28994 -184760 -67135
1617 -67135 -111790 -4378 -81057 -32673 -57953 -58016 -72227 -128628 -162690 -25770 79592 -10066
1605 -10066 57546 3624 -104274 -134445 45287 27 48240 -128989 -108877 38732 14458
1594 14458 -54072 -11553 -82865 -40036 -109261 27253 54680 21617 -162223 -173835 -73575
1583 -73575 -156960 17522 -41382 2551 29199 2784 42877 100982 93724 39100 115258 -18069
1571 -18069 -114841 -8217 -13230 -73455 -40124 -30436 1966 25636 23289 -44238 45550 -23681
1559 -23681 -15980 14389 36547 49151 -371 39807 5500 -36810 -114075 -59287 -161031 -121495
1547 -121495 20547 96491 72978 -54366 72360 75020 15164 4444 -83659 -189898 -119891
1536 -119891 90041 92166 -45718 -18589 -9912 111394 53483 122183 102727 10201 128576
1525 128576 193999 70544 82143 -2694 58276 -55506 -14229 138391 170736 151832 -10241
1514 -10241 -62242 -28221 -53933 -31593 55110 32971 67545 88897 70593 54801 -11366 30600
1502 30600 39264 -46097 8288 -37076 -86632 -72527 -92628 -123988 37465 536 -84854 -66693
1490 -66693 -24041 -4287 29747 53631 -18057 -82317 -20211 -10880 28067 -74490 -50823 -74314
1478 -74314 -11004 26907 -15007 -74827 -59339 59734 10321 20667 -20727 -52621 -47474 -67140
1466 -67140 -111150 -146072 -105617 -91626 -177978 -130197 116391 76933 42469 -16163 289 -13092
1454 -13092 -63141 -54506 -18195 -122281 -267570 -160831 -118502 -78422 8825 139735 50888
1443 50888 -57450 -33926 -8756 -10792 -164948 -10115 -40071 -557 24778 -162674 -144488
1432 -144488 33369 50837 -8822 51541 151964 130113 11112 -10351 -4562 20417 -26859
1421 -26859 -51575 6795 -160328 -21709 -5202 -3074 -140721 6183 -44026 47772 103235
1410 103235 -8208 90945 108135 -37287 29120 49727 76576 89085 96582 120194 26330
1399 26330 -6162 -129122 4760 47013 -11752 143180 165067 14964 -34982 -122171 -74052
1388 -74052 -156608 -5876 147425 90660 87953 122525 -88282 7243 -23719 3718 -4556 174898
1376 174898 120681 -66394 -78589 -59929 -160808 45307 46710 61995 143839 -1596 84963
1365 84963 165076 71773 -37204 -62711 33893 -15335 -23372 24888 -77461 -289734 -87177
1354 -87177 6919 88515 33108 13313 94240 -66780 186916 1237 38059 -191500 -170689
1343 -170689 -86478 -26849 79742 -89002 5578 33919 -71766 -53427 27835 -83747 -202563
1332 -202563 -306550 -97288 107302 115433 83192 60046 -69550 -24669 -167886 -115393 -102893
1321 -102893 23680 109570 71809 22976 114443 86112 43506 -27816 -73763 -143751 -23913
1310 -23913 53741 -75417 -49210 -11770 -38104 -56714 -54465 -39240 66097 -119244 -111839 -6362
1298 -6362 121254 111443 51165 10775 -64203 -8414 108195 -96140 -120092 -125723 -57795 107924
1286 107924 7025 -60771 -93053 -46275 74019 124782 54711 95633 95002 96278 97667 -50267
1274 -50267 78134 79010 96533 37085 48875 47561 -59830 -11813 -29197 -72793 -84383 -91143
1262 -91143 62095 -112954 -33590 19925 -62547 24442 94138 73083 30194 -1238 -44407
1251 -44407 -22908 -7012 -24686 43860 -4421 -65066 -86136 -148715 -120650 -83852 -114816 -118999
1239 -118999 94352 54087 -104211 -77969 -107224 -54057 -109125 48253 -101512 -242588 -106807
1228 -106807 77283 65926 64007 71744 -21781 139087 -22422 -123124 -38599 21401 -14371
1217 -14371 -61808 -56535 -144855 -54496 106534 23710 42088 -53232 -109362 -21343 -106338 53096
1205 53096 124338 36310 -13019 -94399 -61557 -85051 28148 -58470 -63199 2943 36972 27219
1193 27219 -77078 -86090 -92062 -4929 -126622 -8748 10651 -73786 -80768 -108688 -82545 -23186
1181 -23186 97632 76811 5002 88212 593 -88799 -53350 -13824 92177 45657 65680
1170 65680 -24866 -58334 93998 108197 -62668 -3395 -66606 261 102291 69673 72110
1159 72110 152864 75635 35987 -38066 -2547 11924 94841 18169 55865 180839 229231 198762
1147 198762 165719 41601 61267 129102 29054 60119 4792 -7417 52455 19937 -61700
1136 -61700 -89403 -39594 -101763 -43366 23283 106173 77527 -32720 81215 14699 78456
1125 78456 82353 51331 -31533 -83792 -124411 -5044 67662 58203 36601 119193 54641 77112
1113 77112 57268 16824 -18632 3722 4992 76109 -4931 45916 150453 245836 36835 110396
1101 110396 286102 101163 93455 91386 206069 160966 225917 -59056 -98116 -34422 -98125
1090 -98125 -15799 77053 -119802 3536 2520 74826 -80783 -91818 67139 52472 -4109
1079 -4109 109578 -22072 105412 101869 -106239 -25276 105141 93299 22292 189076 147569
1068 147569 133867 79682 56483 51525 188453 90286 132509 164335 90472 -78867 114718
1057 114718 87151 -53489 -140045 -79591 -48803 -41489 -96001 -60645 -7857 7729 -31261 -71062
1045 -71062 102052 71279 -143250 -56820 -9279 -88396 -74158 -49979 -71245 41009 43777
1034 43777 -69121 -17997 -6367 -24932 -40148 -120790 -212483 -209847 18068 5004 -39502 179800
1022 179800 10520 -4705 169585 27693 -47421 -81162 33001 238085 143332 109025 72630
1011 72630 -116007 -19751 -5306 19171 -10772 -70064 85287 -13683 -29398 -74194 20779
1000 20779 89097 -16236 38452 131081 136045 156527 122194 102554 -8163 -41048 -170000
989 -170000 -45705 68062 -17990 -38465 28706 -18333 9772 2931 -7512 17238 110029 146091
977 146091 -72597 -49673 79322 61310 -44570 -24841 -27979 -38086 -134980 -27509 -10842
966 -10842 -37269 36150 -110800 10296 -18448 -91192 -160498 -151213 -50919 -6190 -46284 -51262
954 -51262 72506 -48930 -186978 -94260 187224 116706 148329 26494 93644 11293 -51108
943 -51108 -74798 727 -8128 -66317 -53228 103845 32059 -132068 -142259 -135310 -65962 -69282
931 -69282 -46513 -8892 53830 37642 -22497 25764 90700 70048 36495 121243 202164 72129
919 72129 69266 3030 55559 -88268 1653 -83327 -94965 -9940 -19468 -114617 -96128 -93301
907 -93301 -73548 -76706 -15320 -54450 -41301 54367 -2772 -40970 108840 99387 -45455 -133779
895 -133779 -63008 -66492 48627 31356 17692 -51151 37608 35049 69826 -72804 -167268 -86627
883 -86627 -274891 -172530 1101 148950 -11915 59480 -22906 72474 -75510 -111958 72502
872 72502 50320 6761 -12790 -14565 -59394 15147 135935 -11550 -51153 -27932 130583 139903
860 139903 66192 18623 1615 116416 67857 52919 126179 -23626 133567 178291 62042
849 62042 -13021 -128767 18405 119920 27712 34578 -103290 -127849 146007 -60856 -98626
838 -98626 -21389 55151 22412 -13272 81427 11922 -106514 -2185 48612 15437 -113783
827 -113783 -96825 -202614 -183816 -85752 108400 152802 -86084 -96518 -75661 63289 15380
816 15380 -50552 -47320 -12488 10665 132653 115526 5536 -162887 -178006 -138011 -142897 -141241
804 -141241 -103807 -56685 37520 107804 27708 174155 186398 179772 81929 49790 3042 -21430
792 -21430 -603 47925 -52000 44869 59701 -42403 30418 15425 174326 211628 -67
781 -67 -72523 163796 25693 -28726 44708 112430 15780 56590 16660 99342 -1588 -6694
769 -6694 -34536 91191 133151 32079 300 -51053 10002 25892 118387 57854 224088 171288
757 171288 17337 -108951 -136752 -247918 -43153 -82111 -248447 -110281 -49579 992 122800
746 122800 65857 16458 24094 65890 24675 113606 62835 -34820 40367 68666 134592 71362
734 71362 51385 -33872 14828 -116709 -1518 79538 -29744 -79481 -8588 -12312 26485 -64676
722 -64676 -63198 36689 -1929 23881 17957 17302 -101 32775 -39151 -106797 -18656 43426 -44543
709 -44543 -79818 -171578 -123495 -93615 -99248 -49080 20233 -64328 139261 119274 10918 -67102
697 -67102 -176791 -32429 -21528 72552 17094 -19180 -85929 -15303 128587 116230 -187878
686 -187878 -19760 -104937 -156861 52046 46939 55098 4230 19652 28550 49847 -32737 -126335
674 -126335 -66945 -1721 -57691 -24169 -11836 91002 -56068 -58197 -20197 -46689 -63118 -105394
662 -105394 -2606 -123738 65469 74514 -62363 63731 8807 -128874 -28757 38885 44380
651 44380 -27154 -108019 79130 -48082 7600 2727 -8912 94272 74697 -142942 -224679
640 -224679 -183247 -23708 -6655 -19603 -156087 -45897 -33506 37839 15073 -35422 55966
629 55966 104187 99800 -74044 -42141 44545 28826 -14968 -150115 -44233 43131 -74102
618 -74102 -19078 27398 -69409 -52538 -23283 -28725 48976 -179689 -115854 102117 61985 -3205
606 -3205 -68705 57537 15628 -2002 69702 44431 157894 13878 18317 120056 152574 111132
594 111132 70884 149171 -10937 -59239 -9757 -33054 10542 43408 -83205 -34364 10791
583 10791 -138183 -184567 -19281 101453 19356 -27720 -64537 107874 59463 -5733 -127724
572 -127724 10394 87336 20275 143182 16307 -119320 -103130 16387 99508 32443 -165188
561 -165188 -271049 -54647 41184 92677 -16782 -3665 61464 90992 16060 3117 66873
550 66873 6438 -11016 132916 128195 4303 104743 108495 11614 -61355 -34166 42323 76830
538 76830 -21451 -86903 169744 84748 -36258 41559 30842 59410 154264 36423 130216
527 130216 -96576 -45593 -43624 -42753 151017 41805 72501 96445 55326 -59045 31934 -135446
515 -135446 -73064 69835 -2829 36371 139559 206938 89155 11026 -96928 13585 58850
504 58850 -43562 -99104 -24349 -80416 122499 38346 -3215 136413 -8002 156268 40345
493 40345 -18169 -90115 48013 32003 -22166 -91934 16000 131885 131113 89235 45655 -57450
481 -57450 -142212 -154133 -199158 -79440 180134 135134 67597 113229 108698 76228 43530 -13909
469 -13909 42371 -19346 4935 19821 32359 17801 -18049 88648 91708 212186 136489 73743
457 73743 120180 87455 50716 -24336 -78652 22533 -42233 -38834 -21587 -41550 12496 -15065
445 -15065 -56077 -63855 -7483 -68521 -32006 77210 147598 104459 138675 104129 -3439 -15054
433 -15054 4418 68917 78702 80140 52615 -24126 751 -57861 62098 107552 73964 60011
421 60011 87053 74833 -65445 -92055 44150 -18108 -136865 -112177 -54016 65741 41274
410 41274 31402 -102590 -112639 -39415 -65055 118243 26787 -41277 63587 105528 33128 55714
398 55714 91132 32374 -1195 -15949 41468 -85719 -8647 72364 197288 104277 25398 101623
386 101623 5220 -44726 62899 -14086 108829 99514 -116513 77083 67672 -14931 30744
375 30744 -12238 -48872 44920 -75502 -194862 -58941 74214 138771 46253 18738 118499
364 118499 55354 35001 44637 38825 146190 171284 127296 154846 37133 -3673 15600 -31501
352 -31501 -21670 2411 -54921 -44602 -20426 -110110 -26045 -170873 -104817 -6552 27362 22736
340 22736 50332 18291 -7792 78137 187387 154885 32234 -21387 -65300 -38668 -24136 18639
328 18639 15017 79415 24010 -18719 21833 86230 22213 112124 117010 64780 100147 16705
316 16705 -107030 -194849 -79798 12858 -47777 -76747 -40023 -130545 -45320 -63473 83253
305 83253 190096 91898 103466 -48987 -100056 -50440 -92074 13025 -26113 100980 108766
294 108766 -25200 30950 -712 -862 -82181 -57577 157045 109440 99655 35367 -91701 -89040
282 -89040 -31919 72308 123512 208259 66185 51759 -5850 84700 105207 -76350 18214
271 18214 27484 39760 56246 136561 -1702 -64902 42540 129650 140664 -1408 29999 -30396
259 -30396 109203 253511 -79503 -38264 95023 62387 92133 39124 -74939 -19389 123437
248 123437 44040 105558 30936 167924 47123 4815 225392 129591 68015 96715 54667
237 54667 32767 62426 138381 155333 131628 107661 84294 -26512 57542 114284 -32853 9302
225 9302 -3889 -47919 22165 -109460 -149763 -78306 -42064 -22742 -27555 67819 11125 -16478
213 -16478 172110 59651 -52850 166020 -28309 -57172 62482 31400 54594 36662 -89707
202 -89707 -83439 -22139 10711 -5033 -4533 61729 -15810 -96290 -14208 -41586 77410 182880
190 182880 41152 30105 -36752 -160164 -117984 -17546 63512 259286 147192 32554 103057
179 103057 88592 25543 -71609 30797 78519 -23150 5560 104283 66139 99187 81198
168 81198 59264 65770 97236 193269 98030 79899 -47643 -86900 -100117 101495 65913 -40619
156 -40619 -179144 -169923 -37027 142943 168529 30331 46091 -75931 18301 106784 -28183
145 -28183 -34443 140262 147618 102914 8173 -46417 -7295 73167 157700 86541 170943 200666
133 200666 133342 100572 63064 7314 -20114 -32485 27203 57488 30113 -53858 -4565 52124
121 52124 28102 2234 -67257 -24029 12763 102854 28251 -464 68736 131230 -29962 72266
109 72266 -3590 -129556 -85067 113387 10739 92690 70178 -55967 -44681 76559 61146
98 61146 98029 49837 -51820 -78383 -54145 87131 75957 136795 115543 44741 77020 91706
86 91706 67059 -3243 -9479 103263 67928 91132 36382 33053 -66183 5658 50825 61924
74 61924 70483 120148 2221 65265 64922 -3660 33697 38170 -6604 -23651 119466 111274 104919
61 104919 128828 73881 13119 45395 15706 100527 141586 73692 6099 4114 87508 92961
49 92961 96723 108606 96106 3625 66284 39347 61684 61592 -81246 38456 136107 -14842
37 -14842 -22070 67858 104696 3361 4528 55803 8304 -79596 -58401 38481 62107 274
25 274 83781 112076 39714 27822 4576 27164 63737 73937 77349 -25655 -86480 23035
13 23035 154368 95989 43578 110636 -14779 66852 100740 73362 44143 14686 98818 -1819
1 -1819 51349
0 51349
$$ Imaginary data points
##PAGE= N=2
##DATA TABLE= (X++(I..I)), XYDATA
16383 -880315 -815137 -711524 -721052 -786289 -667366 -653381 -562488 -678794 -566324 -539268 -511732
16372 -511732 -691832 -721446 -589893 -553562 -499602 -512736 -531521 -566892 -655256 -574205 -534389
16361 -534389 -590968 -572736 -547962 -528630 -603758 -603196 -530927 -427915 -393161 -328880 -286278 -400321
16349 -400321 -441671 -341152 -285532 -381540 -529722 -421653 -422572 -475824 -409949 -317408 -301877
16338 -301877 -341766 -333085 -455196 -531391 -271318 -256784 -198074 -342065 -275641 -356633 -337761
16327 -337761 -315801 -295771 -150688 -225895 -174368 -153986 -226388 -193120 -155235 -113487 -39547
16316 -39547 -20402 -10354 -90415 -160333 -280128 -205496 -179940 -157925 -27288 -59351 -134164
16305 -134164 1788 28635 -19427 60133 46277 65358 88713 72988 39406 49904 65109
16294 65109 78045 127823 12632 177410 129602 111059 54886 154776 165515 178518 126024
16283 126024 182034 101780 133306 175359 82770 197127 140388 157588 184882 225633 219280
16272 219280 341624 261836 163748 197937 276084 65844 303983 275950 280358 255595 184076
16261 184076 243824 258640 282924 424125 368331 457477 377757 312353 401854 350476 372645
16250 372645 261243 207555 281976 287082 366928 374633 415070 383996 303114 258743 216709 284017
16238 284017 308870 522736 453141 204676 351175 441482 339815 446659 480334 402313
16228 402313 437115 433100 524076 493820 467079 466851 404832 474569 507420 631599 560912 571246
16216 571246 480155 476335 519535 513232 480636 406382 542867 528044 650908 684691 658375
16205 658375 618799 550719 508249 637775 573809 473377 597682 499319 607416 613142 571184
16194 571184 692835 670533 621972 619482 561708 745133 621105 719821 774169 724555 693991
16183 693991 659286 508935 672073 608314 535370 627846 633543 506139 593556 681428 692171
16172 692171 750706 673208 584803 665558 652582 676788 871460 802477 707080 754225 729955
16161 729955 766765 670138 783679 787987 812369 759575 766324 802456 718916 655262 763316
16150 763316 890118 799980 701965 811183 991605 791716 708137 928379 807365 788275
16140 788275 786963 683682 694752 700468 765371 848266 934128 866372 778776 596445 827408
16129 827408 857939 840041 715276 759481 703701 840024 928606 723182 670618 718452 776961
16118 776961 880218 877754 918663 844525 799206 744464 854237 991684 1019562 909752 856434
16107 856434 851949 862596 773493 776283 796431 882277 754593 721034 715851 724306 755180 821708
16095 821708 867890 810529 866266 904146 943982 809310 803837 734592 703030 936280 865692
16084 865692 833667 869660 821796 784169 827502 684312 704466 717546 714405 877198 821083
16073 821083 795506 807842 963997 941033 983947 869096 761524 735142 817854 898078 859300
16062 859300 796917 880019 719681 694128 917412 905356 831817 791300 826737 935984 953791
16051 953791 841450 838419 881531 897028 945999 893378 754561 868192 942679 899530 792319
16040 792319 843761 863186 887488 722657 872086 914638 856818 899403 925705 1030339 974905
16029 974905 951124 868142 865678 772761 956990 970853 749701 722996 814162 865750 999895
16018 999895 1055796 952211 842736 712337 847071 963735 836328 754544 746514 960754
16008 960754 784394 861155 843945 753157 776114 858314 868431 712275 792321 892247 804152
15997 804152 836240 1023994 892309 744776 908614 880748 898096 874768 809653 897999 970491
15986 970491 968953 981692 850456 789506 952948 966646 927413 991292 1059824 972597 915329
15975 915329 847383 822806 862334 836766 799286 722430 793465 976137 952529 828766 874271
15964 874271 957928 984405 1003530 980040 1040392 972288 943973 769532 887780 943345 846528
15953 846528 872089 860113 697478 768573 929287 978887 883279 860527 716839 807133 883989
15942 883989 815327 873051 712906 878670 891675 885949 907261 960474 834862 884016 860334
15931 860334 732078 981138 755261 694744 857946 872379 819002 969857 932948 925501 867986
15920 867986 949845 827777 895463 754604 877328 1043513 851537 924675 963946 1056626
15910 1056626 1051680 964578 825685 1006528 1022978 878557 909748 904306 866780 954045 809987
15899 809987 937397 820662 885971 841961 799340 881296 947208 835244 720209 589626
15889 589626 606991 617628 815173 860002 839217 829277 802642 843333 969033 875945 908354
15878 908354 785929 829267 904169 868372 963942 924063 940469 974973 980987 928448 939652
15867 939652 848660 856083 935533 985946 879022 1035391 1023936 850452 813541 917230 919778
15856 919778 985696 1002121 893931 847214 844959 739879 847481 759828 854913 1055623 1001583
15845 1001583 998951 861572 821131 802188 927773 870575 885349 1035715 904047 747129
15835 747129 844078 954321 912124 937967 909939 944892 1040480 932108 829210 794159 722231
15824 722231 852231 868450 897851 942277 900158 961653 944499 946308 992749 982441 850376
15813 850376 817532 879780 882077 780700 797964 997952 976808 1010269 980890 981087 856392
15802 856392 777828 888118 995091 968343 934138 860629 889294 760734 825415 893523 884372
15791 884372 787385 745536 960429 1024576 964805 929276 845476 1004946 990748 984411 910769
15780 910769 913932 985315 1131785 973893 1030710 1000529 990332 1047471 1002910 1006776 978221
15769 978221 952628 892757 968991 951110 859758 726316 971622 880665 1022786 965919 735807
15758 735807 781942 852405 886835 718306 668868 920383 1040165 892545 825615 922710 976263
15747 976263 1013466 966470 857149 689426 802172 1007031 1003506 922263 958732 944651 883628
15736 883628 939956 916438 806938 840791 989133 1011065 916294 788179 618999 774431
15726 774431 806014 802854 852352 998355 1026781 831475 722828 731922 859033 913340 892328
15715 892328 923912 872726 888236 849215 822533 897499 902575 955723 945012 816923 797473
15704 797473 814311 803308 784164 924506 748668 687132 889524 924007 884971 891246 1040957
15693 1040957 1001052 850768 799389 776178 840212 968065 913578 813726 853181 959305 946393
15682 946393 908307 856736 930867 820011 761913 918012 887068 914850 869941 939907 1037416
15671 1037416 775121 866297 849812 889709 918921 967318 1012392 833479 812362 843635 847838
15660 847838 764603 830285 769206 677971 778767 876217 857873 825142 740235 957432 802907
15649 802907 748947 823395 878153 828671 763214 749579 839191 832318 813108 1014343 1042568
15638 1042568 1087649 955364 928748 915095 879904 884292 952494 851036 902573 953490 886203
15627 886203 997583 966318 965106 810181 867541 861124 706831 796059 775950 1027720 1090520
15616 1090520 932403 952983 799398 913562 922676 1022273 898925 810676 1007540 992947
15606 992947 828460 842739 745083 929137 968077 829346 789613 813671 820947 981529 907355
15595 907355 878157 869248 756782 900249 942413 1103576 873160 896319 803478 876128 870654
15584 870654 809132 812015 867131 921496 966834 897075 877166 809532 768269 798009 753833 795086
15572 795086 917093 859644 914601 910270 788291 900079 911440 852939 893656 871095 818011
15561 818011 743868 812031 746507 783420 802132 805949 807373 968302 915982 977626 917592 1014741
15549 1014741 843272 863437 1016086 1018025 943025 925225 756619 790769 782064 998614 935521
15538 935521 952542 987844 997878 1078143 1035170 1046621 883654 921976 907371 913843 803879
15527 803879 921112 852474 983047 945860 970935 1063724 867403 822013 823601 841920 912598
15516 912598 871182 939673 831879 868916 843193 896874 895671 865304 824301 842108 714756
15505 714756 837231 853719 865565 871387 864461 963962 967637 885531 851587 899322 984994 811143
15493 811143 840837 1000417 790609 778350 748764 721025 926520 782234 837800 838244 918139
15482 918139 942824 959206 1138447 1061478 963281 1005476 979040 886531 780245 751782 902879
15471 902879 982342 900709 779669 880685 948513 1008165 1010666 883787 970594 984195 931413
15460 931413 1026788 1031545 1025780 1012212 801654 751690 729837 693183 746045 728068 885560
15449 885560 824309 829478 923085 923256 803652 788911 907327 888224 1045422 966712 845227
15438 845227 857100 892651 776600 733470 805641 803577 895125 988090 825176 908737 922818
15427 922818 812957 705626 960946 958356 800819 911801 892395 918326 927728 908131 896470
15416 896470 961652 833618 883044 940029 970676 950638 1008926 962331 789449 790311 780267
15405 780267 731801 858929 646512 762209 835709 825404 995319 947835 972717 949163 846526
15394 846526 799286 958527 885268 827375 835405 878887 948362 958706 821765 707867 850393
15383 850393 1046844 1052186 887888 866207 869059 789193 715126 872377 971957 885246 798321
15372 798321 996725 925825 889834 877735 868736 832496 918667 980443 924406 900962 976177
15361 976177 1153472 1075056 796901 825172 998085 986928 842150 883710 956281 838840
15351 838840 762603 819708 868932 949612 948427 896263 862222 801015 981797 857367 928715
15340 928715 912759 742716 825322 899083 947145 910261 887091 913929 888435 975880 1015737
15329 1015737 853646 780425 820129 893541 835113 802168 969717 998314 1043431 1073559 1006052
15318 1006052 874048 991668 1073638 1010524 917260 943757 757615 713919 956853 937741
15308 937741 982475 895226 943112 851409 886691 877599 765744 898449 841625 739411 835641
15297 835641 950310 908496 926918 884931 740351 928779 936876 1012496 1033533 839282 984180
15286 984180 956486 982943 889137 837827 918040 885290 874723 780141 877156 886563 878535 907100
15274 907100 760344 794922 996680 1025795 1009670 837009 801019 948342 1102054 1094046 1079457
15263 1079457 1105634 988671 879914 894401 882122 955717 935446 872134 803805 778235 814365
15252 814365 796299 835343 800379 851943 956584 898315 1062861 997384 923037 908238 1027611
15241 1027611 968589 997877 1051088 809013 879124 824680 947418 959594 823123 783694 750751
15230 750751 884334 924844 962241 963980 883441 871180 812286 842549 982020 1000367 863190
15219 863190 967594 829944 885526 925450 956367 876922 828413 854200 797767 782330 835928
15208 835928 809009 935717 964252 970337 948504 933175 940745 994398 1037983 937058 921214
15197 921214 943773 1035298 1056954 976975 852354 934464 879326 751665 865856 819613 804754
15186 804754 914283 1013779 945615 799855 875689 959150 886492 937724 915509 1002857 1000116
15175 1000116 987853 942894 1036798 949759 871504 871398 927460 839525 864512 955066 1017170 1117747
15163 1117747 1112269 1076569 938686 928826 915188 1017301 951752 967143 989870 971570 936624
$$ [...]
##END NTUPLES=NMR SPECTRUM
##END=
