##TITLE=1H_CG-1208
 CDCl3
 8 sc, 
 30.7.2024
##JCAMPDX= 6.0         $$ Bruker NMR JCAMP-DX V2.0
##DATA TYPE= NMR SPECTRUM
##DATA CLASS= NTUPLES
##ORIGIN= UXNMR, Bruker Analytische Messtechnik GmbH
##OWNER= root
$$ XWIN-NMR		Version 3.5
$$ Tue Jul 30 15:45:16 2024 Russian Standard Time (UT+4h)  she@DPX200
##.OBSERVE FREQUENCY= 200.1315
##.OBSERVE NUCLEUS= ^1H
##.ACQUISITION MODE= SIMULTANEOUS
##.ACQUISITION SCHEME= undefined
##.AVERAGES= 8
##.DIGITISER RES= 18
##SPECTROMETER/DATA SYSTEM= spect
##.PULSE SEQUENCE= zg30
##.SOLVENT NAME= DMSO
##.SHIFT REFERENCE= (INTERNAL, DMSO, 0, 20.7682)
##AUDIT TRAIL= $$ (NUMBER, WHEN, WHO, WHERE, WHAT)
$$ ##TITLE= Audit trail, XWIN-NMR		Version 3.5
$$ ##JCAMPDX= 5.01
$$ ##ORIGIN= Bruker BioSpin GmbH
$$ ##OWNER= she
$$ F:/spectra/data/she/nmr/H-F/1/pdata/1/auditp.txt
$$ ##AUDIT TRAIL=  $$ (NUMBER, WHEN, WHO, WHERE, WHAT)
(   1,<2024-07-30 15:43:06.98 +0400>,<she>,<DPX200>,
      <created by zg, POWCHK disabled, PULCHK disabled
       configuration hash MD5:
       00 E9 B6 7A A2 85 ED C7 34 08 36 98 17 FE 4E 26
       data hash MD5: 16K
       67 56 F5 6B F7 07 9D 75 B0 F9 D1 42 B2 47 B4 DB>)
(   2,<2024-07-30 15:43:45.64 +0400>,<she>,<DPX200>,
      <Start of raw data processing
       efp BC_mod = 2 LB = 0.24 FT_mod = 6 PKNL = 1 PHC0 = -25641.07 PHC1 = 13.78749 SI = 16K 
       data hash MD5: 16K
       19 14 89 66 12 16 A4 8F 90 88 4D 8B AB BF 9A 90>)
(   3,<2024-07-30 15:44:09.03 +0400>,<she>,<DPX200>,
      <pk PHC0 = 2.180446 PHC1 = -0.7999998 
       data hash MD5: 16K
       96 0E F9 EF DB 5F A7 86 F2 93 82 8C 82 F6 49 00>)
(   4,<2024-07-30 15:44:12.65 +0400>,<she>,<DPX200>,
      <abs ABSG = 5 
       data hash MD5: 16K
       38 EA 3D 21 C7 A3 E7 F0 27 F5 AC B9 19 42 5E 68>)
$$ ##END=
$$ 
$$ hash MD5
$$ 04 2D A6 9A 20 B4 16 DF 2F 24 BE 22 66 45 B3 AE
##$RELAX= 
##$RELAX= 
##$RELAX= 
##$RELAX= 
##$RELAX= 
##$RELAX= 
$$ Bruker specific parameters
$$ --------------------------
##$DU= <F:/spectra>
##$EXPNO= 1
##$NAME= <H-F>
##$PROCNO= 1
##$TYPE= <nmr>
##$USER= <she>
##$AMP= (0..31)
100 100 100 100 100 100 100 100 100 100 100 100 100 100 100 100 100 100 
100 100 100 100 100 100 100 100 100 100 100 100 100 100 
##$AQSEQ= 0
##$AQ_mod= 1
##$AUNM= <au_zg>
##$AUTOPOS= <>
##$BF1= 200.13
##$BF2= 200.13
##$BF3= 200.13
##$BF4= 200.13
##$BF5= 200.13
##$BF6= 200.13
##$BF7= 200.13
##$BF8= 200.13
##$BYTORDA= 1
##$CFDGTYP= 0
##$CFRGTYP= 5
##$CHEMSTR= <none>
##$CNST= (0..31)
1 1 145 1 1 1 1 1 1 1 1 1 1 1 1 1 1 1 1 1 1 1 1 1 1 1 1 1 1 1 1 1 
##$CPDPRG= <>
##$CPDPRG1= <>
##$CPDPRG2= <>
##$CPDPRG3= <>
##$CPDPRG4= <mlev>
##$CPDPRG5= <mlev>
##$CPDPRG6= <mlev>
##$CPDPRG7= <mlev>
##$CPDPRG8= <mlev>
##$CPDPRGB= <>
##$CPDPRGT= <>
##$D= (0..31)
0 1.2 0 0 0 0 0 0 0 0.06 0 0.03 0 0 0 0 0.0002 0 0 0 0 0 0 0 0 0 0 0 0 
0 0 0 
##$DATE= 1722339786
##$DBL= (0..7)
120 120 120 120 120 120 120 120 
##$DBP= (0..7)
150 150 150 150 150 150 150 150 
##$DBP07= 0
##$DBPNAM0= <>
##$DBPNAM1= <>
##$DBPNAM2= <>
##$DBPNAM3= <>
##$DBPNAM4= <>
$$ [...]
##$SUBNAM3= <"">
##$SUBNAM4= <"">
##$SUBNAM5= <"">
##$SUBNAM6= <"">
##$SUBNAM7= <"">
##$SUBNAM8= <"">
##$SUBNAM9= <"">
##$SW= 24.0689530833862
##$SWIBOX= (0..15)
0 0 2 0 0 0 0 0 0 0 0 0 0 0 0 0 
##$SW_h= 4816.95568400771
##$TD= 16384
##$TD0= 1
##$TE= 0
##$TE2= 300
##$TE3= 300
##$TEG= 300
##$TL= (0..7)
0 120 120 120 120 120 120 120 
##$TP= (0..7)
150 150 150 150 150 150 150 150 
##$TP07= 0
##$TPNAME0= <>
##$TPNAME1= <>
##$TPNAME2= <>
##$TPNAME3= <>
##$TPNAME4= <>
##$TPNAME5= <>
##$TPNAME6= <>
##$TPNAME7= <>
##$TPOAL= (0..7)
0.5 0.5 0.5 0.5 0.5 0.5 0.5 0.5 
##$TPOFFS= (0..7)
0 0 0 0 0 0 0 0 
##$TUNHIN= 0
##$TUNHOUT= 0
##$TUNXOUT= 0
##$USERA1= <user>
##$USERA2= <user>
##$USERA3= <user>
##$USERA4= <user>
##$USERA5= <user>
##$V9= 5
##$VALIST= <valist>
##$VCLIST= <CCCCCCCCCCCCCCC>
##$VD= 0
##$VDLIST= <DDDDDDDDDDDDDDD>
##$VPLIST= <PPPPPPPPPPPPPPP>
##$VTLIST= <TTTTTTTTTTTTTTT>
##$WBST= 1024
##$WBSW= 4
##$XGAIN= (0..3)
0 0 0 0 
##$XL= 0
##$YL= 0
##$YMAX_a= 956949
##$YMIN_a= -949874
##$ZGOPTNS= <>
##$ZL1= 120
##$ZL2= 120
##$ZL3= 120
##$ZL4= 120
##$ABSF1= 21.70511
##$ABSF2= -2.364075
##$ABSG= 5
##$ABSL= 3
##$ALPHA= 0
##$AQORDER= 0
##$ASSFAC= 0
##$ASSFACI= 0
##$ASSFACX= 0
##$ASSWID= 0
##$AUNMP= <proc_1d>
##$AZFE= 0.1
##$AZFW= 0.1
##$BCFW= 0
##$BC_mod= 2
##$BYTORDP= 0
##$COROFFS= 0
##$CY= -3
##$DATMOD= 1
##$DC= 0
##$DFILT= <>
##$DTYPP= 0
##$F1P= 0
##$F2P= 0
##$FCOR= 1
##$FTSIZE= 16384
##$FT_mod= 6
##$GAMMA= 0
##$GB= 0
##$INTBC= 1
##$INTSCL= 3.70164e-10
##$ISEN= 128
##$LB= 0.24
##$LEV0= 0
##$LPBIN= 0
##$MAXI= 10000
##$MC2= 0
##$MEAN= 0
##$ME_mod= 0
##$MI= 1.114404
##$NCOEF= 0
##$NC_proc= -5
##$NLEV= 6
##$NOISF1= 3.799351
##$NOISF2= 2.8
##$NSP= 0
##$NTH_PI= 0
##$NZP= 0
##$OFFSET= 20.76817
##$PC= 1
##$PHC0= -25638.89
##$PHC1= 12.98749
##$PH_mod= 1
##$PKNL= yes
##$PPARMOD= 0
##$PSCAL= 0
##$PSIGN= 0
##$REVERSE= no
##$SF= 200.129752148469
##$SI= 16384
##$SIGF1= 3
##$SIGF2= 2
##$SINO= 5.538805
##$SIOLD= 16384
##$SREGLST= <1H.CDCl3>
##$SSB= 0
##$STSI= 16384
##$STSR= 0
##$SW_p= 4816.95568400771
##$SYMM= 0
##$S_DEV= 0
##$TDeff= 16384
##$TDoff= 0
##$TI= <>
##$TILT= no
##$TM1= 0
##$TM2= 0
##$TOPLEV= 0
##$USERP1= <user>
##$USERP2= <user>
##$USERP3= <user>
##$USERP4= <user>
##$USERP5= <user>
##$WDW= 1
##$XDIM= 16384
##$YMAX_p= 351863910
##$YMIN_p= -205620
$$ End of Bruker specific parameters
$$ ---------------------------------
##NTUPLES= NMR SPECTRUM
##VAR_NAME=  FREQUENCY,     SPECTRUM/REAL,   SPECTRUM/IMAG
##SYMBOL=    X,             R,               I
##VAR_TYPE=  INDEPENDENT,   DEPENDENT,       DEPENDENT
##VAR_FORM=  AFFN,          ASDF,            ASDF
##VAR_DIM=   16384,         16384,           16384
##UNITS=     HZ,            ARBITRARY UNITS, ARBITRARY UNITS
##FACTOR=    0.29402158847633, 1,            1
##FIRST=     4156.32859521505, 0,            0
##LAST=      -660.627088792658, 0,           0
##MIN=       -660.627088792658, -205620,     0
##MAX=       4156.32859521505, 351863910,    0
$$ Real data points
##PAGE= N=1
##DATA TABLE= (X++(R..R)), XYDATA
$$ [...]
5680e409J3166l2525K764J06648n4614l387J0870k4811P5105m8501l6484j880
5668I42N3214L6485n8259r9016j645L9048M4592o2710J7875j06267Q6455J1129
5656c8157m1999R3565m027m5065Q532P8859j5716k8767J4304J7427p5372K1869
5644a4547K2413j08111p999L8098J8473N2546J9729o760O9568p2073Q747j1809
5632H275M948Q42K937q536j8007k6352j471L6655l2736j2312K2443L7257l0993
5619a7050N0593M6706j931o0374n3997p239O8917k1367N6998M75J1478R265J007
5606H3481j6026m0373m7925k0264P277L6522K9908q7518L4596K3340k3789K3615
5594B844N3455o2822J2769M4889m2986K5754n0083L8505Q223l2601J9584j9919
$$ y = [-5409, 7757, -24768, -22004, 84644, 30030, 26643, 37513, 12702, 87807, 39306, 2822, 942, 54156, 90641, 32382, -66634, -68279, -29231, 15361, -47349, -29474, -135741, -49286, -38157, -80156, 13409, 9382, -35683, -27151, 51708, 35992, 7225, 21529, 38956, -36416, -14547, 7866, -100245, -108244, -70146, -51673, 873, 20602, 13842, 83410, 11337, 20084, 8275, 13223, 14065, 17002, 8466, -9541, -35893, -37364, -709, -33445, -45757, -23314, 13943, -17050, 33543, 80249, 78318, 17944, -36053, -43292, 25625, 4258, 61256, 61731, 73209, 82474, 83481, 67455, 27082, -20843, -41107, -33830, 2692, 32600, -54918, -20322, 3018, -20771, 2844, 56299, -6523, 6246, 51135, 8149, 33903, -16180, 22325, 30548, -2053, 17531, -2388]
5582b388j6165l2656j8195O0576Q0823j07273M3830O0728k3446L5061K6596J2017
5570A19508K304r9492M4321K3148j05970k7837K1667J3764M2890j1428q038R8605
5558A13442r2931r1501j1539J63855L6910n1033k5623N1594J763n1695K0120M184
5546F7546m121M9807L098n033o2932N6160j9712k2092K576n4230O258j4984L7767
5533D0108L5037O8260Q512q6798l7004J7066m4361M0146n0838O6920m8419j3410
5521d781n7218l6897P5730K5168l3091O8034N9383n4549M0282L3468k1751M5881
5509A39659m101q5625R4688l5479n3596l211L2979N908Q1251p2934J5351P729
5497A22619o0230n209N9055M8128j645k5530J6150K7771k0955k1916j8101k1240
$$ y = [-2388, -18553, -51209, -69404, -8828, 71995, -35278, 8552, 69280, 45834, 80895, 107491, 119508, 121812, 22320, 66641, 89789, -16181, -44018, -22351, -8587, 34303, 22875, 14837, 113442, 20511, -70990, -82529, 81326, 118236, 67203, 41580, 93174, 94937, 43242, 63362, 67546, 63425, 113232, 116330, 111297, 48365, 104525, 84813, 62721, 65297, 11067, 17325, 2341, 40108, 75145, 143405, 151917, 65119, 28115, 45181, 820, 40966, -9872, 57048, 8629, -4781, -61999, -98896, -23166, 2002, -31089, 36945, 96328, 41779, 82061, 115529, 93778, 139659, 135558, 49933, 144621, 109142, 55546, 52335, 85314, 91222, 172473, 99539, 114890, 122619, 62389, 57180, 116235, 164363, 162718, 137188, 153338, 181109, 160154, 138238, 120137, 98897]
5485I8897M2101K3154p9800j9365L3026j2979L9317O0125L1741m9259n775n2886
5473A08297M9198R3596o9879J9836l7090j6585j4871O0458L8299l1229j7431k6673
5461A55926p9241L9669N9521O6199k6399m5574J6544J1823l8722L9725J5812l6973
5449A78310J1321m182k60K0726K4920o6269K8798K5699m7992P3468Q236K4383
5437B77158o3036O8200P8704R9194m8019O358j5164J7132j9698q7084K5922K4743
5425C64410M6936n5678J3241M615R511N8840j818j1418J04129M7912k9814l7644
5413E13222M030K7940q5001K2995O3594l2977m1571l7636L1032m1066n2812M4980
5401D16730K0786m2037J4969L9475j07040N523K422P7914M4626j01684j5394K8182
$$ y = [98897, 140998, 164152, 84352, 64987, 98013, 85034, 124351, 184476, 216217, 166958, 161183, 108297, 157495, 251091, 181212, 201048, 163958, 147373, 132502, 192960, 231259, 200030, 182599, 155926, 76685, 116354, 175875, 242074, 215675, 170101, 186645, 198468, 159746, 199471, 215283, 178310, 189631, 185449, 185189, 205915, 230835, 164566, 193364, 219063, 171071, 244539, 252775, 277158, 214122, 282322, 361026, 460220, 412201, 418559, 403395, 420527, 400829, 313745, 339667, 364410, 411346, 355668, 368909, 373524, 383035, 441875, 440057, 428639, 532768, 580680, 550866, 513222, 517252, 545192, 460191, 483186, 546780, 513803, 472232, 434596, 465628, 424562, 371750, 416730, 437516, 395479, 410448, 449923, 342883, 348406, 350828, 428742, 473368, 371684, 356290, 384472]
5389C84472m1161q4942K2991P953m6502L1311p3449N523M7037l6127K0397K9017
5377B66520K4120j0086J9241j4000N1467j356N1315J2513K3850m0970j7733J2977
5365C77858n7377l4178J1956j6837J4048l272Q0474n532k517j2260Q4020m8215
5353C88168j8706M8451J3125N4082J7889j6662n7727K2637O3331q9847r5769J3973
5341C42945L9654Q960k4667j920J3581M5693l893J6085L9980N2230L6014l8413
5329E26249K6400M157j02810p6284q304J5559m426K5967J15553J5454k9467O503
5317E14551M2479j0508O4548J5172K47M3587l3849R6829R71l0166o3527J6086
5305F56420N0742j9522N8882L0610q256M5502J07183j9865q235R0058n0300O270
$$ y = [384472, 343311, 258369, 281360, 289313, 242811, 274122, 200673, 206196, 253233, 217106, 237503, 266520, 290640, 280554, 299795, 285795, 337262, 335906, 387221, 399734, 423584, 382614, 364881, 377858, 320481, 286303, 298259, 281422, 295470, 292198, 372672, 367140, 364623, 352363, 436383, 388168, 369462, 417913, 431038, 485120, 503009, 486347, 428620, 451257, 514588, 424741, 328972, 342945, 382599, 391559, 366892, 364972, 378553, 424246, 420353, 436438, 476418, 528648, 564662, 526249, 552649, 556806, 453996, 377712, 369408, 384967, 380541, 406508, 522061, 537515, 508048, 514551, 557030, 546522, 611070, 626242, 626489, 670076, 636227, 733056, 734027, 703861, 640334, 656420, 707162, 687640, 746522, 777132, 768876, 814378, 921561, 901696, 893461, 983519, 933219, 939489]
5293I39489M045O6571M1670n759N828k4726R4429M3798J4134O7690N6764l6784
5281A267149N5078j0306o6357k0277Q739j337o6686J01750L8092O5556O0908N9032
5269A491341Q3584J00178J28917L7378l7292k3092r9410p952j33180j11802m3929
5258A384741R176m7342n0600k5526J1847J47883J0166k7154J7422P026K5008k3426
5246A439221l3257m7654m8619p6325q6758n0421o9238Q6214k4873j3296N8656
5235A133650M5996l4953n0179Q080q5546M1827O0879o3604o8521M80J4387n5847
5223I46649J0164Q1977k5115L490K2778N2613k2564L4337J00690o2926M020L6562
5211A182675N2034j4292K7518j3245q6286l5677q1389m713K2596k5445L84N2062
$$ y = [939489, 943534, 1010105, 1051775, 1046016, 1051844, 1027118, 1121547, 1165345, 1179479, 1247169, 1303933, 1267149, 1322227, 1311921, 1245564, 1225287, 1234026, 1232689, 1166003, 1267753, 1305845, 1371401, 1432309, 1491341, 1574925, 1675103, 1804020, 1841398, 1804106, 1781014, 1681604, 1673652, 1540472, 1428670, 1384741, 1393917, 1346575, 1295975, 1270449, 1282296, 1430179, 1440345, 1413191, 1430613, 1437639, 1462647, 1439221, 1405964, 1358310, 1309691, 1233366, 1146608, 1096187, 1026949, 1113163, 1088290, 1074994, 1133650, 1179646, 1144693, 1094514, 1102594, 1017048, 1058875, 1119754, 1056150, 987629, 988109, 1002496, 946649, 956813, 1038790, 1013675, 1017165, 1039943, 1092556, 1069992, 1104329, 1205019, 1142093, 1146113, 1182675, 1234709, 1220417, 1247935, 1234690, 1148404, 1112727, 1031338, 1026625, 1049221, 1023776, 1024160, 1076222]
5199A076222N0457K4851M9933N0625M3694J516J5425N5769M3358l3010P144K5969
5187A411953j12535o6639L5253l9742k3736m7199J3359N7584N0988O0153J04951
5176A444390r764k5290J25821L4098k0345J6529p3694j0455N3994j30623k6471
5165A378190L2567n9671l776M5972j1672L5083J7569P7804Q0922K7661j9947M4334
5153A645036R1501O1496L2954M7676j688K1868m0995n4108j2348J00989M9844
5142A942225j7099N6750J28475N1381K8133J84336J09918O6741J70353Q6027O4951
5131B872191O5527J43127J05302P1104N4343L5868R8829K9499R4995J84124K48114
5120D003023J66030K22423K57126L22113K35911K92520K99531K41572L46125L47705
$$ y = [1076222, 1126679, 1151530, 1201463, 1252088, 1295782, 1297298, 1312723, 1368492, 1411850, 1378840, 1385984, 1411953, 1299418, 1232779, 1268032, 1228290, 1204554, 1157355, 1170714, 1228298, 1279286, 1339439, 1444390, 1434626, 1409336, 1535157, 1569255, 1548910, 1565439, 1491745, 1481290, 1535284, 1404661, 1378190, 1410757, 1351086, 1347310, 1393282, 1381610, 1416693, 1434262, 1512066, 1592988, 1620649, 1600702, 1645036, 1736537, 1798033, 1830987, 1878663, 1876975, 1898843, 1857848, 1803740, 1791392, 1892381, 1942225, 1925126, 1981876, 2110351, 2161732, 2189865, 2374201, 2484119, 2550860, 2721213, 2807240, 2872191, 2937718, 3080845, 3186147, 3257251, 3311594, 3347462, 3446291, 3475790, 3570785, 3754909, 4003023, 4169053, 4391476, 4648602, 4970715, 5206626, 5499146, 5798677, 6040249, 6386374, 6734079]
5110F734079L36007L33639L51362L38964L66957M10310M51561M33681M21042N39491
5100A0717093N44753O59849P00009Q56387J039798J124578J260919J491788J677240
5091B0072414J931628K200309K519755K856348K673244J887258Q03860k09018
5083C4735798q97684j082860r27770p49432m20888j0642M08462Q01967J364468
5074C3221419J837993K497291L205369M115223M713535M840181L670405J259098
5066E9360514j565041l691049m463550m388590l791449l147923k615615j933293
5058C3764004j455696j053310n16328p8315M11834J050261J589153J751534J420472
5049C6883609M30099r41014k271703k866819k928955k706771k273453k001023
$$ y = [6734079, 7070086, 7403725, 7755087, 8094051, 8461008, 8871318, 9322879, 9756560, 10177602, 10717093, 11261846, 11921695, 12621704, 13478091, 14517889, 15642467, 16903386, 18395174, 20072414, 22004042, 24204351, 26724106, 29580454, 32253698, 34140956, 34944816, 34735798, 33838114, 32755254, 31827484, 31078052, 30657164, 30646522, 31054984, 31856951, 33221419, 35059412, 37556703, 40762072, 44877295, 49590830, 54431011, 58101416, 59360514, 57795473, 54104424, 49640874, 45252284, 41460835, 38312912, 35697297, 33764004, 32308308, 31254998, 30738670, 30660355, 31072189, 32122450, 33711603, 35463137, 36883609, 37313708, 36372694, 34100991, 31234172, 28305217, 25598446, 23324993, 21323970]
5041B1323970j750069j446199j197467j149048j062184r28313r59534q38977o42808
5032A1349371n06612m59405k50877k27506j20672o4299O6865j4047J69543J65669
5022A0108030R3925J39581K5874O827r0264j09745k13608l17357j87038j46607
5012I309618l8161Q3542M3234R4160L1917j00391q2153j75360j14270m9126j25580
5001H877430k5372k1206k757K450M291M8041j0466J76345K33806L16158N35134
4990A0133854N32011K59135m0540l78369o09640o89658o53083n98415n02297m27327
4980G025671l77673k50652k00711j12110L218K9659J68088J35093K92334J49443
4970F862360J73460J37000j18794l65205m41835l48840m29851l98679l36420l02502
$$ y = [21323970, 19573901, 18127702, 16930235, 15781187, 14719003, 13790690, 12831156, 11992179, 11349371, 10842759, 10383354, 10132477, 9904971, 9784299, 9720000, 9786865, 9772818, 9942361, 10108030, 10201955, 10341536, 10367410, 10374237, 10283973, 10174228, 9960620, 9643263, 9456225, 9309618, 9271457, 9354999, 9398233, 9492393, 9524310, 9423919, 9341766, 9166406, 9052136, 9003010, 8877430, 8852058, 8830852, 8828095, 8830545, 8834836, 8882877, 8872411, 9048756, 9282562, 9598720, 10133854, 10665865, 10925000, 10884460, 10506091, 9896451, 9206793, 8553710, 7955295, 7452998, 7025671, 6647998, 6397346, 6196635, 6084525, 6087743, 6117402, 6285490, 6420583, 6712917, 6862360, 7035820, 7172820, 7054026, 6688821, 6246986, 5898146, 5468295, 5069616, 4733196, 4430694]
4960D430694l07906k35462j66736j82138j63800m4039j30205Q5069n888p6376
4950C203213j1226k2000r1090r7901r1971k869n5381j22979j20050r2007j61690
4939B334049j4400k5527n7346k4600q0694n8846N2348O8027K2306k3426L746n4567
4927B141070k5872m8148M4499o3081j20506l8178k5525q886j19198j8240r4952
4916A622983L0578Q771j0130J4068N2779K9578L6692q3135M1364o2444j701M6183
4904A725586k9432P0507K4279o1613k6589K6343l3544k1215o2195Q684M9961n3760
4892A617012K1743L5314N2896N1507J4487j502Q4787j7796l6980Q6670j03049
4881A805089k0373L1030O067O8537k9058m2252L4605j8719j0164L4221J30073
$$ y = [4430694, 4122788, 3887326, 3720590, 3538452, 3374652, 3330613, 3200408, 3285477, 3279589, 3203213, 3191987, 3169987, 3078897, 2980996, 2889025, 2886156, 2830775, 2707796, 2587746, 2495739, 2334049, 2319649, 2294122, 2236776, 2212176, 2131482, 2072636, 2124984, 2193011, 2215317, 2191891, 2195637, 2141070, 2115198, 2067050, 2111549, 2048468, 1927962, 1889784, 1864259, 1855373, 1736175, 1717935, 1622983, 1653561, 1662332, 1652202, 1666270, 1719049, 1748627, 1785319, 1702184, 1743548, 1681104, 1679403, 1725586, 1696154, 1766661, 1790940, 1729327, 1702738, 1729081, 1695537, 1674322, 1612127, 1620811, 1670772, 1617012, 1638755, 1674069, 1726965, 1778472, 1792959, 1791457, 1876244, 1858448, 1821468, 1908138, 1805089, 1784716, 1815746, 1821813, 1890350, 1861292, 1819040, 1853645, 1834926, 1824762, 1858983, 1989056]
4870A989056O2721l6054J9570J74968j3836J7158L5359L8372P3766k0129j1654
4859B329297m1497o5554Q5136J33916Q8970Q1425K5830J48746J71980Q9210J02820
4848C150279Q4611l4887l4468q0489p4994O2046l067p8622K8014P7249O83O7061
4836C163416R4332J53340P6582J22281K03081J52156M2887n1351n4661j8873j16283
4825C766907q3170p8323j336K7873r5697K0582M4986N2868O3277P6649O3521J45035
4813D003172R531P0567J0766r138l9077j4990R6825L2011k4265r850J4576n2863
4801D087265R7245L4361P5958J13071J28025N7440n0851J47655J17210J13541
4791D920920J59124Q8795J47096R3659K46972K92487K27391K32367K59757L03596
$$ y = [1989056, 2051777, 2015723, 2035293, 2210261, 2196425, 2213583, 2248942, 2287314, 2361080, 2340951, 2329297, 2287800, 2222246, 2307382, 2441298, 2530268, 2611693, 2637523, 2786269, 2958249, 3047459, 3150279, 3234890, 3200003, 3165535, 3085046, 3010052, 3072098, 3069031, 2990409, 3018423, 3095672, 3096355, 3163416, 3257748, 3411088, 3487670, 3609951, 3813032, 3965188, 4008075, 3956724, 3902063, 3883190, 3766907, 3683737, 3605414, 3604078, 3631951, 3536254, 3556836, 3601822, 3654690, 3717967, 3794616, 3858137, 4003172, 4012703, 4083270, 4094036, 4084898, 4045821, 4030831, 4127656, 4159667, 4135402, 4125552, 4140128, 4087265, 4184510, 4218871, 4294829, 4407900, 4535925, 4593365, 4542514, 4690169, 4807379, 4920920, 5080044, 5168839, 5315935, 5409594, 5656566, 5949053, 6176444, 6408811, 6668568, 6972164]
4781F972164K77650M12314K81770J02840K32178j4076J14380R7739J40699L28667
4771H946325K43714L56176L61190L81624M13739M19701M44700L99879M05083M48603
4761A2820734M83903O53137P18327O64382O31658N42442N55052P60384Q03422
4752A8633441J100622J245588J440832J647621K009590K271845K658468L049426
4744C4057433L202480L036413J730757J34789j184554k013700j885951j510575
4736C5567092j157602p32018k93498K81127P61712J368411K024341K790262L757603
4727D4367430M657057N434960N183021L327567o8888l337929n232325n333933
4719D8996960m883758m229105l382296k818899k216009j690471j106007n48833
$$ y = [6972164, 7249814, 7662128, 7943898, 8046738, 8278916, 8264840, 8379220, 8476959, 8617658, 8946325, 9190039, 9546215, 9907405, 10289029, 10702768, 11122469, 11567169, 11967048, 12372131, 12820734, 13304637, 13957774, 14676101, 15340483, 15972141, 16514583, 17069635, 17830019, 18633441, 19734063, 20979651, 22420483, 24068104, 26077694, 28349539, 31008007, 34057433, 37259913, 40296326, 42027083, 42161872, 40977318, 38963618, 37077667, 35567092, 34409490, 33677472, 33383974, 33665101, 34426813, 35795224, 37819565, 40609827, 44367430, 49024487, 54459447, 59642468, 62970035, 62901147, 59563218, 54330893, 48996960, 44113202, 39884097, 36501801, 33682902, 31466893, 29776422, 28670415, 28121582]
4711B8121582k3474M84497R42546J469026J775096J372575L52468r33227k218724
4702C1342365k733738k640319k394033k153759j986463j692370j387104j241094
4694A5113485j109481q21736p70272n27964m07516k93949j07018j42034k1941
4685A0911574J18682J47722J80728J23583J01484K7494l4300j20453j51939j25748
4675A1178827j85884k23289j16021n7678J44747P5977J19689L09939M02164L71205
4665A2019676N07080O42985O67108Q27697Q19410Q12358M32956Q2482k45286l57863
4655A6208603l19791k61617k09215l9395M0972J13430J94359K41891M40747N98897
4645A7008881O99761P67154J022336J204210J399585J422291R97878N51036K34745
$$ y = [28121582, 28098108, 28582605, 29525151, 30994177, 32769273, 34141848, 34494316, 33561089, 31342365, 28608627, 25968308, 23574275, 21420516, 19434053, 17741683, 16354579, 15113485, 14004004, 13182268, 12411996, 11884032, 11476516, 11182567, 11075549, 10933515, 10911574, 11030256, 11177978, 11358706, 11482289, 11583773, 11611267, 11576967, 11456514, 11304575, 11178827, 10992943, 10769654, 10653633, 10595955, 10740702, 10816679, 10936368, 11246307, 11648471, 12019676, 12526756, 13169741, 13836849, 14664546, 15483956, 16296314, 16729270, 16811752, 16566466, 16208603, 15888812, 15627195, 15417980, 15378585, 15419557, 15532987, 15727346, 15969237, 16409984, 17008881, 17708642, 18475796, 19498132, 20702342, 22101927, 23524218, 24522096, 25073132, 25307877]
4636B5307877J56964K82989O33269Q62513J146791J592857K152916K540086K835562
4627C7511824K679370J783037N44001l80067o97652o35383j40541J51530M65614
4618D1281733N63539O87060Q18888J372639K106867K858130L451238L348818K689610
4609E9178522J409306k51868j669257k634551l228799l603720l526703k842984
4601D2829946k163281j634917j203386q88251m72320r7539M70460R29351J175786
4592C8945849R54749k23777j642412k633020l057839k978123k603614k145452
4584B4616361j817082j578773j245423j056299q03112n83825k90649j05465k73544
4575A6862189m25487p54271q96440j012236r57208q57645q46906o08215n40542
$$ y = [25307877, 25464841, 25747830, 26381099, 27243612, 28390403, 29983260, 32136176, 34676262, 37511824, 40191194, 41974231, 42518232, 42138165, 41440513, 40805130, 40664589, 40816119, 41281733, 41845272, 42532332, 43351220, 44723859, 46830726, 49688856, 53140094, 56488912, 59178522, 60587828, 60335960, 58666703, 56032152, 52803353, 49199633, 45672930, 42829946, 40666665, 39031748, 37828362, 36940111, 36467791, 36370252, 36840712, 37770063, 38945849, 39900598, 39676821, 38034409, 35401389, 32343550, 29365427, 26761813, 24616361, 22799279, 21220506, 19975083, 18918784, 18115672, 17531847, 17241198, 17135733, 16862189, 16436702, 15682431, 14785991, 13773755, 12816547, 11958902, 11111996, 10503781, 9963239]
4566I963239n11901l73764m25156l49225l59342l71749l65218l13457k46177k68310
4556F378940j45578k43300j09260o4776j00791l0758o813N3018K11116K17514
4546F159312J43184j01855k20484l44941l63597k03674k61571l14689k16684j89286
4536D085715k43434j88163j56236o5771k24911l2252L2293n5276n8600j1349L1928
4525C113944o1227L497p1437L522j3499o8201n3117n7915K614j11073q9859k8583
4513B568666J939J803o6668J3567K4951j701P6721J22345J23508O6576o7052J5900
4501B880555k2801J8985j57524j09723o2026q8711q6939j9020p4457o7788j2487
4490B198064Q1872J20700Q6601O3593R6736J59912K43461J53264O6180K99695
$$ y = [9963239, 9451338, 9077574, 8652418, 8303193, 7943851, 7572102, 7206884, 6893427, 6647250, 6378940, 6233362, 5990062, 5880802, 5816026, 5715235, 5684477, 5677664, 5730682, 5941798, 6159312, 6302496, 6200641, 5980157, 5635216, 5271619, 5067945, 4806374, 4491685, 4275001, 4085715, 3842281, 3654118, 3497882, 3432111, 3207200, 3174948, 3207241, 3151965, 3093365, 3082016, 3113944, 3052717, 3056214, 2984777, 2988299, 2974800, 2906599, 2853482, 2795567, 2798181, 2687108, 2597249, 2568666, 2570605, 2572408, 2505740, 2519307, 2544258, 2542557, 2619278, 2741623, 2865131, 2931707, 2864655, 2880555, 2857754, 2876739, 2719215, 2609492, 2547466, 2458755, 2371816, 2352796, 2278339, 2210551, 2198064, 2279936, 2400636, 2487237, 2550830, 2647566, 2807478, 3050939, 3204203, 3270383, 3570078]
4480C570078R6972k6986r7194k41986k04516k12413k24206j77931m8455j99739
4470B233624j14207J5410p976J3216K4442R0954O6683O1321R2968n332J07650
4459B578753K04079R9225J01391R3926O5008j59113j67170k24268j99983k10202
4449B181646l9527j19237j20551l5470O8346o0328o8548K8771l4895p571N5810
4438A848446l9536m1791J6136O2151l2608O5021N8953K1657J5538j05141M685
4427A873511K364P867n4095L5828j4786K7216N8790K9067Q2425n2224m7744J9419
4415A967638R798R422J15534m81O0456L6302O6951Q2938J01202J49171J04498
4404B703429O1789O9916l3439J6645m2826j7791O5024m7027n8068q1029J1919
$$ y = [3570078, 3667050, 3640064, 3542870, 3300884, 3096368, 2883955, 2659749, 2481818, 2433363, 2233624, 2119417, 2134827, 2126851, 2140067, 2164509, 2255463, 2322146, 2383467, 2476435, 2471103, 2578753, 2782832, 2882057, 2983448, 3077374, 3142382, 2983269, 2816099, 2591831, 2391848, 2181646, 2142119, 2022882, 1902331, 1866861, 1935207, 1874879, 1806331, 1835102, 1800207, 1792636, 1848446, 1808910, 1767119, 1783255, 1845406, 1812798, 1877819, 1936772, 1958429, 1973967, 1868826, 1873511, 1875875, 1883742, 1829647, 1865475, 1850689, 1877905, 1936695, 1965762, 2048187, 1995963, 1948219, 1967638, 1977436, 1986858, 2102392, 2101911, 2162367, 2198669, 2265620, 2348558, 2449760, 2598931, 2703429, 2765218, 2835134, 2801695, 2818340, 2775514, 2757723, 2822747, 2775720, 2717652, 2636623, 2648542]
4393B648542m358Q5560q8393L3700P7292J59738R1973J77489Q7438J71773K47623
4382C688377K46891J43378j2334r4874q6335k30397k12955j48294j58202j00332
4372C034923j04972j12809j50748m4947j01344N6666N7898m0348m155M5926Q83
4361B636973K0474J48977j9651N3794Q8156j19968j09608j90551j64077p5396
4351B269123j54124n9097r6056q5713p7416p9631p87j1969o1576N027n3698P819
4339A601902k7946r7534q561J0118J2358p5943j38220P502K99O917O2829q3197
4327A270524M133l9395L9318K4663P6461L4328K2218J02127o2972q5008J8747
4316A405144j230k9009o2081m0546o9732L5682K2721K3020n8530N6836O6529M4203
$$ y = [2648542, 2644184, 2729744, 2641351, 2675051, 2752343, 2912081, 3004054, 3181543, 3268981, 3440754, 3688377, 3935268, 4078646, 4066312, 3971438, 3885103, 3654706, 3441751, 3293457, 3135255, 3034923, 2929951, 2817142, 2666394, 2621447, 2520103, 2576769, 2634667, 2594319, 2590164, 2636090, 2636973, 2657447, 2806424, 2786773, 2840567, 2928723, 2808755, 2699147, 2508596, 2344519, 2269123, 2114999, 2055902, 1959846, 1874133, 1796717, 1717086, 1716299, 1704330, 1642754, 1647781, 1594083, 1601902, 1573956, 1476422, 1467861, 1477979, 1490337, 1414394, 1276174, 1283676, 1283975, 1290892, 1353721, 1270524, 1274657, 1235262, 1274580, 1299243, 1375704, 1410032, 1432250, 1534377, 1471405, 1386397, 1405144, 1403914, 1374905, 1312824, 1272278, 1202546, 1238228, 1260949, 1283969, 1225439, 1282275, 1348804, 1393007]
4304A393007N1772j5637Q8992L1190K513r906l271n1915l0055L3554j128j7351
4292A471765K176K0788p9660J5377l0107J486Q1483L5078J3198M8909J28865N7821
4280A767179L5630K1247J2988O28o7532P6757l9675n9318L8508K8820j116j3312
4268A800804N0063N7428R159K2984M7876O5313N2070P1748O0821j8919O8133R279
4256B296759j7249l872m110k9699P7739n311M1653l8240j00J17248M5307L9372
4244B519497O9556N708j0467p131J716O6817J3364k5936q4913J6380q383m996
4232B551212j4577j7888o5948J8197N5417m5755j1077O0437L1070L5157N5564
4221B651809Q2493n496p172N6597Q435K0385j0303r1245J9179k8463l2303n9213
$$ y = [1393007, 1444779, 1429142, 1518134, 1549324, 1551837, 1541931, 1538660, 1486745, 1456690, 1490244, 1489116, 1471765, 1473941, 1494729, 1415069, 1430446, 1400339, 1401825, 1483308, 1518386, 1531584, 1580493, 1709358, 1767179, 1802809, 1824056, 1837044, 1837672, 1770140, 1846897, 1807222, 1747904, 1786412, 1815232, 1814116, 1800804, 1850867, 1908295, 1917454, 1940438, 1988314, 2053627, 2105697, 2177445, 2238266, 2219347, 2287480, 2296759, 2279510, 2275638, 2271528, 2241829, 2319568, 2314257, 2355910, 2317670, 2317570, 2434818, 2480125, 2519497, 2589053, 2594761, 2584294, 2577163, 2578879, 2645696, 2659060, 2633124, 2548211, 2564591, 2556208, 2551212, 2536635, 2518747, 2452799, 2470996, 2526413, 2480658, 2469581, 2530018, 2561088, 2596245, 2651809, 2734302, 2728806, 2721634, 2778231, 2786666, 2807051, 2796748, 2705503, 2724682, 2696219, 2663916, 2604703]
4209B604703m8944M2304M2467L3435K3460J05885J7725L4940J74221L5620J0691
4198C076507M6860M4201j494n570R489r217o0781p3904J3538m3886J2952P9911
4186C088606K3376K0807K3630J43588R5203M1136J32144J02015R3858P4995P3334
4175C912692M5340Q7965j8180L2155O0888J25788N6453Q4091J10777K62667J84380
4164D945016K12360K44316L53409L01525M27091N90045P97946N59260K20287r6273
4154H554982m68898m37136m07089k92704q6016j64734j06712M2923M1782J12754
4144F789152J57191J62177J49335J98853K32701K72122K40069K58645K73103L35014
4134I068362J85473K63875L57053K96933M33340M19781M09578M67887M99350P35509
$$ y = [2604703, 2555759, 2598063, 2640530, 2673965, 2697425, 2803310, 2821035, 2855975, 3030196, 3065816, 3076507, 3123367, 3167568, 3166074, 3160504, 3169993, 3160776, 3099995, 3026091, 3039629, 2995743, 3008695, 3088606, 3111982, 3132789, 3156419, 3300007, 3395210, 3436346, 3568490, 3670505, 3764363, 3839358, 3912692, 3958032, 4045997, 4027817, 4059972, 4120860, 4246648, 4303101, 4387192, 4497969, 4760636, 4945016, 5157376, 5401692, 5755101, 6056626, 6483717, 7073762, 7871708, 8430968, 8651255, 8554982, 8086084, 7648948, 7241859, 6949155, 6863139, 6698405, 6591693, 6634616, 6676398, 6789152, 6946343, 7108520, 7257855, 7456708, 7689409, 7961531, 8201600, 8460245, 8733348, 9068362, 9253835, 9517710, 9874763, 10171696, 10605036, 11024817, 11434395, 11902282, 12401632, 13137141]
4124A3137141O99556P60569R10018Q91688R81047J099970J176968J302947J371089
4115B2330993J486431J505905J620913J675034J609142J706366J354599J281880
4107C4571263J132554J016089P88350O57434P31402P68556P53956R10035J114331
4098D2443970J265689J514529J693024J916745K104931K112744K079502K074904
4090E7206038J808411J286809P18129K37117k59710n60557q04228r30384r27832
4081E7773793o45087l56099R4744N29934Q62755J132454J345251J470102J506692
4072F3714539J375641J072697N98401k6980o11297p75113j040661r80236q04351
4063F2522640n69190k84967l0411L31692Q85023J204316J402181J428003J365935
$$ y = [13137141, 13836697, 14597266, 15507284, 16398972, 17380019, 18479989, 19656957, 20959904, 22330993, 23817424, 25323329, 26944242, 28619276, 30228418, 31934784, 33289383, 34571263, 35703817, 36719906, 37508256, 38165690, 38897092, 39665648, 40419604, 41329639, 42443970, 43709659, 45224188, 46917212, 48833957, 50938888, 53051632, 55131134, 57206038, 59014449, 60301258, 61019387, 61256504, 60996794, 60436237, 59632009, 58701625, 57773793, 57128706, 56772607, 56867351, 57397285, 58260040, 59392494, 60737745, 62207847, 63714539, 65090180, 66162877, 66761278, 66734298, 66123001, 65347888, 64307227, 63326991, 62522640, 61953450, 61668483, 61638072, 61969764, 62854787, 64059103, 65461284, 66889287, 68255222]
4054F8255222R66565O45760K63405k68282r76779j534794j863242j899834j803207
4045F1784814j619097j339984r89515o92866n54943l62833k4127P6876O2716o3581
4035E6277460k88330n04448q20039j041657j304054j647639j841448j832113j744434
4026D5253298j633782j387932j193886r91002o90431n36574k28577j1231J88052
4017C8767935M57394O92844R62762J241479J619760K030479K367551K465415J837043
4008E2442662P55963n27898j335875j666341j409589r34953n74264j39729J42966
3999D6752942M26964Q98271J564132K151610K529838K658774K377317J839947
3991F1199795R35949j38094j504831k686208l352775l380858l123407k715036
$$ y = [68255222, 69221787, 69867547, 70130952, 69862670, 68885891, 67351097, 65487855, 63588021, 61784814, 60165717, 58825733, 57836218, 57143352, 56588409, 56225576, 56201449, 56278325, 56341041, 56277460, 55989130, 55484682, 54664643, 53622986, 52318932, 50671293, 48829845, 46997732, 45253298, 43619516, 42231584, 41037698, 40046696, 39356265, 38819691, 38591114, 38579883, 38767935, 39225329, 39918173, 40880935, 42122414, 43742174, 45772653, 48140204, 50605619, 52442662, 53198625, 52670727, 51334852, 49668511, 48258922, 47323969, 46749705, 46609976, 46752942, 47179906, 48078177, 49642309, 51793919, 54323757, 56982531, 59359848, 61199795, 62135744, 61997650, 60492819, 57806611, 54453836, 51072978, 47949571, 45234535]
3983D5234535k223110j800462j433545r97226n86900p2072L45433Q45415J081991
3974D0394059M92861m10268j496967k322588k676346k681648k535737k325013
3966B6438353k096979j881528j655657j505947j361419j229856j018855r54337
3958A4733775p37026o66616o44904n49165l33349l42201l85607l89684l93964
3949A0291259k26924k50665k33494k04633k15299j81368k65873k60834l59546
3940H092623k99098k65696l16208k23001k51757k35611k00070l07600k52711j89836
3930E551035o7406n2161j55161j36487o4403j41801j35551j16923q2052j92936
3920D406154j63502q3238r0755k8372j39177j96447j11186j16025j6941J841q3925
$$ y = [45234535, 43011425, 41210963, 39777418, 38780192, 38193292, 38121220, 38466653, 39312068, 40394059, 40886920, 40476652, 38979685, 36657097, 33980751, 31299103, 28763366, 26438353, 24341374, 22459846, 20804189, 19298242, 17936823, 16706967, 15688112, 14733775, 13996749, 13330133, 12685229, 12136064, 11802715, 11460514, 11074907, 10685223, 10291259, 10064335, 9813670, 9580176, 9375543, 9160244, 8978876, 8713003, 8452169, 8092623, 7793525, 7527829, 7211621, 6988620, 6736863, 6501252, 6301182, 5993582, 5740871, 5551035, 5483629, 5431468, 5276307, 5139820, 5075417, 4933616, 4798065, 4681142, 4599090, 4406154, 4242652, 4159414, 4068659, 4040287, 3901110, 3704663, 3593477, 3477452, 3460511, 3462352, 3378427]
3909C378427k3327K4717O6489o0007n5873q70j28238n3948o6844q1264n1485j39554
3897B808223k9791m8608J3973N0671r5917n1836m5372M4827M845q8738P3353o9037
3885B566593K7852q037j4780K1168m0364m9872O091l0670m8007j22546L1961J7212
3873B356601r3410j9178J8315j3216l4076L7135L1517m5129k1029O5257k0309
3862B262478L8793o5703j1472j9615J275k5596n3154J0949n8197m4087K9905P3778
3850B139354j18542N3571K6734K1601k0652k1297l3063j8767J0409K1043j6412
3839B043979o570J3412J1525n2757l7090k3153J4926J4700l6724L3393J3875m5895
3827A943621J19496k390o2433O0179O047k4345Q1290k2889o873m9407k8789j9322
$$ y = [3378427, 3355100, 3379817, 3446306, 3386299, 3330426, 3329556, 3201318, 3147370, 3080526, 2999262, 2947777, 2808223, 2778432, 2729824, 2743797, 2794468, 2698551, 2646715, 2601343, 2646170, 2651015, 2562277, 2635630, 2566593, 2594445, 2586408, 2571628, 2592796, 2552432, 2502560, 2508651, 2477981, 2429974, 2307428, 2339389, 2356601, 2263191, 2244013, 2262328, 2249112, 2215036, 2252171, 2283688, 2238559, 2217530, 2282787, 2262478, 2301271, 2235568, 2224096, 2204481, 2205756, 2180160, 2127006, 2137955, 2079758, 2035671, 2065576, 2139354, 2020812, 2074383, 2101117, 2122718, 2102066, 2080769, 2047706, 2028939, 2039348, 2060391, 2043979, 2037409, 2050821, 2062346, 2009589, 1972499, 1949346, 1964272, 1978972, 1942248, 1975641, 1989516, 1943621, 2063117, 2060727, 1998294, 2058473, 2064520, 2040175, 2121465, 2098576, 2091703, 2042296, 2013507, 1994185]
3815A994185Q90k1976j5392J2521r622K5994J5551O4188n8052O877M9185R3190
3803B157539K7216L2866J03394k2737j06114m2602j7883M3293k100k3226J1675
3792B161321l342O5891M6601O3028L5395L7755O4573L9163J02535K9532O9833
3781B712285l2100J37029l5083k1132M5000l2992p803N392L7482N2207o428j6771
3769B837086K5742Q7195L7476l464O444J18229K1572J9315K0806k6381P7182l5639
3757C185563J7698J5500J4571n7682R5670M4505q2344M2635J31886j2877L4620
3746C429745P4846L5143Q8667Q0614k0213m5510K7577M9266O4632p2107j2066
3735C700594N2252K7972L4605J9511M2335J08696L3027J07385R7875N1225M6522
$$ y = [1994185, 1995075, 1973099, 1957707, 1970228, 1960606, 1986600, 2002151, 2066339, 2008287, 2015164, 2064349, 2157539, 2184755, 2217621, 2321015, 2298278, 2192164, 2149562, 2131679, 2174972, 2172872, 2149646, 2161321, 2157979, 2223870, 2270471, 2333499, 2368894, 2406649, 2471222, 2510385, 2612920, 2642452, 2712285, 2680185, 2817214, 2782131, 2760999, 2805999, 2773007, 2765204, 2770596, 2808078, 2860285, 2853857, 2837086, 2862828, 2950023, 2987499, 2984035, 2990479, 3108708, 3130280, 3149595, 3170401, 3144020, 3221202, 3185563, 3203261, 3218761, 3233332, 3175650, 3271320, 3315825, 3233481, 3276116, 3408002, 3395125, 3429745, 3504591, 3539734, 3628401, 3709015, 3688802, 3643292, 3670869, 3720135, 3784767, 3712660, 3700594, 3752846, 3780818, 3815423, 3834934, 3877269, 3985965, 4018992, 4126377, 4224252, 4275477, 4321999]
3724D321999J68885J27223L6766J17680J66444J36796R7188Q1406O8132R8621
3714E421140J97829J83579J24705J21391J13375J61738J84201K62545L09639J88294
3704G268436L27426L70450L25520M53609M02010L72620L58608K92917K64473K98936
3694A0735005K77596N00964M51674O77622O83398O87151N43913K06127J32403
3685A4895853J53585K11864K59288M50043N84460Q10257Q76882O77324L15853
3676A9235409J21017j55763k01850j38653R7081L05213O00239P39143Q95136Q17557
3666B2314529M07109J85748k3918j71027n3254L3259L64193N63675Q11657J054636
3656B5486607J016101Q40716L34717M6942m35639m00300k37824J2778K80551O86615
$$ y = [4321999, 4490884, 4618107, 4654873, 4772553, 4938997, 5075793, 5172981, 5254387, 5322519, 5421140, 5618969, 5802548, 5927253, 6048644, 6162019, 6323757, 6507958, 6770503, 7080142, 7268436, 7595862, 7966312, 8291832, 8745441, 9147451, 9520071, 9878679, 10171596, 10436069, 10735005, 11012601, 11513565, 11965239, 12642861, 13326259, 14013410, 14557323, 14763450, 14895853, 15049438, 15261302, 15520590, 15970633, 16555093, 17365350, 18242232, 18919556, 19235409, 19356426, 19200663, 18998813, 18860160, 18957241, 19262454, 19862693, 20601836, 21496972, 22314529, 22721638, 22907386, 22883468, 22712441, 22659187, 22692446, 23056639, 23620314, 24431971, 25486607, 26502708, 27343424, 27678141, 27725083, 27289444, 26889144, 26651320, 26664098, 26944649, 27631264]
3646B7631264Q21106P30284N65651Q3514n19217r77226r91163q10404p01223m43163
3636B5389423p8937o400J0966k14592n95005r26674j261246j212604j118754q58786
3626A9127391o57851n64754m18852l80250l79284n71270o49534p18971o85699
3617A4100926n68239m56937n18727k99136l07486l18748j71651k01347k12588
3608A1046067j01859n8733k2632L3942o3563J81666J57538J91117K82654K21011
3598A1867208L43000L82179L89531L95358N09264L15247L43623K63553K85993
3589A5094956M11341L81192M73897M99334N89161O93336P81793Q11177O45635
3580B0381822O14129O33454O45453O07171N75193O01519O16903O99381O13639
$$ y = [27631264, 28452370, 29182654, 29748305, 29831819, 29312602, 28335376, 27344213, 26533809, 25832586, 25389423, 25310486, 25304086, 25315052, 25100460, 24505455, 23578781, 22317535, 21104931, 19986177, 19127391, 18469540, 17904786, 17485934, 17105684, 16726400, 16155130, 15505596, 14786625, 14100926, 13532687, 13075750, 12557023, 12257887, 11950401, 11631653, 11460002, 11258655, 11046067, 10944208, 10885475, 10862843, 10896785, 10833222, 11014888, 11172426, 11363543, 11646197, 11867208, 12210208, 12592387, 12981918, 13377276, 13886540, 14201787, 14545410, 14808963, 15094956, 15506297, 15887489, 16361386, 16860720, 17449881, 18143217, 18925010, 19736187, 20381822, 20995951, 21629405, 22274858, 22882029, 23457222, 24058741, 24675644, 25375025, 25988664]
3571B5988664P82187P65667O68524P11967O79288Q04916J016441J182317J366173
3562C3966144J417283J205432R51421P43909N99454N33923N23390N54001N25883
3553D1020840O05279O18998O35868O87388P09862P39385P22455O39933Q95334
3544D7275342J237878J470025J868903K099076K005949J898515J573910J403816
3536F0833414J275934J075108Q47344O96398N88613L14385K28197k0722m177P8747
3526F5913241J40736J28784Q2088Q6463J6652J67487J71009K40818K85734M43857
3516F7676869K44964J18755q4977k92734l99516o60638p49987r72498j069861
3507F3810377j257130j518077j671408j653994j430016j248063r67587p00280
$$ y = [25988664, 26770851, 27536518, 28205042, 28917009, 29596297, 30401213, 31417654, 32599971, 33966144, 35383427, 36588859, 37540280, 38284189, 38883643, 39417566, 39940956, 40494957, 41020840, 41626119, 42245117, 42880985, 43568373, 44278235, 45017620, 45740075, 46380008, 47275342, 48513220, 49983245, 51852148, 53951224, 55957173, 57855688, 59429598, 60833414, 62109348, 63184456, 64031800, 64728198, 65316811, 65631196, 65859393, 65838671, 65834494, 65913241, 66053977, 66182761, 66264849, 66351312, 66367964, 66535451, 66706460, 66947278, 67233012, 67676869, 67921833, 68040588, 67955611, 67662877, 67263361, 66602723, 65852736, 64880238, 63810377, 62553247, 61035170, 59363762, 57709768, 56279752, 55031689, 54064102, 53363822]
3499E3363822o16432n23611o38630p03439o77391r03366p65150p89855q64099
3490D6881849q80612o85435m04447m15272o38007q96419j038443j268470j315910
3481C9338834j141673j015819j007269j018896j042613j120633j132079j001536
3473C0858316q78175r30598q72937p41314p44720o90120o61704o78665p82922
3464B3877161p81266q15614p81692p21012o43110n75008n25545o01605o32700
3455A7799609n23592n71393n08976m31431n71438o11353o01739n11384n24249
3446A2944054l90999l91628m88716l19958k30094k12755k97863k02905k62099
3437A0147037j05607k21356j99188k35608k45435j16614k31791j09607j85206
$$ y = [53363822, 52747390, 52223779, 51585149, 50881710, 50204319, 49300953, 48535803, 47745948, 46881849, 46001237, 45315802, 44911355, 44496083, 43858076, 42961657, 41923214, 40654744, 39338834, 38197161, 37181342, 36174073, 35155177, 34112564, 32991931, 31859852, 30858316, 29980141, 29049543, 28176606, 27435292, 26690572, 26000452, 25338748, 24660083, 23877161, 23095895, 22280281, 21498589, 20777577, 20134467, 19559459, 19033914, 18432309, 17799609, 17276017, 16704624, 16195648, 15764217, 15192779, 14581426, 13979687, 13468303, 12944054, 12553055, 12161427, 11672711, 11352753, 11122659, 10909904, 10612041, 10409136, 10147037, 10041430, 9820074, 9620886, 9385278, 9139843, 9023229, 8791438, 8681831, 8496625]
3428H496625j38458j60340j38744n0498p1995j22656o5327n1467m8812j07039
3418G541289n086n4591q4706r2205r6825n3547n6641j48493j7659q007j01440
3407F822089o0252L4905j60767o2524k579N2130M416l9274o6632j8021j2899L8708
3395F529300p819o2440l8445K8083n3035k968l9614j6544q523o1769N6560k235
3383F320551M6169P2132k1589K9534J4465L663J02029J04484j7409m0164J8705
3372F632570j27943J5323K2812o0384l7458K6390j720O3943k985R4257k4139K1342
3360F622008J0981k6218N7760Q8216o1039Q528q914J3513p5225l7003k1768q4307
3348F486532Q708l2710J32868q1922p6327J52883J28909m2908J00624J53611P581
$$ y = [8496625, 8358167, 8197827, 8059083, 8008585, 7936590, 7813934, 7748607, 7697140, 7648328, 7541289, 7536203, 7481612, 7396906, 7304701, 7207876, 7154329, 7097688, 6949195, 6931536, 6923529, 6822089, 6761837, 6796742, 6635975, 6573451, 6570872, 6623002, 6627418, 6588144, 6521512, 6503491, 6490592, 6529300, 6521481, 6459041, 6420596, 6448679, 6395644, 6392676, 6353062, 6336518, 6327995, 6266226, 6322786, 6320551, 6366720, 6438852, 6417263, 6446797, 6461262, 6464925, 6566954, 6671438, 6654029, 6613865, 6632570, 6504627, 6519950, 6542762, 6482378, 6444920, 6471310, 6469590, 6533533, 6530548, 6624805, 6600666, 6622008, 6632989, 6606771, 6664531, 6752747, 6691708, 6700236, 6691322, 6704835, 6629610, 6592607, 6570839, 6486532, 6495240, 6462530, 6595398, 6513476, 6437149, 6590032, 6718941, 6676033, 6776657, 6930268, 6937849]
3337F937849l5277M2900Q1017P4525k0637L3084J21919j3562k9730N2817R3628
3326G338533K5051P9710J48360O5663J10143L2344Q963J12407O9343N5522J00404
3315H146443M9272k3194O6433J629J4254L6059M3042J6535J13159M5782M0325
3304H549739Q9250O6411O043K44805J08722J25062O2265J39166L8106N7015P4958
3293I561542j0563M6640L5887m3204M0982l1797N7790Q9732P3189Q2606L2675
3282I935479Q7959J31802J02163J17413J00444P4444J23925k5506n0330J6212
3272A0614005k4133j4030P2496R260M4922Q955N3231M8314j1790O319J8992J71955
3260A0998496J19309l5735J08780P1447J8477L9099K7770J21334O8780J38720
$$ y = [6937849, 6902572, 6945472, 7026489, 7101014, 7080377, 7113461, 7235380, 7221818, 7192088, 7244905, 7338533, 7363584, 7443294, 7591654, 7657317, 7767460, 7799804, 7808767, 7921174, 7990517, 8046039, 8146443, 8195715, 8172521, 8238954, 8240583, 8254837, 8290896, 8333938, 8350473, 8463632, 8509414, 8549739, 8638989, 8705400, 8711443, 8956248, 9064970, 9190032, 9252297, 9391463, 9429569, 9486584, 9561542, 9550979, 9597619, 9633506, 9590302, 9631284, 9599487, 9657277, 9747009, 9820198, 9902804, 9935479, 10023438, 10155240, 10257403, 10374816, 10475260, 10549704, 10673629, 10648123, 10597793, 10614005, 10589872, 10575842, 10648338, 10657598, 10702520, 10711475, 10764706, 10813020, 10801230, 10807549, 10826541, 10998496, 11117805, 11082070, 11190850, 11262297, 11280774, 11319873, 11347643, 11468977, 11537757, 11676477]
3250A1676477J52749Q1070J46494O2567J87307J49995K38658K25314K28565K40022
3240A3389218L10950J87948K23514K25376K86336K28710K80617K57817J97665
3231A5588151J91980J74758K04258K63625J71996K89173L32682L29437L22484
3222A7868544M80601L96847M91031N57497O25815P22281P64298Q30039R22603
3213B3659556J052427J184765J426938J645533K042919K226882K388773K461797
3205C8089590K221799J914283J523721R62325M93471Q3378r1678j24383L1216
3196D5103722K70957K92436K08057l8760m01957q56148j250668j733579k058480
3187C9535580k030866k047530j774378j603265j337733r50008q38513n99587n03671
$$ y = [11676477, 11829226, 11910296, 12056790, 12119357, 12306664, 12456659, 12695317, 12920631, 13149196, 13389218, 13700168, 13888116, 14111630, 14337006, 14623342, 14852052, 15132669, 15390486, 15588151, 15780131, 15954889, 16159147, 16422772, 16594768, 16883941, 17216623, 17546060, 17868544, 18349145, 18745992, 19237023, 19794520, 20420335, 21142616, 21906914, 22736953, 23659556, 24711983, 25896748, 27323686, 28969219, 31012138, 33239020, 35627793, 38089590, 40311389, 42225672, 43749393, 44711718, 45205189, 45288567, 45196889, 45072506, 45103722, 45374679, 45667115, 45875172, 45836412, 45434455, 44578307, 43327639, 41594060, 39535580, 37504714, 35457184, 33682806, 32079541, 30741808, 29791800, 28953287, 28353700, 27850029]
3178B7850029k94121l14760j95237J7617o768R2027R0541J72076J72701K05104
3168B7789209L04048K38306L34082L47559L50298N00868M93478N68390M88140
3159C1414378P32776O86620P60203P46635P42668Q38194Q91986R44007Q56175
3150C8613642R15578R81885Q95466R63450J034255J028592R41626R92221J157085
3141D7523800J075136J151723J271779J248146J347039J389895J375525J415265
3133E7798308J493320J504401J700390J769048J888999K016258K177608K393444
3125G2741776K499757K767489K906434L321408L539614L962104M211810M581131
3117A00531523N190805N828302O682861P384807Q210326Q631650Q638670Q332780
$$ y = [27850029, 27555908, 27241148, 27045911, 27063528, 27056760, 27148787, 27239328, 27411404, 27584105, 27789209, 28093257, 28331563, 28665645, 29013204, 29363502, 29864370, 30357848, 30926238, 31414378, 32147154, 32833774, 33593977, 34340612, 35083280, 35921474, 36813460, 37757467, 38613642, 39529220, 40511105, 41406571, 42370021, 43404276, 44432868, 45374494, 46366715, 47523800, 48598936, 49750659, 51022438, 52270584, 53617623, 55007518, 56383043, 57798308, 59291628, 60796029, 62496419, 64265467, 66154466, 68170724, 70348332, 72741776, 75241533, 78009022, 80915456, 84236864, 87776478, 91738582, 95950392, 100531523, 105722328, 111550630, 118233491, 125618298, 133828624, 142460274, 151098944, 159431724]
3109A59431724P865012O998120O235535N500341N185639N107055N097803M649602
3101B06070831L703208K156641O62109k70465p62475p58696n27539K98089J473625
3092B12045328K944790M571052O056703P148243P591100P189152O099370M325288
3084B57971026K338212K99527j479352k403539k558426k035957j264555j042596
3076B49824340j456752k610500m377461o452097q417314j0046267j0569836j0229014
3068A95665099r375102q343914p075762n942490n338665m835207m569181m495932
3060A45688846m292878l823258l153530l718719m179239m280850m486916l929726
3052A13823730l475808l418733l471936l487329l544041l708977l869681l810605
$$ y = [159431724, 167296736, 174294856, 180530391, 186030732, 191216371, 196323426, 201421229, 206070831, 209774039, 211930680, 212592789, 212322324, 211559849, 210801153, 210273614, 210571703, 212045328, 214990118, 219561170, 225617873, 232766116, 240357216, 247546368, 253645738, 257971026, 260309238, 260608765, 259129413, 256725874, 254167448, 252131491, 250866936, 249824340, 248367588, 245757088, 241379627, 234927530, 226510216, 216463949, 205894113, 195665099, 186289997, 177946083, 170870321, 164927831, 159589166, 154753959, 150184778, 145688846, 141395968, 137572710, 134419180, 130700461, 126521222, 122240372, 117753456, 113823730, 110347922, 106929189, 103457253, 99969924, 96425883, 92716906, 88847225, 85036620]
3044H5036620l810942l560605l210638k963107k432400k099857j657405j078478
3036F4223188j493224j809534k170855k255265j817964j449149j180949r30321
3028E1115927o33862m65713j16505J74852N505o15120r35538q32770l67216l51453
3018D6978107l04721j52387p599K02113K44856L54112M81997M55922N09741N86489
3008D9348630M23161M32093O67911R33653R87052M88535k74980p25273m76627
2999E1804155l02635k89141l21373l68909j92219p8604K40210N33396R43799J267039
2989E3235718J752502K110292K462040K626358K676015K856288L028617L057232
2981G3805062K865816K456753K001377J681537J492572J187254P12193K16161
$$ y = [85036620, 81225678, 77665073, 74454435, 71491328, 69058928, 66959071, 65301666, 64223188, 62729964, 60920430, 58749575, 56494310, 54676346, 53227197, 52046248, 51115927, 50482065, 50016352, 49899847, 50074699, 50080204, 49465084, 48529546, 47696776, 47329560, 46978107, 46673386, 46520999, 46513400, 46715513, 46960369, 47314481, 47796478, 48252400, 48762141, 49348630, 49771791, 50203884, 50871795, 51805448, 52792500, 53281035, 53006055, 52280782, 51804155, 51501520, 51212379, 50891006, 50522097, 50329878, 50251274, 50491484, 51024880, 51968679, 53235718, 54988220, 57098512, 59560552, 62186910, 64862925, 67719213, 70747830, 73805062, 76670878, 79127631, 81129008, 82810545, 84303117, 85490371, 86202564, 86418725]
2973H6418725r8722m11340p05270q43987p87609q51749r16490p89750o70369m00249
2963G9943190l8899N1470M0531k12239o09328n63561n38369n15452l69405l44219
2953G6843719J497K83915O37039J043238J309064J280544J403397J259871R47885
2944H5010169P81051O13576Q13098J052388J419828J702531J830403J802047J423098
2935I6448189R22738L14230m21643j087758j680435k616434l594365m319209m624423
2926G9340890m682831m583384m166043l817645l131979k644224k135066j565492
2918E2614226r95460n20237j52002L69675P39925J095381J542641J917633K343617
2909E8955399K632159K999394L080644L143304L100211K846400K374049J747100
$$ y = [86418725, 86320003, 85908663, 85203393, 84359406, 83571797, 82720048, 81803558, 81013808, 80343439, 79943190, 79904291, 79955761, 79996292, 79784053, 79174725, 78611164, 78072795, 77557343, 77187938, 76843719, 76845216, 77129131, 77766170, 78809408, 80118472, 81399016, 82802413, 84062284, 85010169, 85791220, 86404796, 87217894, 88270282, 89690110, 91392641, 93223044, 95025091, 96448189, 97370927, 97685157, 97263514, 96175756, 94495321, 91878887, 88284522, 83965313, 79340890, 74658059, 70074675, 65908632, 62090987, 58959008, 56314784, 54179718, 52614226, 51618766, 51098529, 50946527, 51316202, 52056127, 53151508, 54694149, 56611782, 58955399, 61587558, 64586952, 67667596, 70810900, 73911111, 76757511, 79131560, 80878660]
2901H0878660Q84716Q4210r46204j865126k698964l266072l657557l897567l996470
2892F1519626l885112l583841l383968l064764k646279k258363j901761j431814
2884C9363724j173779q95718n69100l59975j76770O7795K39729M06687N62884
2875C7465477O48543N80253O80486P42835Q16925R70258R33628J074058J054075
2866D4966538J130108J137084J160550J257531J091869J020178Q63275O92248
2858E3319381N50443L00358L19607J89738L3888k4842L1081J43718K80717M62822
2848E5606911N19465N97796M14882J43124j40202m06085m97334l02032J97143
2839E6133668P29570J052864J313511J734534J862896K085422K109628K100023
$$ y = [80878660, 81763376, 81847586, 80901382, 79036256, 76337292, 73071220, 69413663, 65516096, 61519626, 57634514, 54050673, 50666705, 47601941, 44955662, 42697299, 40795538, 39363724, 38189945, 37294227, 36725127, 36365152, 36188382, 36256177, 36495906, 36902593, 37465477, 38114020, 38694273, 39374759, 40117594, 40934519, 41904777, 42838405, 43912463, 44966538, 46096646, 47233730, 48394280, 49651811, 50743680, 51763858, 52627133, 53319381, 53869824, 54170182, 54489789, 54679527, 54713415, 54688573, 54719654, 54863372, 55144089, 55606911, 56126376, 56724172, 57139054, 57282178, 57141976, 56735891, 56238557, 55936525, 56133668, 56863238, 57916102, 59229613, 60964147, 62827043, 64912465, 67022093, 69122116]
2831F9122116K216649K090610K105225K229851K341116K543647K750051K886460
2823H8285725L345187L636880L944375M540682N286194N888327O599122P636295
2815A29162787R859967J3036516J7509085K3636008K8913475K3210499K983441
2808B48311778j7130057k4093481k0685853j5625813j1584030p979915n211601
2801A46001028k937658r70895J303147L602015O026327Q449660J0910128J3774258
2793A86158010J7516562K2330093K8298210L4301622L6437227K5826287R95899
2786C51863910k3973456l6208473l6787342l2935361k8157583k3854359k0207300
2779A49740036j7479676j5112592j2991846j0899214r120351p489156n970787
$$ y = [69122116, 71338765, 73429375, 75534600, 77764451, 80105567, 82649214, 85399265, 88285725, 91630912, 95267792, 99212167, 103752849, 109039043, 114927370, 121526492, 129162787, 139022754, 152059270, 169568355, 193204363, 222117838, 245328337, 248311778, 231181721, 207088240, 186402387, 170776574, 159192544, 151212629, 146001028, 143063370, 142092475, 143395622, 146997637, 153023964, 161473624, 172383752, 186158010, 203674572, 226004665, 254302875, 288604497, 325041724, 350868011, 351863910, 327890454, 291681981, 254894639, 221959278, 193801695, 169947336, 149740036, 132260360, 117147768, 104155922, 93256708, 84136357, 76647201, 70676414]
2772G0676414m767597l581846k737613k248733k480835k592751k674144k518850
2764D7074045k351719k451096k230770k269103k190749k154655k093435j949848
2756B9382670j859200j684160j484296j279828j008826r08345o98418n45785m58151
2747A9455661l81370l16675k97742l45401m53379n92319n52112o86692q02864
2738A5027107p65293p36138p02790o46687m57435m40024l36688l39864j93949
2729A0408239o4675k9764M7288L8408k7138r8206j89033j44484k74184m29596
2719I236855l76637l40592m46510l23600l56604l59853k08379k12466j4173j56736
2709F441305o5448J00036J13386L7525j3417R151j4838j38754j88845k28805j86966
$$ y = [70676414, 65908817, 62326971, 59589358, 57340625, 54859790, 52267039, 49592895, 47074045, 44722326, 42271230, 40040460, 37771357, 35580608, 33425953, 31332518, 29382670, 27523470, 25839310, 24355014, 23075186, 22066360, 21158015, 20459597, 19913812, 19455661, 19074291, 18757616, 18459874, 18114473, 17661094, 17068775, 16516663, 15829971, 15027107, 14261814, 13525676, 12822886, 12176199, 11718764, 11278740, 10942052, 10602188, 10408239, 10343564, 10313800, 10361088, 10399496, 10372358, 10274152, 10085119, 9940635, 9666451, 9236855, 8860218, 8519626, 8073116, 7749516, 7392912, 7033059, 6824680, 6612214, 6598041, 6441305, 6375857, 6475893, 6589279, 6626804, 6613387, 6622538, 6607700, 6468946, 6280101, 6051296, 5864330]
2698E864330k84077k66581j75575k50531k19200j24547j28164L3634J6642L8608
2688D504539Q8585P9194K28264K3293l5706k9034k9046j56748k28033j60042k89597
2677C995669k39237j70984k11527j20701j19791o9951m8352l2650K6763P6769
2667C086008J08730J12916Q713L8425N1097Q1546j61731j65903n8476k00763k82817
2656B617745j79895j93934o2601p0736n3910q6757P753J29384Q1450J11600Q6222
2645B386321O5980M0649Q8832J0249o897p4759j03227o0270j68188j56842j41680
2634A880168j04509k6370m3763l5701P4737O7453K1552O1230Q1386J05248K4091
2623B105522O5917N8626L5505o3895q0520j56462r0339k7834j28427q4275m3662
$$ y = [5864330, 5580253, 5313672, 5138097, 4887566, 4668366, 4543819, 4415655, 4449289, 4465931, 4504539, 4593124, 4672318, 4900582, 4923875, 4888169, 4859135, 4830089, 4673341, 4445308, 4285266, 3995669, 3756432, 3585448, 3373921, 3253220, 3133429, 3063478, 3015126, 2982476, 3009239, 3086008, 3194738, 3307654, 3316367, 3354792, 3405889, 3487435, 3325704, 3159801, 3101325, 2900562, 2617745, 2437850, 2243916, 2181315, 2110579, 2056669, 1969912, 1977665, 2107049, 2188499, 2300099, 2386321, 2452301, 2492950, 2581782, 2592031, 2585134, 2510375, 2407148, 2346878, 2178690, 2021848, 1880168, 1775659, 1749289, 1705526, 1669825, 1744562, 1812015, 1833567, 1894797, 1976183, 2081431, 2105522, 2171439, 2230065, 2265570, 2201675, 2121155, 1964693, 1874354, 1846520, 1718093, 1633818, 1590156]
2612A590156M350L0002p1024O3580J40352Q8679J04668Q5453J02128R5433J35887
2601B369664J04428m7657J45270j4807k9924j09544k26563j90211j42026j47989
2591A710641J5604M2736n3138L018L2157Q6042J67620J21336P4472M8395R1869
2580B340752J23181P7677j9220J33311P1465j07447k00512j03215k13512k51901
2570A850579r2059r6231n5783q2851L5304n12M6842p1173R277o8483j41978k2034
2558A310898k5888j67814j16041l5049r6810o8247R25l3677K3495M653m44O2101
2546H58102M2054N1893O6713j2886P361m4735J0627n2275r0376k2952K6263q4294
2534G55495j30362j11214k3358k8671O0195J8449K5386P0415O4593k0538N9891
$$ y = [1590156, 1594506, 1624508, 1553484, 1617064, 1757416, 1846095, 1950763, 2036216, 2138344, 2233777, 2369664, 2474092, 2426435, 2571705, 2556898, 2526974, 2417430, 2190867, 2000656, 1858630, 1710641, 1726245, 1768981, 1715843, 1718861, 1751018, 1837060, 2004680, 2126016, 2200488, 2248883, 2340752, 2463933, 2541610, 2522390, 2655701, 2727166, 2619719, 2419207, 2315992, 2102480, 1850579, 1758520, 1662289, 1606506, 1523655, 1558959, 1558447, 1605289, 1534116, 1543393, 1474910, 1332932, 1310898, 1285010, 1117196, 1001155, 966106, 869296, 801049, 801974, 768297, 791792, 796445, 796001, 858102, 900156, 952049, 1018762, 1005876, 1013237, 968502, 979129, 926854, 836478, 813526, 839789, 755495, 625133, 513919, 490561, 461890, 522085, 540534, 565920, 636335, 700928, 680390, 740281]
2523G40281M4484n252P865n4426m3348j21044N9625q4510M867k4528j65327M6390
2511D05077q9780N070O0930P1665j5921L1467R2882N6193N8461j9150P7104k2048
2499G11950p5620k1672m9990o9620J3970r6052n4879p0312O8661K4783n2049K5638
2487C54808O6673M4661N0393n2381Q1054j4356O0377j8337k3041n7121j16241
2476C76489n9229p9137O2267q4816m5014p5799K3375O8239L0825O1041K7821M6498
2464C52560Q7984j0643j1990R3001m2039L35P385n7797j05337n5008o6442J9789
2452B11798k635K935m3231o0741J67609R5634n1903L7235J7173J8124M8043r8862
2440C41179K9918j623N763J2383j32048m3169m1234o9063l7072k2045j6946k2965
$$ y = [740281, 784765, 779513, 787378, 732952, 689604, 568560, 628185, 543675, 548542, 524014, 358687, 405077, 315297, 320367, 381297, 452962, 437041, 468508, 561390, 617583, 676044, 656894, 733998, 711950, 636330, 614658, 564668, 495048, 509018, 412966, 358087, 287775, 356436, 381219, 329170, 354808, 421481, 466142, 516535, 464154, 545208, 530852, 591229, 572892, 549851, 492730, 376489, 317260, 238123, 300390, 215574, 170560, 94761, 118136, 186375, 217200, 278241, 306062, 352560, 440544, 429901, 417911, 510912, 468873, 469208, 476593, 418796, 313459, 258451, 192009, 211798, 209163, 212098, 168867, 108126, 275735, 371369, 319466, 356701, 373874, 391998, 440041, 341179, 371097, 369474, 375237, 387620, 255572, 212403, 171169, 102106, 65034, 42989, 26043, 3078]
2428C078J35187J2131O77J17205l5122P86P8406J4380M605J9822p4619j1506o7598
2415A97432j8169k3018q1678N6610n4033k329J5999K9258o2079O5546J42781P2468
2403C38788K1703l6768m8995j7611J2955j1996J0809j0638j34404k5906N5353
2392A53290k1390r0966l5170K2981R0440l6194M2958L5611k0927L6061j6904n886
2380A53904N3786l3255P4968N0494j28291j4363r226p0468k1979J1790q057m3455
2368A5848M6583K7507m0823M7983K7719Q5339l4275J9166N7396L1443q6985o5699
2356A31202l4095j9424k470k6610k4575K8092q41K048L1610l9453K4171j882L4944
2343A02717N2700K6769P5307K6256N3285q7753j4666n1396p5284M0206j13396
$$ y = [3078, 138265, 150396, 151073, 268278, 233156, 233942, 312348, 326728, 331333, 351155, 276536, 265030, 197432, 179263, 156245, 74567, 131177, 77144, 74815, 90814, 120072, 57993, 123539, 266320, 338788, 360491, 323723, 274728, 257117, 270072, 258076, 268885, 258247, 123843, 97937, 153290, 131900, 40934, 5764, 28745, 119185, 82991, 125949, 161560, 140633, 176694, 159790, 153904, 207690, 174435, 249403, 299897, 171606, 157243, 148017, 77549, 55570, 67360, 59303, 15848, 62431, 89938, 49115, 97098, 124817, 210156, 175881, 195047, 252443, 283886, 196901, 131202, 97107, 77683, 75213, 48603, 24028, 52120, 51279, 53327, 84937, 45484, 69655, 67773, 102717, 155417, 182186, 257493, 283749, 337034, 249281, 234615, 183219, 107935, 148141, 34745]
2332C4745N274Q7347q4381q54L0193n358j949K5904J31324o8126J0642J12069
2320B76830K4677l2961p2250J7360M561m7865n0877k2759R667n6223M5496Q073
2308A03729P333J7920P3241l0168N9481J2589j9571R0307P7813m7936L9708K6293
2296D10739J7021O365L9105j8751O2807j4221j7892M6812l7620Q9459J3014P6604
2284F73442M3595j937L9094O0659R9638k1602L6740R9237N0690Q209j8147J04473
2272A174091K0485P4358R2947O5245M1356J10181J12294J74437R8239K21054K70660
2261B455347K09433K70568M06165L23186K93069K84050M23541M07815P35312Q86989
2251F695475J189958J526089K246706L367670K146358j489703k937574k268350
$$ y = [34745, 40019, 127366, 42985, 42131, 72324, 66966, 65017, 90921, 222245, 154119, 164761, 276830, 301507, 268546, 196296, 213656, 218217, 170352, 119475, 96716, 106383, 50160, 95656, 103729, 111062, 128982, 202223, 172055, 231536, 244125, 224554, 314861, 392674, 344738, 384446, 410739, 427760, 434125, 473230, 454479, 517286, 503065, 485173, 531985, 494365, 583824, 596838, 673442, 717037, 715100, 754194, 814853, 914491, 892889, 929629, 1028866, 1079556, 1087765, 1069618, 1174091, 1194576, 1268934, 1361881, 1427126, 1468482, 1578663, 1690957, 1865394, 1963633, 2184687, 2455347, 2664780, 2935348, 3341513, 3664699, 3957768, 4241818, 4665359, 5073174, 5808486, 6695475, 7885433, 9411522, 11658228, 15025898, 17172256, 15682553, 12744979, 10476629]
2243A0476629j751030j470947j174878q74083p44259n38184m49130l55731m01593
2234B716794m26345l16873k01195k46313j43496j24211j15134m2375r3720N4367
2224A061499m704M972o6190l3720J3836q0098n9350q5864j1503j20742p9274m1113
2212D97749n2106n7019j07691j2490p786R9621J01288j09958J6352O4746K0386
2201D53092l7103j8643o7066j0873k3340j4703l1755o2438o097l1229o0725j6121
2189G2999r1303R8054K8479J442p322O7363p214O1522M0056j5424p4545J2964
2177A87071k1254l5194K791l1852l2695M1028o5599R964J0037q7245O2928j9412
2165B0568O0652j126J01668p2642P276R1141K8566m8412o9404q2125K0062k2091
$$ y = [10476629, 8725599, 7254652, 6079774, 5205691, 4461432, 3923248, 3474118, 3118387, 2716794, 2290449, 1973576, 1772381, 1526068, 1382572, 1258361, 1143227, 1100852, 1007132, 1061499, 1056795, 1061767, 995577, 961857, 975693, 895595, 836245, 750381, 738878, 618136, 538862, 497749, 445643, 388624, 280933, 268443, 260657, 360278, 461566, 351608, 367960, 432706, 453092, 415989, 397346, 330280, 319407, 296067, 281364, 249609, 187171, 181074, 149845, 89120, 72999, -18304, 79750, 108229, 109671, 102349, 169712, 162498, 224020, 264076, 248652, 174107, 187071, 165817, 130623, 133414, 101562, 68867, 109895, 44296, 54260, 64297, -22948, 39980, 20568, 81220, 80094, 181762, 109120, 116396, 207537, 236103, 187691, 118287, 36162, 56224, 34133]
2153C4133p1901J7092K3236m2213J0669n0347r096O2209K5110K2782O5138Q665
2141I5477p4487R2372L9987k7916j9716k9863o4559J3821o2636m5610J0685R508
2129f2937m0151p278o52J17151M1513O773L5480j3905L3755m8001m0874k8160
2117g286p2772J8557M7121J8926r0309J2605j3731j1009l4982k9436J08247J3919
2105d0150j8138j9554Q2980k807M3774K2071m2306L9854l0917J1810J2837o3830
2093d376m2805m156k4285q0108K9555N486l272L8173P8511n1422M0431O9831j3381
2080C8182M8187o0990k4060P5175m3741j40824J5203M3939l8927J9138n911K0157
2068e4472p69k6292O2551K5678n3905L2206R2265K4843q2916j0220L9452k4578
$$ y = [34133, -37768, -20676, 2560, -39653, -28984, -79331, -88427, -26218, -1108, 21674, 86812, 95477, 20990, 113362, 153349, 125433, 105717, 75854, 11295, 25116, -37520, -83130, -72445, -62937, -103088, -110366, -111018, 6133, 47646, 54419, 89899, 75994, 109749, 61748, 20874, -7286, -80058, -61501, -14380, 4546, -85763, -73158, -86889, -97898, -132880, -162316, -54069, -40150, -58288, -77842, 5138, 2331, 46105, 68176, 25870, 65724, 34807, 46617, 59454, -4376, -47181, -51337, -75622, -155730, -126175, -120689, -123961, -85788, -7277, -58699, -18268, 51563, 38182, 86369, 25379, 1319, 76494, 32753, -108071, -92868, -48929, -87856, -68718, -74629, -54472, -55241, -81533, -18982, 6696, -47209, -15003, 77262, 102105, 19189, 8969, 48421, 23843]
2056B3843L741J1142J4378n5167K652p141K5170k1150J4809j4263k0087R968O4645
2043E2540L4336j5537r623l637M4474K135m8723q6549K2520J8558l0610k0726
2031d0842m1924p8185P3509l5568L173l407p416L949N2291L0243Q277K1006m330
2018a9224j4199N1184m3821n88m1993p5437R2028o0641Q671l2857m1819N0247
2006a28449J0976J8707m4713O0474Q8829J2551J4523N4196l0369n5821p9786L1310
1994d7572M1355o3933m3184k7242m5380j9664Q2346K6610p463M3953K9492K7646
1982c036J6429q972l0579M1007J2668r029Q093K7071p9514m8559k0323k9026O7529
1969e6241k4302n8940m1868j4262M434L5721J6433P9942Q3043k2983p3449N9235
$$ y = [23843, 27584, 38726, 53104, -2063, 589, -6552, 18618, -2532, 12277, -1986, -22073, -12105, 52540, 86876, 71339, 61716, 58079, 102553, 104688, 55965, -30584, -8064, 10494, -20116, -40842, -82766, -160951, -87442, -123010, -119837, -123244, -130660, -126711, -74420, -44177, -35900, -14894, -19224, -33423, 17761, -26060, -26648, -68641, -144078, -52050, -112691, -104020, -136877, -178696, -128449, -117473, -98766, -143479, -83005, 5824, 18375, 32898, 87094, 56725, 904, -78882, -47572, -6217, -70150, -113334, -140576, -185956, -205620, -123274, -96664, -104127, -60174, -30682, -3036, 13393, 4421, -26158, 14849, 27517, 18488, 26581, 53652, -25862, -74421, -94744, -123770, -56241, -80543, -139483, -181351, -195613, -191179, -155458, -139025, -59083, 23960, 977, -72472, -13237]
1957a3237l0150r8106N0565O1432o7583L9093m6297o8745L1505N5789m0692m0261
1945a66687P2204N3363j4649N1388k7401k9567K163O242O596L9968j8737p893
1933c3010m4031l5722k9876K5799J1246n3193M5823l1838O0984Q2517j5536o5359
1921h2196m2005O4865K9219L2920J432j6629K2196m4471l3390M166J0436l318
1909e6775l1640n2427j485O9164o9287Q7215k1831O8309P1684m2706J7407l1786
1897E842K7015r661l6957k4096j3420l1744j6662m481j8239J5525m5441O4688
1885h7631J5860j3893J7096K4182L7101K2004L2357o1279R114L8871l2174k138
1873e30M1565j31984j6172p387K966K0705Q4704j33929J0838j8502Q4332J4835
$$ y = [-13237, -43387, -141493, -90928, -29496, -97079, -57986, -104283, -173028, -141523, -85734, -126426, -166687, -94483, -41120, -55769, -4381, -31782, -61349, -59186, -52944, -46348, -6380, -25117, -33010, -77041, -112763, -142639, -116840, -105594, -158787, -112964, -144802, -83818, -1301, -16837, -82196, -124201, -59336, -30117, 2803, 4235, -12394, 9802, -34669, -68059, -63893, -53457, -56775, -88415, -140842, -142327, -73163, -142450, -55235, -77066, -8757, 62927, 20221, 37628, 5842, 32857, 23196, -13761, -37857, -51277, -83021, -99683, -104164, -122403, -106878, -152319, -87631, -71771, -85664, -68568, -44386, -7285, 14719, 47076, -14203, -5089, 33782, 1608, -530, 41035, -90949, -107121, -114508, -111542, -90837, -6133, -140062, -129224, -147726, -63394, -48559]
1861d8559O565M4236j3723l8169N0815k4578L0236K6680o1795o7990Q282j9552
1849a07552m6443K3706J6819r38l5169J3411L1805N7759J8676K2239j8644j4550
1837c8881O040J19616j6325p036o3226n5049k5731m1377j5178K1356J3216j6140
1825a18715J8320J0918j7808K6662L175P1386N6775l2429j9876J0250j5341j7443
1813b4126o0321K1041K4629l2699K0887o0917M0456k9652L5853K19o679J3494
1801e7815M1924n80k4942Q4556l178k0994N0783m9209r7197O4743n7436n3567
1789a22912j2035L5279J1529m2770k6413K4189R6391j0769m6475Q7947K2913O829
1777B3703j4408k8100k9N9808P77l9781q1206N8014j09859K2907j4632M9050L1371
$$ y = [-48559, -41994, 2242, -11481, -49650, 1165, -23413, 6823, 33503, -28292, -96282, -88000, -107552, -153995, -130289, -113470, -114408, -149577, -136166, -104361, -46602, -27926, -5687, -24331, -38881, -32841, 86775, 70450, 63414, 188, -54861, -80592, -121969, -137147, -115791, -102575, -118715, -100395, -89477, -107285, -80623, -77448, -6062, 50713, 18284, -1592, 8658, -6683, -24126, -84447, -63406, -38777, -71476, -50589, -111506, -71050, -100702, -64849, -64630, -71309, -57815, -15891, -16471, -41413, 43143, 39965, 18971, 69754, 20545, -76652, -11909, -69345, -122912, -134947, -99668, -88139, -130909, -157322, -133133, -36742, -47511, -93986, -6039, 16874, 23703, 9295, -18805, -18834, 40974, 41751, 1970, -79236, -21222, -131081, -108174, -122806, -73756, -42385]
1764d2385m3400K6388j6995n921M0675k15J3396L5389k5529K3698j7363J5752
1752C490o8817k9531j8900q143P6654J8943n7831L9712J837j5240K3823n7464
1740i1467k3221J19537K0677k6231m5999M8650m624q293l8169l7597K2227k7872
1728i2382n6828R2564o2176q677Q159K3573Q0446m8302M4103k2195j0740N4070
1716A615M8457m9863K6675J0368l8861j10490o7117k709P3564J325L2295l9761
1704a14502n632J6398q4J6557r458L9616P4259k7399m5293N9401J1323p1340M287
1691e1867m8178j2191j3517l0672P3743J8522p312n9074L9434M4455L7420m4048
1679e3285J3023k1762M6477J895j3835k0853k460J2137L7343J8115o0704l9751
$$ y = [-42385, -85785, -59397, -76392, -82313, -41638, -41853, -28457, 6932, -18597, 5101, -12262, 3490, -65327, -94858, -113758, -121901, -45247, -26304, -84135, -44423, -42586, -57826, -34003, -91467, -114688, 4849, 25526, -705, -46704, 1946, -2678, -10971, -49140, -86737, -64510, -92382, -149210, -56646, -118822, -127499, -119340, -95767, -15321, -63623, -19520, -41715, -52455, 1615, 50072, 209, 26884, 37252, -1609, -112099, -179216, -181925, -108361, -107036, -74741, -114502, -120134, -103736, -103820, -87263, -96721, -57105, 17154, -10245, -55538, 3863, 15186, -56154, -51867, -100045, -112236, -125753, -156425, -82682, -64160, -71472, -130546, -91112, -46657, -9237, -53285, -40262, -62024, -15547, -13652, -27487, -48340, -50800, -38663, -1320, 16795, -43909, -83660]
1667h3660Q7282m0489o6729j4441O0571L2226l818L8103l0802O3321l5642l1629
1655b5707k6831j6201L4786k4804N434k6642J8757n2419P3429k6468k9892l7574
1643a34132P1480J2924L1009o0049l3113J05236N0141P4534j4560q4623J861l3212
1631a2504n8833o374o6281l4885O2742k8569J8417L2866l134P305J7379O025J3888
1618e1958J9402L1820N7726p3896l4845k5532P6597m4572j9454j3326K2814l037
1606e8261j7311J0203N8256L9741n8866j259L4179j8170N6412p0042q2375O3314
1594d4179N4938q1376n613N9787Q733m398o5644l6741M0746L2705L57n8180J4605
1581h4260n426J06016m5369l932N6399K8902n8433N1636n8595j5950j1791J8985
$$ y = [-83660, 3622, -36867, -103596, -118037, -57466, -25240, -29058, 9045, -21757, 41564, 5922, -25707, -52538, -68739, -33953, -58757, -53323, -79965, -61208, -113627, -40198, -66666, -96558, -134132, -62652, -49728, -18719, -78768, -111881, -6645, 43496, 118030, 103470, 18847, 20708, -12504, -71337, -77711, -143992, -178877, -116135, -144704, -126287, -93421, -96555, -89250, -71871, -65846, -51958, -32556, -736, 56990, -16906, -51751, -77283, -686, -45258, -64712, -78038, -55224, -58261, -75572, -65369, -7113, 32628, -26238, -27497, 6682, -11488, 44924, -25118, -107493, -44179, 10759, -70617, -76230, -16443, -7710, -12108, -77752, -114493, -73747, -41042, -40685, -98865, -84260, -89686, 16330, -29039, -32971, 23428, 52330, -6103, 45533, -13062, -29012, -40803, -21818]
1569b1818K7239q5789J6963r158l1060O0576j1610l1251N8035l3014K3888J4423
1557b2576k868n680n2259M1225M933P0103j10215m9301K0402K2625J7923p1475
1545a37163M5276K5766L2450j928q1179L9651N7990m9110O7225j6113J2813m3124
1533d7446l4465m2948N104K6299N2162L753l5022n1391k1859M6139M7578j0749
1521f2845O761m6397K8677L9785l0024L8680m665j3438l8551L8232M9939j26885
1509a20731L7196N0114j8561n7371L3317M1590n271m0905P040J01071k3406p7438
1497g3355O0379L3318M8316K5611n7910p933l0496l5534R738o4462l0138R9368
1485b3098m1265o363L4396K1959j5578L0848M1716k3793n312o0267N138N9134
$$ y = [-21818, 5421, -80368, -63405, -72563, -103623, -43047, -54657, -85908, -27873, -60887, -36999, -22576, -25444, -31124, -83383, -42158, -37225, 32878, -77337, -126638, -106236, -83611, -65688, -137163, -91887, -66121, -33671, -35599, -116778, -77127, -19137, -68247, -1022, -17135, -4322, -47446, -81911, -124859, -119755, -93456, -41294, -37541, -72563, -123954, -145813, -99674, -52096, -62845, -56084, -102481, -73804, -34019, -64043, -25363, -30028, -43466, -82017, -43785, 6154, -120731, -83535, -33421, -51982, -109353, -76036, -34446, -39717, -80622, -73582, 27489, 4083, -73355, -12976, 20342, 68658, 94269, 36359, 28426, -2070, -37604, -27866, -92328, -122466, -23098, -64363, -70726, -36330, -14371, -29949, 899, 42615, 18822, 13510, -46757, -41619, 17515]
1473A7515K6176P5010p4550j00707j8305M1481Q9950j3013j03169j8239j9563
1462i7414L5921Q0628N019k471Q109k7544o4886P3077n3273K087M5988L8427p9500
1449c5832q882N4123p3957L4229m6942J7151L2576m5650O3967K5937l3719k0845
1437c7844K7231L1308L8964r731o03o6425j6308j1396m8203K0500m201M779r753
1424h1682K553K3707R2162K5302m6817l8191k4373M3510q583m5808K5266J4316
1412a8638k1467M0296r7805K7662j673j2238L481l338j5763M1974N2288l8441
1400d3662l3129J2967p819O572l557N1339K2421K2206n3437R336M3146n6406R122
1387b0901k075o1144m172O8076m3229k3531J3993M3496k9640O6964r472r29l3618
$$ y = [17515, 43691, 118701, 44151, -56556, -74861, -33380, 56570, 43557, -59612, -77851, -97414, -61493, 19135, 24154, 21683, 29792, 2248, -62638, 10439, -42834, -40747, 5241, 43668, -35832, -44714, 9409, -64548, -30319, -77261, -60110, -27534, -73184, -9217, 16720, -16999, -37844, -10613, 20695, 59659, 49928, 49325, -17100, -33408, -44804, -93007, -72507, -76708, -71929, -81682, -79129, -55422, 36740, 62042, 15225, -22966, -47339, -3829, -12412, -58220, -32954, -18638, -40105, 191, -97614, -69952, -71625, -83863, -80382, -83720, -99483, -57509, -5221, -43662, -76791, -63824, -71643, -65071, -68628, -17289, 5132, 27338, -26099, -16763, 26383, -30023, -20901, -22976, -84120, -88292, -20216, -63445, -86976, -72983, -29487, -59127, 7837, -1635, -2564, -36182]
1374c6182Q3345j4873k1192o2996P9782M335n5006m4403o5275J5238P8660K6240
1362a2327l9145k0942N3073R001L2030O4693o673k3151p35k0632p7752k2150m3604
1349a08314O0111K1612j9654k9780L8593L7109n9226J020J5755N5294k3754l1339
1337d2573L9164J0655J6347k4722m367j5055l7849Q818j0923J0990j0138k2997
1325h2650j4394j1766j9929L9324Q0493o746k0374L3240M4265M215l9013M7909
1313E4574k3296k7600J6089r5692n8401N389N574R2015J1112n5579J0463K6797
1301c8555j4151l5108P9457Q530M6896Q245p600n1325L4140J0685j2392j8169
1289A0653j6304K3728p2717o103k1136L596N0315K0283K896q6715K6030O8625
$$ y = [-36182, 47163, 32290, 11098, -51898, 27884, 32219, -22787, -67190, -132465, -117227, -38567, -12327, -51472, -72414, -19341, -10340, 21690, 86383, 79710, 56559, 55824, 35192, -42560, -64710, -108314, -48203, -26591, -46245, -76025, -37432, -323, -59549, -58529, -42774, 12520, -11234, -42573, -3409, 7246, 23593, -1129, -5496, -20551, -58400, -49582, -60505, -49515, -59653, -82650, -97044, -108810, -128739, -89415, -8922, -15668, -36042, -2802, 41463, 45678, 6665, 54574, 31278, 3678, 19767, -75925, -134326, -128937, -123363, -31348, -20236, -75815, -65352, -38555, -52706, -87814, -8357, 173, 47069, 55314, 47714, -3611, 30529, 41214, 28822, 10653, -5651, 18077, -54640, -60743, -81879, -78283, -27968, -7685, -4789, -91504, -65474, 3151]
1277C151J8188k0668l5968k7880L5848k6137m780N8579j0506K2785k0732p0015
1265g8135j5444J10746n3891j1455n2783j2804L4505J6714N9598J9001k1516K263
1253c201K00m8575Q5o7918m651J119k1070P3902O6766n3593J8759k0518P889Q003
1239d2803K2328L2753K8171q210q4393j1832K6001M4317L3357j7207n4382m8134
1227h0034J07089j4080k8809k3007n5453K4605K7366L9203m5765j0891M3939J01535
1215H5698J1333j17351m3990N9449L0146O3758n6590p1802k1163M3185o8827O5579
1203b0575l039j1448L6877n749k3207M1372K9960p5380O0227j1934M7671o8188
1191c413l3117O2227M6506o8879j4885n1516n0150N0686M8236Q010m7622R8764
$$ y = [3151, 21339, 671, -35297, -63177, -27329, -53466, -58246, 333, -10173, 12612, -8120, -78135, -93579, 17167, -36724, -48179, -100962, -113766, -79261, -62547, -2949, 16052, -5464, -3201, -3001, -51576, -51491, -119409, -124060, -122941, -144011, -70109, -3343, -56936, -38177, -58695, -50806, -42803, -20475, 12278, 40449, 32239, -52154, -63986, -37985, 6332, 39689, 22482, -31900, -80034, 27055, 12975, -15834, -38841, -94294, -69689, -42323, -3120, -48885, -59776, -15837, 85698, 97031, -20320, -64310, -4861, 25285, 89043, 32453, -39349, -60512, -17327, -86154, -20575, -23614, -35062, 1815, -3934, -27141, 14231, 44191, -31189, 29038, 17104, 64775, -3413, -36530, 25697, 72203, 3324, -11561, -63077, -113227, -62541, -14305, -6295, -53917, 44847]
1179D4847j6389J0178P4264J2216m4145n6388k5058J3397q7295l5306L4879n9
1167g4859O4411m8383j9915r298j2773M4558L450m8335N2488J2652m3396N4997
1155b4403N8996L0958R205r5295m658M2167o3831l3264M149j6032Q7071J5892
1143A0955m018o5498O7751N8312o9075l5334L7067l2274J5681J9611Q9392l2804
1131E9766k3490m0372o0822J3495m9116P95j8694O5609m3359k0373J06020O6227
1119E5686n7616o6158O62O7428q449L1170k099j0970K1110k7404p503k8920K7741
1106e322q624p101j01571L2592O5500L1679J871l1585k9560O1341K3348j10866
1094g8298O7020R5094k5268o3548K9685o1157J2135m0120N4961q26n8282l8833
$$ y = [44847, 28458, 38636, 112900, 125116, 80971, 24583, -475, 12922, -74373, -109679, -74800, -74859, -10448, -58831, -78746, -88044, -100817, -56259, -52809, -101144, -48656, -36004, -79400, -24403, 34593, 65551, 74756, -20539, -25197, 16970, -46861, -80125, -75976, -92008, -4937, 10955, 6937, -58561, 9190, 67502, -1573, -36907, 160, -32114, -16433, 3178, 92570, 59766, 36276, -4096, -64918, -51423, -100539, -99744, -118438, -52829, -96188, -116561, -10541, 55686, -1930, -68088, -67426, 2, -8447, 22723, 20624, 9654, 30764, 3360, -4143, -33063, -5322, -13946, -21047, -122618, -90026, -24526, 7153, 9024, -22561, -52121, 9220, 32568, -78298, -11278, 83816, 58548, -5000, 24685, -36472, -24337, -64457, -9496, -10322, -68604, -107437]
1082a07437N3030N7453M7708r004m1894k5327K8854N0559j6808L4295O135j2807
1070F4757q934o0680l1759N9743L341q2613j4284Q1316m4434n9758P0397O3916
1058D1008p1351m5937P3012P313K1777J6099J8812r138m6687l9610K5170P8939
1046F9407j8963q2298r7669P6546O3085K5981k498j10730J8415M8923J9030K6317
1034C5546J2259k277m1205j4751L0678j5633m611l6673l1773L9410j3247o5491
1022a07768J2669L5512L0372j9148L3931J443J6596n2530M9327p0952K518N4449
1010a3581J5672Q398k256p8828N0816M5395n0354q4605J2429P4164N6362n3731
998b0119l7212P5335J8478m1363M6419M213j2957l4424L3569K9242o9554P403
$$ y = [-107437, -54407, 3046, 50754, 41750, -144, -25471, 3383, 53942, 37134, 71429, 77564, 64757, 55823, -4857, -36616, 23127, 26468, -56145, -70429, 10887, -33547, -93305, -22908, 41008, -30343, -76280, -3268, 4045, 25822, 41921, 60733, 51595, 4908, -34702, -9532, 69407, 50444, -31854, -129523, -52977, 10108, 36089, 33591, -77139, -58724, -9801, 9229, 35546, 47805, 45528, 4323, -10428, 20250, 4617, 6, -36667, -68440, -29030, -42277, -107768, -95099, -59587, -29215, -48363, -14432, -12989, 3607, -48923, 404, -70548, -68030, -13581, 2091, 10489, 8233, -70595, -19779, 25616, -24738, -109343, -96914, -22750, 33612, -20119, -57331, 18004, 36482, -4881, 41538, 45751, 32794, -1630, 31939, 61181, -8373, -970]
986i70m5725n1922O8052L1356N2699P005p4253o340p7556L9783l312P467O073
973d7643J2502K3954l92j4083J8281K9305Q4002o5239l7737m9163K3690K5379
961B856J1975j5368l1733K0933M8370j9265L1981K9579o2290m3374J26312q7925
949A2051L8628M0212P7002q0955j20504l8098P7654J3281q676n9614p579P1494
937A4896O0808J3154k1265k8540J0703j2680R38l0516M9455l1340P55q04p4852
924d9288p7070L8005J16376o4628L9102O437n0576K6012J04580o7871J5099n1943
912a5765M3483k9067J6059j5091L4739k9598l1330p69j2210J5525l4574Q4170
900B5572j3704n0633j9297Q4445k3612j5738M6171j0231p6300J08873j5960l8318
$$ y = [-970, -46695, -98617, -30565, 791, 53490, 60495, -13758, -20098, -97654, -57871, -61183, -53716, -47643, -35141, -11187, -11579, -25662, -7381, 21924, 105926, 40687, 2950, -46213, -22523, 2856, 14831, -537, -32270, -11337, 37033, 17768, 49749, 79328, 17038, -26336, 99976, 12051, 50679, 90891, 167893, 86938, -33566, -71664, 5990, 19271, 10595, -49019, -56598, 14896, 75704, 88858, 67593, 39053, 49756, 37076, 38014, 7498, 56953, 25613, 26368, 25564, -49288, -126358, -88353, 28023, -36605, 2497, 8934, -41642, -15630, 88950, 21079, 36178, -15765, 27718, -1349, 14710, -381, 34358, 4760, -26570, -27339, -39549, -24024, -58598, 25572, 11868, -38765, -58062, 26383, 2771, -12967, 33204, 22973, -53327, 55546, 39586, 1268]
888A268j5611j8387R772p27j3174m2986m0929J3519j260L2857R4637m9888K3493
875g416m6565N7485N3432M446R676j6026L8300j8645k4216j09886n8875N0915
863f7375l8531K7490l1018N9659K9k6016J3527K6375P6017k1821l0289P8089L0510
850I6646K636r1887L3175O567q9339r6933Q7576M2134m3635J4327L6456M6035
838D3758j3700l9303J4303P366o5053l8255R9512k6255l998K7537q4500L9871
826c8717K6164M1347k3402m4927P2131q3578K9606L2782o5375q424J27981r733
814E5855k5877o031N9754j08774L3466P8989l7763M8978n5690k3337Q548j6830
802A1288j264j8734J1096l7524J3814K7969K8783p670o4480p015L1864R0598n0897
$$ y = [1268, -14343, -32730, -22958, -23685, -36859, -79845, -120774, -107255, -108515, -75658, 18979, -30909, -7416, -53981, 3504, 56936, 61382, 71058, 55032, 93332, 74687, 50471, -59415, -118290, -67375, -105906, -78416, -109434, -49775, -49746, -75762, -62235, -35860, 40157, 18336, -11953, 66136, 96646, 99282, 7395, 40570, 47137, -42202, -139135, -51559, -9425, -53060, -38733, -2277, 43758, 30058, -9245, 5058, 12424, -52629, -90884, 8628, -17627, -21625, 5912, -78588, -38717, -12553, 28794, 5392, -39535, 32596, -50982, -21376, 11406, -53969, -62393, 65588, 55855, 29978, 23947, 83701, -25073, 8393, 87382, 49619, 98597, 42907, 19570, 28118, 11288, 10024, -8710, 2386, -35138, -21324, 6645, 35428, 27758, -36722, -43737, -11873, 78725, 27828]
789B7828q0751J3193P7809j9391O130P938K8172q600o6269O171K4348k3459Q40
776f041m6613L5874Q3414m7720n6715M3297l9393M7979L4719J0331p830l0779
764B0523n9430j7711l6059K1199L779J468M3618L9114O504p7295l2601M1005M3623
751b263N1979k9279j9780J0842l0942m9163R6291k6268o5429K5844K8367l2992
739d2793k0726M5145n3837K2158R0245j5596j9056L8824l6634n3418J4253j1603
727d3038L3795m0607O3667n3431m1308R8811P9494k6952j19836J539O5222K8896
715D6252o1251j9000L6925J6373J2033j708N898o1314p2779R3691Q612l1977M5979
702A7734N535p9712M2549K3805N431k4449L1023J2440L8890m120j7185o8550k8125
$$ y = [27828, -52923, -39730, 38079, 18688, 24818, 32756, 60928, 52328, -13941, -7770, 16578, -6881, -6041, -52654, -16780, 66634, 18914, -37801, 5496, -33897, 14082, 48801, 59132, 51302, 20523, -38907, -56618, -92677, -71478, -67699, -66231, -22613, 16501, 23005, -54290, -86891, -45886, -2263, 49716, 20437, 657, 11499, -19443, -68606, 27685, 1417, -64012, -38168, -9801, -42793, -63519, -18374, -72211, -50053, 40192, 24596, 5540, 44364, 7730, -45688, -31435, -43038, -9243, -49850, 13817, -39614, -80922, 17889, 97383, 70431, -49405, -47866, 17356, 46252, -14999, -33999, 2926, 19299, 31332, 29624, 35522, -25792, -98571, -4880, 3732, -28245, 17734, 23269, -56443, -13894, 9911, 15342, -9107, 21916, 34356, 73246, 69126, 51941, -16609, -44734]
689d4734J02216K9815p1l5920p0925M9243O5924r4712j7845Q8503k9810j02955
677f1271K676j4486K2801K9371M2511k3094O5216N12l2077j8434K8368k2189l1477
664a1573L5184r018K0751j9225m893j1650O2336m4013k1206J03845n4141o5332
652a8935J5268K6644L0501l819o8043j6982J0429L0159J345L8425K3113q2207
640a4102k636N9800K592P01J8815l0619Q5397m8990k8462Q2964q1585j7620M5200
627G1455r0272R698J10011J0945j27341k9213P5732K4908j5845p2804M7044p022
615G296L9658l4580L2787j0785k7869J07220J66m8084p9533L8717J2795l4439
603C349l8678K5391k4109k1956k5907p617Q5761N2989n623k8478K372M600K4462
$$ y = [-44734, 57482, 87297, 87226, 51306, -19619, 29624, 95548, 836, -17009, 71494, 41684, -61271, -58595, -73081, -50280, -20909, 21602, -1492, 63724, 64236, 32159, 13725, 42093, 19904, -11573, 23611, 14593, 35344, 16119, 11226, -424, 61912, 17899, -3307, 100538, 46397, -18935, -3667, 22977, 53478, 49659, -18384, -35366, -24937, 5222, 6567, 44992, 68105, -14102, -16738, 43062, 45654, 46355, 65170, 34551, 119948, 70958, 42496, 125460, 43875, 26255, 71455, -18817, -9119, 100892, 111837, -15504, -44717, 31015, 55923, 40078, -32726, 14318, 7296, 46954, 12374, 45161, 34376, 6507, 113727, 113893, 65809, -13724, 24993, 37788, 3349, -35329, -9938, -34047, -56003, -81910, -89527, -3766, 49223, 43600, 15122, 17494, 22094, 46556]
590D6556j1449M3127L154q9983P044j2383L5605N2590j0728p5129j0855K5719
578C268K0920o9711K8073M5287J5422k9133L1998p910k8933P04O5648k5918Q795
565E8510K1490n2844k0163K4855J0689j5756Q279k0997l8155p004m567J8647O4016
552D7000J7994m7741L67N1682n9040k7805N6853r879m8003P501K7511j0112j6598
539a0270N6450k6919k9711J1181Q3200j376M2427p4386p7510R0321l1779m6124
527a4496m864K354q176J4734o324j1858J3876R642J8819k5524J05810j01699K6780
514A9074M094n5708K5624M8153M9001n4199k3338J0421O744l2433p761N4863M3394
501H7929P013j8117k3733M723J0246J9903o7022L8188m3321R422R4025p116j23588
$$ y = [46556, 35107, 78234, 81388, -8595, -1551, -13934, 21671, 74261, 63533, -11596, -22451, 3268, 24188, -45523, -17450, 27837, 43259, 14126, 46124, 38214, 9281, 9985, 75633, 49715, 58510, 80000, 27156, 6993, 31848, 42537, 26781, 35060, 14063, -24092, -31096, -35663, -17016, 47000, 64994, 17253, 17620, 69302, 10262, -17543, 39310, 29431, -18572, -11071, 16440, 6328, -10270, 46180, 19261, -10450, 731, 83931, 82555, 124982, 50596, -26914, 63407, 31628, -14496, -19360, -17006, -25182, -10448, -16772, -28630, -14754, -5112, 13707, -11817, 93993, -7706, 19074, 23168, -32540, -6916, 41237, 90238, 36039, 12701, 23122, 29866, -2567, -10328, 44535, 87929, 94942, 76825, 53092, 57815, 68061, 87964, 20942, 59130, 15809, 25231, 119256, 112140, -11448]
488a1448L4338r4641M4739N8782k9433j1180N7019j105m0958Q4873n0756p5032
476c4802J9954Q0202j7030L6920l9181k5188J4687L2812J9406n9404o9154Q022
464c2756M5935R233J2114M1342L101n1579m074J422L0891J479O713p991o0391
451d561R6870m5246J2702N8859k868J077p3245L682l5110Q492O9770l9052r0410
438c9040M5102Q4837L6466l3352j33913l7715J1062Q6663J00661j0745l9583q077
426F2366j936J5824r364J3281k2169l8071K4j1774M7780k1056m0171L3108l1785
413c943M0187J7362L8750m4285k5973J3029m345M824O8026j8021n5580K4512P034
400F1577m1318Q4752l4179n1385k6561l8394M8896O746O8084j9516j01253K6139
$$ y = [-11448, 22890, -71751, -27012, 31770, 2337, -8843, 48176, 47071, 6113, 90986, 40230, -34802, -14848, 65354, 48324, 85244, 46063, 20875, 35562, 68374, 87780, 28376, -40778, -32756, 13179, 22412, 34526, 75868, 78969, 27390, 23316, 24738, 55629, 57108, 63821, 55830, -4561, 92309, 47063, 59765, 118624, 115756, 116833, 43588, 47270, 12160, 20652, 90422, 51370, -39040, 6062, 90899, 127365, 94013, -39900, -77615, -66553, 20110, 120771, 110026, 70443, 62366, 60430, 76254, 66890, 80171, 58002, 19931, 19955, 8181, 55961, 34905, -5266, 27842, -3943, 36244, 53606, 92356, 48071, 22098, 35127, 30782, 35606, 103632, 85611, 30031, 54543, 61577, 20259, 105011, 70832, 19447, -7114, -45508, 3388, 10134, 78218, 58702, -42551, -16412]
388a6412R8033J6423k2196l8476P5499n9724r621O4496o6482j8861L5792K555
376F1026J0990j7616K9368m941k2848L5262m7255j177K1551k8892m2030Q0506
364G3944k4944j0307m8115n4855N0958K5397l3200Q312L9689N3655j01951K8137
352F720R4111J1452K8311j17419K5899K5577O3050n8830m7675M0292K7025k240
340I6273L326q0616M412j01741O7512P7613o4331J921J4243O9370K7135l8019
328G7098L3159j8097q0316n27O6804n1905Q1609m0108j27108K7033j0706R1525
316D8461n5500j9389J9578M199N2794k1169j1371N1235r1224N6884J09479m4982
304I8995k5001j08399l1941j8641N7598J06157q3602L5139J2604j7476N5951j8338
$$ y = [-16412, 81621, 98044, 75848, 37372, 112871, 53147, 43526, 108022, 41540, 22679, 58471, 61026, 72016, 54400, 83768, 78827, 55979, 91241, 43986, 42809, 64360, 35468, -6562, 73944, 49000, 38693, -9422, -64277, -13319, 12078, -21122, -12810, 26879, 80534, -21417, 6720, 100831, 112283, 140594, 23175, 49074, 74651, 137701, 78871, 31196, 71488, 98513, 96273, 99599, 18983, 23395, -78346, -10834, 66779, 2448, 4369, 18612, 87982, 115117, 77098, 110257, 92160, 11844, 11317, 78121, 26216, 107825, 67717, -59391, -32358, -43064, 48461, -7039, -26428, -6850, -2651, 50143, 28974, 17603, 68838, -22386, 34498, 143977, 98995, 73994, -34405, -66346, -84987, -27389, 78768, -4834, 30305, 42909, 25433, 81384, 63046]
292F3046n4623J9519J0430L288L2407K8906N7068j6773m2498N577J4691k4092
280I6946m7600m5717l4048j0865K7432O5321n3140j7408O454K8587M6235j0016
268E2181K2105l3453k2539K4962p052l1813k9210J4985k5972J1195O9578k4817
256B0150K341Q898l6163N7648J2087r0919J02657k7720K6471k4733k0520M0143
244G0340K1617m8832M9265k0297M4422j00150j6354P2468k5932q0773N1860K2359
232C9993q161J2602j7053O296N8571k988q9411N8587k4935K4130n2457j9291k0313
219c4430M5026J8225L1648l4274m9166J6871P8550l4405p6470J6999O6574p981
207C7167J8271K5091j7505l965O5788n0044p7321J3499K1182n9532N5965l6068
$$ y = [63046, 8423, 27942, 38372, 41660, 74067, 102973, 160041, 143268, 100770, 106347, 121038, 96946, 49346, 3629, -30419, -41284, -13852, 51469, -1671, -19079, -12625, 15962, 62197, 52181, 74286, 40833, 18294, 43256, 36204, 4391, -24819, -9834, -35806, -24611, 44967, 20150, 22491, 31389, -4774, 52874, 64961, -25958, 76699, 48979, 75450, 50717, 30197, 70340, 91957, 43125, 92390, 72093, 116515, 16365, 11, 72479, 46547, -34226, 17634, 39993, 31832, 44434, 27381, 33677, 92248, 89260, -151, 58436, 33501, 57631, 5174, -14117, -34430, 10596, 28821, 60469, 26195, -22971, -6100, 72450, 38045, -38425, -21426, 45148, 37167, 55438, 80529, 63024, 59059, 124847, 74803, -2518, 10981, 32163, -27369, 28596, -7472]
195g472N1725k9965N5975J1422m8212J00173n0479m3059k6252J2061N799K0754
183E2470K7104K6798m3199J2883l8069l0599m8976N783L1905k0508K8582J057
171E231J1817n3860M5758Q113M1058p1154m4745P7720N1773m9113k1258l600J3220
158A0960q426J426k4041J718l0613L9699L428K9546J7205k1933m4216o374j1972
145d3593J6385M5537K2134m6070k5853K497n1631P6033l8606K9865K57P497m8346
132e3894K3069L4143K9083j2785j2154Q3424m7615q5417K0735J2513K7920j9415
120c93n1435O9623l8342l8454l0758J3412Q3872J12p488p425j6546K2765l2750
107c3807j4641N5853o733K965k9706K5232m9544M1706j1516j0120K2879P37m4698
$$ y = [-7472, 44253, 14288, 70263, 81685, 33473, 133646, 83167, 40108, 13856, 25917, 31716, 52470, 79574, 106372, 63173, 76056, 37987, 7388, -41588, -35805, -3900, -24408, 4174, 5231, 17048, -36812, 8946, 17059, 58117, -13037, -57782, 19938, 71711, 22598, 1340, -2260, 10960, 2534, 3960, -20081, -18363, -48976, -9277, -5849, 23697, 40902, 18969, -25247, -31621, -43593, -27208, 18329, 40463, -5607, -31460, -28963, -80594, -4561, -43167, -13302, -13045, -5548, -53894, -30825, 3318, 32401, 19616, 7462, 90886, 43271, -42146, -21411, -8898, 19022, -393, -51828, 17795, -20547, -59001, -89759, -76347, 7525, 7637, 149, -7276, -23822, -1057, -33807, -48448, 7405, 672, 3637, -26069, -837, -50381, -8675, -20191, -30311, -7432, -6695, -51393]
94e1393j422N4661k5556J1244o406l6677J8099p201L4667K5102J9423l7322k3748
81b6529k8300k4997k932j6587k8480N3651J4270l8817N8502r975j3037P3205l9994
68c0020q662L6441P13p427n3150J1439n011n26j5103M2364k0243q1009p036K5020
54a12210j7446M5541K2107k8138K4318M889P510k5778K8106q291j9976p535L3598
41e3305K3942l3677l13L3980m2943J8393r8815L9637l1843M43M7504L7097l4157
28i4057m391K8400P75J7949j4027P383o747K0654m5424m1937M52k435j0303k6101
14a69809J8884K2366k1477j9065N6767J3130l6376K4935k2603j8316n678L7079
2a20163K8418N1823
$$ y = [-51393, -52815, 1846, -23710, -12466, -18872, -55549, -37450, -44651, -9984, 15118, 34541, -2781, -26529, -54829, -79826, -82758, -99345, -127825, -74174, -59904, -98721, -40219, -50194, -63231, 9974, -30020, -38682, -2241, -1528, -8955, -62105, -50666, -55677, -56203, -71306, -28942, -49185, -130194, -137230, -112210, -129656, -84115, -62008, -90146, -65828, -60939, -53429, -79207, -51101, -59392, -79368, -86903, -53305, -29363, -63040, -63353, -29373, -72316, -53923, -152738, -113101, -144944, -144501, -96997, -59900, -94057, -98448, -70048, -69273, -51324, -65351, -57968, -64715, -44061, -89485, -131422, -130970, -133405, -143708, -169809, -150925, -128559, -150036, -169101, -112334, -99204, -135580, -110645, -133248, -151564, -157242, -120163, -91745, -39922]
0c9922
$$ y = [-39922]
$$ Imaginary data points
##PAGE= N=2
##DATA TABLE= (X++(I..I)), XYDATA
16383b426152N2761J0819Q638M8967L6825K9046j4295M6354O7565K0983J2186
16372b106303K6400K9638K1388M852K4664K4999J8779N4933K3349K4215o544k5097
16360a884727O9773M7929M483J9163Q6022P7083m0376N277J4460L0711L5560L3694
16348a500948k918J2172N1591K8353m367L8895L6608L4401k0665q002N7979N2022
16336a224879N164n5589R8998K3523K3550L0046n6702K8570M0725M7334J6916
16325a022344M947J6844L9863P2704J6597q31M4138N0681Q793M0192R761l1333
16313g49988L7330O8950m879L5670k6121J6023P5097p39j4682l679L3824k7811
16301e61005K2844J7275O2315O4593J7775k2952L3716N8801O2208l7675M7505
$$ y = [-2426152, -2373391, -2362572, -2353934, -2304967, -2268142, -2239096, -2253391, -2207037, -2139472, -2118489, -2106303, -2079903, -2050265, -2028877, -2024025, -1999361, -1974362, -1955583, -1900650, -1877301, -1853086, -1859630, -1884727, -1814954, -1767025, -1762542, -1743379, -1657357, -1580274, -1620650, -1615373, -1600913, -1570202, -1534642, -1500948, -1503866, -1491694, -1440103, -1411750, -1416117, -1377222, -1340614, -1306213, -1326878, -1334880, -1276901, -1224879, -1219715, -1275304, -1176306, -1152783, -1129233, -1099187, -1155889, -1127319, -1086594, -1039260, -1022344, -1017397, -1000553, -960690, -887986, -871389, -872220, -828082, -777401, -768608, -728416, -718655, -749988, -712658, -643708, -648587, -612917, -639038, -623015, -547918, -548657, -563339, -567018, -533194, -561005, -538161, -520886, -458571, -393978, -376203, -399155, -365439, -306638, -244430, -282105, -234600]
16290b34600K198O4695N815k1663J7964k841L4353P171L3339K0027k9795K6970
16278g6367R9654R869m1489N7169O9336o3062N3319O4125L1879M923K5414k6887
16266B07883j5192O9301k0314L7707j8305J5966l4349O457J01866m8036j8423
16255B84561R5881N1385M3566J2363L8282p4835M7320k3936j0126K0210k74M6402
16243E30799M4528n3001J8667M8268L292O5254J9197J8935K3844j5012m1871P1498
16231G34398o3722M0562L2189M052J4544j8082Q7193K8880j0956k9207j0979O8370
16219H77242L2003m4458L2193O4332J833M1565N3277q1485l88l795l7058Q6322
16207A021583m4596j982P9733k7240M8599j5843k9640L8721l0931N3942P1352
$$ y = [-234600, -232402, -167707, -161892, -183555, -165591, -168432, -134079, -126908, -93569, -73542, -103337, -76367, 23287, 33156, -8333, 48836, 118172, 55110, 108429, 172554, 204433, 209356, 234770, 207883, 192691, 261992, 241678, 279385, 261080, 277046, 242697, 249154, 351020, 302984, 284561, 380442, 431827, 475393, 487756, 526038, 451203, 498523, 474587, 464461, 484671, 484397, 530799, 575327, 522326, 540993, 589261, 592553, 657807, 677004, 695939, 719783, 704771, 662900, 734398, 670676, 711238, 743427, 747479, 762023, 743941, 831134, 860014, 849058, 819851, 808872, 877242, 909245, 864787, 896980, 961312, 963145, 1004710, 1057987, 976502, 976114, 972319, 935261, 1021583, 976987, 975005, 1054738, 1027498, 1076097, 1060254, 1030614, 1069335, 1038404, 1092346, 1163698]
16196A163698p162q144J7838O3120p5967m1391N9717k4668L0354J9733j9692o3074
16184A114362M9741L3736p367k1039K9613K5354K1905N4407K6891q872m4236P5434
16172A349929l5155l6940L8144j4735L3555J8176j073m2581K3780K0651N5001
16161A408752k8470l748m27M741J0845l6548k8113N1970N8624N320k2950O054
16149A426050K0110M5859J9357r9740l8509K6023K3765j0932J02217l952m2717
16138A467531N2571j1994K6560k8665N8684P676M910J2994p0174n153j8672r0708
16126A405560Q4688N5456l9238Q3049l9205J068J583L7458m6839J9148O6668n8578
16114A570818O7311n040r969J7314N4133k2796k9907L7770J4474j15575L959q3464
$$ y = [1163698, 1156536, 1148392, 1166230, 1229350, 1153383, 1111992, 1171709, 1147041, 1177395, 1197128, 1177436, 1114362, 1164103, 1197839, 1190472, 1169433, 1199046, 1224400, 1246305, 1300712, 1327603, 1318731, 1274495, 1349929, 1314774, 1277834, 1315978, 1301243, 1334798, 1352974, 1351901, 1309320, 1333100, 1353751, 1408752, 1380282, 1376534, 1376107, 1380848, 1391693, 1355145, 1327032, 1379002, 1437626, 1442946, 1419996, 1426050, 1446160, 1492019, 1511376, 1411636, 1373127, 1399150, 1422915, 1411983, 1514200, 1510248, 1467531, 1520102, 1508108, 1534668, 1506003, 1564687, 1572363, 1577273, 1590267, 1520093, 1514940, 1496268, 1405560, 1490248, 1545704, 1506466, 1589515, 1550310, 1551378, 1552961, 1590419, 1543580, 1562728, 1629396, 1570818, 1638129, 1633089, 1623120, 1640434, 1694567, 1671771, 1641864, 1679634, 1694108, 1578533, 1582492, 1499028]
16102A499028K8391L7997j5383L3542M7683K5085k0594Q0062N530j11921R511
16091A618931L8985l1291L8695N647j00785M4113N3638M1868j1130j16023P6320
16080A658968j7466L6305M7964k2620n8373j7369K6055K1289J3979j8889L0667
16069A700510O3593o5137k233J9202o8189K0826O5148l9574l6411j0803N0092
16058A697024Q153K073M8349m1805q0732R1672N5760n8571L9130j1425k5565L9887
16046A763950j10257Q9452K9139m1812n028J2502p1842P4014k90k008p724k9394
16034A700702J8906k1213K6560J1682l0652R191k9333j6768J9012k4378k6642
16023A637067L3523M5258L8045l3624n0442m7635M6660J19169l1805L6702N3172
$$ y = [1499028, 1527419, 1565416, 1550033, 1583575, 1631258, 1656343, 1635749, 1715811, 1721341, 1609420, 1618931, 1657916, 1626625, 1665320, 1670967, 1570182, 1614295, 1667933, 1709801, 1698671, 1582648, 1658968, 1641502, 1677807, 1725771, 1703151, 1644778, 1627409, 1653464, 1674753, 1688732, 1669843, 1700510, 1764103, 1698966, 1696733, 1715935, 1647746, 1668572, 1733720, 1694146, 1657735, 1646932, 1697024, 1705177, 1707250, 1755599, 1713794, 1633062, 1724734, 1780494, 1721923, 1761053, 1749628, 1724063, 1763950, 1653693, 1743145, 1772284, 1730472, 1725444, 1737946, 1666104, 1740118, 1739828, 1737820, 1730096, 1700702, 1719608, 1698395, 1724955, 1736637, 1705985, 1715176, 1685843, 1669075, 1688087, 1663709, 1637067, 1670590, 1715848, 1753893, 1720269, 1669827, 1622192, 1668852, 1788021, 1756216, 1792918, 1846090]
16012A846090q7199k1399J3179J4235m8792K281k4388l008N0968m6914J5610J6645
16000A727308K1703m7945O8597l2927j7422P0666L7354j5121j02926q0226J01231
15989A730292k2548j6912J12565o3345k5481L3800p7699M2533O95N4081k9540
15978A738441K5793L9301n3722o2277P3110L3851m0200l487k387O760p044J0704
15966A758843j7668O722m9711l4N7753j9178K6447l2796K9131j9213l5223N5994
15954A761067k7277k2686L4812L3942j4920K6441K745n1499l5048k5254j7877
15943A664446Q5673M3680k4343n9431k7541N1651k0315K0595N8961p1202J0701
15932A732875N2401q4105j5851N4552M7559J3932j7576q8463o7666Q0890p148
$$ y = [1846090, 1758891, 1737492, 1750671, 1764906, 1716114, 1718395, 1694007, 1690999, 1741967, 1695053, 1710663, 1727308, 1749011, 1701066, 1769663, 1736736, 1719314, 1789980, 1827334, 1812213, 1709287, 1629061, 1730292, 1707744, 1690832, 1803397, 1740052, 1714571, 1748371, 1670672, 1713205, 1713900, 1767981, 1738441, 1764234, 1803535, 1749813, 1687536, 1760646, 1794497, 1754297, 1750810, 1748423, 1755183, 1748139, 1758843, 1741175, 1747897, 1698186, 1698152, 1755905, 1736727, 1763174, 1730378, 1759509, 1740296, 1705073, 1761067, 1733790, 1711104, 1745916, 1779858, 1764938, 1791379, 1794124, 1742625, 1707577, 1682323, 1664446, 1750119, 1793799, 1769456, 1710025, 1682484, 1734135, 1713820, 1734415, 1793376, 1722174, 1732875, 1785276, 1701171, 1685320, 1739872, 1787431, 1801363, 1783787, 1695324, 1627658, 1708548, 1701400]
15921A701400N89p602p4400O1896N6540J6537m5716J6358l216O5329n5250m664
15909A727801M9663q354l3512L075o466K8075N069k6302k7288k5546R6577l8157
15897A744635k8770O0577m602j46440M5908M1499L511N0633j6901Q967L056N793
15885A767866k1565j760m0492r257J11342L8357j9890K948k3019k2584L5144q397
15873A808693j334j4120L7447o1348J0304k7149k9833l9765K675M4442j9597o0465
15861A649950N0209K4941L2717M6716Q987J2493J159j83o6115j1026L407J969
15849A755224N5249q851j6310k709J7833o2503J9671k4314J106R6728M7808p8447
15837A800485m4158O165L1710M565m6655M1500o2603o51K280K7479m607K8330
$$ y = [1701400, 1701989, 1694387, 1619987, 1681883, 1738423, 1754960, 1709244, 1725602, 1722386, 1787715, 1732465, 1727801, 1777464, 1769110, 1735598, 1738673, 1732207, 1760282, 1765351, 1739049, 1711761, 1686215, 1782792, 1744635, 1715865, 1776442, 1771840, 1625400, 1671308, 1712807, 1716318, 1766951, 1750050, 1759017, 1762073, 1767866, 1746301, 1744541, 1704049, 1694792, 1806134, 1844491, 1824601, 1827549, 1804530, 1781946, 1817090, 1808693, 1807359, 1793239, 1830686, 1769338, 1779642, 1752493, 1722660, 1682895, 1685570, 1730012, 1710415, 1649950, 1700159, 1725100, 1757817, 1804533, 1813520, 1826013, 1827172, 1826989, 1760874, 1749848, 1753255, 1755224, 1810473, 1801622, 1785312, 1782603, 1800436, 1737933, 1757604, 1733290, 1734396, 1831124, 1878932, 1800485, 1756327, 1762492, 1794202, 1798767, 1752112, 1793612, 1731009, 1730358, 1732638, 1760117, 1755510, 1783840]
15825A783840R163K1184l4762K0383k8942o4629P6201K802n2528k1399K9254l9687
15813A700880J10360j9956o1439M8375N6846j9309o3833N6280j9582n161p2067
$$ y = [1783840, 1793003, 1814187, 1779425, 1799808, 1770866, 1706237, 1782438, 1785240, 1732712, 1711313, 1740567, 1700880, 1811240, 1791284, 1729845, 1778220, 1835066, 1815757, 1751924, 1808204, 1788622, 1783461, 1711394]
$$ [...]
##END NTUPLES=NMR SPECTRUM
##END=
