##TITLE=1H_CG-1208-x4
 CDCl3
 8 sc, 
 9.8.2024
##JCAMPDX= 6.0         $$ Bruker NMR JCAMP-DX V2.0
##DATA TYPE= NMR SPECTRUM
##DATA CLASS= NTUPLES
##ORIGIN= UXNMR, Bruker Analytische Messtechnik GmbH
##OWNER= root
$$ XWIN-NMR		Version 3.5
$$ Fri Aug  9 13:58:09 2024 Russian Standard Time (UT+4h)  she@DPX200
##.OBSERVE FREQUENCY= 200.1313
##.OBSERVE NUCLEUS= ^1H
##.ACQUISITION MODE= SIMULTANEOUS
##.ACQUISITION SCHEME= undefined
##.AVERAGES= 8
##.DIGITISER RES= 18
##SPECTROMETER/DATA SYSTEM= spect
##.PULSE SEQUENCE= zg30
##.SOLVENT NAME= Acetone
##.SHIFT REFERENCE= (INTERNAL, Acetone, 0, 20.871)
##AUDIT TRAIL= $$ (NUMBER, WHEN, WHO, WHERE, WHAT)
$$ ##TITLE= Audit trail, XWIN-NMR		Version 3.5
$$ ##JCAMPDX= 5.01
$$ ##ORIGIN= Bruker BioSpin GmbH
$$ ##OWNER= she
$$ F:/spectra/data/she/nmr/H-F/1/pdata/1/auditp.txt
$$ ##AUDIT TRAIL=  $$ (NUMBER, WHEN, WHO, WHERE, WHAT)
(   1,<2024-08-09 13:56:50.84 +0400>,<she>,<DPX200>,
      <created by zg, POWCHK disabled, PULCHK disabled
       configuration hash MD5:
       00 E9 B6 7A A2 85 ED C7 34 08 36 98 17 FE 4E 26
       data hash MD5: 16K
       9B 1C A6 9A F3 7B A9 D4 AB 5A 9A BA 62 49 24 0A>)
(   2,<2024-08-09 13:56:53.37 +0400>,<she>,<DPX200>,
      <Start of raw data processing
       efp BC_mod = 2 LB = 0.24 FT_mod = 6 PKNL = 1 PHC0 = -25795.17 PHC1 = 11.58749 SI = 16K 
       data hash MD5: 16K
       A1 18 60 87 72 75 31 F0 2C F5 B6 F8 25 DC 28 4C>)
(   3,<2024-08-09 13:57:14.89 +0400>,<she>,<DPX200>,
      <pk PHC0 = -198.3809 PHC1 = -3.4 
       data hash MD5: 16K
       17 0B A8 AD D2 26 21 1F 4D 84 5C 7B B6 2E FB 4E>)
(   4,<2024-08-09 13:57:18.50 +0400>,<she>,<DPX200>,
      <abs ABSG = 5 
       data hash MD5: 16K
       F0 6A 41 0F 4B 68 CD BF F2 2B 95 D6 8A CD 6B 55>)
$$ ##END=
$$ 
$$ hash MD5
$$ 7B 28 51 6F 1C 19 19 F7 A5 6F 28 F8 3F 75 32 F2
##$RELAX= 
##$RELAX= 
##$RELAX= 
##$RELAX= 
##$RELAX= 
##$RELAX= 
$$ Bruker specific parameters
$$ --------------------------
##$DU= <F:/spectra>
##$EXPNO= 1
##$NAME= <H-F>
##$PROCNO= 1
##$TYPE= <nmr>
##$USER= <she>
##$AMP= (0..31)
100 100 100 100 100 100 100 100 100 100 100 100 100 100 100 100 100 100 
100 100 100 100 100 100 100 100 100 100 100 100 100 100 
##$AQSEQ= 0
##$AQ_mod= 1
##$AUNM= <au_zg>
##$AUTOPOS= <>
##$BF1= 200.13
##$BF2= 200.13
##$BF3= 200.13
##$BF4= 200.13
##$BF5= 200.13
##$BF6= 200.13
##$BF7= 200.13
##$BF8= 200.13
##$BYTORDA= 1
##$CFDGTYP= 0
##$CFRGTYP= 5
##$CHEMSTR= <none>
##$CNST= (0..31)
1 1 145 1 1 1 1 1 1 1 1 1 1 1 1 1 1 1 1 1 1 1 1 1 1 1 1 1 1 1 1 1 
##$CPDPRG= <>
##$CPDPRG1= <>
##$CPDPRG2= <>
##$CPDPRG3= <>
##$CPDPRG4= <mlev>
##$CPDPRG5= <mlev>
##$CPDPRG6= <mlev>
##$CPDPRG7= <mlev>
##$CPDPRG8= <mlev>
##$CPDPRGB= <>
##$CPDPRGT= <>
##$D= (0..31)
0 1.2 0 0 0 0 0 0 0 0.06 0 0.03 0 0 0 0 0.0002 0 0 0 0 0 0 0 0 0 0 0 0 
0 0 0 
##$DATE= 1723197410
##$DBL= (0..7)
120 120 120 120 120 120 120 120 
##$DBP= (0..7)
150 150 150 150 150 150 150 150 
##$DBP07= 0
##$DBPNAM0= <>
##$DBPNAM1= <>
##$DBPNAM2= <>
##$DBPNAM3= <>
##$DBPNAM4= <>
$$ [...]
##$SUBNAM3= <"">
##$SUBNAM4= <"">
##$SUBNAM5= <"">
##$SUBNAM6= <"">
##$SUBNAM7= <"">
##$SUBNAM8= <"">
##$SUBNAM9= <"">
##$SW= 24.0689771365484
##$SWIBOX= (0..15)
0 0 2 0 0 0 0 0 0 0 0 0 0 0 0 0 
##$SW_h= 4816.95568400771
##$TD= 16384
##$TD0= 1
##$TE= 0
##$TE2= 300
##$TE3= 300
##$TEG= 300
##$TL= (0..7)
0 120 120 120 120 120 120 120 
##$TP= (0..7)
150 150 150 150 150 150 150 150 
##$TP07= 0
##$TPNAME0= <>
##$TPNAME1= <>
##$TPNAME2= <>
##$TPNAME3= <>
##$TPNAME4= <>
##$TPNAME5= <>
##$TPNAME6= <>
##$TPNAME7= <>
##$TPOAL= (0..7)
0.5 0.5 0.5 0.5 0.5 0.5 0.5 0.5 
##$TPOFFS= (0..7)
0 0 0 0 0 0 0 0 
##$TUNHIN= 0
##$TUNHOUT= 0
##$TUNXOUT= 0
##$USERA1= <user>
##$USERA2= <user>
##$USERA3= <user>
##$USERA4= <user>
##$USERA5= <user>
##$V9= 5
##$VALIST= <valist>
##$VCLIST= <CCCCCCCCCCCCCCC>
##$VD= 0
##$VDLIST= <DDDDDDDDDDDDDDD>
##$VPLIST= <PPPPPPPPPPPPPPP>
##$VTLIST= <TTTTTTTTTTTTTTT>
##$WBST= 1024
##$WBSW= 4
##$XGAIN= (0..3)
0 0 0 0 
##$XL= 0
##$YL= 0
##$YMAX_a= 155810
##$YMIN_a= -142514
##$ZGOPTNS= <>
##$ZL1= 120
##$ZL2= 120
##$ZL3= 120
##$ZL4= 120
##$ABSF1= 20.89601
##$ABSF2= -3.173182
##$ABSG= 5
##$ABSL= 3
##$ALPHA= 0
##$AQORDER= 0
##$ASSFAC= 0
##$ASSFACI= 0
##$ASSFACX= 0
##$ASSWID= 0
##$AUNMP= <proc_1d>
##$AZFE= 0.1
##$AZFW= 0.1
##$BCFW= 0
##$BC_mod= 2
##$BYTORDP= 0
##$COROFFS= 0
##$CY= -3
##$DATMOD= 1
##$DC= 0
##$DFILT= <>
##$DTYPP= 0
##$F1P= 0
##$F2P= 0
##$FCOR= 1
##$FTSIZE= 16384
##$FT_mod= 6
##$GAMMA= 0
##$GB= 0
##$INTBC= 1
##$INTSCL= 3.70164e-10
##$ISEN= 128
##$LB= 0.24
##$LEV0= 0
##$LPBIN= 0
##$MAXI= 10000
##$MC2= 0
##$MEAN= 0
##$ME_mod= 0
##$MI= 1.114404
##$NCOEF= 0
##$NC_proc= -8
##$NLEV= 6
##$NOISF1= 3.799351
##$NOISF2= 2.8
##$NSP= 0
##$NTH_PI= 0
##$NZP= 0
##$OFFSET= 20.87103
##$PC= 1
##$PHC0= -25993.55
##$PHC1= 8.18749
##$PH_mod= 1
##$PKNL= yes
##$PPARMOD= 0
##$PSCAL= 0
##$PSIGN= 0
##$REVERSE= no
##$SF= 200.129531568929
##$SI= 16384
##$SIGF1= 3
##$SIGF2= 2
##$SINO= 5.538805
##$SIOLD= 16384
##$SREGLST= <1H.CDCl3>
##$SSB= 0
##$STSI= 16384
##$STSR= 0
##$SW_p= 4816.95568400771
##$SYMM= 0
##$S_DEV= 0
##$TDeff= 16384
##$TDoff= 0
##$TI= <>
##$TILT= no
##$TM1= 0
##$TM2= 0
##$TOPLEV= 0
##$USERP1= <user>
##$USERP2= <user>
##$USERP3= <user>
##$USERP4= <user>
##$USERP5= <user>
##$WDW= 1
##$XDIM= 16384
##$YMAX_p= 354933194
##$YMIN_p= -1589031
$$ End of Bruker specific parameters
$$ ---------------------------------
##NTUPLES= NMR SPECTRUM
##VAR_NAME=  FREQUENCY,     SPECTRUM/REAL,   SPECTRUM/IMAG
##SYMBOL=    X,             R,               I
##VAR_TYPE=  INDEPENDENT,   DEPENDENT,       DEPENDENT
##VAR_FORM=  AFFN,          ASDF,            ASDF
##VAR_DIM=   16384,         16384,           16384
##UNITS=     HZ,            ARBITRARY UNITS, ARBITRARY UNITS
##FACTOR=    0.29402158847633, 1,            1
##FIRST=     4176.90961886468, 0,            0
##LAST=      -640.046065143027, 0,           0
##MIN=       -640.046065143027, -1589031,    0
##MAX=       4176.90961886468, 354933194,    0
$$ Real data points
##PAGE= N=1
##DATA TABLE= (X++(R..R)), XYDATA
$$ [...]
7707 3237939 3406126 3614534 3538064 3128212 2538874 2624745 2296932 2733248 2601724 2699075
7697 2699075 3173710 3354522 3341059 2595389 3349020 3244191 2925234 2565988 2945514 2838611
7687 2838611 3589234 3629715 3135162 3627060 3068815 3367052 3214796 2947988 3120853 2731086
7677 2731086 2973267 3036672 2735075 3129895 3678561 3763964 4103638 4096616 3934227 3946175
7667 3946175 4191851 4157207 3734842 4428378 3846009 4603046 4826262 5014616 5034415 4650525
7657 4650525 5301653 5873846 5990893 6684412 6343608 6607581 6646354 6101159 4877794 5365403
7647 5365403 5926379 5239445 4313359 3856689 3660498 3390454 3561291 4188725 4053292 3880169
7637 3880169 4438487 4481070 4810704 4480162 4597135 5626056 5484250 5790078 6465472 6322163
7627 6322163 6715531 6924455 5932311 5626107 5301406 5508898 5149092 4419431 4408727 3941135
7617 3941135 3095047 2824694 2727954 2030247 2580924 2717278 2778910 3113063 2744392 2440068
7607 2440068 2011886 2371108 1784913 1609161 2606930 2845841 3103761 3414486 3328485 2857519
7597 2857519 3035426 3481489 2907603 3135735 3161113 2070160 2792619 2280095 2495306 3084409
7587 3084409 2553389 2667933 2648785 2397547 2493990 1926840 2473151 1624624 1420579 2353250
7577 2353250 2200473 2886413 2761367 2499899 2651269 2021544 2128925 1956680 2235136 2643738
7567 2643738 3104805 2068648 1836802 2126740 2445260 2139342 2746641 2434359 2817608
7558 2817608 2681502 1847082 1603759 2038908 2462303 2193879 2194302 2389157 2624505 2318444
7548 2318444 1657920 1945253 2231121 2486863 2451036 2729959 2560847 2287518 2092222 2382335
7538 2382335 2598243 1950114 2383082 2284078 2848800 2464447 2323731 1686261 1965336 2068505
7528 2068505 2473640 2681168 1967978 1811376 2369945 2356753 2201944 2096757 2251344 2627639
7518 2627639 3218622 2783149 2233088 1810710 2405240 2405370 2490139 2942215 2338256 2978299
7508 2978299 2580412 2673905 2522501 2328285 2428481 2582078 2819124 3195983 2502529 2331477
7498 2331477 2873233 2684648 2867241 2504532 2195877 2677302 3166202 3177858 2747038 2789464
7488 2789464 3444877 3349765 3441404 2775952 2943099 3428246 3299512 3760537 4041135 3779089
7478 3779089 4008367 4056232 3901026 4149131 4394349 3888096 3521032 3721066 3686995 3152058
7468 3152058 3325346 3894000 3620125 3867157 3990317 4104983 4186966 4009449 4445995 5168643
7458 5168643 5154080 5480029 5222956 6079571 6520022 6552176 5985808 5782986 5879480 6233479
7448 6233479 5730773 5762621 6061149 5903044 6023217 5056334 4561936 5111245 5604915 4493878
7438 4493878 4717463 4236689 4170242 4398385 5396483 6032454 5325790 4808843 5126368 5741862
7428 5741862 5751041 5715686 5455208 5752492 6155581 6015836 5805627 5457816 5766483 6159688
7418 6159688 5639590 5907821 5792032 4485418 4511534 4273485 4289435 4328619 4835061 4620070
7408 4620070 3998358 3911329 3918402 3752090 3641632 2923501 3387756 4275689 4357381 3808957
7398 3808957 3496944 2770266 2555660 2944372 3644090 3507599 4442417 4703622 4442844 3292957
7388 3292957 3417211 4208900 4558645 4329466 4047539 3319551 3144769 3576651 4155454 4005797
7378 4005797 4160732 4585088 4162733 3581693 4105792 4330899 4392718 4845211 4476820 4707951
7368 4707951 4438856 4640894 3525997 3599889 4306226 4780245 4687987 5151135 4817803 4893351
7358 4893351 4578945 4515084 4241095 4378648 4772004 5041915 5162381 4430923 4467873 4896943
7348 4896943 5176635 5645401 5484617 6083649 6307666 5683525 5475095 6013906 5805442 5962776
7338 5962776 6892885 6666253 5839460 6009001 5718648 6018063 6683769 6486094 6356916 6159607
7328 6159607 6550612 6155374 6400378 6513737 6272085 6775701 6556426 6729635 6213232 6594315
7318 6594315 6950656 6944157 6907112 7739327 7657698 7470354 7838857 8452604 8604312 7774330
7308 7774330 7572311 7950490 7811799 8533984 8444547 8254358 8422191 8747851 8990891 9090792
7298 9090792 9450930 9353506 9524803 9586407 9650989 10080441 10424298 10115858 10962255 12050744
7288 12050744 12292841 13345945 13849183 13892747 14729761 15045802 15628069 15744684 15074675
7279 15074675 17007527 17972015 18413223 18279255 17997295 18212950 17743584 17296648 17243621
7270 17243621 17441712 16779446 16075923 16561517 17092790 16323717 16509987 16928679 16282872
7261 16282872 15629636 15967473 15888651 15059140 14976237 15115372 14631772 13445786 13168662 12740382
7251 12740382 12334390 12671221 11789972 11730456 12185721 11996950 11824380 11724132 12387896 12424729
7241 12424729 12720429 12649671 12595887 12309731 12038444 11792269 11587970 11994703 11636423 12411613
7231 12411613 12627267 12419035 12446883 11999523 12527765 12453473 11901898 11639207 11249534 11043469
7221 11043469 12161415 12572388 12252976 12431295 11459619 12714411 12620766 12460828 11947689
7212 11947689 11818952 11813399 12472086 13003884 13239280 12759269 13892802 14086731 14506962 13733036
7202 13733036 13906679 13876565 14403977 15193645 14682026 15192373 15403494 15402872 15377699 15051638
7192 15051638 15336377 16299017 15764454 15679055 16360299 16227838 16533392 16832951 17267286 17919418
7182 17919418 17550529 17376023 17433776 18476139 18612888 19140383 18971523 19872494 19281348
7173 19281348 18994177 20167593 20951871 21411615 21665768 21887158 22407919 22755530 24097787
7164 24097787 24874511 25014885 25833158 26472297 27165644 28242721 29330305 30449718 31313113
7155 31313113 31858226 33322905 34551180 35585779 37676679 39536513 39684308 41582353
7147 41582353 43184298 44649619 45420086 47096622 49907924 53001430 56090084 60601188
7139 60601188 63503630 67801146 70626534 73793939 78999020 85529852 93316388 104687078
7131 104687078 114040009 125101448 137211948 152768588 169776331 192743852 190645964
7124 190645964 150473451 118356442 94885143 81009216 71537557 65296147 60809797
7117 60809797 58435191 56184380 53607194 50804611 47741696 44662114 42547354 41263996
7109 41263996 40111255 39276119 39122120 40079984 40326317 40648255 43463285 43753421 44356728
7100 44356728 44388790 42722047 40326964 38892989 36924466 35117617 33987689 33357180 32742314
7091 32742314 32449635 32815208 32849621 33570831 35262542 35590280 35364071 33354586 30044663
7082 30044663 27769630 25893835 24906867 23754025 22969844 23009202 22204012 21159511 21258506
7073 21258506 20571516 19239372 18879763 19144426 19305000 20471927 19547782 19488477 18856920
7064 18856920 18338947 17902903 16790621 16689117 16529511 16462863 16269094 16865566 16481553
7055 16481553 16124736 16309201 16421753 16570188 16466893 16280267 16622008 16591005 16460948 16796693
7045 16796693 16957345 16580817 16872283 17066935 17617706 18620112 19537241 19027500 19604989
7036 19604989 21086077 20693881 21301925 21450684 21585782 22680822 23663629 24105463 25375181
7027 25375181 26368094 27870057 30327838 31899061 32609446 33981309 34225552 32862271 30447503
7018 30447503 29955869 29851555 29528643 31081535 31522059 31206497 28906694 26554655 23281952
7009 23281952 21990266 20767940 19578447 19169162 18521961 18938139 18444531 17876789 18608440
7000 18608440 19286698 19146581 19926874 21109022 21908651 23148221 25782429 26592982 28264281
6991 28264281 30059279 30768590 30425676 29222718 27852396 26623210 25906179 26338634 26318593
6982 26318593 26386014 26062481 25114100 21711305 19511998 16628159 14221314 13699558 11996977
6973 11996977 11149641 10364350 9459036 9092765 9438719 9508943 9231533 9168941 8647064 8024273
6963 8024273 8921545 9045900 8578006 8523794 8756497 7323023 6666191 7884150 7353079
6954 7353079 7281789 7778380 7363056 7385551 7659132 7898012 7470071 7267841 7354897 7118313
6944 7118313 6987719 7040490 6866869 6350618 6749367 6925493 7033380 6564801 6496372 7232627
6934 7232627 6769134 7043231 7503852 6984580 7262295 6844955 7147883 8073277 7294469 7647285
6924 7647285 7481246 7279775 7263467 7199812 7827724 7777883 7651826 7952808 7765425 7302084
6914 7302084 7441374 7225696 7523871 6816039 7334736 7741359 8021634 8032145 8241818 9014428
6904 9014428 8327424 8828621 8768679 8850373 8361379 8503779 8525602 9024873 8908753 8735170
6894 8735170 10140946 9974578 10171816 9880425 10240335 10753346 10976339 10999768 11237117 11721909
6884 11721909 11941588 11488564 12078504 12390014 13361394 13339514 13388801 14597671 15550994 16663749
6874 16663749 17595084 18528112 19659530 21205264 20486477 19386315 19523833 19394200 18923317
6865 18923317 19150017 19336464 19689528 19566169 18903348 18226284 17440269 15816113 15075244
6856 15075244 15155321 15483249 15283098 15014978 15334089 16601377 17189814 17807325 18023924
6847 18023924 19469218 20250857 20914547 23951025 24930022 26690625 28359442 28051465 26981235
6838 26981235 25625464 24648014 24404593 23933924 24328057 24848588 23936308 23417913 21294071
6829 21294071 18383619 16882571 15714586 15043418 13812863 12665249 12298110 10852466
6821 10852466 11502811 11237323 10902258 10894758 11278135 11413566 11094438 12323754 13168090 12640356
6811 12640356 13885129 14465275 14104832 13658929 12167683 11599721 11216951 10670308 11124431
6802 11124431 11507234 12387995 10975586 8783075 8825554 7965807 6312265 5749617 5896088
6793 5896088 5042452 5430237 4737906 4334257 4114105 4190553 4159575 3289417 3399539 3327621
6783 3327621 3658011 2810181 2823368 3396954 2996265 2958214 3019852 3306912 3025737 3054144
6773 3054144 2126353 2381669 2321291 2324303 2777030 2332096 3105242 3472443 2682841 2051036
6763 2051036 1873177 2439439 2278096 1998931 1640085 1402721 1258614 1595687 1379726 423055
6753 423055 1321089 1336696 1291244 1622163 1323031 1605769 1762018 1541150 1609436 1467213
6743 1467213 766382 721938 1573855 1428082 1772313 1604028 810687 1144023 1465550 820468
6733 820468 1170635 646489 453322 1273330 1251699 1005379 546398 637020 847269 1239598
6723 1239598 727946 865160 1039544 744687 163302 55732 1046374 952462 756872 682555
6713 682555 552162 466380 -62581 192583 911820 1368852 1369326 739278 620157 372365
6703 372365 916207 1331704 612265 1527681 1314614 -144049 -462706 583462 859804
6694 859804 833412 520395 413138 553154 70219 21517 42760 -95861 -125859 352071
6684 352071 654538 1365667 960864 781491 236189 239533 23135 -205486 118106 664158
6674 664158 416183 217397 933332 1339124 257199 117005 1359668 561727 65040
6665 65040 -260760 94343 697326 995705 662574 176562 324103 203096 -593576 109302
6655 109302 -69599 56603 -191611 -608698 -315608 -103944 -187645 395793 299309 34566
6645 34566 9714 250253 494821 407742 115817 87422 575088 892531 625023 401323
6635 401323 992281 1282294 470970 505128 158720 461096 472485 68588 412802 -462907
6625 -462907 242740 -170266 -271763 183544 163634 71201 -24968 240847 447796 64304
6615 64304 766737 537767 -171817 792109 789638 1223401 845770 687238 383122 673451
6605 673451 424740 -538330 -590836 70362 29266 -352451 39589 412498 602191 806359
6595 806359 355103 864218 533870 39698 24404 71193 -50653 -204820 -88307 318446
6585 318446 641935 895887 647584 788512 544146 -75088 328082 521154 916371 1004324
6575 1004324 1008799 690462 622690 -84267 748018 878501 591103 579525 599867 -70452
6565 -70452 -440549 -34796 48277 -160445 -49466 -49125 1415543 1155875 586521 505842 83155
6554 83155 -98709 128787 -451660 -67172 423751 393991 550262 416730 661756 244465
6544 244465 194256 116121 136761 360040 -161845 399639 973460 692582 732063 766656 449423
6533 449423 468170 555111 1194596 832105 110903 740057 266051 569113 210475 -917116
6523 -917116 -442869 60962 97229 591050 382550 155953 -97631 179997 77771 -463476
6513 -463476 347492 981140 790330 150244 -354038 -545800 -705842 -659607 607368 175521
6503 175521 308423 -291911 243345 594167 495208 -404938 -846 412973 327888 99075
6493 99075 267036 378586 343513 164133 428285 714535 -23537 229647 975207 1186521
6483 1186521 864458 343153 -348900 229049 349860 -105992 282865 817578 -130366 129637
6473 129637 252120 871152 694401 230577 4398 512029 342642 -358645 -248517 -418633
6463 -418633 561280 568523 -39934 1050656 33651 49810 -682272 -496847 -533401 -589884
6453 -589884 -120259 152996 -664062 -334828 249787 -239061 -238349 296818 993646 152911
6443 152911 34711 -517696 -33202 -136502 135398 528638 -47252 -100024 629054 -356232
6433 -356232 -390247 521447 63812 91467 295214 569749 954071 560194 -248162 581391
6423 581391 615309 284289 -263440 -472874 -1356011 -882990 117632 78966 232584 837680
6413 837680 352595 -198448 -18020 920618 910104 -170910 -223890 249634 424978 1168668
6403 1168668 1117682 859171 399543 75610 188506 -35020 -658131 -246579 -531782 -723072
6393 -723072 104666 -240497 -163739 152714 491926 837144 860260 812902 211765 -282051
6383 -282051 502352 128637 -614364 -396161 -847393 -558731 -155177 -135158 487581 317146
6373 317146 567210 223185 -413940 -7719 -646566 -400282 -719399 -560260 -130937 -109465
6363 -109465 -561052 -376684 314708 365146 360397 -57605 -59555 349917 394133 224176 856071
6352 856071 125599 304919 -184399 340541 462306 18155 144073 196963 97318 -186984
6342 -186984 -269785 -945824 -361178 -543969 -238983 263430 538816 464908 114845 -143675
6332 -143675 230542 6182 184170 981424 918393 494664 -631616 491083 216710 411726
6322 411726 -176126 -375215 -12573 -596405 121671 614013 -520937 -659016 51671 305481
6312 305481 210436 43048 104252 395414 88919 -20419 104162 367024 171830 -391866
6302 -391866 7987 -577515 -681835 -416841 -457529 329897 2013 149663 -135994 126257
6292 126257 326180 480746 -9512 -148173 5199 -764220 -229245 472653 -214752 131202
6282 131202 318275 267393 -270174 -235559 29303 138184 -513274 -243823 9179 108466
6272 108466 669250 -127863 189577 568436 696177 628399 60735 151601 -177845 -537759
6262 -537759 -335073 -25130 361435 85646 187787 582515 889938 380527 27806 -103207
6252 -103207 817071 954007 553491 -74489 114983 1054297 1023794 958378 141314 -267159
6242 -267159 -202501 21210 390997 1137376 779670 -20592 577412 547558 558037 307689
6232 307689 213298 331769 321873 226022 454406 124781 -83569 -236798 -764045 -411801
6222 -411801 85238 425336 386173 218696 204526 -364159 304634 -15025 -142496 -108312
6212 -108312 -286795 -388598 135438 469556 -283707 49327 81769 -338683 -414010 -603421
6202 -603421 214933 684375 -255400 66532 151731 17842 -52340 -130094 -318458 -138860
6192 -138860 198275 -391119 -320165 -488159 -294267 -193732 -145996 310061 -157428 318966
6182 318966 27730 790829 337613 -578823 325176 11158 36433 77771 -112696 500753
6172 500753 1111750 383023 733322 484720 530778 -432757 236342 96118 -161814 592588
6162 592588 549394 106779 78397 137283 262860 134981 288895 164523 -41261 624747
6152 624747 106438 352453 -56084 -531111 -312490 293707 400454 386115 -413635 -442036
6142 -442036 -13767 -365930 -365190 -923456 446660 259996 772878 575316 76836 4616
6132 4616 425331 269954 -582809 44350 -381012 255943 652847 61797 -10440 -533217
6122 -533217 163210 345390 -317821 -442571 -53968 468806 121677 54216 37891 59319
6112 59319 -606038 72934 473611 -206193 151789 622901 835872 -1859 -434631 -323720
6102 -323720 -200178 214353 516048 853365 -336894 263444 14962 681267 179890 -371417
6092 -371417 -314853 -355133 78984 -7029 177241 -361369 389476 -504 -498438 -534592
6082 -534592 -1283194 -1222219 -100309 111421 390364 -40124 -717240 -931805 -113705 -272227
6072 -272227 -412320 233064 -539426 76566 142845 -110456 320326 136902 4202 -114785
6062 -114785 -169122 666408 -105973 400870 -313187 -312534 -649907 -681317 -394373 148779 234689
6051 234689 -30709 110904 621757 -221463 -235643 -34407 -482297 122949 389473 113152
6041 113152 216326 489251 240504 -94564 -341920 -232672 -931321 -591860 545938 354690
6031 354690 462524 196325 -111072 36410 265260 362867 98819 -352254 42213 388933
6021 388933 -209196 595700 81077 154950 1295865 936081 -379372 157613 -82744 94384
6011 94384 432577 509141 205312 489799 1051925 233593 -433522 -188707 347320 745392
6001 745392 56506 173948 196144 -49481 -499951 552421 123862 -362721 -265742 -29979
5991 -29979 -336035 -242429 -750595 -531349 104852 -629060 -106870 -729709 445801 27232
5981 27232 -275755 -735851 -391489 30374 731363 648962 165068 341145 564284 468472
5971 468472 149768 124089 417364 -605488 -790089 -246360 -60023 675361 -85591 -204707
5961 -204707 -209944 -408946 349931 -544871 -726121 216542 -314952 481899 519925 -213931
5951 -213931 784141 -191689 -455044 161840 -743454 -11259 -81197 468956 450796 177430
5941 177430 291809 23946 819881 466587 662973 1208204 689801 304169 -476116 -864978
5931 -864978 -120989 59281 -641049 -11867 344733 717948 195793 182650 328798 139670
5921 139670 583145 551115 144752 30402 -187286 -253371 -170619 -538753 -649896 -76963
5911 -76963 552748 306916 171038 297294 -232376 123739 5013 -218512 110088 500040
5901 500040 391454 610830 377865 -470663 32978 97361 84055 -219264 203988 580933
5891 580933 -126880 151113 146179 -23244 -355695 606601 307302 264752 -145021 -83428
5881 -83428 -378620 -198598 -65686 64372 313449 354301 151788 -792164 -560860 -287928
5871 -287928 118368 272800 165489 -406185 83951 64394 595714 1027183 1065571 824025
5861 824025 589266 2274 142272 606210 635862 -22271 -35113 42946 -23027 442255
5851 442255 -264717 -191286 -326237 -533655 -216690 628976 219167 109416 500670 43213
5841 43213 891206 451386 -164443 143816 573044 424731 875808 626006 255197 1350785
5831 1350785 524600 278961 235330 -432061 59211 -355955 370132 661699 410329 215456
5821 215456 83032 191435 -430815 -236385 -364363 -124045 342636 -214825 33622 190612
5811 190612 -34822 517628 442000 419939 464029 -189573 -197060 -14235 -369583 -172575 -102656
5800 -102656 260738 268032 424136 377207 -125815 305455 -626917 31738 579891 234707
5790 234707 -249692 129199 715424 92114 480715 119725 -451700 435520 134279 84982
5780 84982 724970 728418 774198 315073 -50001 291239 277413 1396652 731903 569034
5770 569034 1085900 992118 1270187 785234 440371 64482 268636 926210 696518 -95918
5760 -95918 -417357 809519 784675 1023686 266858 13524 398980 48420 289653 398579
5750 398579 301957 284322 783185 561209 417502 173747 357384 576370 998117 761521
5740 761521 378807 861367 576573 518170 1345803 833094 791709 1002398 926449 770876
5730 770876 850820 360658 265727 300550 -104915 138509 461751 558033 1193935 934293
5720 934293 635906 225884 461668 628916 993994 1197586 413517 1291093 1612139 1378423
5710 1378423 997808 593062 672376 1461266 1511135 927059 597343 401998 511952 216809
5700 216809 483193 864717 927418 1291694 688735 951777 895282 1934549 1650314 1254777
5690 1254777 134932 368284 650900 511431 999013 961163 115678 -497977 489629 738359
5680 738359 752947 588050 188027 147732 294361 1007587 1179822 452542 287945 242838
5670 242838 566071 525034 650437 625179 669899 238685 1636221 949977 509694 638376
5660 638376 1218044 1032063 863980 543315 1042489 417476 932803 846878 769231 230289
5650 230289 611214 729686 1216686 1048368 -84346 245857 668878 225507 316243 593818
5640 593818 1334715 568215 394640 -275712 -158867 429301 216889 654245 1104146 939406
5630 939406 686514 782553 107274 283221 677813 965056 582001 1368942 643266 1673087
5620 1673087 1366685 888558 962446 929452 1127284 155503 437040 739723 658871 1038911
5610 1038911 1131273 1581903 1267798 1216871 1019179 495619 632066 1164915 959612 946238
5600 946238 991520 976415 1255780 916745 888932 988360 921590 892984 862765 1611302 1535884
5589 1535884 671815 1308886 1259279 876096 1878971 1516104 1249605 804156 1130496 1522622
5579 1522622 1764770 994646 1532414 2080401 2411855 2394283 2143093 1942853 1809474 1622268
5569 1622268 1527742 1691572 1821954 1616874 2300007 2063801 1552099 2047918 2653414 2456047
5559 2456047 2298816 2143919 2527660 2559126 2471241 2269097 2212687 2405483 2669804 2203071
5549 2203071 2484583 1926673 2206111 2145201 1856735 2744728 2091207 2486734 1987484 1866526
5539 1866526 2448523 2811885 2589870 2196149 2761415 2747403 2921020 2964245 2657270 2899325
5529 2899325 2715683 2449965 2780248 2147419 1580159 1900644 2575112 2299597 1723735 1826738
5519 1826738 1909233 1589642 2217073 2746173 1649671 1473240 1767450 2609017 1831450 1735909
5509 1735909 1547961 2495092 2209692 2287073 1774089 1257641 1390830 1179957 684697 1110932
5499 1110932 1599782 1617203 1121447 1575345 1396786 1578453 1757335 2296367 1784627 1337883
5489 1337883 1548499 1434343 1963351 1556372 2653456 2059474 1746488 1408794 1359040 1834840
5479 1834840 1570605 2391177 2492050 1936148 2389104 2131516 1738246 1312138 1550557 1515401
5469 1515401 1855893 2197212 1455444 1497317 1769468 2435687 1246565 1563648 2254056 2069644
5459 2069644 3094499 1793258 1859154 2671742 2523332 2532827 2155014 1819724 2283642 2666625
5449 2666625 2649121 2020710 1552445 2040800 1882381 2314584 1880593 1978429 2000344 1410726
5439 1410726 1862492 2389120 2610091 2510395 2873829 3022496 2863636 2828002 2725745 3051425
5429 3051425 3123075 2295597 3109546 3507578 2595080 2377424 3088272 2321941 2365090 2631268
5419 2631268 3162614 3650851 3026048 2935088 3075604 3182359 3219951 3684457 3719051 3721416
5409 3721416 3401131 3412747 3738262 3840749 3880513 3896578 3524300 3575944 4141162 4186608
5399 4186608 4551633 4685574 4972272 4542839 4771646 4923883 4650977 4381869 4240568 4459645
5389 4459645 4493918 4516848 4212258 4246643 4216562 4536821 3760141 3734281 3896144 4331655
5379 4331655 3267194 2666250 2674404 3032220 3196066 3388057 3619767 3405973 3616347 3634025
5369 3634025 3727264 4320381 3999754 2926398 2698026 3019653 3724673 3537902 4123358 3256075
5359 3256075 2668598 2817269 3346494 2895778 3231383 3494371 3140257 2957045 3260358 4129761
5349 4129761 3520454 3027001 3493613 3982982 4008263 3567868 3502373 4159636 3864612 3073637
5339 3073637 3691774 4610449 3880728 3369747 3177529 3668542 3908072 4027232 4354800 3705938
5329 3705938 4291568 4796106 4411671 4588854 3943386 3907698 4028219 4606354 4295783 3942730
5319 3942730 4579662 4483421 4039979 3865351 3598226 4358693 4491357 4325428 4082190 4509584
5309 4509584 4516255 4769701 5886589 5216659 5308599 5171819 4390611 5627048 5400688 4919158
5299 4919158 5518760 5159588 5898626 5744390 5854530 6102183 6641502 6019127 6357322 6653762
5289 6653762 6829943 6849974 6987901 8049942 8344923 8093006 7948452 8479169 8817152 9570856
5279 9570856 8906746 8355402 8522092 8912837 9022965 9143714 9233064 9311626 9480723 9569305
5269 9569305 10020313 10524603 10051339 10847079 11969266 11834896 11846558 11380241 10522341 9907961
5259 9907961 9862930 9471876 9532597 8403078 8244675 7731519 7651499 7947843 8117156 7724654
5249 7724654 7778424 8334317 8470541 8565987 8562243 8184923 8239047 7623315 6816106 6946429
5239 6946429 5766968 5725929 5811546 5744020 5280454 5460031 5750457 5898405 5696550 5092523
5229 5092523 4652204 5005114 5276767 5152255 5201920 5171140 5160284 5750820 5416203 5343179
5219 5343179 5882293 4506991 4928250 4872868 5312638 5333381 4851702 4868316 4984007 5464404
5209 5464404 5316506 5078948 4975684 5677954 5826278 5816154 4801415 4395147 5267348 5659436
5199 5659436 5552668 6135365 6023860 6027749 5777919 5990651 5789655 5705221 5867538 5457651
5189 5457651 5912514 5471549 5569128 5941775 5590394 6030398 6959841 6872394 6678242 5440306
5179 5440306 5738384 6356649 6506872 5944487 5543796 6490291 6644735 6980656 6652853 7836602
5169 7836602 7729381 7524184 8166102 7721832 7225973 7306489 7772145 7836497 7920953 7545635
5159 7545635 8483638 9339482 8672513 8775350 8382404 8896711 9696374 9293642 9247158 8967614
5149 8967614 8887501 9986608 10462887 9904205 10221487 10471817 11283821 11479723 11686739 11254087
5139 11254087 11844865 11336589 10686497 11214706 11694356 12247194 12017977 11861070 11371680
5130 11371680 12027002 12425291 12718587 12338331 12706584 12452359 12844026 13325860 12982180
5121 12982180 13131851 13846348 13659950 13024776 13640573 14050396 13113995 13063505 14150260
5112 14150260 14694931 13886261 13033631 14010918 13518012 14037393 13337091 13060755 13124090 13588741
5102 13588741 13692047 13511229 13594491 14180312 14421151 14520243 14589439 14226992 14688829 15081898
5092 15081898 15026881 14572870 14383101 15510818 16958762 16157680 16333080 16973001 17280473
5083 17280473 17150352 17667019 18135959 18244240 19147442 19608193 21057000 21140395 20352613
5074 20352613 21746948 22351216 23278977 23854458 25135643 25578157 27451195 28687914 29949509
5065 29949509 30511563 32437352 34442473 35975259 37880964 39188131 41595383 43373596
5057 43373596 44874982 46798772 47505335 47521473 47400341 47356561 47073631 46764355 46667084 46840024
5047 46840024 47793210 48694030 51156918 53689696 54963867 57035516 60217567 62968103
5039 62968103 65202883 66436785 66505809 65639576 62493184 57631746 53102768 50175267 47748951
5030 47748951 45241390 42634611 41749164 40642546 40634659 40399642 40663935 41523306 41575913
5021 41575913 42283918 41481958 41048609 38244663 35467751 32427690 29971075 27645852 25389116
5012 25389116 22898489 21673713 20424605 19253999 18450821 17257550 16658848 16682111 15998328
5003 15998328 15189043 14905274 14966763 14078203 14254717 14189406 13827397 13703535 13705914 13602261
4993 13602261 13511849 13476145 13988958 12566366 12447202 12942740 12614354 12919193 12028443 11830437
4983 11830437 11939408 12226471 12051394 12648125 13224217 12593232 12201033 11528393 12370665
4974 12370665 12415505 12501384 12061305 12157243 12211973 11854259 10417211 10291559 11066618 11361949
4964 11361949 11508791 10930559 11067699 11361122 11612134 11441036 11495657 11407497 11977405 11326768
4954 11326768 11108317 10561614 9852118 10022263 9621982 9679647 10452748 9544348 9758595 8943587
4944 8943587 9117692 9831051 9725984 9750126 10181458 10053810 9950812 9484817 9944475 9932945
4934 9932945 9788333 9581416 9973341 9963460 9660354 9402245 9489205 9853744 9378447 9698327
4924 9698327 10215313 10403143 11308541 10786140 10902447 10807740 10685659 10089091 10905633 11449064
4914 11449064 10890373 10558233 10377450 11488890 11459304 11389157 11416596 11740243 11645374 12590723
4904 12590723 12890869 13752386 12991611 12562205 12180853 12653362 12920105 13035324 13581896
4895 13581896 14123956 14014694 13532933 14057910 14698879 15103670 14977466 15832736 16246048
4886 16246048 15957004 15211944 14444814 15715823 16167951 16982046 17278530 17153765 17417793
4877 17417793 17663198 17788037 18537573 19276086 18869549 18525588 18580623 18394933 18994546 19184568
4867 19184568 19741319 19972968 19633503 20440121 20629539 21678507 21919678 21509272 22063138
4858 22063138 22676964 22962429 23152998 23364036 23853455 24385013 25059211 24875168 25054809
4849 25054809 25658967 26467208 26561358 27712874 28292177 29045811 29373299 29711306 29760757 30072201
4839 30072201 30827322 30420023 30137059 30462609 31309751 31732531 31886818 32364102 32719483
4830 32719483 33220719 34539880 36088433 36532112 36936411 37426387 38495835 39468814 38816818
4821 38816818 38463549 38472539 38221200 39136043 39823534 40410365 41166104 42158363 43023779 44645983
4811 44645983 44871726 46062385 47527077 48710178 50368745 52144528 54949229 56974514
4803 56974514 57655601 58496619 60634518 62423625 63598299 64224474 65303461 65591070 65651852
4794 65651852 66650625 66079009 65956428 66557637 67875454 68988903 69325854 71762808 73472873
4785 73472873 75648624 78388061 81723517 84865457 87526115 89401015 90810412 91043999
4777 91043999 90175183 88758044 86465746 85280736 84141533 82072663 82159638 81973888 82229485
4768 82229485 83021230 85265290 86300427 88812359 91555898 93184440 94346386 94536780
4760 94536780 92569791 90631329 87943927 84554998 81944101 79081813 77423174 76949378
4752 76949378 75807469 75719392 77812161 78941510 80864625 82428394 85099534 84978440 83885324
4743 83885324 81258858 77104013 71111723 65533811 61127013 57202428 54582502 52235439
4735 52235439 49693787 47782710 46228178 45560455 44721031 45066660 45240632 44757631 44052380
4726 44052380 42723145 40804836 38664017 36074775 32568030 29578836 27325234 26213786
4718 26213786 23888618 22263418 20909819 20496683 19140281 17872809 17025755 16554011 15505033
4709 15505033 15345136 14572664 14415033 13650798 13544709 14062115 13286272 12536092 11599871
4700 11599871 11281629 12200361 12401600 11378531 11389646 11306326 10866803 10240140 9845667 10442956
4690 10442956 10270265 10038324 10303480 9581656 9296520 9479147 9535989 9480401 9437740 9249788
4680 9249788 9224586 8601222 8566926 8606401 8663699 8577187 8569731 8283372 7878133 8176014 8487873
4669 8487873 8449804 7861824 8129736 7949815 7482984 7235503 7405156 8155983 8263381 8405592
4659 8405592 8322687 7505294 7582907 7578466 7633112 7751625 8048469 7719501 7616385 7839644
4649 7839644 8078530 8381565 8388919 7965189 8033669 8709471 8672631 8657922 8195151 8484645
4639 8484645 8554402 8528153 7591088 8109825 8764730 8590254 8621453 8173918 8395585 8891354
4629 8891354 8879260 8460282 8797911 9359826 8976549 8919699 9509382 9487358 9823378 10200148
4619 10200148 9856068 8950545 9798739 9889511 9305024 9329417 8614384 9083677 9201080 9761205
4609 9761205 9702830 9770065 10049124 9247068 9498270 9879694 9844378 10047955 10380056 10681745
4599 10681745 9934088 10493205 11034832 10620926 9991653 10138732 10086074 10216470 9539696 9523493
4589 9523493 9323050 9509736 9879674 9612103 9376402 9563388 9410174 9387697 9414307 9443531
4579 9443531 8458501 7831408 8245848 7719421 8088403 8167351 7757508 7866971 8413716 8924644
4569 8924644 8223346 8009679 7468990 7577899 7742271 7404138 7870534 7790001 7699337 8443793
4559 8443793 8587647 8251398 7568754 7089890 7532473 7430371 7298193 7888234 8027263 7442925
4549 7442925 7361848 7372642 8433465 7663311 7730396 7920268 7371002 7555472 7437055 6846452
4539 6846452 6345596 6460053 6877416 6142241 7123337 7055546 6664158 7095177 6945339 7076625
4529 7076625 6808308 7182178 7071870 7156016 6252418 5964956 6003277 6068002 6542970 6059306
4519 6059306 6608458 6469163 5911406 5512557 5301548 5237283 5560091 5978703 5417148 5218117
4509 5218117 5488658 5901109 5651389 5469410 5195242 5598604 5684334 5982214 6629663 5923490
4499 5923490 6683245 6163578 5933285 5457516 6008532 5479354 5450922 4895197 4990036 4927777
4489 4927777 4472565 5542370 4339986 4098102 4469600 4927114 4927518 5109300 5323641 5469929
4479 5469929 5594325 4984666 4719564 4624607 4374056 4198381 4000794 4353365 4350509 5224262
4469 5224262 5169083 4708275 4374122 3729804 4712173 3795005 3488084 4006788 4654839 5156176
4459 5156176 4604498 4405225 4214124 4193214 5211857 5421860 5185284 5152207 4344910 4138757
4449 4138757 4453220 5155035 4721784 4446077 4611650 4370697 4262917 3909226 3756389 4037917
4439 4037917 4459246 3988472 3657213 4377323 5081210 5518360 5246349 5153049 5020185 4710418
4429 4710418 4391356 3928300 4154480 4170130 4649281 4836419 4677841 4981653 4694645 4599262
4419 4599262 4416502 4248455 4605460 4468287 4774746 4773956 5047717 4651475 4266252 5002797
4409 5002797 4733799 5088008 4895268 4624016 5245272 5363211 5182587 5201156 5023150 5250369
4399 5250369 4792291 5167859 4478491 5119702 5214824 4509338 5476253 5682623 5632344 5402495
4389 5402495 5020064 5161990 4673486 5255985 5327496 5868078 5419980 5212467 5616376 4531729
4379 4531729 5728559 5672931 5258930 4836745 4867023 5194887 4546554 4769785 5320783 5609122
4369 5609122 5343651 5881156 5979537 5365970 5557306 5200105 5641342 6295230 6138014 6062301
4359 6062301 5731081 5744743 5190301 6034699 5526378 4797654 5913900 5638302 5349923 5226611
4349 5226611 5666018 5433114 5419723 6065141 6410652 6535143 6028880 5961949 5823308 6053979
4339 6053979 7094725 6713662 6592540 6509350 6354906 5906080 5438873 5525133 6616731 6789970
4329 6789970 5827201 5464972 5807672 5816438 6000490 5915634 6272329 6979223 6451573 6623596
4319 6623596 6902595 6906459 6982307 6624124 7166941 7392835 7087096 6852594 6922054 7022368
4309 7022368 6616289 7622051 7103104 7114005 6946162 6236797 7133645 6975355 6523524 7056054
4299 7056054 7310612 7786776 6952448 7532753 8216800 8037872 7810849 7099981 7734554 8045356
4289 8045356 8300580 7844645 7998134 8452848 8229346 9085063 8774798 8442537 8226408 9127554
4279 9127554 9206138 8574636 9263586 8824281 9083872 8768065 8630326 8928444 9431420 10095774
4269 10095774 10065944 8946497 8734194 9499535 9895431 10259275 10571977 10350978 10141718
4260 10141718 10241877 10394650 10873358 11212511 10845640 10961355 11491179 11637914 11914389
4251 11914389 11658606 11206846 11377723 12065609 12280059 11517704 11870057 12142083 11665082
4242 11665082 11887971 12256846 12368536 12457411 13073517 13189882 13133550 12714705 13356787 14547198
4232 14547198 14047761 14090232 14058904 14364912 14403975 15067445 14206185 14581510 15644486 15296814
4222 15296814 14719522 15058855 15327319 15633256 15873994 16276016 16206515 16468666 17010282 16714752
4212 16714752 16932285 17143072 16685306 16362911 17470524 17513835 17131403 17122106 17547453 17832063
4202 17832063 17626581 17645332 17808349 18218370 18545673 18023941 17469859 17623491 18171684 18286619
4192 18286619 18864425 19072269 18945503 18545425 19804235 20154206 19750700 19878209 20074715
4183 20074715 20080278 20382305 20780989 20564880 20779332 21095717 21430746 20958152 22028781 22260714
4173 22260714 21657945 21968831 22116644 22670991 22456016 22662442 23860258 23744318 23464862
4164 23464862 24041779 23767278 24378755 24581007 25204497 25285842 25541491 25943064 26429397 27395645
4154 27395645 28079482 28316699 28559580 28922919 29162097 29509972 29976395 29505902 29816418
4145 29816418 30818953 32478283 32108381 32340354 33713178 34485913 35210680 34622963 35538483
4136 35538483 36483991 36858680 38042751 38908817 39861813 40379151 41407394 42455437 43807286
4127 43807286 44646110 46264461 47296519 48785709 50895937 51316936 52682862 54243264
4119 54243264 56426674 57608140 58335549 59165917 60715852 61389531 61985989 61908372 62151938
4110 62151938 63158510 63843215 64583073 64730887 65538848 67240995 66845963 68224730 69377779
4101 69377779 70344373 71798359 73394688 73042155 73449009 73167156 72522811 71414064 69859153
4092 69859153 68150211 67168020 65843165 64184298 62161843 61405749 60292757 60121028 58961778
4083 58961778 58103662 57914986 57427473 57675226 56577598 56049781 55545128 54881994 54249962
4074 54249962 53337285 52730330 51855269 50420567 50608380 49886209 50119516 49966564 49235170
4065 49235170 49414088 49626255 49128287 50553866 51655979 51927653 52888920 54007248 55299191
4056 55299191 56377035 57203934 58691488 60043390 60897196 61500183 62084456 61992853 62380837
4047 62380837 63183804 64622003 64271559 64527942 65364762 66271617 67109061 69268993 70972895
4038 70972895 72381029 73797905 75570308 75847147 77290154 77008595 76590742 76429119 74984216
4029 74984216 73740206 72726092 70507585 68264357 67046711 65418187 64807752 65043266
4021 65043266 65019353 64971333 65514438 66210719 66756780 67573239 68365104 69747706 71436060
4012 71436060 71380962 71866801 72048846 71143133 70531287 69865836 68580085 67618200 66345773
4003 66345773 65164704 63973787 62915619 62973835 62863025 63001922 63628916 63515032 64849670
3994 64849670 65686808 67399568 68903980 70546976 71695475 72306179 72849866 72387796 72029197
3985 72029197 70135553 68037551 66339630 63874390 62583562 59954177 57181744 55483010
3977 55483010 54138834 53072865 51865118 51203341 50383575 50134335 48681847 47974473 46472851
3968 46472851 45449088 43871470 42126332 40656240 39143066 37239142 34807262 33011495
3960 33011495 31465648 29980760 27712448 26136183 24812777 24436957 23561280 22963032 22449689
3951 22449689 21499049 20649785 19623570 18983388 18773008 18798052 18025782 16740897 16540399
3942 16540399 15521691 15654736 15182727 15059509 14575845 14584742 14445245 13998362 13858160 14026017
3932 14026017 14078497 13708956 13608196 13611344 13179692 12154015 12014530 11726206 10760528 11117279
3922 11117279 11505813 11363782 10207330 10333834 10844678 10676236 10649585 10233990 9680387
3913 9680387 8945714 9300679 9927603 9692939 9379676 8563014 8837407 8704130 8679210 9027610
3903 9027610 9088454 8975760 9347019 9061567 9027726 8265924 8771436 8020851 7986943 7944912
3893 7944912 7448522 7743500 7944831 7987208 8409457 9311401 9023049 9311737 8656067 8757694
3883 8757694 8431071 8931926 8151542 7661046 7063236 7515582 8051623 8444225 8125536 8126865
3873 8126865 8074622 8021828 7851738 8259946 8362291 8293166 7503790 8132977 8560441 8059818
3863 8059818 8124769 7817794 7978491 8170625 8163405 7376836 6847919 7346383 7280245 7815014
3853 7815014 7775979 7914371 7919905 7894669 7791784 8009794 8207942 7820304 7958343 7993316
3843 7993316 7379737 6411379 6668628 7528917 7738197 7705648 8555701 7904454 7641338 7496941
3833 7496941 8041562 7794250 8193216 7763374 8553169 8279415 8238811 8219100 7920498 8336168
3823 8336168 8327341 8949772 8321466 8219771 8024530 8702295 8951773 8674082 8167361 8253949
3813 8253949 7731824 8664233 8238964 8485946 8808426 9089800 9028727 8447641 8843609 8783148
3803 8783148 9463096 9356654 8389194 8709084 9146373 9749881 9601834 9104794 9620331 9409950
3793 9409950 9273371 9872356 10064565 10129738 9852031 9939902 10396829 9883509 9686002 11006320
3783 11006320 10435650 9795535 10065287 10166364 10138691 9955579 10419037 10922812 10128120 10692638
3773 10692638 11758599 11194836 11254080 11069492 11393462 11950010 12008865 11403971 11030205 11792325
3763 11792325 11666333 12216917 12110683 12386985 12893422 12604570 12966058 13183400 13487616
3754 13487616 13256816 12534645 12660692 13054723 13365301 14150169 14301922 13924774 13639825
3745 13639825 13506342 14476076 14484505 14853810 15175134 15059522 15564911 15127550 15523271 15651729
3735 15651729 15577715 15641170 15626318 15840660 15828260 15350241 16305565 16608907 17672133 17333969
3725 17333969 17671360 17346985 17482612 17985531 19019409 19555032 19019057 18364271 18858369
3716 18858369 19595352 18786037 18727953 20045039 19911206 20411902 21178462 21373798 20823218
3707 20823218 21872872 21988649 21996200 22401373 22579519 22910605 22982584 24001854 24259990 24719313
3697 24719313 24848953 24694934 24757751 25445156 25894608 25966743 26604988 27191865 27382391 27946383
3687 27946383 28253074 28660749 29160823 30587417 31602260 31162579 31836193 32963652 34363740
3678 34363740 34440695 34712287 36328513 37229938 38049440 38242710 39536610 39987770 41417021
3669 41417021 42239270 42243467 43445990 44344266 44368858 45253214 45346864 45583994 46213879 46937817
3659 46937817 47565837 47455536 48057156 48258589 48235569 48222894 47354338 46616207 46346016 45662444
3649 45662444 44937136 44368020 43956739 43830995 42706839 41771824 41307701 40215403 39628464
3640 39628464 38108732 37036653 35908724 34814557 33310005 32944806 32411275 32022410 31079494
3631 31079494 29981034 29179670 27868770 28192802 27164853 26533739 26161494 25881706 25749786
3622 25749786 25144081 23615135 23559183 23485603 23109104 23277874 22317922 21945926 22346763 21582768
3612 21582768 22001361 22540639 22032286 21044904 20906066 20731737 21589426 21501340 21140883 21362470
3602 21362470 20942964 21094422 21288518 21822192 21757431 21632241 22648193 22111483 21855516
3593 21855516 21875698 21862298 21295968 22157714 22698467 22089663 22839674 23332483 23570021 23509275
3583 23509275 23630488 23600845 24025023 23908809 23897332 24476810 24813953 24884805 25094816 25191867
3573 25191867 26415211 26022183 26164318 26397212 26823952 27715528 27811796 27731032 27277070 27630014
3563 27630014 28338407 28885748 28958661 29139181 29328779 30214803 31122926 31223889 31494771 32254553
3553 32254553 32816609 33284437 33882226 33947547 34729490 35441914 36490226 36804612 38194656
3544 38194656 38596797 39039632 40212760 40010100 40530787 42182453 43057268 42498382 43333529
3535 43333529 44336351 44976672 45736392 46539886 47222995 47887249 48525261 49595228 50716770
3526 50716770 51539861 52086326 52870270 53691556 54625422 55027951 56010854 57058204 58226615
3517 58226615 59324337 59985497 61620843 63082494 63891344 65134461 66781334 67391870 67927070
3508 67927070 69222025 70038151 69523970 70545313 71218320 71701841 72581365 73949741 74975291
3499 74975291 74848548 75286200 76185048 77595960 77920803 79157065 79807908 80463091 82689066
3490 82689066 83778482 85210490 87090901 87288744 87913639 89137376 90246191 90067714 90558381
3481 90558381 90465217 91224524 91155787 91012234 90446005 89238003 89464195 89947644 90768186 89955611
3471 89955611 89227954 89404568 89146001 88266244 88137487 87533903 86547261 86728866 86106034
3462 86106034 86016802 85871699 85221370 84814712 83376445 81527561 80221038 79782970 78302478
3453 78302478 76609555 74755235 73304931 71701210 70264314 69548967 69547085 67412669 66474346
3444 66474346 66376703 65851747 64901447 64626718 64197714 63603684 62385178 62234888 61347017
3435 61347017 60582840 60972692 59931616 58528715 57261210 55981992 54504706 54135873 53385715
3426 53385715 52331567 52060338 50847087 49608032 49373799 48617988 47725204 46976100 46039481
3417 46039481 46384547 45440176 44195216 43953553 43253540 42777248 41799340 41144062 41627935
3408 41627935 40645666 39838798 39933847 38979843 38625821 38191343 38095805 37573088 37516525 37050790
3398 37050790 37399364 37106874 36500080 36827890 36686105 36443905 36232280 35862974 35624870
3389 35624870 35651792 35438488 35328239 35545763 34969401 35163577 34726569 34636501 34587046 34425279
3379 34425279 35184769 34846138 34395701 33872376 34064195 34728636 34131541 34106019 33521406 33247317
3369 33247317 33518202 33882626 34011650 33448301 33103858 33042113 33442238 33073212 33239766 33180353
3359 33180353 33170255 33125200 33534181 34121898 33356879 33256007 34136119 33970363 33563545 33769782
3349 33769782 34111633 34826208 34787907 34180649 33675597 33853945 34361988 34587003 34910591 34626167
3339 34626167 35725367 36197444 36201486 36709981 36427435 36721037 36504780 36657088 37859977
3330 37859977 38878760 38627229 38712566 39288901 39730998 40606420 40949206 41565670 42207609
3321 42207609 43480149 43434342 43869423 45261625 45644661 46810337 47161153 48407543 49215193
3312 49215193 50402016 51182615 52955380 54121978 54710498 56015388 56290652 57639025 58506099
3303 58506099 59788515 60930165 61869140 62865088 63937288 65981727 67759121 69282337
3295 69282337 71511918 73343214 74506317 76576216 79299405 82123655 84918374 87030700
3287 87030700 88708947 90403706 91481390 91970013 91821517 91843618 90493409 89619172 88665672
3278 88665672 87348123 85598988 83312188 81425366 79146702 77136459 74070225 70583047
3270 70583047 67425877 63728636 60331768 57039781 53723251 51014021 49063561 46318636
3262 46318636 44077035 42491781 40891919 40047026 38853514 38195174 37252076 36023031 35956146
3253 35956146 36154198 35454914 35191470 34195611 33706062 34153490 34451703 33966423 33599922
3244 33599922 33952580 34375232 34303992 33529131 34490387 34620371 34301042 34742713 34501439 35106871
3234 35106871 35247444 35547148 34935414 35729604 35418095 35665379 36064702 35998460 36441252 36093130
3224 36093130 36036434 36336225 36809978 36729443 37065235 37706600 37069254 37730977 38124883 38483425
3214 38483425 39039252 38631875 39314098 39705426 40640623 41507379 41327812 41584491 41708128
3205 41708128 41659237 42679049 42962390 43930278 43941922 44816091 45171880 45411380 45872658 46456570
3195 46456570 47120962 47219940 47390519 48992370 49635344 49143842 49388867 49927219 50250382
3186 50250382 50621166 51981375 52232952 52775306 53141402 54178593 54368624 55532870 56754774
3177 56754774 57556936 58692797 59999780 61693445 62768551 63845591 65294536 67290202
3169 67290202 68448164 70503753 72757802 73482244 74406672 75443718 76298657 76148457 76375608
3160 76375608 75876137 76181233 76460541 76193637 75511645 74926256 75515924 75035807 75306649
3151 75306649 76435914 76816815 75970425 76139746 76565648 76998618 77484263 78141065 79864375
3142 79864375 81407690 82622844 83679029 85398313 87863303 89991885 93127687 95173351
3134 95173351 98235571 100877973 104126924 107808095 111926340 115637729 118427329 121061346
3126 121061346 123002504 124811493 125699375 125225140 123517665 121486360 118756813 116621808
3118 116621808 114174739 111649388 109224558 107598461 105725184 104871435 103887243 102688464
3110 102688464 102894138 102958185 103629488 103669799 105123263 107129480 108821001 110327682 112458613
3101 112458613 115512189 117510916 121613186 124137341 127491779 131362895 135058023 138670091
3093 138670091 141842746 145787060 148877155 151785865 153987721 155582809 157024704 158336617
3085 158336617 158932346 159531176 160512306 161204189 162976898 166575555 168746608 171587994 174823586
3076 174823586 178190686 181942645 185247143 188146941 190233992 191680363 192098524 192442739
3068 192442739 192033433 189911648 188586374 186744689 184317097 180962966 176983409 172869702
3060 172869702 168022699 162356285 156202807 149554446 143749035 137808013 130786533 124048758
3052 124048758 118101789 112733364 107727142 101687377 96691947 92603995 88236748 85057185
3044 85057185 81485728 77736862 74733499 72664996 69682040 67687300 65358294 63880340
3036 63880340 61566608 60594737 58955336 57937607 57387177 55358795 53508344 52616441 51930191
3027 51930191 51172030 51489717 49942759 47941275 47038870 47081693 46217451 45297775 43555656
3018 43555656 42812722 42985859 42082132 42219234 41339114 40333055 39388163 39415147 38463420
3009 38463420 38019065 37726972 36732655 36426999 36465271 36142290 35863850 36021807 36119149 36017805
2999 36017805 35710536 36120073 36515450 37097138 36693501 37232701 36712039 37213667 37258813 38490791
2989 38490791 39304079 38874732 39083371 39108808 39279138 40670950 41177568 41900689 42788893
2980 42788893 42961427 44228335 45612928 46807758 47511575 48241084 49682255 51006061 51996526
2971 51996526 53396559 54106932 55082301 55865244 57385697 57611194 58915132 62435472 64398953
2962 64398953 66680045 68905298 71441426 74519701 77500484 81076087 84975622 89222291
2954 89222291 93613419 97530523 101767341 105130494 106658494 108084881 108078632 106196849 102266258
2945 102266258 97443472 92784453 86416912 79571769 72693829 66599410 61663089 56116911
2937 56116911 52734051 49492373 46769263 43859720 40894824 39300540 37533816 35745336
2929 35745336 33512288 33045958 32156627 31275191 30811308 30027082 29478650 28925882 28216244
2920 28216244 28127439 27732258 26996892 26063071 25696768 25772241 25588394 25442024 24875405 24507046
2910 24507046 24677089 24596131 23876396 23643076 23702635 23813193 23569896 22724992 22655685 23150697
2900 23150697 22924794 22591007 22805398 22914357 22750503 22425354 22104457 21629885 21216219
2891 21216219 21703878 22340515 22122712 21903915 21844150 21974221 21883732 21805214 22299137 21788937
2881 21788937 22504355 22775413 23252004 23497761 23727067 23849659 23798422 23765345 24336041 24581605
2871 24581605 25071842 25613085 25196910 26196373 25780981 26472236 27066002 27067018 26984161 27422889
2861 27422889 27874503 27629188 28207058 28761296 28816531 29201438 30237748 29958524 30112393
2852 30112393 29946429 29690007 30155684 30363824 30928190 31433710 31630028 31440739 31270393
2843 31270393 32008672 31854473 32080100 33044810 33623513 33980803 34915566 34824216 35214157 36309196
2833 36309196 36375630 36645450 37154382 37712137 37017035 36870009 38290551 38633903 39202298
2824 39202298 39519207 40417310 41694248 41816871 42928578 42850653 44130874 45235323 46188210
2815 46188210 46418303 46926406 48350467 49767507 50661007 51081605 52833190 53035282 54703905
2806 54703905 56299649 56506276 58799456 60164839 61787932 63390931 65635937 68109113
2798 68109113 70132329 73018415 75999247 78193941 81131447 84880634 87964754 90836780
2790 90836780 94404067 97688344 100677157 104962022 107855859 112389152 117112386 121401067
2782 121401067 125192633 130111926 135893871 141886270 148313523 155543888 163266272 171708631
2774 171708631 178975977 187555142 195672080 204445978 214678118 226215179 240345808 255744384
2766 255744384 273012043 291671565 311003179 330695826 346930977 354933194 348934611
2759 348934611 326805894 296034595 262947050 233755289 208599671 189364355 173748070
2752 173748070 162230337 151346828 140658768 129927857 118772298 107925285 97792953
2745 97792953 90588549 83765903 79057482 74508739 69533624 65876030 61476386 57390636
2737 57390636 53773366 51183423 49719475 46029032 42970561 41038880 38488582 36284624
2729 36284624 33700734 30741375 28846872 27679846 26198445 24518095 23780917 21990857
2721 21990857 21306339 20753910 19785756 18897198 17802058 17974052 16909191 16269986 14783378
2712 14783378 14171421 13930447 14228800 13616609 13319315 12339448 11854882 11685042 10632725
2703 10632725 10362029 10328654 9435298 9202815 9243129 8879866 9018742 8566956 8396386 8556983
2693 8556983 8090175 7208715 6953705 6972300 6260245 6191575 5425365 6720601 6437512 6123940
2683 6123940 6286707 5208175 5976693 5593630 5110385 4992015 5578208 4974934 4678805
2674 4678805 4802453 5450638 5284494 4784233 4254121 4791674 5297433 4288070 3818969
2665 3818969 4223502 4013171 3658574 4305551 3539931 3786196 3341648 3301415 3982765 4235413
2655 4235413 3517733 3121986 3479168 3640139 3856735 3488465 3316672 2938678 2839333 2461507
2645 2461507 2815801 3252651 3432608 3278117 3208018 3281789 1929730 2628582 2293348 2339595
2635 2339595 2289387 2645362 3113059 2562376 2144342 1460360 2435053 1802035 1532272 1584035
2625 1584035 1706162 1857969 2296073 2493142 2393746 2179276 2404411 2890722 2660102 2332670
2615 2332670 3137638 2481448 2338966 1975468 2666181 2683676 2170715 2352176 2453642 2907765
2605 2907765 2062271 1605393 2761543 2203103 1869825 2409092 2337772 2430895 2311894 2109520
2595 2109520 1674298 1368082 1188123 1544681 2319624 2292933 2626075 2179999 1710319 1459134
2585 1459134 1789216 1391988 1550559 1662629 1617496 1575787 2045203 1461080 1633562 1807239
2575 1807239 1967369 2390088 2248895 1650323 2297670 2140240 1388192 1852513 2247063 2438695
2565 2438695 1747923 1883046 2195466 2737619 2187427 2064032 1559752 1689955 2073720 1720047
2555 1720047 2273525 2514186 2196081 2420931 2753177 3427925 3497735 2872442 2776157 2603698
2545 2603698 2812648 2883893 1601259 1159067 1110974 1168162 1297474 1573636 2021602 1600907
2535 1600907 1888392 2439058 2050253 1143156 906773 1736402 1392348 1120179 654289 1110213
2525 1110213 1286190 1511222 1333819 1343785 1187106 904837 1316377 1485468 1097957 1198288
2515 1198288 1855096 1213497 459590 1247425 1331493 1592709 1208034 1719652 1734193 656210
2505 656210 846193 961134 766086 728199 956876 1147365 1088905 1084707 1003549 1399731 951308
2494 951308 1277011 1613054 1242667 1183566 1383783 143184 107148 91705 796420 942352
2484 942352 1440263 1170008 1123326 1597713 1845768 1742714 1103765 1353298 854075 504582
2474 504582 673858 325244 145684 1062694 791529 845530 1100117 1564880 863726 330740
2464 330740 672228 1187753 1359055 1369733 952727 1301128 301461 429268 931518 1067960
2454 1067960 531614 99897 212980 418056 778484 1259140 860738 1033536 1150003 769001
2444 769001 261701 837470 1550962 1148573 1316976 565121 1780716 1026280 372072 304819
2434 304819 877217 401848 1473962 1043438 -344667 108318 736672 1339969 917206
2425 917206 924565 902839 788903 1130637 1264139 1417399 1446191 1119142 1228613 1115525
2415 1115525 1553100 1146717 762584 657477 1334635 2039902 1751667 941854 520093 997982
2405 997982 1607410 1198582 1045781 1224329 1127957 664298 936504 749408 1440645 912573
2395 912573 168868 998187 1399485 840794 1042561 1106180 1767070 1345115 1800031 1971307
2385 1971307 1599089 2222904 1630654 1651581 1361299 1786494 2158486 1685520 1397956 831280
2375 831280 1478627 1786422 1424033 1553229 1689168 1820467 1254352 1427748 1324703 1155968
2365 1155968 675459 1048747 1939712 1460563 1744567 1577687 1029829 1315141 788872 1436349
2355 1436349 1625451 1821356 1225884 722943 2128119 1537747 1458664 1480023 1316899 835011
2345 835011 1513945 1810167 1871741 1384873 1405126 1467111 1991754 1653510 1627964 1242921
2335 1242921 1165193 1124745 1539342 2054103 2324094 1956162 1902153 2099830 2088762 2027560
2325 2027560 1813631 1797303 1682647 2288646 2117728 1983888 2045646 2248227 2679585 2173672
2315 2173672 1088137 2181122 2580504 2436271 2257926 2557516 2180498 2158104 2400353
2306 2400353 2793179 3524346 2996909 2942180 3232481 3320728 2594336 3291327 3957831 2905903
2296 2905903 2913577 3068327 2924341 2575984 2415515 3278490 3421973 3220072 3012909 3130728
2286 3130728 2945517 3291357 4034668 3511344 3551502 4028228 4911099 3610686 3949808 3858844
2276 3858844 3908687 4094744 4203517 4576220 4486037 4639177 4852873 4563095 4667687 4286926
2266 4286926 3917758 4313125 4100469 4674000 5173200 4382258 4890525 4709397 4544146 4461890
2256 4461890 4728394 5503563 5489183 4769581 4659649 5244526 5425823 6438311 6712722 5905133
2246 5905133 5468750 5681544 5983003 6056717 6196135 6218019 6010767 6199489 6367236 6182253
2236 6182253 6324696 6842009 7058402 6788850 6719938 7506563 7771013 6728120 7145354 7685813
2226 7685813 8387239 8278770 8416450 8338464 8235255 9641513 9513244 9088157 9624862 9937550
2216 9937550 10299234 10530041 10829783 11640773 12221291 12290502 12594233 12518157 13671861 14179410
2206 14179410 15291651 15542825 16609772 16839771 17821058 18837912 19276801 19838651 20837417
2197 20837417 22437705 23324266 23752857 24751137 27036519 29899268 33120299 35671439 37434593
2188 37434593 38996096 40640862 43402045 47424037 52404282 58451116 66079075 74873495
2180 74873495 85590982 96813950 112357170 108229149 79707734 59450972 45185300
2173 45185300 35478433 28644390 23417088 19409424 18224333 17318516 15522548 13733750
2165 13733750 11814797 10259364 9569133 8483457 7480808 6044614 5707173 4842679 5077487
2156 5077487 4739677 4356026 4149575 3752079 3118692 4043681 2593544 2581814 2445687 2677311
2146 2677311 2327199 2609388 2244913 2022833 2966754 3129057 2198783 1639085 2225874 1973350
2136 1973350 1531665 1607138 1586823 1807128 2242554 1457935 1364421 1219609 1243596 891678
2126 891678 1177392 701750 47473 74050 824518 811331 159476 569250 208907 256838
2116 256838 531113 468454 -21897 296353 597488 251937 -89262 -183421 159169 76132
2106 76132 9164 22984 -1956 423185 246557 771546 579857 749229 751937 481058 670263
2095 670263 690126 758009 303539 505173 -12820 517845 443404 499675 559292 923343 342484
2084 342484 385650 649569 113520 -855682 173271 458620 796664 601974 929440 999360
2074 999360 1239719 292506 581149 739122 198411 -13688 -61745 -45283 423472 613134
2064 613134 477569 594187 -24447 322546 169905 -239913 -63328 -638354 -326059 -125062
2054 -125062 -182948 95965 -20106 69954 656612 559149 446805 619239 944432 603982
2044 603982 291299 101036 422822 1049514 674070 295210 718893 285061 330347 550391
2034 550391 792213 1002630 1264466 593004 -142956 673031 851418 -126427 161554 572470
2024 572470 249046 357745 266332 862820 694364 476770 90 -79891 169186 488484
2014 488484 -25170 -290598 -313362 105937 184693 -60029 668438 401127 8218 335267
2004 335267 -334283 -23367 -274581 -432659 -457914 -141160 -375780 2964 193064 384177
1994 384177 872935 906585 472081 655545 749917 1414240 1067626 607052 829926 -2706
1984 -2706 -231514 -250097 823742 1006969 815417 672094 90844 352717 138630 89238
1974 89238 48426 -50133 300818 164433 64572 154992 503721 139874 82359 213836 71489
1963 71489 461744 -385604 -345559 -148731 83309 731173 -104881 161197 74971 -642178
1953 -642178 -780085 -1190961 -731286 848822 -48333 -931811 -447594 -219693 -851043 -506624
1943 -506624 -172709 210042 75413 515011 632187 27481 -5412 -274506 -116331 -61188
1933 -61188 151866 -52220 168581 178439 -225743 42531 248449 -287505 102315 336508
1923 336508 -193967 488662 411771 76147 -319330 -758906 -18601 -139539 -209751 -90707
1913 -90707 -285075 115318 -29316 -455022 -23079 -31649 509550 -514901 -367555 281327
1903 281327 379424 1192451 803214 347481 73309 -289421 279803 -114137 222847 359895
1893 359895 287129 666626 447214 369353 670636 662025 -773769 128899 -43440 -410764
1883 -410764 -213734 -62487 585006 254602 -188099 110964 253377 119512 102062 -251267
1873 -251267 -789800 -1095536 -457793 -196875 -233294 262057 635705 123001 476402 62928
1863 62928 -243371 -479915 -136531 55423 -321745 -182493 243462 -138169 -211237 -641240
1853 -641240 -202601 -140982 -152968 -201519 -639294 -735425 -112632 985006 1087596 626096
1843 626096 -218354 855927 469105 273602 271449 197013 587178 921383 362257 -319380
1833 -319380 228306 428607 -401817 -62928 225730 -632988 -755173 -588058 -274850 -177831
1823 -177831 -260716 -708410 -1032275 -31850 -162804 -812310 -1101976 -439348 -227582 -541440
1813 -541440 -466280 48947 -430397 -747053 -1067580 -873168 -291699 125004 353166 641196
1803 641196 179235 -308029 558238 263191 519615 515695 375131 152512 768134 -77072
1793 -77072 304136 -212783 57954 -66833 -388288 -16602 135352 791885 314795 228391
1783 228391 157457 832565 149856 632893 629602 -310606 -783756 -78142 505111 113125
1773 113125 774250 95097 -120232 -252804 162135 -312537 -872801 178611 -44017 552493
1763 552493 511763 361757 -54787 64813 169853 -82363 902834 674044 -165241 133565
1753 133565 574805 148469 -206910 -898300 -820121 -374884 -152422 -171896 -63320 273316
1743 273316 -430088 -684929 -866902 -138353 43107 -128699 -689714 -61929 -557154 -401282
1733 -401282 -335315 429353 555895 192316 537031 802621 -85473 -114769 -81891 -663092
1723 -663092 -1044193 -884448 -130311 2502 -284187 -195251 194474 -266267 -262968 -145966
1713 -145966 -232273 6646 92078 -211579 -266435 550234 1038997 20389 -198903 -525373
1703 -525373 -15652 175667 -114096 -205089 293988 54085 58080 353493 5437 -223142
1693 -223142 -181350 -483110 -623222 -544715 -663542 -482588 159789 323249 74012 -110051
1683 -110051 625970 252062 -166061 -566984 -86498 190370 -685611 -356556 42346 218313
1673 218313 693700 180600 284175 -60890 270974 -32068 -252225 -265259 -280160 73365
1663 73365 22340 268113 229857 -376922 -684462 -193581 144341 367806 -75770 429445
1653 429445 263352 613783 420129 140351 179456 -104397 612064 -34709 -62678 -142012
1643 -142012 -97741 150067 185827 549447 202429 567970 491571 73591 -293200 62674
1633 62674 -527983 -1106363 -92014 -1007592 -481522 -609088 -747286 332339 509806 -53980
1623 -53980 -423485 -791763 -812534 -289470 -272943 -74138 -133453 50271 -269462 -299424 -733699
1612 -733699 13412 -63287 -300801 48709 -504607 -230825 -162433 -381762 -809646 -80645
1602 -80645 -198327 -42682 -36937 145632 326619 -696279 -559434 52973 -487241 -135477
1592 -135477 499236 212171 814303 592753 444315 445227 656505 339534 171525 222605
1582 222605 -235266 -659547 -10591 171205 -303376 240247 359683 -134604 205081 -404119
1572 -404119 410078 -129587 -155878 228073 403123 139694 -224817 -572921 -638564 -252145
1562 -252145 -190398 454040 504994 345820 -450239 -531219 -1247666 -228014 -634407 -429409
1552 -429409 323972 129016 -52081 211848 -167370 -488931 -73277 -77687 256540 238883
1542 238883 230521 -114972 -333014 62410 -43761 271923 162229 24480 -82571 346617
1532 346617 785666 196542 -53852 677936 794327 452900 109843 -110680 785522 132960
1522 132960 -96761 260939 51288 -968315 155459 43497 -64615 140049 -443919
1513 -443919 -424386 -273820 17947 -306877 -722922 -410051 -552977 -179020 375360 -87175
1503 -87175 -162022 -53294 97933 15909 -176634 -482306 -380040 -46205 -308301 -572142
1493 -572142 -279862 -421224 -354223 -236747 -73231 53397 -323778 -232927 -510713 -523061
1483 -523061 349751 40837 -233443 -370775 108128 52818 91223 683767 611021 -588731
1473 -588731 -429700 -320195 -450118 -53010 -290203 14105 -578130 -312712 -382332 81986
1463 81986 -108610 711129 507194 -40022 597837 502149 79083 -19181 -506237 -376453
1453 -376453 -233151 -8303 1107502 -247397 -36878 -39402 -107518 185511 102848 -109157
1443 -109157 -317134 -133967 55215 -507026 -1014178 -658925 -515942 228380 -453177 -150797
1433 -150797 -814749 -120268 769013 97191 227007 783807 772148 -165098 -731906 -761184
1423 -761184 -299105 -617386 -335584 -414221 -834779 -342844 378467 -430443 -42110 55710
1413 55710 -238924 -252304 11767 -574847 -212326 -124430 -19400 -792984 -1058363 -906628
1403 -906628 -773112 114399 -181273 -218950 548866 497038 -360170 -631872 -87336 514845
1393 514845 249301 24370 -235419 -48045 -136160 -96599 -559744 -470227 -194094 -130065
1383 -130065 533308 -118383 -135774 219415 -382197 -578496 -241837 27434 -645011 -594481
1373 -594481 -21683 -298509 -669805 -1221323 -339810 -634211 -780107 -521547 -345241 -564847
1363 -564847 -964748 -154483 -432123 -230988 252262 -336780 -878238 -603256 -715584 -719545
1353 -719545 -126941 -18946 46791 203960 -385396 421708 -40468 43281 328185 -665980
1343 -665980 -415760 94116 -71710 140126 863397 281126 -170454 -747688 -442585 -699792
1333 -699792 -598633 288297 137189 188757 252615 790078 190009 6115 159173 633612
1323 633612 531706 55962 139128 -456128 -159695 114647 164138 -243108 620758 1338170
1313 1338170 132146 241893 50721 -455744 -42651 -759688 -1025988 -1050672 -1126699 -58081
1303 -58081 228914 501289 -677952 -859533 -924712 -376959 -503361 -152425 445150 315232
1293 315232 487590 234907 -204429 -564614 266357 266212 -192205 -376704 -69956 -433608
1283 -433608 -309880 -239663 -453033 -54775 184814 682816 442193 319557 -188632 -3344
1273 -3344 604028 20195 269711 25597 -244848 186490 318712 763418 310387 -219522
1263 -219522 -971251 -772100 416932 199393 -100604 -217899 -345931 -405291 -494543 241448
1253 241448 802674 385748 48827 -839390 -487932 -186638 -275502 -192121 -454163 -441263
1243 -441263 -210619 -210982 230027 -44202 -368433 10553 -584761 -424475 -93841 26980
1233 26980 -47469 4505 451829 -41941 -522540 -720492 -747319 -890575 -113787 -363072
1223 -363072 -225973 153777 -78582 -60823 -478392 -45633 347920 -414543 -574346 -492238
1213 -492238 -325134 233485 218980 466319 186362 146107 610543 223370 -547202 122809
1203 122809 -270610 -106116 468103 -167242 -87973 -165805 38499 -714340 442140 -611614
1193 -611614 -163616 690710 402355 -224912 -381478 75692 -34061 -510769 -638230 675371
1183 675371 265003 -41042 -131523 -214668 -129986 498852 164165 -425769 -329512 165355
1173 165355 117970 -100648 -542895 -221118 -63488 -86319 69407 -62324 -234634 -241665
1163 -241665 -1028143 -1048983 -869432 58024 -342427 -153548 7310 53118 -271119 -241402
1153 -241402 759405 360553 346434 92010 -74476 -238866 -483512 -208149 -81338 89680
1143 89680 719944 83088 110087 -138108 -54776 -268599 -101169 -16537 175670 100459 352055
1132 352055 525661 -220495 -6082 684359 728437 201910 400655 -114922 -471551 134835
1122 134835 214272 -792115 -522044 -1110688 -478964 -2232 -551641 -86556 -164639 122313
1112 122313 -279449 -466393 -384998 -414007 140964 -430099 -60079 44343 -517846 94508
1102 94508 255982 -292428 -771536 428984 763151 456927 -222042 -599383 50938 168968
1092 168968 -155805 -735573 -252920 360013 328815 23607 -92755 -104150 387467 -870269
1082 -870269 -636076 -206679 70176 623849 156383 59336 48421 395602 -441235 -318183
1072 -318183 -243748 -574393 346151 465799 -203260 -224338 -49158 151811 107279 234381
1062 234381 -237683 98070 369219 418263 1109243 996583 379721 208604 -446847 -59325
1052 -59325 -49720 164953 513586 -82891 -410424 -255085 -341931 -814043 -534791 -195761
1042 -195761 130779 161772 -17495 -500698 -1118815 -455901 -260838 -591942 -424466 -222346
1032 -222346 54842 218504 -226245 -259641 499830 -32948 242087 726398 18769 -433100
1022 -433100 -433324 -205708 -447166 -152260 -211160 -144278 -172464 -221235 62626 -189532 108865
1011 108865 -49330 6683 149790 560608 447896 -60364 -87794 -185960 884131 352022
1001 352022 30980 833980 273922 -252065 -449834 -674214 -1262322 -624978 75387 211849
991 211849 -215397 282524 -36771 -120686 230968 -210659 -22934 -956842 -778873 1089
981 1089 194864 625566 -470133 -648742 -238601 -243486 -98869 -472494 -213201 251492
971 251492 128411 -289282 -208419 -622990 -5181 -525837 -353822 387901 743537 233762
961 233762 995808 618330 253588 192080 -151995 125870 -201516 -688723 -275235 -48935
951 -48935 -326134 390809 674140 792135 663743 413594 358379 768038 180201 -354781
941 -354781 152885 120498 -372198 -537802 -481939 -525258 -392859 18016 -195744 -200995 -403858
930 -403858 151402 -83318 115508 166776 84084 -98048 -59 67493 -5573 295296 450815
919 450815 -424541 308227 396009 -120132 -173508 153071 -16464 -68890 93667 667211
909 667211 195235 228993 1174629 766501 30233 92734 -404735 -1100524 -357607 182735
899 182735 -515217 -594573 -302648 255232 308832 487191 104708 -814804 -124107 -268681
889 -268681 412955 -177930 7403 778779 254864 426964 64822 218545 214817 -161114
879 -161114 -477154 -166574 -105464 191779 522337 9128 322931 344660 558062 261282
869 261282 183251 268120 523316 469826 813929 400006 441760 320822 -126171 -239530 448605
858 448605 728736 566830 324133 -125479 830941 637385 523849 -579118 -314739 591033
848 591033 525480 -349597 -1067875 -925462 -506692 -425016 -568018 162489 266127 205087
838 205087 -184877 222110 401438 120701 132384 134955 63455 1251495 747282 442076
828 442076 51431 -496188 -93788 343601 -197986 -204682 -471429 257716 -893011 -1005701
818 -1005701 -421685 -293271 -314625 -393818 -318870 -348353 -101616 545457 -134200 124286
808 124286 426796 185367 23864 -635537 -72663 -101245 190896 -593238 -309406 -497423
798 -497423 119494 859826 1116807 1214658 573935 -351037 -854294 2050 1129227 800100
788 800100 -265348 528103 1158398 412332 -88920 232029 163223 -343452 -491441 81543
778 81543 690763 362415 1023825 101148 380765 541256 39877 -553656 145997 -42187
768 -42187 -646144 -787316 294745 -413444 -420863 -159268 -244152 -38544 -300305 -271843 -1201503
757 -1201503 -344099 -202340 632419 222347 215163 527997 145998 220432 -102256 60075
747 60075 -390632 49071 -535042 447230 94871 -311949 -129044 524316 1289638 571421
737 571421 683789 341427 724707 665341 980959 499927 592703 722356 488503 763118
727 763118 540802 504411 -323463 44775 478254 -179257 -1059 -272912 -93128 -146750
717 -146750 258032 -235943 -186156 -122332 -93035 -764 239067 28606 -283301 -381335 357839
706 357839 -419694 -895998 -220175 -521911 -578131 -320144 545685 8591 -73234 -94996
696 -94996 375073 -111000 460861 1036865 720411 348492 -135829 -115676 -127116 144581
686 144581 667582 542014 210763 503327 745739 11382 -70150 -482989 -994241 -367103
676 -367103 -409872 -383756 72045 426432 86892 396788 664378 832843 -147804 301160
666 301160 591666 792684 697592 783158 1014053 12962 -288160 -187530 -491380 -413996
656 -413996 -141124 583612 153599 -990722 328221 196363 -308131 169162 130731 111839
646 111839 202442 606462 715010 130222 -59189 -56430 108332 305940 241012 827631 811178
635 811178 542046 216562 -296599 -722161 -559614 -44720 65974 -566975 168341 758990
625 758990 67057 -416420 -434634 -646619 274079 742580 -425714 722899 789988 1114519
615 1114519 1068573 32529 262962 721497 770333 858589 791095 602921 891508 457607
605 457607 -406101 -127556 312920 253755 280208 -479368 148260 -143081 -313150 -243519
595 -243519 144720 998972 402826 720673 509309 762519 1125972 1067475 426471 490861
585 490861 169010 450394 793760 494526 126350 107173 -225260 -134833 64632 290264
575 290264 457885 103774 -242190 -627106 -795195 -530425 -377240 -495452 58233 -335373
565 -335373 -913904 -241562 240045 349810 170462 -193314 -93826 -154742 -768922 -20572
555 -20572 165813 -290716 319792 588756 109278 -289259 275150 460254 662554 362581
545 362581 160921 68472 -3366 -43765 48641 297840 47976 -43739 -539327 -514061 -108782
534 -108782 149684 763950 276583 572155 1144387 413913 505536 1054344 138464 -98579
524 -98579 112648 627603 95196 196051 417963 -223119 62077 -193195 -114671 308512
514 308512 686958 180439 -746150 48460 391783 198954 -209347 -277701 -321030 121430
504 121430 433385 125191 -63128 -1136515 -489876 258968 645545 499567 558360 198543
494 198543 182865 172344 -531814 -371089 -339340 178709 -266607 -234679 -16737 -229888 -207058
483 -207058 -492351 -359803 -983349 -90043 -210158 -274728 545556 -449323 -323757 -188071
473 -188071 280602 -145387 -215100 187694 -240537 -196486 615105 148185 -320727 144936
463 144936 140495 461712 -28694 102064 178612 164953 153726 -323513 12185 201603 339517
452 339517 -248233 -42149 -187061 -28986 578021 -467803 -331015 -134470 278841 67079
442 67079 -448130 -243137 -249323 -415372 37656 191721 423313 81347 -644713 -489922
432 -489922 85020 -201201 50640 156372 -498227 -389036 -757470 37833 -304914 -429137
422 -429137 -451371 -589985 255750 172358 -470705 197806 550183 210940 271229 178807 287680
411 287680 369254 -2382 254648 526053 988163 228007 -543688 -340765 -98748 -411650
401 -411650 -1103251 -65272 651838 9608 422244 190611 388625 -154964 99715 -97688
391 -97688 -72010 -163677 208581 1073789 777750 130977 36007 -114825 -372325 281680 -179518
380 -179518 -25495 134512 449591 248003 -474906 -65980 609370 -5802 703517 807157
370 807157 655222 513323 355426 201349 671965 614111 563220 195097 982364 79428
360 79428 100698 593262 216568 -491304 34798 28356 -334178 190320 421699 131293 316357
349 316357 530418 -43474 43791 79869 -455456 56429 29693 502824 528091 218152 98802
338 98802 308344 209003 37611 543745 507201 935165 362005 490293 422347 -190189 -776191
327 -776191 -724787 -283363 -429114 -573193 440392 -228772 -250922 -328749 -206273 -157578
317 -157578 368111 693072 439802 241134 -563014 415713 480474 631553 -109188 -498826
307 -498826 12323 130014 -377840 -308676 643713 164181 -597491 -482600 -190018 -70881
297 -70881 236327 -117064 102407 -71269 -295178 374812 204609 159324 -3432 -137099
287 -137099 329953 495191 652480 731897 1268857 1205218 632711 54006 23028 -216708
277 -216708 298185 102367 436821 910101 939728 66273 -46174 211237 8394 -236630
267 -236630 847103 1394466 200991 327795 258767 792746 990893 292020 298731 -881277
257 -881277 -258548 698909 507298 -406142 -221666 -56213 14721 253126 -416103 -562770
247 -562770 373335 351902 189613 -171258 691852 527666 -309708 249660 311811 366539
237 366539 -62732 -165721 -4678 174663 -120228 -45672 -90836 -279178 -718192 -84172
227 -84172 -30482 404132 687546 660905 66552 169751 -640591 -359031 -206392 -258601 272817
216 272817 -133066 274235 59568 43967 358171 345385 400171 912288 74355 -258919
206 -258919 -268645 -448472 -334044 33724 326874 289470 147488 331036 94988 -1848 747533
195 747533 260265 -293422 -488159 95376 228635 -27818 3161 -230319 -121615 -152806
185 -152806 267446 705127 960007 858371 44539 176385 129481 526290 760404 390703
175 390703 -87990 -406126 -301249 373231 601189 301499 266568 -230890 -914818 -302708
165 -302708 -36605 88840 141602 220547 1073990 1101137 668438 -120155 470202 643471
155 643471 773425 -34802 117571 411505 241634 267394 18956 -540125 -347420 400161
145 400161 514711 310134 339495 -219222 -433972 -97348 114446 544203 -483733 86643
135 86643 71964 173496 181705 619200 375140 29409 540533 495365 -3940 172382 -408837
124 -408837 -658554 141228 222456 142804 442244 519536 729967 409631 722520 516457
114 516457 187886 172284 428925 152337 254344 655148 80785 65832 -239623 232866
104 232866 455481 -149554 -376594 -177564 408711 -233764 -251597 72647 142774 419425
94 419425 209463 -95654 557107 -46221 99041 267444 202276 202666 90547 -181821 -556059
83 -556059 -296474 -43622 312528 272309 147494 115510 57015 -77837 138826 -263008 -27709
72 -27709 -456508 -340671 -73518 65945 -186280 127470 15568 749227 226865 91541
62 91541 149778 -72327 352464 271643 254528 233475 484966 293082 -424790 533213 769245
51 769245 722138 663844 398948 323678 58359 56321 -345029 -379629 -394489 -344614 -72478
40 -72478 9298 -426611 95545 -20702 14368 316953 419010 113749 566563 682969 521697
29 521697 271277 464243 138107 72227 -19243 -77878 -239116 375448 741453 -98304 119794
18 119794 -215119 -307287 -317671 140438 -335007 -157887 -1330 406916 719244 867019
8 867019 228238 75469 473004 670482 -146790 212020 79998 -413287
0 -413287
$$ Imaginary data points
##PAGE= N=2
##DATA TABLE= (X++(I..I)), XYDATA
16383 -3428155 -2959183 -3136129 -3898015 -3460937 -3516540 -3341950 -3159095 -3137030 -3027065 -2854177
16373 -2854177 -2506284 -2622670 -2717748 -2767625 -2449070 -2818065 -2624258 -2490881 -2740426 -2996162
16363 -2996162 -2849092 -3081364 -2569433 -2446189 -2229304 -2595467 -2664976 -2852923 -2296115 -2373961
16353 -2373961 -2317849 -2481815 -2204744 -2123262 -2400383 -2317941 -1999767 -1876429 -1529774 -1486300
16343 -1486300 -1839140 -2298749 -2265205 -1868195 -1614305 -1928304 -2139866 -1877639 -1461380 -1837098
16333 -1837098 -1724741 -1809767 -1298182 -1258609 -1162642 -1447503 -1546422 -1035213 -1273385 -1454470
16323 -1454470 -1324963 -1325661 -1251786 -1155301 -769128 -470134 -630427 -618457 -768144 -846633 -614164
16312 -614164 -1162829 -1259067 -1007376 -1099179 -723468 -351839 -900842 -1177072 -710451 -733832
16302 -733832 -425029 -446297 -181033 50317 57740 242873 336847 231497 225039 -178478 -318140
16291 -318140 -367021 -87862 -467115 17467 -97254 -63861 407749 -48599 219046 -79419
16281 -79419 -291454 740177 -61699 233492 291827 63235 668971 689928 236253 487275
16271 487275 431334 308100 729013 41243 23268 635488 476507 183695 565157 1362308
16261 1362308 1389789 854898 962448 737490 997948 1470935 1273094 1221457 716831 1049134
16251 1049134 1327131 1274078 1769084 1446383 953724 1159874 1396087 759587 882047 773772
16241 773772 965512 1267269 647231 778616 577549 1006994 1348759 2279098 2070583 2263800
16231 2263800 1728890 1574138 1541435 1708774 2415633 1589607 1191045 1207734 1751366 1817304
16221 1817304 2352800 2323982 1838648 1451112 1625365 1878333 2069340 2787532 2338961 2207977
16211 2207977 2614896 2693186 2584808 2905905 3152049 2391394 2229890 2085450 1839733 2370298
16201 2370298 2140424 2216962 2736969 2213935 1859598 2316383 2112531 1873843 2224333 1826551
16191 1826551 2033178 2409397 2615118 2114068 1920077 1952248 1243676 3019910 2592173
16182 2592173 2328300 2406026 3324438 2799448 2474322 2679900 2781146 2530369 2502952 2762848
16172 2762848 2406984 2671931 2536931 1921966 2494448 2371969 1706730 2490301 1973235
16163 1973235 2524572 2611591 2373786 2415327 2500817 2684536 2702059 2900060 2945579 3124197
16153 3124197 3561773 3265939 3094624 2727115 2263892 2562783 2463081 2703037 3299248 2907109
16143 2907109 3027542 3316550 2445785 2487692 3443697 3154300 3459627 3413606 2757194 1977488
16133 1977488 2490348 2887025 3083064 2918888 2761665 3006419 2910194 3293711 2891563 2819098
16123 2819098 3314912 2609287 2759298 3229227 3430584 3260173 3121645 3069480 3639691 3601326
16113 3601326 3594521 3270980 3989381 3776977 3591503 3288399 3099895 2899733 3410920 2943835
16103 2943835 2775450 2811049 3379407 3341379 3494694 2712925 3263739 3258772 3382986 2995901
16093 2995901 3036120 3323041 3653490 3469412 2493458 2501785 2346295 2313115 2641408 2534819
16083 2534819 2316305 2933057 2638204 2875728 3022736 3209064 2596546 3138031 2489624
16074 2489624 2788267 2963879 3586231 4064104 3630165 2789534 3026357 3300569 3199441
16065 3199441 2958737 2995442 3019619 3664310 3164288 3600656 3565972 2857478 2873951 3337730
16055 3337730 3873772 4171473 3679187 3675822 3124897 2948401 3635654 4117460 4102210 3931881
16045 3931881 3435511 3519063 3036569 3268212 3557925 3297270 3596033 4125208 3945105 3736640
16035 3736640 4245457 3493159 3329863 3694396 2996712 2562784 3571421 3204653 3149207
16026 3149207 2977255 3626326 3223012 2855266 3375220 3747887 3390903 3236128 3365188
16017 3365188 3093784 2932861 2213676 2837037 3859511 2956592 3426828 3288745 2283756
16008 2283756 2782619 3898638 3884437 3559869 3480412 2901174 3327531 3292054 3375846 3850357
15998 3850357 4512041 4318777 3490492 3511074 3752163 2361919 2832289 3872992 3438786
15989 3438786 3199459 2548271 2703183 2618221 2999640 3377835 3346123 3528127 2939566 2835568
15979 2835568 2431169 3679084 3359977 2836601 2955688 3347226 3513148 3301869 3531991
15970 3531991 2981323 2985853 3288726 2990578 2706606 2646614 3654570 3196902 3244302 3675645
15960 3675645 3294852 3572394 4066417 3105171 3174673 3033781 2931659 3190948 3290752 3512184
15950 3512184 3287374 3727139 4154926 3635701 3483460 3394019 3579950 4228002 3299254 3199759
15940 3199759 3171806 3238740 3024585 2690843 3082444 3705366 3813357 4122103 4167101 3665081
15930 3665081 3270798 3126025 3476084 3855017 3307208 3566252 3773518 4145792 3594226
15921 3594226 3099913 3354680 4239252 3575739 3334365 3547628 3031544 3199734 2775698
15912 2775698 3229036 3481497 3314061 2951507 3197723 3179043 2921567 3412378 2976416 3349192
15902 3349192 3280782 2994790 3498910 3748406 4072547 3374622 2955161 3051123 3256011 3222215
15892 3222215 2991015 3276010 3261665 3989664 4556209 3835443 3453810 4949403 4297985
15883 4297985 3602014 3619885 3971192 3821377 3828891 3059179 3428108 3471794 3129750 3379903
15873 3379903 3608125 3959431 3806241 3742996 4311291 4016606 3927158 4109408 3401246 3263873
15863 3263873 3156561 3226814 4206855 3556607 3287298 3526616 3761389 3800116 4022095 3437442
15853 3437442 3482598 3253784 3559804 3761487 3810580 3213459 2895570 3567429 3240577 3654439
15843 3654439 3534587 2583944 3017251 3429537 2724558 2858770 2759595 3176690 3502506 3626450
15833 3626450 2988158 3710085 3574169 3782533 3154699 3550262 3421598 3796436 4011793
15824 4011793 3173256 3025991 3417568 3014741 2443139 2369347 2565059 2868455 3216440 3781325
15814 3781325 3714282 3233343 3395115 2771072 2674604 2841835 3282817 3596161 3944198 3723637
15804 3723637 3768629 3451857 2882857 3007660 3355915 3630722 3577334 3364871 2888283 3262600
15794 3262600 3564415 2705441 3158630 3186877 3220445 3865162 3965624 4147553 3152958 2525779
15784 2525779 3300486 3338029 3319868 3910344 3910606 3559962 2831433 3033692 3427561 3003256
15774 3003256 3364399 3337562 3634723 3585052 3722829 3773155 3355380 3374102 3822869 3994124
15764 3994124 4348965 4352543 3456790 3128545 3142993 2710054 3370356 3732057 1801757 2323300
15754 2323300 3227102 3286602 3271864 2744104 3182910 3094379 2720116 2772290 3033016 3895410
15744 3895410 3591031 3495385 3177283 3340580 3719769 3739613 3726028 3954698 3539817 3328527
15734 3328527 3237053 3670799 3410491 3601432 3768468 3308019 3067706 3847407 3643566 2848805
15724 2848805 4269609 3780460 3397250 4105425 3753314 3336921 3787016 4061742 4378419
15715 4378419 3649529 3951097 4167974 4022245 3451169 3522042 3925174 3618929 2634209 2233804
15705 2233804 2932764 2739243 3386903 3100934 2788735 3552592 3968505 3423993 3392291 2658264
15695 2658264 2420844 2289195 2922821 2920211 2972913 3017799 3562592 3409867 3305245 3323533
15685 3323533 3388428 3330282 3589250 3569228 4052069 3459369 3193983 3648243 3608497 3299308
15675 3299308 3328307 3265927 3024901 3462108 3982970 3700199 3066934 4040964 3504779 3426308
15665 3426308 3172467 3053921 3316572 3265007 2867541 3008272 3009555 3597168 3688364 3341083
15655 3341083 3498257 2931743 3306171 3362103 3119287 3433275 3360756 3327967 3163853 3581443
15645 3581443 3576635 3389784 3803761 3587509 3706926 4067410 3520863 3600240 3282342 2543853
15635 2543853 2360988 2822679 2263583 2452472 2771919 3423633 3870858 3526203 3667672
15626 3667672 3757304 3385257 3030168 2437402 3126182 3018810 2722537 3210593 3216544 2828174
15616 2828174 3009748 2940316 2493195 3136097 3150154 3363057 3419158 3747391 3605772 3487623
15606 3487623 2898273 2562273 3090883 3463155 3700094 3776193 2463368 2386305 2897937 3531570
15596 3531570 3281805 3481302 4108168 3775967 3942531 4146919 4027326 3966032 3620909 2715301
15586 2715301 2989510 3418787 3436847 3837903 4153498 2856033 2529595 2548102 2268670 2491425
15576 2491425 2746726 3051824 3919657 3597856 3585223 2715602 2656247 3088469 2997273 3189963
15566 3189963 3204457 3174050 3249017 4024916 3886361 3887525 3714042 3339945 3626665 4105643
15556 4105643 4075532 3564602 3152291 2955349 2854085 2683523 3158759 3986411 3683483 3422042
15546 3422042 3537228 3846196 3824501 4412017 3723380 3408321 4398578 3799933 3310192 3119996
15536 3119996 3799685 3947034 3994996 4045086 3922290 4096462 3327468 3850648 3473356 4054456
15526 4054456 3742307 2654168 3246457 4273816 3798076 3642360 3787307 3975143 4683859
15517 4683859 3996259 3552730 3300005 3972100 3790895 3331710 2584736 2516650 2773881 3086453
15507 3086453 4197438 3882765 3450128 3632267 3399939 3294459 2602242 2795128 3380166
15498 3380166 3754097 3331247 2979827 3147549 3390765 3323148 3304715 3508390 2964414 3189723
15488 3189723 3773941 4005891 4664269 5027771 3572614 3282179 3739637 3878041 4005686
15479 4005686 4016419 3451686 3429161 4063385 2948728 2960890 3537058 4028729 4265159 3902182
15469 3902182 4082041 4317172 3408272 3756134 3879971 3158470 3519055 3646992 3275609
15460 3275609 2973716 3829271 3895866 4262482 4012191 3630222 3628663 3109881 3241524 3683079
15450 3683079 3841640 3721625 3559046 3646404 3889251 3177950 3292221 3158177 3131346 3350485
15440 3350485 3587578 4265714 4033902 3966780 2669219 2592143 3386656 3607905 2609822 3263857
15430 3263857 4593971 3507957 3919910 3803936 3396985 3372890 3188427 3910567 3864472
15421 3864472 4262117 3534585 3130309 3136715 3768679 3942340 3476214 3633486 3893802 3431045
15411 3431045 3094023 3341546 3337142 3426464 4083181 3703959 3485013 3527368 3790271 3869068
15401 3869068 3838182 4413288 4677483 4239047 4458402 4925333 4208631 4498672 4058848 3898674
15391 3898674 3575613 3892407 3881523 3850915 3878538 3818320 3544047 3505160 2915666 3478505
15381 3478505 3207894 3093853 2898117 2958305 3598170 3605823 3783889 3919218 4140641 3178712
15371 3178712 2940330 3278677 3764867 4031397 4394308 3449878 3814989 3659271 3098189
15362 3098189 3827523 3278679 3047344 3730862 3302425 3110183 3725560 3598728 4230890
15353 4230890 3634767 3574434 3761622 3549824 3342028 3557690 3218527 3191694 4041008 3716549
15343 3716549 3850033 3903772 3845679 3659711 3805154 3865814 3985256 3790603 3697122 3730447
15333 3730447 3513563 3250107 3431970 3103924 2809476 2907649 2514312 3011542 4133062
15324 4133062 3436063 3439450 3655390 3090754 3529407 3421644 3718374 3530809 3270161 3018739
15314 3018739 4092443 4144418 4241837 4375347 4004203 3663563 3104682 2671890 3192387 3366357
15304 3366357 2886758 3603525 4658515 3800488 3565884 3498118 3470807 3278240 3345081 4108269
15294 4108269 4250510 3233978 3819364 3705588 3027270 3405819 3113283 3173583 2637840
15285 2637840 3715448 3400689 3423151 4421653 3811037 2964648 3418440 3770108 3582030
15276 3582030 2848840 3438864 3087703 2948410 3313616 3476606 3466123 4215699 3552342 3279075
15266 3279075 3389923 3090661 3163915 3713139 3645950 3853398 3115525 3550395 3946812 2868117
15256 2868117 3215125 3581634 3255410 3005207 3057388 3250890 3346883 3359343 3907397 4328307
15246 4328307 4065472 3585282 3408692 3883025 4056159 4261587 3699227 3535589 3420226
15237 3420226 3091048 4041749 3877544 3899828 3416958 3651750 3620919 3580866 3752720 3375375
15227 3375375 3064681 3361174 3827385 3728269 2835708 2840891 2884866 3497284 3711775 4149298
15217 4149298 3581353 2958053 3477413 3519739 3463299 3275030 3322955 3621038 3750841 3565334
15207 3565334 4347628 4394224 4445775 3487986 2572406 3595339 4045890 3673388 3355625 3666554
15197 3666554 3071710 3732816 3504738 3459904 4091963 3898735 3809783 3603544 3817736 4456974
15187 4456974 4137234 3904434 3535364 3087426 2817688 3114432 4256339 3753582 3394156
15178 3394156 4006677 4292610 3075785 3547291 3652703 2912105 4222291 3441301 3223147
15169 3223147 2899947 3730336 3631536 3673796 3851629 3740951 4519544 3685435 3096503 3060394
15159 3060394 3539172 3405109 4174997 4214835 3965932 3797141 3618755 3736367 3567068 3616229
15149 3616229 3891691 3276225 3014402 2289081 2176642 2504898 3300266 3325180 3825516 3671399
15139 3671399 3550180 3424181 3918263 4046979 3331663 3917101 4085304 4428039 3958535
15130 3958535 3877344 3736411 2815735 2985061 2951489 2455001 2955599 4352527 4786613 3824266
15120 3824266 3243731 3869155 3849355 3496411 3998716 3502327 3493357 3472730 3877999 3985449
15110 3985449 4036476 3499340 3214833 3399834 3212769 3931525 4129631 3298943 3316114 3825051
15100 3825051 3347547 3608526 3387723 3461286 3673114 3199727 3588389 3687731 3707506 4163360
15090 4163360 3382865 3381361 3544115 3086366 3560823 3129592 3602350 3388314 4320545 4768343
15080 4768343 3863266 4160634 4604277 4336144 3669255 4066566 3430823 4263648 3912013
15071 3912013 3716584 3338175 2822878 3519544 3959235 3567086 3403992 3896583 3716440
15062 3716440 3684828 3458245 3594251 3560734 3600257 3557456 3086405 3099183 3137800 3674476
15052 3674476 3332646 3031154 3727375 3286425 3358532 3863811 3187780 3183427 3566885 3174128
15042 3174128 3523764 3319731 3459281 3980080 3964809 3797492 3642979 3961968 3799266 4154559
15032 4154559 3259761 2903792 3637545 3548172 3622860 3198275 2994962 3711664 3350112 3834566
15022 3834566 4100807 3209751 3528401 4206678 3428067 3227183 3636008 3459064 3939132
15013 3939132 3061845 3449576 3421784 3989047 4323846 3724213 2971542 4081077 3815088
15004 3815088 3951440 3794208 3981032 3500432 3194633 3618185 3861007 4127318 3841819
14995 3841819 3915629 3604327 3893184 3456310 3018610 3609159 3892286 4284761 3666971 3724820
14985 3724820 3918691 3823804 3675006 4206938 4154341 3526044 4035783 3771400 3121588 3455560
14975 3455560 3811969 3206240 3581982 3615038 3672134 3917513 3788067 3865215 4202234 4623931
14965 4623931 3475046 3341389 3735808 3172381 3251440 3537829 3697886 3532631 3624317 3503277
14955 3503277 3598038 3779257 3936933 4075111 4327090 3772247 3560177 3414979 3636189 3897334
14945 3897334 3422549 3106044 3049309 3493359 4209769 3301588 3802689 3621519 3403642 2819608
14935 2819608 3818441 3597850 3696865 3563271 4121808 3430112 3801801 3741755 3280117 3748754
14925 3748754 3478283 3559242 3389105 3237197 3391770 3459780 3919407 3299651 3373362 3825691
14915 3825691 3609374 3751313 3747792 3179128 3376679 3565362 3649484 3770885 3229990 3082132
14905 3082132 3618879 4295835 4000147 4195715 4155139 3308476 3076438 3342072 4362278
14896 4362278 3917447 3486765 4210316 4043164 3940476 3629935 3583618 3226004 3815911 4244618
14886 4244618 4499495 3888672 3379823 3590508 3591928 3126667 3107860 2951591 3985131 3395633
14876 3395633 3872288 4494496 4277709 3738024 3296222 3432375 3812834 3715361 3244352 3385756
14866 3385756 4531541 4404658 3271662 3656019 4099561 3534958 3458374 3144862 3858205
14857 3858205 3330925 3098040 3475044 3062561 2769958 3066466 3430904 3596296 3982983
14848 3982983 4032025 3214508 3677834 4648807 4874374 4325692 3543470 3542395 3915492 3949452
14838 3949452 3778199 3959331 4010174 2947418 4008640 3549630 3790811 3678454 3633524
14829 3633524 3431434 3031718 3375458 3328766 2846604 3074750 2825060 3552164 4154078 4247597
14819 4247597 3816623 3717618 3267151 2834385 3511518 3375937 3938068 3964908 3107697 3052329
14809 3052329 3602711 4047094 3685429 3172655 4111829 3763792 4235780 2951889 3135497
14800 3135497 3281095 3219179 3110852 3163038 3315494 3099163 3489409 3990281 4345507 4382693
14790 4382693 3992629 3999651 4154581 4152712 3514779 3667891 3337526 3887367 3896453 3600663
14780 3600663 3609462 4008981 3500571 3438571 3483783 3504862 3430936 3628106 3835458 4116915
14770 4116915 4198848 4906919 3990988 4041143 3934569 3720556 3637448 3600753 3639940 3591469
14760 3591469 3576686 3381518 3366491 3519146 3789933 3743124 3967118 3939797 4520142 4107716
14750 4107716 4346043 4285176 3844531 3697103 4090427 3446866 3632322 4011976 3554277 3365115
14740 3365115 3482589 3403950 2431966 3177124 4136367 4321284 3892096 3207807 2957716 3485083
14730 3485083 3325260 3252089 3309544 3753840 3417914 4114472 3969447 2988291 3706430 3466779
14720 3466779 3347702 3199278 3301882 3464051 3516209 3791478 3866597 4301714 4315554 4458017
14710 4458017 4484676 4444466 4315076 3925621 4121185 3834568 3861869 3215347 4149668 3638757
14700 3638757 3593894 3962623 3611893 3376465 3419125 3658833 3910856 3829940 4089863 3675612
14690 3675612 3585366 3492477 4015435 3856320 3685488 3678068 3341565 3468759 3206576 2844564
14680 2844564 3321671 3698504 4213191 4015643 4093315 4031360 3748557 3223671 3123795 3103230
14670 3103230 3160349 3637737 4055955 4806490 3910090 4158906 3887905 3777668 3611742 3516065
14660 3516065 3193351 3702936 3857302 4071247 3732224 3177537 3104536 3546978 3775421 4047256
14650 4047256 3588892 3309685 3399800 3301882 3815715 3763036 3900043 3774936 3887868 3078519
14640 3078519 3063416 2901253 3805097 4066940 3153063 3332636 2941344 2733136 2739076 2970006
14630 2970006 3494361 3340090 3728181 3570781 3693874 3895105 3817582 3998967 4478576 4578271
14620 4578271 4389043 4565565 4726930 4666081 4041813 3541312 4128422 4297817 4130791 4067767
14610 4067767 3791212 3252563 3375164 4520758 3865602 3690209 3236977 4151957 4334349
14601 4334349 4423271 4370068 3539775 3887210 4259931 4240531 3516743 4196235 3680934 4506884
14591 4506884 4399192 3802601 3961061 3806405 3728637 4144717 4291323 4864229 4581125 3220575
14581 3220575 3659626 4998550 4191046 3067157 3277608 3460874 3544084 3763700 4005783
14572 4005783 3655726 4231454 3107902 2990153 3735180 4075610 3663249 3503709 3758584
14563 3758584 3984654 3458523 3271110 3096729 3468585 4048706 4211173 3489268 3310963
14554 3310963 3590124 3701972 4201324 3458127 3292089 3729107 2982038 3650321 3971496
14545 3971496 4239435 3898900 3478977 4001530 3074446 3385663 3374166 3342737 3631668 3914264
14535 3914264 3423865 3824228 3257270 3097147 3862532 4076996 3446600 4002850 3784876
14526 3784876 3397631 3826861 3801355 3843938 3571553 3878560 4301566 3702782 4100502 4369329
14516 4369329 4092567 4005635 3537781 4277866 3540943 3756533 3325746 4074145 4335016 4466923
14506 4466923 4086187 3849352 3943331 4529853 4473442 4364035 4340952 3639321 3935253 4032343
14496 4032343 4097446 4108833 3861895 3714535 4316731 3655291 3484011 3876927 3813271 3826931
14486 3826931 3814841 3678759 3877118 4006201 4164163 4943183 4654374 4066189 3895576 4583009
14476 4583009 5006872 4932365 4309854 3583099 3518671 3544839 3774983 4115316 3520235 4426693
14466 4426693 4948643 4895950 4245037 4246050 4169415 4259219 4523074 4321587 4316613 3590535 3705939
14455 3705939 3459806 3504151 3547210 3735697 4479217 4705277 3827578 3554420 3737947 4474519
14445 4474519 3950773 4196019 4572995 4082602 3837730 3898848 3767118 3962091 3916676 3496087
14435 3496087 3421200 3744422 3685277 3619805 3133520 3496466 3534042 3182986 3556009 3981579
14425 3981579 4284184 3969604 3858086 3942342 3726925 4070780 3982159 4415809 3535107 2894215
14415 2894215 4010273 3653914 3820470 4615289 4063445 3805479 3581078 3503768 3932194
14406 3932194 4242028 4052973 4105423 4212221 3930472 3189867 4226502 3837036 3965410
14397 3965410 3247042 3509977 3416481 3646072 3804505 3736783 3535559 3068405 4713679 4222455
14387 4222455 3698338 4082066 4668855 4205128 3905831 3337718 4132898 4246589 3839952
14378 3839952 4042356 4112497 4046417 3456647 3682839 4049254 4208005 4202360 4205778 3602584
14368 3602584 3542591 3787514 2924481 3111534 3234904 3661867 3338058 3732861 4067506 3338895
14358 3338895 3419972 3865214 3427348 3186513 3234948 3750772 3469010 3857715 4061330 4037817
14348 4037817 3599217 4397109 3371329 3460400 4267690 4224022 3695236 3203119 3979459 4058321
14338 4058321 3721410 4311056 3962705 4141336 4526913 4443334 4534137 4323346 3798861 4542003
14328 4542003 4598938 3712410 3967639 3771283 3855661 3960891 3799770 3453470 3876680 3662935
14318 3662935 3252414 4164927 4392524 3646435 3982744 3652840 2981718 3240755 4310329
14309 4310329 4443424 4255843 5086706 4898984 4223290 3798250 3205153 4150652 4298828
14300 4298828 4218416 3754509 3091806 3409638 4121255 3055875 3684893 3200426 3427046
14291 3427046 4336293 4241758 4265816 4025950 4150808 4514524 4678660 4404351 4510661 4156193
14281 4156193 3956458 3855003 4200113 3684597 3465816 4271469 4497203 4733821 3216226
14272 3216226 2752256 3913957 3926565 4175185 3799060 4447232 3803644 4039902 4349420
14263 4349420 3697109 4056915 3424265 3659849 3326323 3815047 3940066 4020352 4551694 4194579
14253 4194579 3833881 4076173 4397115 3802705 4129783 5172388 4747255 4396286 4469820
14244 4469820 4066137 3975552 3899012 3991690 3202391 3612398 3988070 3363853 3944761 3859773
14234 3859773 3786127 3452640 3909474 4434795 4052124 4205768 3627140 3750522 3661965 3747671
14224 3747671 4407404 3910703 3798581 3327005 3769282 3803660 3999610 4414140 3891750 3899445
14214 3899445 4030515 3667731 4092626 3827579 4225390 4455089 4112468 4476852 3869268
14205 3869268 3935881 4171187 4185407 4444302 4429389 3764652 4165252 4339300 3884818 4537320
14195 4537320 5003970 4048585 4588207 4380754 3737138 3854815 4115311 4231414 4947627
14186 4947627 4695661 3425110 3649069 4159245 4122170 4374457 3452909 3587231 4150828
14177 4150828 4348951 4558928 3808617 3359965 3444380 3933988 4818842 4396600 3024369
14168 3024369 3344520 4063141 3227772 3678078 4100877 3805949 4274115 4242750 4228114 3649799
14158 3649799 3588057 3896565 3883519 4706898 4794732 4480417 4175999 4013439 4478525 3803493
14148 3803493 4473517 4454560 3876787 4222734 4147431 3903131 3904539 4321684 3583776 3879624
14138 3879624 4023613 2972352 3068441 3803621 3855351 4229935 4187850 3475466 3968308 4539312
14128 4539312 4192626 5055892 4397258 4530060 4179721 3204633 4361042 4783932 4529136
14119 4529136 4850180 4500931 4292756 3881461 3809991 4096262 4201853 4195853 4257226 3866284
14109 3866284 3721169 4695708 4121006 2697946 3286245 4277852 4412006 3586198 3361918
14100 3361918 3941860 3482894 4544272 3827910 3369936 3624567 4576676 4628474 4479637
14091 4479637 3999039 4293819 4498582 4605297 3452914 3857555 3891283 3528672 3923297
14082 3923297 4404124 4190145 4171226 4232587 4561792 5015074 4352197 4114607 4160540 4226438
14072 4226438 4693906 3855384 3803751 4518318 3799191 3884407 3740296 3962683 3774917 3808835
14062 3808835 3768044 3250532 3249911 2972161 3320833 3851204 4203213 4056431 3102146 3345742
$$ [...]
##END NTUPLES=NMR SPECTRUM
##END=
