##TITLE=1H_CG-1208-x3
 CDCl3
 8 sc, 
 9.8.2024
##JCAMPDX= 6.0         $$ Bruker NMR JCAMP-DX V2.0
##DATA TYPE= NMR SPECTRUM
##DATA CLASS= NTUPLES
##ORIGIN= UXNMR, Bruker Analytische Messtechnik GmbH
##OWNER= root
$$ XWIN-NMR		Version 3.5
$$ Fri Aug  9 13:48:30 2024 Russian Standard Time (UT+4h)  she@DPX200
##.OBSERVE FREQUENCY= 200.1313
##.OBSERVE NUCLEUS= ^1H
##.ACQUISITION MODE= SIMULTANEOUS
##.ACQUISITION SCHEME= undefined
##.AVERAGES= 8
##.DIGITISER RES= 18
##SPECTROMETER/DATA SYSTEM= spect
##.PULSE SEQUENCE= zg30
##.SOLVENT NAME= Acetone
##.SHIFT REFERENCE= (INTERNAL, Acetone, 0, 20.9313)
##AUDIT TRAIL= $$ (NUMBER, WHEN, WHO, WHERE, WHAT)
$$ ##TITLE= Audit trail, XWIN-NMR		Version 3.5
$$ ##JCAMPDX= 5.01
$$ ##ORIGIN= Bruker BioSpin GmbH
$$ ##OWNER= she
$$ F:/spectra/data/she/nmr/H-F/1/pdata/1/auditp.txt
$$ ##AUDIT TRAIL=  $$ (NUMBER, WHEN, WHO, WHERE, WHAT)
(   1,<2024-08-09 13:47:08.42 +0400>,<she>,<DPX200>,
      <created by zg, POWCHK disabled, PULCHK disabled
       configuration hash MD5:
       00 E9 B6 7A A2 85 ED C7 34 08 36 98 17 FE 4E 26
       data hash MD5: 16K
       0C F3 04 67 5C F0 13 10 A2 27 03 A7 18 9D 07 34>)
(   2,<2024-08-09 13:47:29.17 +0400>,<she>,<DPX200>,
      <Start of raw data processing
       efp BC_mod = 2 LB = 0.24 FT_mod = 6 PKNL = 1 PHC0 = -25640.75 PHC1 = 15.38749 SI = 16K 
       data hash MD5: 16K
       7B CC AF 68 8B 28 E5 82 6B 2C 2C E1 5D 87 74 85>)
(   3,<2024-08-09 13:47:48.73 +0400>,<she>,<DPX200>,
      <pk PHC0 = -158.5542 PHC1 = 0 
       data hash MD5: 16K
       77 A5 54 29 A2 A4 57 AF 20 1B BB 68 F2 B9 AB 35>)
(   4,<2024-08-09 13:47:52.03 +0400>,<she>,<DPX200>,
      <abs ABSG = 5 
       data hash MD5: 16K
       98 D6 15 1D F4 6C B8 9F CD 49 40 3D D4 43 5E 85>)
$$ ##END=
$$ 
$$ hash MD5
$$ B3 08 12 EF 06 D8 CD C8 1C AC 45 DE 5D 26 A4 AA
##$RELAX= 
##$RELAX= 
##$RELAX= 
##$RELAX= 
##$RELAX= 
##$RELAX= 
$$ Bruker specific parameters
$$ --------------------------
##$DU= <F:/spectra>
##$EXPNO= 1
##$NAME= <H-F>
##$PROCNO= 1
##$TYPE= <nmr>
##$USER= <she>
##$AMP= (0..31)
100 100 100 100 100 100 100 100 100 100 100 100 100 100 100 100 100 100 
100 100 100 100 100 100 100 100 100 100 100 100 100 100 
##$AQSEQ= 0
##$AQ_mod= 1
##$AUNM= <au_zg>
##$AUTOPOS= <>
##$BF1= 200.13
##$BF2= 200.13
##$BF3= 200.13
##$BF4= 200.13
##$BF5= 200.13
##$BF6= 200.13
##$BF7= 200.13
##$BF8= 200.13
##$BYTORDA= 1
##$CFDGTYP= 0
##$CFRGTYP= 5
##$CHEMSTR= <none>
##$CNST= (0..31)
1 1 145 1 1 1 1 1 1 1 1 1 1 1 1 1 1 1 1 1 1 1 1 1 1 1 1 1 1 1 1 1 
##$CPDPRG= <>
##$CPDPRG1= <>
##$CPDPRG2= <>
##$CPDPRG3= <>
##$CPDPRG4= <mlev>
##$CPDPRG5= <mlev>
##$CPDPRG6= <mlev>
##$CPDPRG7= <mlev>
##$CPDPRG8= <mlev>
##$CPDPRGB= <>
##$CPDPRGT= <>
##$D= (0..31)
0 1.2 0 0 0 0 0 0 0 0.06 0 0.03 0 0 0 0 0.0002 0 0 0 0 0 0 0 0 0 0 0 0 
0 0 0 
##$DATE= 1723196828
##$DBL= (0..7)
120 120 120 120 120 120 120 120 
##$DBP= (0..7)
150 150 150 150 150 150 150 150 
##$DBP07= 0
##$DBPNAM0= <>
##$DBPNAM1= <>
##$DBPNAM2= <>
##$DBPNAM3= <>
##$DBPNAM4= <>
$$ [...]
##$SUBNAM3= <"">
##$SUBNAM4= <"">
##$SUBNAM5= <"">
##$SUBNAM6= <"">
##$SUBNAM7= <"">
##$SUBNAM8= <"">
##$SUBNAM9= <"">
##$SW= 24.0689771365484
##$SWIBOX= (0..15)
0 0 2 0 0 0 0 0 0 0 0 0 0 0 0 0 
##$SW_h= 4816.95568400771
##$TD= 16384
##$TD0= 1
##$TE= 0
##$TE2= 300
##$TE3= 300
##$TEG= 300
##$TL= (0..7)
0 120 120 120 120 120 120 120 
##$TP= (0..7)
150 150 150 150 150 150 150 150 
##$TP07= 0
##$TPNAME0= <>
##$TPNAME1= <>
##$TPNAME2= <>
##$TPNAME3= <>
##$TPNAME4= <>
##$TPNAME5= <>
##$TPNAME6= <>
##$TPNAME7= <>
##$TPOAL= (0..7)
0.5 0.5 0.5 0.5 0.5 0.5 0.5 0.5 
##$TPOFFS= (0..7)
0 0 0 0 0 0 0 0 
##$TUNHIN= 0
##$TUNHOUT= 0
##$TUNXOUT= 0
##$USERA1= <user>
##$USERA2= <user>
##$USERA3= <user>
##$USERA4= <user>
##$USERA5= <user>
##$V9= 5
##$VALIST= <valist>
##$VCLIST= <CCCCCCCCCCCCCCC>
##$VD= 0
##$VDLIST= <DDDDDDDDDDDDDDD>
##$VPLIST= <PPPPPPPPPPPPPPP>
##$VTLIST= <TTTTTTTTTTTTTTT>
##$WBST= 1024
##$WBSW= 4
##$XGAIN= (0..3)
0 0 0 0 
##$XL= 0
##$YL= 0
##$YMAX_a= 580546
##$YMIN_a= -656221
##$ZGOPTNS= <>
##$ZL1= 120
##$ZL2= 120
##$ZL3= 120
##$ZL4= 120
##$ABSF1= 20.93126
##$ABSF2= -3.137932
##$ABSG= 5
##$ABSL= 3
##$ALPHA= 0
##$AQORDER= 0
##$ASSFAC= 0
##$ASSFACI= 0
##$ASSFACX= 0
##$ASSWID= 0
##$AUNMP= <proc_1d>
##$AZFE= 0.1
##$AZFW= 0.1
##$BCFW= 0
##$BC_mod= 2
##$BYTORDP= 0
##$COROFFS= 0
##$CY= -3
##$DATMOD= 1
##$DC= 0
##$DFILT= <>
##$DTYPP= 0
##$F1P= 0
##$F2P= 0
##$FCOR= 1
##$FTSIZE= 16384
##$FT_mod= 6
##$GAMMA= 0
##$GB= 0
##$INTBC= 1
##$INTSCL= 3.70164e-10
##$ISEN= 128
##$LB= 0.24
##$LEV0= 0
##$LPBIN= 0
##$MAXI= 10000
##$MC2= 0
##$MEAN= 0
##$ME_mod= 0
##$MI= 1.114404
##$NCOEF= 0
##$NC_proc= -5
##$NLEV= 6
##$NOISF1= 3.799351
##$NOISF2= 2.8
##$NSP= 0
##$NTH_PI= 0
##$NZP= 0
##$OFFSET= 20.93126
##$PC= 1
##$PHC0= -25799.3
##$PHC1= 15.38749
##$PH_mod= 1
##$PKNL= yes
##$PPARMOD= 0
##$PSCAL= 0
##$PSIGN= 0
##$REVERSE= no
##$SF= 200.129519512893
##$SI= 16384
##$SIGF1= 3
##$SIGF2= 2
##$SINO= 5.538805
##$SIOLD= 16384
##$SREGLST= <1H.CDCl3>
##$SSB= 0
##$STSI= 16384
##$STSR= 0
##$SW_p= 4816.95568400771
##$SYMM= 0
##$S_DEV= 0
##$TDeff= 16384
##$TDoff= 0
##$TI= <>
##$TILT= no
##$TM1= 0
##$TM2= 0
##$TOPLEV= 0
##$USERP1= <user>
##$USERP2= <user>
##$USERP3= <user>
##$USERP4= <user>
##$USERP5= <user>
##$WDW= 1
##$XDIM= 16384
##$YMAX_p= 461099868
##$YMIN_p= -117157
$$ End of Bruker specific parameters
$$ ---------------------------------
##NTUPLES= NMR SPECTRUM
##VAR_NAME=  FREQUENCY,     SPECTRUM/REAL,   SPECTRUM/IMAG
##SYMBOL=    X,             R,               I
##VAR_TYPE=  INDEPENDENT,   DEPENDENT,       DEPENDENT
##VAR_FORM=  AFFN,          ASDF,            ASDF
##VAR_DIM=   16384,         16384,           16384
##UNITS=     HZ,            ARBITRARY UNITS, ARBITRARY UNITS
##FACTOR=    0.29402158847633, 1,            1
##FIRST=     4188.96283754472, 0,            0
##LAST=      -627.992846462995, 0,           0
##MIN=       -627.992846462995, -117157,     0
##MAX=       4188.96283754472, 461099868,    0
$$ Real data points
##PAGE= N=1
##DATA TABLE= (X++(R..R)), XYDATA
$$ [...]
6778A8736732L43591K98837K3562m42854q49287j142178j174776j066335r43516
6769A3783776q65932o49487n69929l67698k39332j53278j69652k10049k15604
6760A0342815j69268j2899J40916J97156L73168N05842L06874q5844l97884m99222
6750A0701654m13481k06860m7711Q6133J09902j42388m10610o87726p31372n84381
6740G673160o13138n14807m56407m54038k61580k20732k44335j20869j81532l26048
6730D279674k44191j99107j77465j45663j23839j50675j04807r2660q6109j00408
6720B854750k2664o4674o3294l0307o0278o6472o4409j6004q1407p9129k0025
6709B286087q6660p6294m8132l614l3917n1552n5853j0183k2967k3638n7269l6377
$$ y = [18736732, 19080323, 19379160, 19402722, 18959868, 18110581, 16968403, 15793627, 14727292, 13783776, 12917844, 12268357, 11698428, 11330730, 11091398, 10938120, 10768468, 10558419, 10342815, 10173547, 10160648, 10301564, 10498720, 10871888, 11377730, 11684604, 11598760, 11200876, 10701654, 10288173, 10081313, 10033602, 10119735, 10229637, 10087249, 9676639, 8988913, 8257541, 7673160, 7060022, 6545215, 6088808, 5634770, 5373190, 5152458, 4908123, 4787254, 4605722, 4279674, 4035483, 3836376, 3658911, 3513248, 3389409, 3238734, 3133927, 3041267, 2955158, 2854750, 2832086, 2767412, 2704118, 2673811, 2613533, 2547061, 2482652, 2466648, 2385241, 2306112, 2286087, 2199427, 2123133, 2075001, 2071387, 2037470, 1985918, 1930065, 1919882, 1896915, 1873277, 1816008, 1779631]
6697A779631M835j5115n792l7566L4403k1848n7822k6147n880k474n949J214r627
6684A631863l0341K1566l181j0952n3428l7720j0034J0655k018m7184l3450j1700
6672A424076l4055j6120j578k7501l4538L308k7908K6906m1028J8769J4568m6238
6660A258661r661J3969q1504j8220M9751m9748k171J6459n232l4989P061j8475
6648A125901m487j9348j2763K7258J0138j04224M4417k6086l9124J4221J8907
6637A034810l4311j1427j7399j6198K2091l3444k0353L4555j0865k0666l3554
6626H93239j5856o751k0731M2229k3808O067J0679L6472o066l2338k137k5701
6614H55298l327O240o4595N0526l190m0541O6670j8987m7228n745M9399l4665
$$ y = [1779631, 1784466, 1769351, 1763559, 1725993, 1760396, 1738548, 1680726, 1654579, 1648699, 1646225, 1640276, 1641490, 1631863, 1601522, 1623088, 1619907, 1608955, 1555527, 1517807, 1507773, 1518428, 1516410, 1469226, 1435776, 1424076, 1390021, 1373901, 1372323, 1344822, 1310284, 1313592, 1285684, 1312590, 1271562, 1290331, 1304899, 1258661, 1249000, 1262969, 1181465, 1163245, 1212996, 1163248, 1161077, 1177536, 1172304, 1137315, 1144376, 1125901, 1121414, 1102066, 1089303, 1116561, 1126699, 1022475, 1066892, 1040806, 1001682, 1015903, 1034810, 1000499, 989072, 971673, 955475, 977566, 944122, 923769, 958324, 947459, 926793, 893239, 877383, 870632, 849901, 892130, 868322, 874389, 885068, 921540, 915474, 883136, 880999, 855298, 851971, 858211, 793616, 844142, 840952, 800411, 867081, 848094, 800866, 795121, 844520, 809855]
6602H09855j816N608l0038o155r878J6138q309M242K4703m923J8375l4809q1936
6589G01057M5919k9822L357M1565J8739j4398J8647N025j0527P5k5437J3466J4741
6576G82407l5975j5184L7164N7892q435K155j1857l0647p251j1184j4312J0489
6564G55262J3451k5769m246N6563m885P518k8871K0189j5398K9772j0931n5307
6552G37348l009N7568P361P977k6420j2912k8090L9386k0166j5108O7040k3993
6540G86982l2860K5128M453k0459l1940n367M2742o995M5204k518l3941J9406
6528G89835P499k0878n8988J0746K0367p60k7357l258l181J5162n5488j3215j1414
6515F49070j138N5069L6749m4561r67k5732M4600N701j8637l888l5772m9356m822
$$ y = [809855, 808039, 813647, 783609, 777454, 767576, 783714, 775405, 779647, 804350, 799427, 817802, 782993, 701057, 746976, 717154, 720511, 762076, 780815, 766417, 785064, 790089, 779562, 779637, 754200, 767666, 782407, 746432, 731248, 768412, 826304, 817869, 820024, 808167, 777520, 770269, 759085, 744773, 755262, 768713, 742944, 738698, 795261, 790376, 797894, 769023, 789212, 773814, 803586, 792655, 737348, 734339, 791907, 799268, 807245, 780825, 767913, 739823, 779209, 759043, 743935, 810975, 786982, 754122, 779250, 783703, 763244, 731304, 725937, 768679, 761684, 806888, 804370, 770429, 789835, 797334, 776456, 717468, 728214, 748581, 747821, 720464, 717206, 714025, 729187, 673699, 660484, 649070, 647932, 703001, 739750, 695189, 694222, 668490, 713090, 718791, 700154, 696266, 660494, 611138, 606316]
6502F06316Q293l7704J0052j1760J0780n0282J0271J5496m0446n3621L3740K687
6490E03822K7248k8540K2142M142j2249k9830J406l268P966p708n798K0972k490
6477D97815Q013l4427m2355K7760L0775m771l3514M909m4195M5372p3821M7491
6465D29052p279M7317l6751k5159k740o4284N4516K4677q7149M5354k6935M577
6453C55196j072J5923j7407r689J7409K4115k5524j4854l2667L4970K1371l4906
6441C32865J1870n303J5673J1450k2650k9422K6332k9047K445j9486k098O1786
6429C54415m0571k7162L3712J5547p814j929l8589j6608K8459J949M7602k7391
6417C21620o2378R06R758J1628q773O3614K7913m1771q056n680J0651l587m2638
$$ y = [606316, 614609, 576905, 586957, 575197, 585977, 535695, 545966, 561462, 521016, 467395, 501135, 503822, 531070, 502530, 524672, 528814, 516565, 486735, 488141, 484873, 492839, 485131, 479333, 500305, 497815, 505828, 471401, 429046, 456806, 487581, 482810, 449296, 454205, 410010, 455382, 381561, 429052, 421773, 469090, 432339, 407180, 404440, 340156, 394672, 419349, 332200, 377554, 350619, 355196, 354124, 370047, 352640, 342951, 360360, 384475, 358951, 344097, 311430, 346400, 367771, 332865, 344735, 339432, 355105, 366555, 343905, 314483, 340815, 311768, 314213, 294727, 292629, 354415, 313844, 286682, 320394, 335941, 328127, 326198, 287609, 271001, 299460, 301409, 349011, 321620, 259242, 260148, 269906, 281534, 272761, 336375, 364288, 322517, 314461, 308781, 319432, 315845, 273207]
6404B73207k9641R596J9041P118l0267J9527l6522l22o912N3463q751L4724q624
6391B95637j4893J2827k017k6488k8773k9443j7324K529L9032k0234j7761K8336
6379B21428K8494L147N518n3011k0071L0284M2831o0283L1924K7104j5242m307
6367B37816l4554K1703l4124N0262q271k3371J9340K894J2635J6579O357o222
6355B61044k2695J7875K3134m5765K4098l5291m6411Q947M1206M7806l1013k048
6343B40887j1837J261N498k6255k5259Q55K4696j7975L9443n4135L4679K5123
6331B36981j8037l2130J6537q203k4854K3032N1993k9856l2190O804K9803o8747
6319A51133k1701O1249K0552k4816k8273M6207J303J6721j8780k0696O346O741
$$ y = [273207, 243566, 253162, 272203, 279321, 249054, 268581, 232059, 231737, 224825, 278288, 269537, 304261, 295637, 280744, 293571, 291554, 265066, 236293, 206850, 189526, 192055, 231087, 210853, 193092, 221428, 249922, 253069, 258587, 205576, 185505, 215789, 258620, 198337, 230261, 257365, 242123, 237816, 203262, 224965, 190841, 241103, 232832, 209461, 228801, 231695, 244330, 260909, 267266, 261044, 238349, 256224, 279358, 233593, 257691, 222400, 175989, 184936, 226142, 273948, 242935, 240887, 229050, 230311, 235809, 209554, 184295, 185150, 209846, 191871, 231314, 177179, 211858, 236981, 218944, 186814, 203351, 195148, 170294, 193326, 245319, 215463, 183273, 190077, 219880, 151133, 129432, 190681, 211233, 186417, 158144, 204351, 205654, 222375, 203595, 182899, 189245, 195986]
6307A95986J7634k392k464J8136J8655n0970J0480k8203J6512O3516l0189l2445
6295A94256l97K576Q886m225k3488L913J5599k1715j1306M443K718O955k2625
6282A55590M384K7664k0929n409n232K4198j1953J2393k7778J8393j6282M626
6270A59665j3784K755K5543l3176k7857R639j0431J6457K7774j4852K0364k3676
6258A38421K2580K00k293l6887L0703K6193k8880k2881J675L7861N3742n6471
6246A63963J1366k4287j6792J4138L9343l7842k1404N483j3283O3693j7693p793
6234A58892k0146M112L4387m237J7165j918L225j4713k65j3526l0345j7616J0827
6221A25842k474K2815j0214M395j9088L0016j6720L9151q952j6023l3484N3354
$$ y = [195986, 213620, 211228, 208764, 226900, 245555, 194585, 205065, 176862, 193374, 256890, 226701, 194256, 193859, 196435, 205321, 201096, 177608, 181521, 197120, 175405, 164099, 168542, 171260, 178215, 155590, 159974, 187638, 166709, 161300, 156068, 180266, 168313, 180706, 152928, 171321, 155039, 159665, 145881, 148636, 174179, 141003, 113146, 122785, 112354, 128811, 156585, 141733, 162097, 138421, 161001, 161201, 158908, 122021, 152724, 178917, 150037, 127156, 128831, 166692, 220434, 163963, 175329, 151042, 134250, 148388, 187731, 149889, 128485, 133968, 120685, 184378, 166685, 158892, 138746, 142858, 177245, 173008, 190173, 188255, 191480, 176767, 176502, 162976, 132631, 115015, 125842, 123368, 146183, 135969, 140364, 121276, 151292, 134572, 173723, 164771, 148748, 115264, 168618]
6209A68618J0467m7376n150Q578O5353p948n7094L1463L3198r59n1128M2j6816
6196A31248J3667P299K6632n1339j4524R153k480l2720L0258n517p837J9529N3130
6183A76499k8270O954m4114j7093O265K2113r465k4323K9146P7651J4254n3638
6171A55979K0386m7236J1553K4729l423k8640k0811L1219q291q149K462J474J0970
6158A42222l387k804K644L0706n0996l0430n293P2313Q353k3724r582P451j664
6145A35809n7843N2867L1358k8594M4710n3111k6607k6560K7626k8538P2984j1685
6133A32416k0149k4970J8342j394m1482P457M5760j1041N480Q240j839K0590J2348
6120A49758m1666J9323J3599l4292j1218r881R627J1148k1815P490J7179L929
$$ y = [168618, 179085, 131709, 126559, 135137, 200490, 192542, 135448, 166911, 200109, 199150, 148022, 148064, 131248, 144915, 152214, 178846, 127507, 112983, 122136, 119656, 86936, 117194, 111677, 103840, 123369, 176499, 148229, 155183, 111069, 93976, 100241, 122354, 112889, 88566, 117712, 195363, 209617, 155979, 176365, 129129, 140682, 165411, 161988, 133348, 112537, 143756, 135465, 127316, 129778, 131252, 142222, 138835, 136031, 138675, 169381, 118385, 87955, 82662, 154975, 163328, 139604, 130022, 137473, 135809, 77966, 130833, 162191, 133597, 178307, 125196, 98589, 72029, 99655, 71117, 144101, 132416, 112267, 87297, 105639, 104245, 62763, 70220, 115980, 104939, 110419, 118659, 116820, 137410, 149758, 108092, 127415, 141014, 106722, 95504, 85623, 95250, 106398, 84583, 92073, 109252, 113181]
6108A13181k0690J1349j4828J2035R524n1652J511P717M8057M1401l8665N3351
6096A72291n2869j9970K5557j0547n1232O664K9943R380K1485K755j4360r247
6084A09850L972L5579o1801l0558L2696J3782J5746L4894j242l7263K1935o2203
6072G5387J167L3784J6543k9978j4617L5885j4357l6497L9506l2148K8394K3665
6060A26734n968M5802j9301j7984k384m2705P1483k2453m2657K125K1156L6263
6048A50111k3014l572q785J3163q304P185K8176l571l4787j8636K4696L8245k3300
6035A37607j4965j0828K9730j2975q5374r088M1269m817J0257Q576Q879K5606
6023A23877L8435m138m2887M397l0505K2106j6426L0210k129k7587R1155j7851
$$ y = [113181, 92491, 103840, 89012, 101047, 110571, 58919, 60430, 68147, 116204, 157605, 118940, 172291, 119422, 99452, 125009, 114462, 63230, 69894, 99837, 109217, 130702, 133457, 119097, 109850, 113822, 149401, 87600, 57042, 89738, 103520, 119266, 154160, 152918, 115655, 137590, 75387, 76554, 110338, 126881, 96903, 82286, 118171, 103814, 67317, 106823, 74675, 103069, 126734, 120766, 166568, 147267, 129283, 126899, 84194, 155677, 133224, 90567, 92692, 113848, 150111, 127097, 123525, 114740, 127903, 119599, 126784, 154960, 151389, 116602, 97966, 122662, 160907, 137607, 122642, 111814, 141544, 128569, 43195, 34107, 75376, 70559, 80816, 89392, 98271, 123877, 162312, 158174, 115287, 119684, 89179, 111285, 94859, 125069, 122940, 95353, 186508, 168657]
6011A68657l8753k2318J9153l616M1967m392J4112m8244J3314J3653p575n304
5999A40654k4833R104j9822k4860r818M9110J2564k3549l1045K189J7623M8591
5987A45908K683J7949q414k5416Q123l4411k6439J5516R305j1938m2534J9457
5975F9789K0811N0899n1176J0525Q1L7282m2502j5865J8024k5980K1623j0506
5963H3005M7206K8514m5850l7894j8060M7957j1416j9530M664j6187L3243P694
5951A03346N5732o8834J4563J0659m2074K7108L2977p120m3767K4190r178K0064
5939A17666o81j9898l7505K7871k8086k2890M5770R172k8461J2335j3377L9422
5927A01338j8406J7271k3010l48j5134N9534m2213j1335M9830l6612q282m8584
$$ y = [168657, 129904, 107586, 126739, 123123, 165090, 160698, 174810, 126566, 139880, 153533, 145958, 140654, 115821, 124925, 105103, 80243, 70425, 119535, 132099, 108550, 77505, 79694, 97317, 145908, 148591, 166540, 158126, 132710, 140833, 106422, 79983, 95499, 104804, 92866, 50332, 69789, 90600, 141499, 90323, 100848, 100929, 138211, 95709, 79844, 97868, 71888, 93511, 83005, 130211, 158725, 112875, 74981, 56921, 104878, 93462, 73932, 78596, 62409, 95652, 103346, 159078, 90244, 104807, 115466, 73392, 100500, 133477, 126357, 82590, 106780, 97602, 117666, 116985, 97087, 59582, 87453, 59367, 36477, 82247, 91419, 62958, 75293, 61916, 101338, 82932, 100203, 77193, 76845, 61711, 121245, 79032, 67697, 117527, 80915, 72633, 24049]
5915B4049k282M8714l6925K2837j1085K560O1392m4356l3632L0920N348k0127
5903D7413J9402j824k2228N7457J5935m6864K3331n1634Q859O248J9028K4222
5891I9345j7213k1458L7877j5346j8482M3612n6354l9747J0677k7868L5035N1191
5879H1269L453m6587n964M0242j4265J5437k6604j6599j3270K7499L3145n4222
5867B3534J494O8510P626j3291L3985j9181K231j4726J091k1642l2946J2158K9340
5854G8183J6403J1886k695j830p373K2184j5549M0028m3605k6517N929J4411R061
5841A00516o911q981j3266J4872j7470L2745l8636o194R5013k0801l2638k4202
5829G4047R430j8840J0295j9532M8958l798N290k7746K5733J4601l940k306q236
$$ y = [24049, 21767, 70481, 33556, 56393, 45308, 47868, 109260, 64904, 31272, 62192, 67540, 47413, 66815, 64991, 42763, 100220, 116155, 69291, 92622, 40988, 49847, 56095, 75123, 99345, 82132, 60674, 98551, 83205, 64723, 108335, 51981, 12234, 22911, -4957, 30078, 81269, 84722, 38135, 32171, 72413, 58148, 73585, 46981, 30382, 17112, 44611, 77756, 23534, 25028, 93538, 101164, 87873, 121858, 102677, 104908, 90182, 91273, 69631, 36685, 48843, 78183, 94586, 106472, 103777, 101947, 94574, 116758, 101209, 141237, 97632, 71115, 77044, 91455, 100516, 93605, 84624, 71358, 86230, 68760, 101505, 62869, 56675, 151688, 130887, 98249, 74047, 83477, 64637, 74932, 55400, 104358, 100560, 105850, 78104, 103837, 118438, 114498, 112192, 103956]
5816A03956J4624p996j3130j6793O247J4201j1716k7054K6135j0517J3803L433
5804I5193j1662Q381m3372K9649P568k8221J5052L3102L9672k5173J0633p7620
5792E3202K5920L2224Q852k3414n1754L6392j2814l5492L6712k2200m3559K8456
5780C2525K6732R278k0613K8987n807j9476J745N8623j2837L479j5311k2809J7175
5767H1691L5166n1035q3N1171J910m9437k675k6423J3848J2214J4440J0486J6096
5754A07369j109L1183m8945l5752Q2259J812R688L3596o5660r313k7030m0667
5742C7431L4662M411M944j3362K5532P864L5202m3402N083O861j9413L746K7944
5729A17503k1376J4709k2383l6684M1638M8668n3852Q187j8508j5094J4442r938
$$ y = [103956, 118580, 110584, 97454, 80661, 86908, 101109, 89393, 62339, 88474, 77957, 91760, 95193, 83531, 91912, 48540, 78189, 85757, 57536, 72588, 105690, 145362, 120189, 130822, 53202, 79122, 111346, 120198, 96784, 45030, 81422, 68608, 33116, 69828, 47628, 4069, 32525, 59257, 68535, 47922, 76909, 71102, 51626, 53371, 111994, 99157, 102636, 87325, 64516, 81691, 116857, 65822, 65739, 116910, 118820, 69383, 66708, 40285, 54133, 66347, 80787, 91273, 107369, 106260, 137443, 88498, 52746, 135005, 136817, 146505, 180101, 114441, 105128, 78098, 37431, 72093, 76504, 81448, 68086, 93618, 101482, 136684, 93282, 98365, 105226, 85813, 89559, 117503, 96127, 110836, 88453, 51769, 93407, 142075, 88223, 96410, 77902, 62808, 77250, 67312]
5717F7312m5186N2042M208k3278J408L0222K3377j5067j6370K7095j0314l5462
5705E9987k522Q496K4053l0243k2223J7900L378J8522k0476J9260j5609R963K6847
5692I7333J1727n1310L7247q795n9153L1755M1716M098J6840n6606K1856N108
5680I1816N805l2372J1648K5231n0905N5130l5673n662N4047P239j8523L877j4514
5667I7144K3208p688l1156K073L1302J8735r119o827K9832O048m6932j9388L108
5654I0340J4439L2597r757k6527l320M1086m433J4676o005j693j8180K7471K1423
5641A72117m1903M325j4371j729N283j1807M236N9801m146J3250k2729j4339K488
5628A50476J4622r368R63l766J7533M4076k2968N21k3863O113j3352K1276l6709
$$ y = [67312, 22126, 74168, 78376, 55098, 56506, 86728, 110105, 95038, 78668, 105763, 95449, 59987, 57465, 65961, 90014, 59771, 37548, 55448, 58826, 77348, 56872, 76132, 60523, 70486, 97333, 109060, 57750, 94997, 86202, 27049, 58804, 100520, 104618, 121458, 64852, 86708, 91816, 97621, 65249, 76897, 102128, 51223, 106353, 70680, 65018, 119065, 126304, 107781, 111658, 97144, 120352, 112664, 81508, 83581, 114883, 133618, 124499, 117672, 147504, 153552, 106620, 87232, 90340, 104779, 137376, 127619, 101092, 97772, 138858, 134425, 149101, 143096, 141403, 123223, 150694, 172117, 130214, 134539, 120168, 118439, 123722, 111915, 116151, 175952, 171806, 185056, 162327, 147988, 150476, 165098, 155730, 156693, 152927, 170460, 214536, 191568, 192089, 168226, 174339, 160987, 182263, 145554]
5615A45554m876j0640Q304j3507P437m4164p26L2612M6755J3163k1746k7188m880
5602A26098K3739k2020N6129j7038k6744L516K2588k1368N7098l1105j2502j9912
5590A38479M0873k5300k2764j2675K4362n095k9295L4198n0185n026K7327n772
5578A09127K3790O2669k6584j1427K1877J0217n7759L5131M6983K7474p73n091
5566B35634n1722J1436Q863k1724j6983k8972N4704M1908P64k8875m585M7798
5554B48246k2030n987M059j588J2890J1948m4570J3732J6978L59O693K1342m8673
5541B13399j0348n7L6358j6482P226k6111m5172o772K4853j156m167p758J2746
5528A76559j9325k9549k028q56M2921L240k4231L8150K0672R17q836J2787k3943
$$ y = [145554, 140678, 130038, 138342, 124835, 132272, 88108, 87382, 119994, 166749, 179912, 158166, 130978, 126098, 149837, 127817, 183946, 166908, 140164, 143680, 166268, 144900, 201998, 170893, 158391, 138479, 179352, 154052, 131288, 118613, 142975, 137880, 108585, 142783, 92598, 87572, 114899, 109127, 132917, 195586, 169002, 157575, 179452, 189669, 131910, 167041, 214024, 241498, 240725, 235634, 183912, 195348, 204211, 182487, 165504, 136532, 191236, 233144, 233908, 205033, 200448, 248246, 226216, 220229, 224288, 222700, 235590, 247538, 202968, 216700, 233678, 234037, 240730, 262072, 213399, 203051, 202994, 239352, 222870, 230096, 203985, 158813, 152041, 176894, 175738, 171571, 163813, 176559, 157234, 127685, 125657, 124801, 167722, 170962, 146731, 184881, 205553, 206470, 197634, 210421, 186478]
5515A86478L0299k7863m596N893j6342N20J2649j8115K1617K6660K4778K3942
5503B65920l4627k3029K0913p689j0881P918n7812M7176L1914L420R941K8223
5491B81387m7490n0765l48O0586l2269p224l718l934p928m855L6580L8135j2627
5478B45530m4136l4322L560N9200M436k5353M4738n568P932l1397J5931j8591
5466B21960r958R553J5249l500M4276J9473j4458k4098J4104K5632k3970L1122
5454C05385j5241J8813j3510k2008K0574p961R010m052k916j9523M5024p28l394
5441C09473j7598P598J0786O9422m206k5459K6563N2438k8193j9257K5461j2120
5429C94908L9047l1902k4393J92L6335l8755N1955K9577l2393l6334l346o207
$$ y = [186478, 216777, 188914, 184318, 190211, 173869, 174389, 187038, 168923, 190540, 217200, 241978, 265920, 231293, 208264, 229177, 221488, 210607, 218525, 160713, 207889, 239803, 243223, 253164, 281387, 233897, 183132, 182784, 243370, 211101, 203877, 200159, 196225, 188297, 183442, 220022, 258157, 245530, 201394, 167072, 170632, 229832, 234268, 208915, 253653, 248085, 256017, 224620, 240551, 221960, 212002, 221555, 236804, 233304, 277580, 297053, 282595, 258497, 272601, 298233, 274263, 305385, 290144, 308957, 295447, 273439, 294013, 286052, 295062, 291010, 288094, 268571, 313595, 312867, 309473, 291875, 299473, 310259, 379681, 375475, 350016, 376579, 429017, 400824, 381567, 407028, 394908, 433955, 402053, 377660, 377852, 414187, 375432, 427387, 456964, 424571, 388237, 384891, 378684]
5417C78684N206l3766K8464J2757K0018n575L8240j0484p596L5393j9040l2978
5405D09323l7409M3159l2382M9165j4576K1386l3862O79k4227K9142K9457j7292
5393D22563J7500Q329m864k7931J534Q5298r583m1597k0879l8688J3047N589K5211
5380D35529Q065k588K889L7456L6396J8010m7055J2769L3499J8554k4697P915
5368E36742l7408K7284O1429O53R764N6368N6805j8737q552m0905O0353K1107
5356G24903M8228K8296k7826j1770L8743j1477N536k6006k7665J6243N9426O952
5344H23583L0071O3126K7133k2761K4786N9773n0788J6301R949K2933l299m2437
5332I58370l5291m6155L8196J4822j0773k8153J5950M0928l8997l3165J5082j5713
$$ y = [378684, 383890, 350124, 378588, 391345, 411363, 405788, 444028, 433544, 425948, 461341, 442301, 409323, 371914, 415073, 382691, 431856, 417280, 438666, 404804, 405483, 381256, 410398, 439855, 422563, 440063, 448392, 443528, 415597, 417131, 502429, 492846, 451249, 430370, 391682, 404729, 410318, 435529, 443594, 441006, 443895, 481351, 517747, 535757, 488702, 501471, 534970, 553524, 528827, 536742, 499334, 526618, 588047, 588700, 598464, 654832, 711637, 692900, 684348, 643443, 703796, 724903, 773131, 801427, 773601, 761831, 800574, 789097, 794633, 768627, 740962, 757205, 816631, 823583, 853654, 916780, 943913, 921152, 945938, 1005711, 954923, 971224, 981173, 1004106, 1000807, 958370, 923079, 876924, 915120, 929942, 919169, 891016, 906966, 947894, 908897, 875732, 890814, 875101]
5320H75101l7681K349J5596J7608o0344n873n782K5758l391P816r938Q746q187
5307H21778o988J3053l938J2230l6214j802o782L370J4407j7978K2265l7498P45
5294G76648K7553k0710J5319J5839k465M6055j9813J4665k2929J0522l3902Q987
5282H15769J9920L955M922k8814k8957N28M9172O321m5097N4774Q628n0496o788
5269H03837R917M0757j471l6465M9598j404k2881j6054P3149K7105n8273Q487
5257H76302M4924q856n903K4825j4677L6092J9257j3433P3386J0064l3145O9448
5245A078284K2140l8838M8012M8831n36N098K929k1872J970J7289O5045j3333
5233A215019J1636N1071O2215M2646m70Q5143P450J1128J4873L8633L0762L0884
$$ y = [875101, 837420, 839769, 855365, 872973, 812629, 806756, 800974, 826732, 823341, 831157, 821219, 829965, 821778, 814790, 827843, 823905, 836135, 799921, 798119, 791337, 794707, 809114, 791136, 813401, 775903, 776648, 804201, 783491, 798810, 814649, 812184, 858239, 838426, 853091, 830162, 840684, 806782, 815769, 835689, 839644, 844566, 815752, 786795, 787323, 836495, 842816, 797719, 852493, 861121, 810625, 803837, 813754, 854511, 853040, 816575, 866173, 864769, 841888, 825834, 898983, 926088, 867815, 876302, 921226, 912370, 906467, 931292, 916615, 952707, 971964, 958531, 1031917, 1041981, 1008836, 1078284, 1100424, 1061586, 1109598, 1158429, 1157893, 1162991, 1165920, 1144048, 1146018, 1163307, 1228352, 1215019, 1226655, 1277726, 1339941, 1382587, 1382117, 1467260, 1474710, 1485838, 1500711, 1539344, 1570106, 1600990]
5221A600990J2871r21N070J9812L3690J0624J9585K0024K8860Q0958q321J8166
5209A841408k0221p039K9734O2083k7810j3702p348N0880M6779J7267m4071j0403
5197A917557L7464l737l9774o6334m6618n386J7139m2940l3737K0392m0451l2911
5185A680664K1814r456M4532J0465N147k4368j4609K3362q322n6203j7501k1483
5173A634042k6751m7336j9469p7097J0997N1944m1720J0064L5345j5596j0779
5162A503644J4560R4663M1945o657m6754m480O918k0753O786m5797l1941m0645
5150A471489K2692J7025k4033L9924J0839L0284N6820K3500L3482j0218L0925
5139A702729k318R788K1887j3012m3579M8535m4450O577k3043J1241n991p4069
$$ y = [1600990, 1613861, 1612940, 1618010, 1637822, 1671512, 1682136, 1701721, 1721745, 1750605, 1831563, 1823242, 1841408, 1821187, 1814148, 1843882, 1905965, 1878155, 1864453, 1857105, 1907985, 1954764, 1972031, 1927960, 1917557, 1955021, 1951284, 1911510, 1845176, 1798558, 1793172, 1810311, 1767371, 1733634, 1754026, 1713575, 1680664, 1702478, 1693022, 1737554, 1748019, 1753166, 1728798, 1714189, 1737551, 1729229, 1673026, 1655525, 1634042, 1607291, 1559955, 1540486, 1463389, 1474386, 1526330, 1484610, 1494674, 1530019, 1514423, 1503644, 1518204, 1612867, 1654812, 1648155, 1601401, 1596921, 1603839, 1583086, 1589872, 1544075, 1512134, 1471489, 1494181, 1511206, 1487173, 1527097, 1537936, 1568220, 1625040, 1648540, 1682022, 1671804, 1702729, 1700411, 1710199, 1732086, 1719074, 1675495, 1724030, 1679580, 1686157, 1663114, 1674355, 1668364, 1594295]
5127A594295K9546N7689K4776k8183j4442M0286J3378O9914m6826M4423L4143
5116A818999L8861N6302L951P131k1522J6213m107j8205Q4600q278K7847J6624
5104B018416n3762Q0045M5237J2682q068O6663O5522M9080J4663N2867M3274M0909
5092B427528j1843J02659N7242N0021J2894M3208K9001K7199j1904N2326M9203
5081B827534J1364P6995J6006J22622J6779M1739Q9923m220J20713O2858O7863
5070C450176J40556K9702L7854J4740K3167k7835j6392M6584O2023K2319J02324
5059C885218O4319j4618P8404Q6075J5118R2711O2624J05051R2753N6644P3891
5048D598190N0093l130N0229P4582N9193R2969J00659P1935P5210J10515Q5024
$$ y = [1594295, 1623841, 1681530, 1706306, 1678123, 1663681, 1703967, 1717345, 1787259, 1740433, 1784856, 1818999, 1857860, 1914162, 1918113, 1925244, 1903722, 1919935, 1915828, 1897623, 1982223, 1973945, 2001792, 2018416, 1964654, 2044699, 2089936, 2102618, 2094550, 2161213, 2226735, 2275815, 2290478, 2343345, 2386619, 2427528, 2415685, 2518344, 2575586, 2625607, 2638501, 2681709, 2710710, 2737909, 2726005, 2778331, 2827534, 2838898, 2915893, 2931899, 3054521, 3071300, 3113039, 3202962, 3198742, 3319455, 3382313, 3450176, 3590732, 3620434, 3658288, 3673028, 3696195, 3668360, 3651968, 3698552, 3760575, 3782894, 3885218, 3949537, 3934919, 4013323, 4099398, 4114516, 4207227, 4269851, 4374902, 4467655, 4524299, 4598190, 4648283, 4645153, 4695382, 4769964, 4829157, 4922126, 5022785, 5094720, 5169930, 5280445, 5365469]
5037E365469P2826J60853J46553J14694Q5272J38721J88014K05376J88196J82591
5027F848565J64234K04918J97581K04424K72401K52798K22722K52436L55879L18792
5017I294750K90078L23502L93152L48329M12353M19016M79972M78229N23971O15628
5007A3578980N90463O66366P82010Q14962R13899R83110R91734J103122J119598
4998B1544244J107409J100427Q41906O25928M36903K12525j2225P281P5019K20748
4988B6160165K66717M31931O27832P48089Q64994J073523J228267J401343J453109
4979C4255970J343623J052194M79280l04450j015369j622748j801867j821869
4971C0564764j582944j250224j024679p51907m80187l35537k00417j19310o017
$$ y = [5365469, 5438295, 5599148, 5745701, 5860395, 5945667, 6084388, 6272402, 6477778, 6665974, 6848565, 7012799, 7217717, 7415298, 7619722, 7892123, 8144921, 8367643, 8620079, 8975958, 9294750, 9584828, 9908330, 10301482, 10649811, 11062164, 11481180, 11961152, 12439381, 12963352, 13578980, 14169443, 14835809, 15617819, 16432781, 17346680, 18329790, 19321524, 20424646, 21544244, 22651653, 23752080, 24593986, 25219914, 25656817, 25869342, 25857117, 25864398, 25939417, 26160165, 26426882, 26858813, 27486645, 28234734, 29099728, 30173251, 31401518, 32802861, 34255970, 35599593, 36651787, 37131067, 36826617, 35811248, 34188500, 32386633, 30564764, 28981820, 27731596, 26706917, 25955010, 25474823, 25139286, 24938869, 24819559, 24813542]
4962B4813542l7463k3170k52290m08890p43304j033985j280041j392497j376795
4953A8265107j254587j131002j043575p55563o17643n81394m47821l89133l32398
4944A1711991l06821k71110k90830l81017l57075m16380m15929m50846l30483
4935H491500k48158k53721j60791j62530j05150n4656n3703K0598J1290L0079
4925G514758J13903Q2122o195M0708q7142j50250k03095j48954k18761r9974j25465
4914F711655p6278J8525K0443M208P7528J6454J21116J49566J26044J55280J54563
4903G479104L1463o2854p7956q8040o7080R4799R7545J01575J31559K08643J98810
4892H047568J26863n234l3284j50470r1151j21113p3313L2102q4935j3406J2219
$$ y = [24813542, 24776079, 24752909, 24500619, 24091729, 23348425, 22314440, 21034399, 19641902, 18265107, 17010520, 15879518, 14835943, 14080380, 13462737, 12881343, 12433522, 12044389, 11711991, 11405170, 11134060, 10843230, 10462213, 10105138, 9688758, 9272829, 8821983, 8491500, 8243342, 7989621, 7828830, 7666300, 7561150, 7506494, 7452791, 7473389, 7484679, 7514758, 7628661, 7710783, 7704588, 7745296, 7658154, 7507904, 7304809, 7155855, 6937094, 6837120, 6711655, 6635377, 6653902, 6674345, 6678553, 6756081, 6772535, 6893651, 7043217, 7169261, 7324541, 7479104, 7510567, 7447713, 7369757, 7281717, 7214637, 7309436, 7406981, 7508556, 7640115, 7848758, 8047568, 8174431, 8169197, 8135913, 7985443, 7894292, 7773179, 7699866, 7731968, 7647033, 7633627, 7645846]
4881G645846k406K1020J01778J57111K48789L05974L53902M82688M52590J39914
4871I907206j59591m39316o20671o40407o04926l90591l23287j75010j78080r6622
4861F278705j1570m7191J4926M2914J15909J73035J95128J83178J18043k9025
4851G034052k33056l26735l52520l63856l06578l09551k04394j34555p9675j27176
4841D595956q8224q2259j1082l1822k1299n6882k8466j0376k7807j538L2267P258
4829D275726o5449m5076r2686n5344q4064j6199Q94n5976j1792l5679P348K7490
4817C849193k9925N1157J2024M1254Q1459M2453J7951o6817Q00j5078p1022J524
4805C914973j4340j3238n1994j0352M8542N2968L5534Q012j8857P3564N8208M5634
$$ y = [7645846, 7643440, 7664460, 7766238, 7923349, 8172138, 8478112, 8832014, 9314702, 9767292, 9907206, 9747615, 9308299, 8687628, 8047221, 7442295, 7051704, 6728417, 6553407, 6375327, 6278705, 6267135, 6219944, 6234870, 6277784, 6393693, 6566728, 6761856, 6945034, 7063077, 7034052, 6800996, 6474261, 6121741, 5757885, 5451307, 5141756, 4937362, 4802807, 4723132, 4595956, 4507732, 4425473, 4414391, 4382569, 4361270, 4304388, 4275922, 4265546, 4237739, 4236201, 4268468, 4275726, 4210277, 4165201, 4072515, 4017171, 3933107, 3916908, 3917802, 3861826, 3850034, 3814355, 3821703, 3849193, 3819268, 3870425, 3882449, 3923703, 4005162, 4047615, 4065566, 3998749, 3999549, 3984471, 3913449, 3914973, 3900633, 3887395, 3835401, 3825049, 3873591, 3926559, 3962093, 3970105, 3951248, 4024812, 4083020, 4128654]
4793D128654K5921L4089O7838R2364M9433O5319Q2716O9083M9281M8017R9119
4782D811834P8222N5744P3735Q8957J15844J26967J07186R9302R7905J07378J33851
4771E896925J30264J24922J11722J61686J21995R6254J24778J20851J77335J11454
4761G178186J18465J27620J21347J44287J76829J58016K14612K16755J88037J64692
4751H808846J47174J44951K58599K25690J71796K03975J35038P2006J53685J22915
4741A0444675J37494K33190J94647J92315K78175L30429L07763K94523L68831
4732A2782042K32904K49190K38410K55093L38521K90761K56263M09806L53822
4723A5406812L97521L90998M00204M57540N69391O22112O54562O44285Q11128
$$ y = [4128654, 4154575, 4188664, 4256502, 4348866, 4398299, 4463618, 4546334, 4615417, 4664698, 4712715, 4811834, 4890056, 4945800, 5019535, 5108492, 5224336, 5351303, 5458489, 5557791, 5655696, 5763074, 5896925, 6027189, 6152111, 6263833, 6425519, 6547514, 6643768, 6768546, 6889397, 7066732, 7178186, 7296651, 7424271, 7545618, 7689905, 7866734, 8024750, 8239362, 8456117, 8644154, 8808846, 8956020, 9100971, 9359570, 9585260, 9757056, 9961031, 10096069, 10168075, 10321760, 10444675, 10582169, 10815359, 11010006, 11202321, 11480496, 11810925, 12118688, 12413211, 12782042, 13014946, 13264136, 13502546, 13757639, 14096160, 14386921, 14643184, 15052990, 15406812, 15804333, 16195331, 16595535, 17053075, 17622466, 18244578, 18899140, 19543425, 20354553]
4714B0354553P53181Q23327R29373Q90257R73258J123987J137500J137870J148625
4705B9271931J158170J097460R16721P68607O45089M92376M88701M67200M41146
4696C5747401N43524P16197Q73757J005930J215564J383427J599623J773287J874400
4687D6733110K084681K073934K043875J808682J380920Q01527K25226l91972j000314
4678E5759669j316622j557962j575316j377450j187441q32365m28013j40791K20414
4669D7564123M84652Q09135J053152J212753J264110J096150O31977j13664j018730
4660E2983658k009071k729709l039269l021796k742053k474646k116716j766412
4652C3083986j381615j171518q66917o68298n10528k59214k19666k80465m81972
$$ y = [20354553, 21107734, 21931061, 22860434, 23750691, 24723949, 25847936, 26985436, 28123306, 29271931, 30430101, 31527561, 32444282, 33212889, 33857978, 34350354, 34839055, 35306255, 35747401, 36290925, 37007122, 37880879, 38886809, 40102373, 41485800, 43085423, 44858710, 46733110, 48817791, 50891725, 52935600, 54744282, 56125202, 56926729, 57151955, 56759983, 55759669, 54443047, 52885085, 51309769, 49932319, 48744878, 47912513, 47484500, 47343709, 47564123, 48048775, 48857910, 49911062, 51123815, 52387925, 53484075, 54116052, 54002388, 52983658, 50974587, 48244878, 45205609, 42183813, 39441760, 36967114, 34850398, 33083986, 31702371, 30530853, 29663936, 28995638, 28485110, 28225896, 28006230, 27725765, 27243793]
4643B7243793p67786j035474j287000j351934j434732j322723j153061r99811
4635A7891272r16963p86875p73544o12705n98207n52552n69513m76547m65902
4626A2138464m03888l43516m04660l38596l11875l25768k45225j75244j88375
4617I401317j54111n8952n5762o3166K050j8453o9639k05906k45936k86438k81676
4606G963328k13421j80237j62956j30433o2328n3692q8759j6731J932k0555m0925
4595F995223l4303J6080M2767P5065N4857O3387n2287n7979n7062k5484k6293
4584F993971o7845l5336o4220j41861m1770k7506Q3197m5762L6335N6337L2398
4573F777938J30024Q0984J29751J69017J67356J82518Q2350j7390n0219j31897
$$ y = [27243793, 26476007, 25440533, 24153533, 22801599, 21366867, 20044144, 18891083, 17891272, 16974309, 16187434, 15413890, 14801185, 14202978, 13650426, 13080913, 12604366, 12138464, 11734576, 11391060, 10986400, 10647804, 10335929, 10010161, 9764936, 9589692, 9401317, 9247206, 9188254, 9132492, 9069326, 9071376, 9052923, 8983284, 8777378, 8531442, 8245004, 7963328, 7749907, 7569670, 7406714, 7276281, 7213953, 7160261, 7071502, 7054771, 7056703, 7036148, 6995223, 6960920, 6977000, 7019767, 7094832, 7149689, 7213076, 7160789, 7102810, 7045748, 7020264, 6993971, 6926126, 6890790, 6826570, 6684709, 6642939, 6615433, 6698630, 6652868, 6689203, 6745540, 6777938, 6907962, 6988946, 7118697, 7287714, 7455070, 7637588, 7719938, 7702548, 7652329, 7520432]
4563G520432j11872m1682k8890K6365J7719Q0985P9572J43705J72668J88752J87649
4552H235403K03957J85896L48097L76839L24950M29744L18884J13892p7174k37446
4542A0223042k67293k92600l11961k08876j54794o9286R0738J12258R7162P8069
4532I296459J43057K14357K69016M36249M70014N70187M41043J08777l33202o32034
4522A0983923p53167o04093m81600m02967l14617j71213k6265p496r282j1491
4512H201732j1811k6436j5070M4061J41163K00216J49276P3883j67411j73920
4502H415683k16804k39193q7491j2908J77854L11953M42399L93517j03835n84968
4492H496207p48939n77516l85520k69632j79656j55162q7315l7088n5386q7863
$$ y = [7520432, 7408560, 7366878, 7337988, 7364353, 7382072, 7463057, 7542629, 7686334, 7859002, 8047754, 8235403, 8439360, 8625256, 8973353, 9350192, 9675142, 10104886, 10423770, 10537662, 10460488, 10223042, 9955749, 9663149, 9351188, 9142312, 8987518, 8918232, 9008970, 9121228, 9218390, 9296459, 9439516, 9653873, 9922889, 10359138, 10829152, 11399339, 11840382, 11949159, 11615957, 10983923, 10230756, 9626663, 9145063, 8742096, 8427479, 8256266, 8230001, 8222505, 8213223, 8201732, 8189921, 8163485, 8148415, 8192476, 8333639, 8533855, 8683131, 8757014, 8589603, 8415683, 8198879, 7959686, 7872195, 7859287, 8037141, 8349094, 8791493, 9185010, 9081175, 8496207, 7747268, 7169752, 6784232, 6514600, 6334944, 6179782, 6092467, 6055379, 5999993, 5912130]
4482E912130n8343m7879p5956n149P588O4438J4901O6381J5454P7090J19230J38726
4470F228611J09954K08393J93471L31173L57235L32908K86793K18996J04296r9095
4460H272735l96535n15888n05760m16436m49352l63368k67640j98979j94545j35221
4450D829011j21553j08019k1715p4381n6464j29126k7751J1293n9244j5574L0689
4439D257166R425J7418P1436O6486R6873J52181K12937j05j53343k20570k28270
4428D281634k99783j99418j04235j11280j12133j38327n6664m9018q7711q4046
4418C039019L7529M395q9392n1299l7594L3160P960J8303K4516k9426j111j08098
4406B847962j06096q7092j02387p4554P363k0523o1230L2516O864p1170j2027
$$ y = [5912130, 5853787, 5805908, 5729952, 5724803, 5732391, 5796829, 5811730, 5878111, 5893565, 5970655, 6089885, 6228611, 6338565, 6546958, 6740429, 7071602, 7428837, 7761745, 8048538, 8267534, 8371830, 8272735, 7876200, 7360312, 6854552, 6438116, 5988764, 5625396, 5357756, 5158777, 4964232, 4829011, 4707458, 4599439, 4577724, 4503343, 4446879, 4317753, 4290002, 4301295, 4242051, 4226477, 4257166, 4266591, 4284009, 4355445, 4421931, 4518804, 4670985, 4883922, 4883817, 4730474, 4509904, 4281634, 3981851, 3782433, 3678198, 3566918, 3454785, 3316458, 3259794, 3210776, 3123065, 3039019, 3076548, 3080943, 2991551, 2940252, 2902658, 2935818, 2943778, 2962081, 2986597, 2957171, 2956060, 2847962, 2741866, 2654774, 2552387, 2477833, 2485196, 2464673, 2403443, 2435959, 2442823, 2371653, 2359626]
4395B359626k1677m5940L3280K4856K3564R180M3048K9759N241k0307p3490l7850
4383B329290o0544P452k4895l7022o2834m0335J8017k3127M0173j170k9230K1405
4371B137180L4009Q541L9474Q9708P1371J27747K02193J41268M8951j16755j09803
4360B673884j66614j08984r8182j15276n1235o9773k0562r4584m368J0493O6617
4349B021416L408J9488K7565P7351K4405N3796N4720J75912J42051J57117J15183
4338B872412n1046j86711j54437j72060j15054r4520p0760q092o5366o0401N8611
4327A952576j0419q856k349M1155J3218O6631l9538R617P1544R3438N6036Q0703
4315B323756J4186L5989m2304p3599n0295o889m5979L7369l8254n6820j1224M3015
$$ y = [2359626, 2337949, 2292009, 2325289, 2350145, 2373709, 2382889, 2425937, 2455696, 2460937, 2440630, 2367140, 2329290, 2268746, 2276198, 2251303, 2214281, 2151447, 2111112, 2129129, 2106002, 2146175, 2145005, 2115775, 2137180, 2171189, 2179730, 2219204, 2308912, 2380283, 2508030, 2710223, 2851491, 2900442, 2783687, 2673884, 2507270, 2398286, 2300104, 2184828, 2133593, 2063820, 2043258, 1948674, 1944306, 1954799, 2021416, 2024824, 2044312, 2071877, 2149228, 2173633, 2227429, 2282149, 2458061, 2600112, 2757229, 2872412, 2821366, 2634655, 2480218, 2308158, 2193104, 2098584, 2027824, 2019732, 1954366, 1893965, 1952576, 1942157, 1933301, 1930952, 1972107, 1985325, 2051956, 2012418, 2022035, 2093579, 2187017, 2243053, 2323756, 2337942, 2373931, 2331627, 2258028, 2207733, 2200844, 2154865, 2192234, 2153980, 2097160, 2085936, 2128951]
4303B128951l5855J3968L6649P987N5991k9011p262J5073N6167j312M6125J9212
4291B306683m3135Q133J9620j4876M4612o5822n4110J9038k3685Q700j4690m434
4279B186034p3916j6549j3718k776p982K6736l8479J6264K945L97K8764k7775
4267B079945l984m968j5687j1914k4727l2482k8264J2311j6263K0766J1900j1943
4255A974690k5641k0616M529o8819k5407J3077J5638n1658m4597K2183j9702l0079
4243A743598J6903k1136l800L105J8951k6106N0589r816P8514l72p23k8231K1091
4230A842567k108o4189q175O7470K3850l7711j5574j2529J7313L8115L739N8831
4218A911599O661j2577n1922P3504n5573N7783N837n144m6609O2687K3902J5823
$$ y = [2128951, 2093096, 2107064, 2143713, 2151700, 2207691, 2178680, 2171418, 2186491, 2242658, 2241346, 2287471, 2306683, 2263548, 2271681, 2291301, 2276425, 2321037, 2255215, 2201105, 2220143, 2196458, 2205158, 2190468, 2186034, 2112118, 2095569, 2081851, 2079075, 2071093, 2097829, 2059350, 2075614, 2078559, 2078956, 2107720, 2079945, 2075961, 2070993, 2055306, 2043392, 2018665, 1986183, 1957919, 1970230, 1953967, 1974733, 1986633, 1974690, 1949049, 1928433, 1932962, 1864143, 1838736, 1851813, 1867451, 1815793, 1771196, 1793379, 1773677, 1743598, 1760501, 1739365, 1735565, 1738670, 1757621, 1731515, 1782104, 1772288, 1850802, 1850430, 1849707, 1821476, 1842567, 1840459, 1776270, 1768095, 1835565, 1859415, 1821704, 1806130, 1793601, 1810914, 1849029, 1852768, 1911599, 1918260, 1905683, 1853761, 1927265, 1871692, 1929475, 1935312, 1930168, 1883559, 1946246, 1970148, 1985971]
4206A985971J9755K9041J631O7757j8300O4844Q839l9434P2153j193P00N5028
4194B246792j7163J8347N251M4569K3143N3306J5890J1933M8230J9151j6615L9087
4182B491921j7424N5772k81L6165Q5301p352Q628P4407N3312k2154J0207P2782
4170B841284J6949J08210M9800L2389L6962L5298J9415K4233N9672N5297m1077
4159C238432P7263M2632K1014J5235K7568J02280M9049P6415L0801L4513J16996
4148C832198N1173O6834P4075O7855M0902O1786L3314K9535K8802R6839O4440
4137D447753M4822L0963l8452K6375N253R368L1225J9219J3947J21014M5357J72343
4125D929187O9639m3264K5166M6002o3011L0112J5434L7745J922j6110J6363j7973
$$ y = [1985971, 2005726, 2034767, 2036398, 2104155, 2085855, 2150699, 2159538, 2120104, 2192257, 2191064, 2191764, 2246792, 2229629, 2247976, 2253227, 2297796, 2320939, 2374245, 2390135, 2402068, 2450298, 2469449, 2452834, 2491921, 2474497, 2530269, 2529988, 2566153, 2651454, 2644102, 2652730, 2727137, 2780449, 2758295, 2768502, 2841284, 2858233, 2966443, 3016243, 3048632, 3085594, 3120892, 3140307, 3164540, 3224212, 3279509, 3238432, 3315695, 3358327, 3379341, 3394576, 3422144, 3524424, 3573473, 3649888, 3680689, 3715202, 3832198, 3883371, 3950205, 4024280, 4092135, 4133037, 4194823, 4228137, 4257672, 4286474, 4383313, 4447753, 4492575, 4523538, 4485086, 4511461, 4516714, 4526082, 4557307, 4576526, 4590473, 4711487, 4756844, 4929187, 4998826, 4955562, 4980728, 5026730, 4963719, 4993831, 5009265, 5047010, 5048932, 5032822, 5049185, 5031212]
4113E031212n727P3005M6659M3838M2236P1369M5567O9894L7806P6351O5282N9875
4101E657367M4650P4817Q7370O7192K1951J10764O3270J27268R1747M2388P6323
4090F465107J58480P5556N5763J14177K07761O6846J44509J08186J45115J90937
4080G732437J86346J48115J73474K08670J69466J05992J38239J69057K44987J40806
4070I417589K36404K18070K44597L01573K35345K10187L32742K76773L54506L32881
4060A2160667L77465L38959M41736L81571M19158L57858M34191N15609M79453
4051A5906667M57205N96384N37839O18394P17159Q25931R14315J134270J042304
4042B2750468N93770L60538L79938N03438P13573Q34978R87026J004925J045996
$$ y = [5031212, 5025485, 5098490, 5145149, 5188987, 5231223, 5302592, 5348159, 5418053, 5455859, 5532210, 5597492, 5657367, 5702017, 5776834, 5864204, 5931396, 5953347, 6064111, 6127381, 6254649, 6346396, 6388784, 6465107, 6623587, 6699143, 6754906, 6869083, 7076844, 7143690, 7288199, 7396385, 7541500, 7732437, 7918783, 8066898, 8240372, 8449042, 8618508, 8724500, 8862739, 9031796, 9276783, 9417589, 9653993, 9872063, 10116660, 10418233, 10653578, 10863765, 11196507, 11473280, 11827786, 12160667, 12538132, 12877091, 13318827, 13700398, 14119556, 14477414, 14911605, 15427214, 15906667, 16363872, 16960256, 17498095, 18116489, 18833648, 19659579, 20573894, 21708164, 22750468, 23344238, 23704776, 24084714, 24588152, 25301725, 26136703, 27123729, 28128654, 29174650]
4033B9174650J016443R68403P39729N55647M45920K76282K02060J64354J81355
4024C3724843K54224L88269N32102P18610Q65610R51434J176882J265681J404605
4015D1282260J435386J383049J257220R93377N47776M2435m28288o62985p86938
4006D5063292p78525n95039m41427k43179o6820J69468L30524N70782O24274P33785
3996D5367135P64202Q23795O50788N81557L68895K16331l3319k21790l76198l54012
3986D7787384k99024j55705j19470P7307K43075L68118M44619N63607N26830O19189
3976E0055930M79085L19150J13886j30460l37288n00395o47177o93262p28432
3967D7931037o66326n73880l48990k20040l2574J05650K87982L94307O23285N20429
$$ y = [29174650, 30191093, 31159496, 31899225, 32454872, 32900792, 33177074, 33379134, 33543488, 33724843, 33979067, 34367336, 34899438, 35618048, 36483658, 37435092, 38611974, 39877655, 41282260, 42717646, 44100695, 45357915, 46351292, 46899068, 46941503, 46513215, 45850230, 45063292, 44284767, 43689728, 43248301, 43005122, 42938302, 43107770, 43438294, 44009076, 44633350, 45367135, 46131337, 46955132, 47605920, 48187477, 48556372, 48772703, 48739384, 48517594, 48141396, 47787384, 47488360, 47332655, 47213185, 47290492, 47533567, 47901685, 48346304, 48909911, 49436741, 50055930, 50535015, 50854165, 50968051, 50837591, 50500303, 49999908, 49352731, 48659469, 47931037, 47264711, 46690831, 46341841, 46121801, 46089227, 46194877, 46482859, 46877166, 47500451, 48020880]
3957D8020880O08943N35045M92466K81400J34551m9684k82458m40376n37671n51860
3947D8211236m66735m04514k50248j23251O4613J09747L62580L83778M96857N44603
3937D8928666M87814N14303M34272L08514L7480k44520m17356o96113q80079r90508
3927D7482473q89185r35202p30727p53478o81919o55062n41747n33361o42796
3918D1118996o79522o77453p48661q69037j005350j030005j215233j236273j225102
3909C2432360j188528j203249j056058j085496r86023r07402q06196q07569p40935
3900B3650904p43080p25252p41258o99893o75436o93264o38643o35809n94732
3891A7503537m97004m05193n11439l87713l74652k88090k52160k21257j37590
$$ y = [48020880, 48629823, 49164868, 49657334, 49938734, 50073285, 50023601, 49741143, 49300767, 48763096, 48211236, 47744501, 47339987, 47089739, 46966488, 47031101, 47140848, 47503428, 47887206, 48384063, 48928666, 49416480, 49930783, 50365055, 50673569, 50711049, 50466529, 50049173, 49353060, 48472981, 47482473, 46593288, 45658086, 44927359, 44173881, 43491962, 42836900, 42295153, 41761792, 41118996, 40439474, 39762021, 39013360, 38144323, 37138973, 36108968, 34893735, 33657462, 32432360, 31243832, 30040583, 28984525, 27899029, 26913006, 26005604, 25199408, 24391839, 23650904, 22907824, 22182572, 21441314, 20741421, 20065985, 19372721, 18734078, 18098269, 17503537, 17006533, 16601340, 16089901, 15702188, 15327536, 15039446, 14787286, 14566029, 14428439]
3882A4428439j32760o6719r1043j27211j39025j62866k59695l43934l69069l38500
3872A2397617m20746m23789l14014l87220l61778l09491k73996k14231k00353
3863I491999j64099p0025j23043j19155j50755j09887j25429j67986j58818j23817
3853H178985k43153j77288k35281j75358k09426j46945j94118j58831j53038j36127
3843F349420p0908n9416j43153k7706m5463n185q8200p865q5664K4098n1667m9719
3831E738572n3036l2083o1208K0647m5924J3708k8401K1510J9237J06227J00917
3820E800166J02527J78232K31450J57514J63737K0723j00165l33387k46479m13757
3810E560561k20647k05330j44185k02803n3037j40178j3443j28546k4734p0642
$$ y = [14428439, 14295679, 14228960, 14137917, 14010706, 13871681, 13708815, 13449120, 13105186, 12736117, 12397617, 11976871, 11553082, 11239068, 10851848, 10490070, 10180579, 9906583, 9692352, 9491999, 9327900, 9257875, 9134832, 9015677, 8864922, 8755035, 8629606, 8461620, 8302802, 8178985, 7935832, 7758544, 7523263, 7347905, 7138479, 6991534, 6797416, 6638585, 6485547, 6349420, 6278512, 6219096, 6075943, 6048237, 6002774, 5997589, 5909389, 5901524, 5815860, 5839958, 5788291, 5738572, 5685536, 5653453, 5592245, 5612892, 5566968, 5580676, 5552275, 5573785, 5593022, 5699249, 5800166, 5902693, 6080925, 6312375, 6469889, 6633626, 6654349, 6554184, 6220797, 5974318, 5560561, 5339914, 5134584, 4990399, 4787596, 4734559, 4594381, 4580938, 4452392, 4427658, 4357016]
3800D357016k077J2926J237o7079l526o3863M3405n0575J3160q3429K9231l4524
3788D151902k8833l0020J6852j1821K1607P271K096O798M785j1833j3844k4990
3776D089970O4088n319L4831m715J9471J5325k4477p896K6767L0261L5593k750
3764D271149l0348K04P6008n3697M052J3951P7660p8468N1056O21m526K4045k2129
3751D329578j9443L0092O4979J8684J6766M1013l1190j7846L4302L5423R9132
3740D601490N4238J11524N2576O1924L9045J70687K1647L6719J620P7529N8163
3729E287162O2230R180L9938K4931R6921N3249N9448K9769M5578L2510R4197R1501
3717E926614J92142M0084J59800O6147J19069J18159K00730R8155J87060J23750
$$ y = [4357016, 4354939, 4367865, 4369102, 4302023, 4298497, 4234634, 4278039, 4227464, 4240624, 4157195, 4186426, 4151902, 4123069, 4093049, 4109901, 4098080, 4119687, 4126958, 4129054, 4135852, 4140637, 4128804, 4114960, 4089970, 4154058, 4148739, 4183570, 4178855, 4198326, 4213651, 4189174, 4181278, 4208045, 4238306, 4273899, 4271149, 4240801, 4241005, 4317013, 4263316, 4267368, 4281319, 4358979, 4280511, 4331567, 4332188, 4327662, 4351707, 4329578, 4310135, 4340227, 4405206, 4423890, 4440656, 4481669, 4450479, 4432633, 4466935, 4502358, 4601490, 4655728, 4767252, 4819828, 4881752, 4920797, 5091484, 5113131, 5149850, 5151470, 5228999, 5287162, 5349392, 5358572, 5398510, 5423441, 5520362, 5573611, 5633059, 5662828, 5708406, 5740916, 5835113, 5926614, 6118756, 6158840, 6318640, 6384787, 6503856, 6622015, 6822745, 6920900, 7107960, 7231710]
3707G231710J88707J09860K36292K08236K73971K25584L49152K82618M38675R1224
3697I636029K14711Q6715K76053J08020Q9835l3421J64805M9827K06833J42208
3687A0941615L16590J21011K68709J57083L15976J67887L13821J35663J96433
3678A2934788N9909K27233Q4100K60835J57873M11238K75160N83409L89879L49729
3668A5734153R5242M63951M76747P25487M80312N98229N50731O84878K64692M09897
3658B0484319L52978M73136L22443N05597K82803M86103L62652O65254M21693
3649B4356978O40029N98396P92926O48136Q37274O99983R87566R73583J125908
3640C1660779J068827J374894J211352J478727J546435J856163J899764K230924
$$ y = [7231710, 7420417, 7530277, 7766569, 7974805, 8248776, 8474360, 8823512, 9106130, 9544805, 9636029, 9850740, 9937455, 10213508, 10321528, 10411363, 10377942, 10542747, 10592574, 10799407, 10941615, 11258205, 11379216, 11647925, 11805008, 12120984, 12288871, 12602692, 12738355, 12934788, 12994697, 13221930, 13306030, 13566865, 13724738, 14135976, 14411136, 14994545, 15384424, 15734153, 15829395, 16293346, 16770093, 17495580, 17975892, 18574121, 19124852, 19809730, 20074422, 20484319, 20837297, 21310433, 21632876, 22138473, 22421276, 22907379, 23270031, 23935285, 24356978, 24997007, 25595403, 26388329, 27036465, 27873739, 28573722, 29561288, 30534871, 31660779, 32729606, 34104500, 35315852, 36794579, 38341014, 40197177, 42096941, 44327865]
3632D4327865K435714K755534K889968L291257L688677M620942N107513M217452
3624G3334922K676198L047243L179890K819648L243668M074714M400534M493415
3616A01270232L791833K208727J976588M483275O285380R811527R878719R528441
3608A49234722J1700859J1842279J4748515K2467654L3208300M1964417O3090531
3601C48257277P4184973L8657618n5421182q3959674p7900151n5676836l3794930
3594A54347095k6375598j8931393j4245703r795457q520266o776873o498703m961663
3586E8241439m831008l575328l601229k706609k868275k210302k618601j943309
3578C3886778k235652j591955j820128j290978j541483j018936j352263r07815
$$ y = [44327865, 46763579, 49519113, 52409081, 55700338, 59389015, 64009957, 69117470, 73334922, 76011120, 79058363, 82238253, 85057901, 88301569, 92376283, 96776817, 101270232, 105062065, 107270792, 109247380, 113730655, 120016035, 129827562, 139706281, 149234722, 160935581, 172777860, 187526375, 209994029, 243202329, 285166746, 348257277, 422442250, 461099868, 405678686, 321719012, 243818861, 188142025, 154347095, 127971497, 109040104, 94794401, 84998944, 76478678, 69701805, 63203102, 58241439, 53410431, 49835103, 46233874, 43527265, 40658990, 38448688, 35830087, 33886778, 31651126, 30059171, 28239043, 26948065, 25406582, 24387646, 23035383, 22127568]
3570B2127568j172362p27847r67662o03862q78281n07733q07157m52520p08415
3561A5301729l17291o19622l23774n51437k62326m84457j78670m71504j87488
3552A1905160l52376j18374k48258n4179l67771o8507k34225l2659k82780j03498
3542A0042533j99849j2201k49039j72j19421q529k42944O0730j56169J00272j23116
3531I092095M9158r0363J04227j44317O0065n9106K0094r4770J2632q2206Q2022
3520H949531m3256P5616p3018R3102j6604J08228m2770J47696P3680J23099M8485
3509I443789J73075O1736J46704N1712J52115P8941K00597R1297J59115J59833
3499A0718914K17338J79235J77384K40937L41324K38933K86010K89777K95991
$$ y = [22127568, 20955206, 20227359, 19259697, 18655835, 17777554, 17269821, 16462664, 16010144, 15301729, 14984438, 14364816, 14041042, 13489605, 13227279, 12742822, 12564152, 12092648, 11905160, 11552784, 11434410, 11186152, 11131973, 10764202, 10695695, 10461470, 10428811, 10146031, 10042533, 9842684, 9830483, 9581444, 9581272, 9461851, 9453322, 9210378, 9271108, 9114939, 9215211, 9092095, 9141253, 9050890, 9155117, 9010800, 9070865, 9011759, 9031853, 8937083, 8949715, 8867509, 8949531, 8906275, 8981891, 8908873, 9001975, 8985371, 9093599, 9050829, 9198525, 9272205, 9395304, 9443789, 9616864, 9678600, 9825304, 9877016, 10029131, 10108072, 10308669, 10399966, 10559081, 10718914, 10936252, 11115487, 11292871, 11533808, 11875132, 12114065, 12400075, 12689852, 12985843]
3490A2985843K94844L65591L46135L84671M21714M07698L69676M45630L54391
3481A6376193M06419M05003M07676M11060L50513M49077M67451M86817N42624
3472B0302833N34606M16091N43533N57070M69753M67147N03797N63008N64660
3463B4922498N75385O23510N89559O37849N99316P03456O75689P28152O50389
3454C0705803P50854P90637P41470O07756O70475N07354M90432N05059M95146
3445C6264986M26489N16884M61116O01895N92744O17333N93953O48657O07625
3436D1331682P68125P09503Q84193R31103J000495R73240R38216Q11136P69482
3427D9117175N94588O07497M47768M22926L56261L03717J43317K39881M7475J80655
$$ y = [12985843, 13280687, 13646278, 13992413, 14377084, 14798798, 15206496, 15576172, 16021802, 16376193, 16782612, 17187615, 17595291, 18006351, 18356864, 18805941, 19273392, 19760209, 20302833, 20837439, 21253530, 21797063, 22354133, 22823886, 23291033, 23794830, 24357838, 24922498, 25497883, 26121393, 26710952, 27348801, 27948117, 28651573, 29327262, 30055414, 30705803, 31456657, 32247294, 32988764, 33596520, 34266995, 34774349, 35264781, 35769840, 36264986, 36691475, 37208359, 37669475, 38271370, 38864114, 39481447, 40075400, 40724057, 41331682, 42099807, 42809310, 43693503, 44624606, 45625101, 46598341, 47536557, 48347693, 49117175, 49711763, 50319260, 50767028, 51189954, 51546215, 51849932, 51993249, 52233130, 52280605, 52461260]
3417E2461260P1243J87007J34080J24991R8384J17481Q8231J41771J08107J12963
3407E3645518k441j4196j48842j26859k66980k47967m30904l53311m60942n04716
3397E1088360o35710o69926p80477p54443q38290o69799n67378l70364l23556
3388D5478417j89779k36421j95781k47201l35851n56570n82842r13226q75107
3379D1345639q91493p06774p05895o83020p02283p30222p96611q02959q06441
3370C4519941o86155o55681o55472o10836o25716p40589p87450p28840p86023
3361B8243179q03696p05600o69110o30162o21694n72465n87613n93651o42953
3352B2416235n68274n52340n03041n85582m41651n01508m11501l99625l81887
$$ y = [52461260, 52532503, 52719510, 52853590, 52978581, 53076965, 53194446, 53282677, 53424448, 53532555, 53645518, 53643077, 53628881, 53480039, 53353180, 53086200, 52838233, 52407329, 52054018, 51593076, 51088360, 50452650, 49782724, 49002247, 48247804, 47409514, 46739715, 46172337, 45801973, 45478417, 45288638, 45052217, 44856436, 44609235, 44273384, 43716814, 43133972, 42220746, 41345639, 40454146, 39747372, 39041477, 38358457, 37656174, 36925952, 36129341, 35326382, 34519941, 33833786, 33178105, 32522633, 31911797, 31286081, 30545492, 29758042, 29029202, 28243179, 27439483, 26733883, 26064773, 25434611, 24812917, 24240452, 23652839, 23059188, 22416235, 21847961, 21295621, 20792580, 20206998, 19765347, 19263839, 18852338, 18452713, 18070826]
3343A8070826m33706m05724m08607l97578l81613l93726k97475l32276k98681
3334A4721440l45138k70959k83355j93195k27729j98190j31951j59226j73421
3325A2738276j29357r9240n9671j11162q6406j05102n6777j07740p7280n7062
3315A1848479k7411p8198k9906m045Q044m7289J9658n518N1993J6936J13204N090
3303A1871037Q2979Q1747P8367J33219K03660J11713K08328K00446K68737K52612
3293A3492845K56761K67763L40341L62008L93662L37541M05629M42459M73153
3284A6772162M17208M91141N36095N45008M68274O33910O46316O81097O73611
3275B1864822P96504P38155R02178Q94211R61872J028721J151072J147425J289973
$$ y = [18070826, 17637120, 17231396, 16822789, 16425211, 16043598, 15649872, 15352397, 15020121, 14721440, 14376302, 14105343, 13821988, 13628793, 13401064, 13202874, 13070923, 12911697, 12738276, 12608919, 12509679, 12450008, 12338846, 12252440, 12147338, 12090561, 11982821, 11905541, 11848479, 11821068, 11742870, 11712964, 11708919, 11716963, 11669674, 11689332, 11683814, 11735807, 11752743, 11865947, 11871037, 11954016, 12035763, 12114130, 12247349, 12451009, 12562722, 12771050, 12971496, 13240233, 13492845, 13749606, 14017369, 14357710, 14719718, 15113380, 15450921, 15856550, 16299009, 16772162, 17189370, 17680511, 18216606, 18761614, 19229888, 19863798, 20510114, 21191211, 21864822, 22661326, 23399481, 24301659, 25195870, 26157742, 27186463, 28337535, 29484960, 30774933]
3266C0774933J342511J418476J375085J423890J247751J223212J007671Q02764
3258D0616293M91139L14131M7063j35493l05142k93051n56815o18968o87291q42990
3248C8028876r84006j205233j336716j474071j644548j646256j722696j623331
3240B6392019j539631j472522j303293j237683j078638q58620q97512o96900o86018
3231A6621202o36850m82802m37773m57869l47570l72200l18810k65663k45142
3222A3056523j84535k31137k17558j30773j20189k28320j58956j01867j18989
3213A1564199j09758j16669j05087n5962j00390o6335n9805m7459r253p6230m9160
3202A0768091l0776Q418m3183k0529l1032n5494P3157p183j1270J5456O0971K9647
$$ y = [30774933, 32117444, 33535920, 34911005, 36334895, 37582646, 38805858, 39813529, 40616293, 41107432, 41421563, 41468626, 41333133, 41027991, 40734940, 40178125, 39559157, 38871866, 38028876, 37044870, 35839637, 34502921, 33028850, 31384302, 29738046, 28015350, 26392019, 24852388, 23379866, 22076573, 20838890, 19760252, 18901632, 18004120, 17307220, 16621202, 15984352, 15501550, 15063777, 14605908, 14258338, 13886138, 13567328, 13301665, 13056523, 12871988, 12640851, 12423293, 12292520, 12172331, 11944011, 11785055, 11683188, 11564199, 11454441, 11337772, 11232685, 11176723, 11076333, 11009998, 10950193, 10902734, 10893481, 10817251, 10768091, 10737315, 10745733, 10702550, 10682021, 10650989, 10595495, 10668652, 10661469, 10650199, 10665655, 10726626, 10756273]
3190A0756273L1516Q7538K9286J3861Q6498N4883J12282J01016Q9758J10097J47360
3179A1620368J75926J53439J12042K10618J93058K32082J92233K22582K32515
3170A3344863K50899J51847K82480K73915K96481K85892K37992K12209L58791
3161A5695369K46736K69460L69189L87614L81338M95083N01435N34058N69593
3152A9449875O16788O27527P21875P07101Q15345P11799O64699N70960M50549
3143B5336518K56697J11995j09678q5097k45498k58034k49506j91521j5752q158
3133B4541966P9242J69006K02359L40030L52765M40890M65098N68592N91811P19655
3123B8471414P08706Q54756Q17987R69321R73256J057071J208968J327182J438360
$$ y = [10756273, 10787789, 10875327, 10904613, 10918474, 11004972, 11059855, 11172137, 11273153, 11362911, 11473008, 11620368, 11796294, 11949733, 12061775, 12272393, 12465451, 12697533, 12889766, 13112348, 13344863, 13595762, 13747609, 14030089, 14304004, 14600485, 14886377, 15124369, 15336578, 15695369, 15942105, 16211565, 16580754, 16968368, 17349706, 17844789, 18346224, 18880282, 19449875, 20066663, 20694190, 21416065, 22123166, 22938511, 23650310, 24315009, 24885969, 25336518, 25593215, 25705210, 25595532, 25510435, 25264937, 25006903, 24757397, 24565876, 24550124, 24541966, 24621208, 24790214, 24992573, 25332603, 25685368, 26126258, 26591356, 27159948, 27751759, 28471414, 29180120, 30034876, 30852863, 31822184, 32795440, 33852511, 35061479, 36388661, 37827021]
3114C7827021J485144J607936J724904J775517J836412J718907J680373J415234
3106E1071448J072245O99207K58945j46093n97170r12866j192845j264836j250978
3097D7737057j254104j104159r64267p54322n33190l05652r7321R0298K16018
3088D3030358M59461N37107O66770Q97875R61705J032633J140020R56412R97428
3079E0679769Q50128P09767N22784J96828p5367l55108o06061q34940j001761
3070E0086039j133430j299054j277914j254949j187175j064561r26566q43658
3062D1098732o13856m63124m46002l21234j89699o5389r603J07566J35942K51158
3052C9484491L55549N40003N89444P85543P72180J039568J107150J196997J355159
$$ y = [37827021, 39312165, 40920101, 42645005, 44420522, 46256934, 47975841, 49656214, 51071448, 52143693, 52842900, 53101845, 52955752, 52358582, 51445716, 50252871, 48988035, 47737057, 46482953, 45378794, 44414527, 43660205, 43127015, 42821363, 42724042, 42814340, 43030358, 43489819, 44026926, 44693696, 45591571, 46553276, 47585909, 48725929, 49682341, 50679769, 51529897, 52239664, 52762448, 52959276, 52883909, 52528801, 51922740, 51087800, 50086039, 48952609, 47653555, 46375641, 45120692, 43933517, 42868956, 41942390, 41098732, 40484876, 40021752, 39575750, 39254516, 39064817, 38999428, 38989825, 39097391, 39233333, 39484491, 39840040, 40380043, 40969487, 41755030, 42527210, 43566778, 44673928, 45870925, 47226084]
3043D7226084J390171J492236J532700J617089J707554J744753J785036J756496
3035F0252119J810905J814121J827271J796229J919227J930754J891070J833347
3027G5075043J796841J557640J426234J122332R68303P90140O38197M97764L42355
3018H4214849P4953j93818o25463r10312j442907j738987k031195k172156k314624
3009G2860340k364380k494827k492747k593673k562852k612948k541417k457484
3001E2740012k319078k122788j856450j717029j431010j184591j034077r13465
2993D0161524p68350p77678q13771r53187j125612j217791j218531j155002r75058
2984C1156544q86693p96670p14158p12862p28704n98661m52738m05503k53143
$$ y = [47226084, 48616255, 50108491, 51641191, 53258280, 54965834, 56710587, 58495623, 60252119, 62063024, 63877145, 65704416, 67500645, 69419872, 71350626, 73241696, 75075043, 76871884, 78429524, 79855758, 80978090, 81946393, 82736533, 83374730, 83872494, 84214849, 84289802, 84095984, 83470521, 82560209, 81117302, 79378315, 77347120, 75174964, 72860340, 70495960, 68001133, 65508386, 62914713, 60351861, 57738913, 55197496, 52740012, 50420934, 48298146, 46441696, 44724667, 43293657, 42109066, 41074989, 40161524, 39393174, 38615496, 37801725, 36848538, 35722926, 34505135, 33286604, 32131602, 31156544, 30269851, 29473181, 28759023, 28046161, 27317457, 26718796, 26266058, 25860555, 25607412]
2975B5607412j40494k59113k54457m37766m64577m33598m02577l64723l79345
2966B2470762l46212k52167k61620k65630k86556k65717k72880k49397k58847
2957B0011736k38931k47463k18371o0535j9627J03024J83359K15469j1144j51084
2947A9566433l36250l57069l70842k63460j18945o3293R731K6387N6003K04945
2937A8353640J34339J80774K87799K81244L40527L68143M13476M70561N64529
2928B1395032P06323P62182P68944P47096O63780N35942N47379N98870O46378
2919B7371926O66770O82083P68680R07549R23899J030049J199977J442297J458025
2910C6451255J265196Q51056R17205J117590J403688J633140J865689J937438
$$ y = [25607412, 25466918, 25207805, 24953348, 24515582, 24051005, 23617407, 23214830, 22850107, 22470762, 22124550, 21872383, 21610763, 21345133, 21058577, 20792860, 20519980, 20270583, 20011736, 19772805, 19525342, 19306971, 19246436, 19226809, 19329833, 19513192, 19728661, 19717517, 19566433, 19230183, 18873114, 18502272, 18238812, 18119867, 18056574, 18066305, 18092692, 18148695, 18353640, 18487979, 18668753, 18956552, 19237796, 19578323, 19946466, 20359942, 20830503, 21395032, 22101355, 22863537, 23632481, 24379577, 25043357, 25579299, 26126678, 26725548, 27371926, 28038696, 28720779, 29489459, 30397008, 31320907, 32350956, 33550933, 34993230, 36451255, 37716451, 38567507, 39484712, 40602302, 42005990, 43639130, 45504819, 47442257]
2902D7442257J971278J869460J678302J197908O11175j15123q27755j522465k076845
2893E0228192k450357k591868k663463k567702k764028l008916k804069k480968
2885B8896821k146161j895099j765439j550338j311432j146552j084198r19689
2877A7077913p95880p61696o58293n71180n46327m23669l99989m14209l66346
2868A2140324k88971k49095k03980k23286k38850l05976k55864k80342j46764
2859I947196k23802k78739k31044r1259j93646j86242r2279q8509p4687j65030
2849H321959m8977n7381q6826n2051q5869J2734o6310j09071m7524m6185k2856
2838G711643o7728j12000p1182l8368k6511o5834o0909K3377O9528J8123K4940
$$ y = [47442257, 49413535, 51282995, 52961297, 54159205, 54770380, 54655257, 53827502, 52305037, 50228192, 47777835, 45185967, 42522504, 39954802, 37190774, 34181858, 31377789, 28896821, 26750660, 24855561, 23090122, 21539784, 20228352, 19081800, 17997602, 17077913, 16282033, 15520337, 14862044, 14290864, 13744537, 13320868, 12920879, 12506670, 12140324, 11851353, 11602258, 11398278, 11174992, 10936142, 10630166, 10374302, 10093960, 9947196, 9723394, 9444655, 9213611, 9122352, 8928706, 8742464, 8650185, 8561676, 8486989, 8321959, 8272982, 8215601, 8128775, 8076724, 7990855, 8003589, 7937279, 7828208, 7780684, 7734499, 7711643, 7643915, 7531915, 7460733, 7422365, 7395854, 7330020, 7269111, 7292488, 7362016, 7380139, 7405079]
2827G405079K2092J5923J4547P4118J02498N8979P9702R1903Q7084O6002J04127
2816H122054J68747R8501N7305J54554R4911R5241N5289M5344J32775J52133R5656
2805I272510J01126O1997O0371J31629J03729Q0065J51496J42223R4334J73005
2795A0372485J38023J31751J40964J63256J44038Q6855J86488K40171J82643K17748
2785A2004422J57841K00781K16445J87295K20465K62028K64711L63853L05122
2776A4182963L43087L72781L35388M70128M06921L21422L81313L96642L20645
2767A7531290M04986L78609M62073M92714N30144N66899O24917N55059N77568
2758B2124259N01491O58958O67366P81030P03705P71130Q25840R50302R77708
$$ y = [7405079, 7427171, 7443094, 7457641, 7531759, 7634257, 7693236, 7772938, 7864841, 7951925, 8017927, 8122054, 8290801, 8389302, 8446607, 8601161, 8696072, 8791313, 8846602, 8891946, 9024721, 9176854, 9272510, 9373636, 9435633, 9496004, 9627633, 9731362, 9811427, 9962923, 10105146, 10199480, 10372485, 10510508, 10642259, 10783223, 10946479, 11090517, 11177372, 11363860, 11604031, 11786674, 12004422, 12162263, 12363044, 12579489, 12766784, 12987249, 13249277, 13513988, 13877841, 14182963, 14526050, 14898831, 15234219, 15704347, 16111268, 16432690, 16814003, 17210645, 17531290, 17936276, 18314885, 18776958, 19269672, 19799816, 20366715, 20991632, 21546691, 22124259, 22625750, 23284708, 23952074, 24733104, 25436809, 26207939, 27033779, 27984081, 28961789]
2749B8961789J101340J170967J343454J362411J509535J663783J671390J884347
2741D0669016K098750K176240K380696K424772K437577K396924K287651K301763
2733E9173389K307156K359933K468705K594836K685092K738177K734547K958100
2725H0019935L409538L972806M598536N191998N757676O341695P008052Q024931
2717A24325167R084021J0131368J0959956J1092787R786374O125923J83510o905914
2709A74783192j2553114j5465424j5537448j4198327j2322182j0639787r123193
2702H4943717p941582p060078o141570n353918m596382l952882l448014l043454
2694D3405837k760765k499257k352093k115531j860290j689262j595066j456587
$$ y = [28961789, 30063129, 31234096, 32577550, 33939961, 35449496, 37113279, 38784669, 40669016, 42767766, 44944006, 47324702, 49749474, 52187051, 54583975, 56871626, 59173389, 61480545, 63840478, 66309183, 68904019, 71589111, 74327288, 77061835, 80019935, 83429473, 87402279, 92000815, 97192813, 102950489, 109292184, 116300236, 124325167, 133409188, 143540556, 154500512, 165593299, 175379673, 181505596, 181689106, 174783192, 162230078, 146764654, 131227206, 117028879, 104706697, 94066910, 84943717, 77002135, 69942057, 63800487, 58446569, 53850187, 49897305, 46449291, 43405837, 40645072, 38145815, 35793722, 33678191, 31817901, 30128639, 28533573, 27076986]
2686B7076986j276497j138315j023519p81632p69283p09559o97717p84667q60455
2677A9035342r36637r76666r14224q56337q03158o95776o54954n84503n42667
2668A2070420n09363m94017m43414m29390m05057m19512k94645l64323l20597
2659H390102k57288k75722k38022k24305k24809j95061k95938j55853j76121j82275
2649F164708j47577k21836j82966j38141j82245j24265j17759j36291j19609j35823
2639D658196j21040p6374j35471r8717j12882q2441j26009j22898p3418j3857
2629C695089r2347j06640r0964m3397r5387q2510r8096o3820o3263J606m1056
2618B919215p3710o0972m9996j03090j7087r134r2406m5262j3515l1632q2214
$$ y = [27076986, 25800489, 24662174, 23638655, 22857023, 22087740, 21378181, 20680464, 19895797, 19035342, 18098705, 17122039, 16207815, 15351478, 14548320, 13852544, 13197590, 12613087, 12070420, 11561057, 11067040, 10623626, 10194236, 9789179, 9369667, 9075022, 8710699, 8390102, 8132814, 7857092, 7619070, 7394765, 7169956, 6974895, 6678957, 6523104, 6346983, 6164708, 6017131, 5795295, 5612329, 5474188, 5291943, 5167678, 5049919, 4913628, 4794019, 4658196, 4537156, 4460782, 4325311, 4226594, 4113712, 4031271, 3905262, 3782364, 3708946, 3695089, 3602742, 3496102, 3405138, 3361741, 3266354, 3183844, 3085748, 3021928, 2958665, 2960271, 2919215, 2845505, 2784533, 2734537, 2631447, 2614360, 2605226, 2512820, 2467558, 2454043, 2422411, 2340197]
2607B340197k1969n4355m7502K081o5680K2358m7680j4790l2703m5621j3668m6286
2595A974382n2296j0389r038l6422l3688m1514p1971m1864j9282l7675l8464j0910
2583A570869n6089K4002M779p1495k8514K1950l054l3397o0899K2816k7041M4969
2571A408896j0360j9366j9998K5685l8527j8551Q076o9790k7383n9849J8099L1342
2559A228274j0647n0424l2186l1841L2483j9601p0361N1643k047k3581n9666K6312
2547A038358J4763K370k7005l833k9450k7207J4901j930k7862L078K0084k2012
2535I54255R602J9779k4500j0872k7129L749L7401l2186l888J293K076L2935K7217
2522I89732o073M5026J016k559k124J8641l4837m613J8464N2937K618k9593j4192
$$ y = [2340197, 2318228, 2263873, 2216371, 2218452, 2152772, 2175130, 2127450, 2112660, 2079957, 2034336, 2020668, 1974382, 1922086, 1911697, 1902659, 1866237, 1832549, 1791035, 1719064, 1677200, 1657918, 1620243, 1581779, 1570869, 1514780, 1538782, 1543561, 1472066, 1443552, 1465502, 1462448, 1429051, 1368152, 1390968, 1363927, 1408896, 1398536, 1379170, 1359172, 1384857, 1346330, 1327779, 1335855, 1266065, 1238682, 1178833, 1196932, 1228274, 1217627, 1167203, 1135017, 1103176, 1135659, 1116058, 1045697, 1097340, 1095293, 1071712, 1012046, 1038358, 1053121, 1055491, 1028486, 1024653, 995203, 967996, 982897, 980967, 953105, 956183, 976267, 954255, 963857, 983636, 959136, 948264, 921135, 924884, 962285, 930099, 926211, 927504, 929580, 962515, 989732, 983659, 1028685, 1029701, 1027142, 1025018, 1043659, 1008822, 1004209, 1022673, 1075610, 1078228, 1048635, 1034443]
2509A034443M7616L2201L5796L936Q0391k4543L6987N0596L5153Q797J8696K9085
2497A389154j3029m0178p2818p8705p0724q3530L331m6068q8802m3327j0764o0418
2485G84122J2744n0888n6307K0969K923o4091O706j8258l3404l9572J9910l2561
2473E52293K0481l1671L500m4545O3888l5651n3463J1130r210J9577P370l6536
2461D67163r686k6913k4258K1898j8238m7855L5302p464L1564m9041r752j3389
2449C49331J5456j9802l4943K713l4132M3427M7727k1268k3461q293J525L486
2437C21766o927n214J9183m8383p6927N3769P74n173J7798o484o3825Q621J9288
2424B28266M2890N130l1622P207o071j7798j2978k1418L6744L1510K774m3346
$$ y = [1034443, 1082059, 1114260, 1150056, 1153992, 1234383, 1209840, 1246827, 1297423, 1332576, 1341373, 1360069, 1389154, 1376125, 1335947, 1263129, 1184424, 1113700, 1030170, 1033501, 987433, 898631, 855304, 844540, 784122, 796866, 745978, 689671, 710640, 713563, 649472, 656178, 637920, 604516, 564944, 584854, 552293, 572774, 541103, 544603, 500058, 563946, 528295, 474832, 485962, 476752, 496329, 503699, 467163, 457477, 430564, 406306, 428204, 409966, 362111, 397413, 389949, 421513, 372472, 362720, 349331, 364787, 344985, 310042, 312755, 278623, 322050, 369777, 348509, 325048, 316755, 318280, 321766, 314839, 309625, 328808, 280425, 203498, 257267, 258041, 252868, 270666, 264182, 200357, 208978, 228266, 271156, 276286, 244664, 251871, 245800, 228002, 215024, 193606, 230350, 261860, 264634, 221288]
2412B21288l8820K1359M8177m6686R869K9135k9375k4379j0895J7631j3524k5870
2400A57910J126K544L6266m3531K7936k5667L695L9200O283k0264j9322j6067
2388A50109n1933j1074M4443r58k0611J0828L0450J2298k944l4994K4182L4841
2376A84637k6661J5275k7637J9292j1959k6282K4971j549K8394l5799J745k5203
2364A19224J9262n2885P1936L0286o0071j718M4222l4177L6023k8380k1766j2361
2352A09595n154o689N5827k3004l7575m732K5591k2840m308N1223J6370J1714
2340A66018j0885j5980J4563N3264K6558o4116l2998O498n2529k4348r528P015
2328F3532P1837n3872J3986k5780N25j1250O4752m0880k5292J3853J0832k2744
$$ y = [221288, 182468, 203827, 252004, 205318, 215187, 244322, 214947, 190568, 179673, 197304, 183780, 157910, 159036, 161580, 197846, 154315, 182251, 156584, 160279, 199479, 205762, 185498, 166176, 150109, 98176, 87102, 131545, 130587, 109976, 120804, 151254, 163552, 160608, 125614, 149796, 184637, 157976, 173251, 145614, 164906, 152947, 126665, 151636, 150087, 178481, 142682, 144427, 119224, 138486, 85601, 157537, 187823, 127752, 126034, 170256, 136079, 172102, 143722, 121956, 109595, 104441, 97752, 153579, 130575, 93000, 88268, 113859, 91019, 86711, 137934, 154304, 166018, 155133, 139153, 153716, 206980, 233538, 169422, 136424, 142922, 90393, 66045, 56517, 63532, 135369, 81497, 95483, 69703, 70228, 58978, 123730, 82850, 57558, 71411, 82243, 59499]
2316E9499p508N0846n4777L9092N115P081K2657o6793j8905j473L7057J4921k5320
2303F1492J7017K9980j3739k1048K8826o8254j4106L428M5266K5710p302j1974
2291G5296j1653j2385K6299k7438j3410K1549l048L3274J5101k4786j0749j4233
2279E3817K0595j4593j1743O482P36m019k2815J4583K3320n0139K0835L294N557
2266D5910J1314l379k2079n212K6943K8385n3773L3916m0635n250O021K2787J2144
2253E7092M040j5330J3425J5396m495j2333M2064m5527L5548M0923p1852J847
2241F0798r366L865K6031K8153J391j8034k0262O809J4161k2579p45K8057k0251
2228G8028q154J5064L7662k1864J9837N2272k8625k0702j3709P613r657l39l5092
$$ y = [59499, 51991, 102837, 48060, 87152, 92267, 99348, 122005, 55212, 36307, 34834, 71891, 86812, 61492, 78509, 108489, 94750, 73702, 102528, 34274, 20168, 23596, 68862, 94572, 87270, 75296, 63643, 51258, 77557, 50119, 36709, 58258, 55210, 88484, 103585, 78799, 68050, 53817, 74412, 59819, 48076, 54558, 55294, 51275, 28460, 43043, 66363, 16224, 37059, 40353, 45910, 57224, 53845, 31766, 26554, 53497, 81882, 28109, 62025, 21390, 16140, 22161, 44948, 57092, 61132, 45802, 59227, 74623, 70128, 57795, 99859, 54332, 89880, 130803, 58951, 60798, 51432, 55297, 81328, 109481, 110872, 92838, 72576, 79385, 93546, 70967, 70222, 98279, 78028, 69874, 84938, 122600, 100736, 120573, 172845, 144220, 123518, 109809, 117422, 107765, 107426, 72334]
2215G2334O0441r801K4107K0101k7078L302M4509n0768l866k1170M8150K8353
2203A88614k762J9106K0312j4687l39N0447l8932J9137L8262p0841k7158O4851
2191B46010K7167M051L0484l170l492l0047P731j0016K1814j4836L3600j2233
2179B97063n712R294N0242N1157j5239k3050N4091L6795l418P3752l476N1501
2167E73000J8367J5662N4229L2794R4418O1015L6986L0768O3686J11282O284q569
2155A089922R6764J25724J9118O7392l6586P1709O6332J75678J26130J58079O3810
2144B024072J10533J30282K84004L04268M76366N94065Q55160P91826J214979
2135F785555j0506j477700j313765j058131n76271m44043k75666k83874j39837
$$ y = [72334, 132775, 122974, 147081, 167182, 140104, 143406, 187915, 137147, 133281, 112111, 160261, 188614, 185852, 204958, 225270, 210583, 210244, 260691, 221759, 240896, 279158, 208317, 181159, 246010, 273177, 277228, 307712, 304542, 301050, 271003, 278734, 268718, 290532, 275696, 309296, 297063, 291351, 300645, 350887, 402044, 386805, 363755, 417846, 454641, 451223, 524975, 521499, 573000, 591367, 607029, 661258, 694052, 788470, 849485, 886471, 917239, 980925, 1092207, 1098491, 1089922, 1186686, 1312410, 1331528, 1398920, 1362334, 1434043, 1500375, 1676053, 1802183, 1960262, 2024072, 2134605, 2264887, 2548891, 2853159, 3329525, 3923590, 4778750, 5570576, 6785555, 6775049, 5297349, 3983584, 2925453, 2349182, 1905139, 1629473, 1345599, 1205762]
2126A205762j51854r2074r5833r4093n4006p3734p7692p5221m8311l5725l3192
2115C74027j0809k0601q554l7553j6327l8927j5325l9068R782L204k397O899l2538
2102A71813k9698m2519n6242M6355K8415K5137m8220o333O6279l5298m885j8279
2090I6525j3130L0033m9787J954J6480j7650j383j9666k1920K2956l2242J3210
2078B5380M8475j3864K5284k291m8160k8860P046R075M814j3484j3468M6622m886
2065D1683m0417M1999j5348J5367r332m1022l9293L2705l199L9673K0613l0648
2053A2781l7389N0925l4032k3256K4404J0468o728l2185L262l9260N9325k2207
2041c3892N507L0104K562o8918K8437J9007J83k2242m2746N5388O8849q4702P54
$$ y = [1205762, 1053908, 961834, 866001, 771908, 717902, 644168, 566476, 491255, 442944, 407219, 374027, 363218, 342617, 334063, 296510, 280183, 241256, 225931, 186863, 196645, 199849, 197452, 204351, 171813, 142115, 99596, 43354, 89709, 118124, 143261, 95041, 88708, 154987, 119689, 114804, 96525, 83395, 113428, 63641, 65595, 82075, 64425, 63042, 43376, 21456, 44412, 12170, 25380, 73855, 59991, 85275, 82984, 34824, 5964, 13010, 22085, 26899, 13415, -53, 46569, 41683, 1266, 43265, 27917, 43284, 33952, -7070, -46363, -13658, -16857, 22816, 43429, 12781, -24608, 26317, -7715, -30971, -6567, 3901, -2827, -35012, -31750, -71010, -11685, -33892, -28385, 1719, 4281, -64637, -36200, -17193, -17010, -39252, -81998, -26610, 42239, -42463, -41709]
2028d1709L1285Q784L9505j9288m3696k2245L1463N46K233n012N514j4680j1711
2015c9011k3841q789J8229J7205l1223k889l605O8951o8113M4852l6926P1306
2003F146K0267j9535l9241K0863L2444m6882K9457n3062j7332K4792m231J9911
1991b6403j5559J6722L835q511J5799k2035j7326L6867m457k2551m417j4709P786
1978e4959j2691N7453Q832j9331j0437P172K95l0807j7886N527N1765m0626j7274
1965g2967n351M720N4063p811L6144r299l4027k3479L0863j5569J2669L7512L3033
1952D0501m0398K8839m7960l390k5526N7476q326m7164L104O751k7957N0702L3152
1939A9804k5618o1290R969o166M0173P7543m5707n9801J828N2862j3452m3932
$$ y = [-41709, -10424, -1640, 37865, 18577, -25119, -47364, -15901, -15355, -13122, -18134, -12620, -27300, -39011, -62852, -71641, -53412, -36207, -67430, -70319, -73924, -4973, -73086, -28234, -65160, 6146, 26413, 6878, -32363, -11500, 20944, -25938, 3519, -49543, -66875, -42083, -46314, -26403, -41962, -25240, -21405, -29916, -14117, -36152, -53478, -16611, -21068, -43619, -48036, -62745, -54959, -67650, -10197, -1365, -20696, -31133, -23961, -23666, -54473, -72359, -66832, -15067, -55693, -72967, -78318, -73598, -19535, -27346, 8798, -501, -34528, -58007, -27144, -42713, -30044, 7468, 40501, 103, 28942, -19018, -22408, -47934, 9542, 1216, -45948, -42844, -36093, -64050, -13348, 19804, -5814, -67104, -57135, -63301, -23128, 54415, 8708, -51093, -49265, 3597, -9855, -53787]
1927e3787J3682j4530L9327j6952r427J540k6210j0104M5313j907m2187M1935
1915c3307k5921M3958o220m4684L5786M429L4627j236m4230R218J4263J3030n9843
1902f0130j2121M8360J1529j1249r149L2179K7648j0398m7689m8856j514R301
1890g2089j5613N3718J071K2784k550k110l8576l3861K5415p053N0567n0880K8928
1877d0249l7466j1767Q3209l0463L8280n0918j4160o647K8259q099k7850K5045
1865e2826P733K9778J6274k5836J3534n683j5462p6728M2744L2409k5094J8477
1853d0680K818k840l3846M7084j2572L2045k5263K1795o071k0966q3L552K8211
1840f816j9491K6858k5007J4275J2166n9107K4370L819O772k7746R284m3008K9833
$$ y = [-53787, -40105, -54635, -15308, -32260, -41687, -40147, -66357, -76461, -31148, -33055, -75242, -33307, -59228, -15270, -21490, -66174, -30388, -25959, 8668, 7432, -36798, -27580, -13317, -287, -60130, -72251, -23891, -12362, -23611, -32760, -581, 27067, 16669, -31020, -79876, -81390, -72089, -87702, -33984, -32913, -10129, -12679, -14789, -53365, -87226, -61811, -68864, -18297, -69177, -40249, -77715, -89482, -6273, -36736, 1544, -49374, -63534, -70181, -41922, -50021, -77871, -52826, -45093, -15315, 959, -24877, -11343, -17026, -32488, -109216, -66472, -34063, -59157, -40680, -37862, -40702, -74548, -27464, -40036, -7991, -33254, -11459, -17530, -38496, -38579, -35027, -6816, -26307, 551, -24456, -10181, 1985, -57122, -32752, -28933, -22161, -49907, -40623, -83631, -53798]
1827e3798L439K5589j7100j060R426J953Q247J9503l2882L2553k6198l9449K0729
1814d9048M2495M115m3089M5295k345m9921O378O347O771k7425R218j0327L9622
1801b1914j4106l2970K0410K093k2550N4056L25n7509L227k9895M2818M7039j7731
1788b6707k8114O673J1587k5854m109r874P1848n1545j4041M3139j0516k0482
1776e7995r641k171N6321K4467m6174q159J3902j2695L4061j6236j113n1181K3259
1763e3355J2044J4300K9836l5753o43j9973N2089k9090K4071j1377l6828K0946
1751c3733K6895l4771j7458L6771k3757L0463p859l3704O0563p4817p915J1879
1739f7443K0699k0887J0545J5027n020K2055j8787j3444M1316j9496o060j3549
$$ y = [-53798, -50359, -24770, -41870, -42930, -33504, -31551, -23304, -3801, -36683, -4130, -30328, -69777, -49048, -6553, -2438, -45527, -232, -2577, -52498, -46120, -39773, -33002, -60427, -51209, -61536, -21914, -36020, -68990, -48580, -46487, -69037, -14981, -14656, -72165, -68938, -98833, -56015, -8976, -26707, -54821, -48148, -36561, -62415, -66524, -76398, -4550, -56095, -70136, -26997, -37513, -57995, -67636, -69807, -13486, 10981, -35193, -43352, -29450, -42145, -8084, -24320, -25433, -76614, -53355, -41311, -27011, 2825, -32928, -33571, -53544, -1455, -30545, -6474, -17851, -54679, -33733, -6838, -41609, -59067, -22296, -46053, -15590, -23449, -57153, 3410, -71407, -79322, -67443, -46744, -67631, -57086, -42059, -47079, -25024, -43811, -57255, -15939, -35435, -41495, -55044]
1727e5044K3703Q148K0569m6755k6376K4658J4562M4808m0706k436m7607L720
1715g8756R7558m2303j2146j4100R161l685K0368k1451p83m561k0255p78J0690
1702f1041L1442J6425l4579L8833n03n9475J7268M8707k0439R284Q693j7127K9704
1689G192k9099j1416j9344k661K925j358j9749P472N275O677j3081m5411P5037
1676c7541j5238k6707K0770N196J5196o610K6869l2622j4650L2577o7045O7114
1664c2691M016Q789K7259J0496m7836l553k053K7690P36P082r341K2208j610j7566
1650f374k5606k1303M4592j5471P715l0489l1j9982J3212l5240j7939M774L7570
1637f4572K9661L8755n7912j1125N179L2196o806L0950o5706l670P1358l6886
$$ y = [-55044, -31341, -23193, -2624, -49379, -75755, -51097, -36535, 8273, -32433, -34869, -82476, -78756, 18802, -23501, -35647, -49747, -40586, -44271, -23903, -45354, -46137, -50698, -70953, -71731, -61041, -29599, -13174, -47753, -8920, -9423, -68898, -51630, -2923, -23362, -14078, -5385, -22512, 7192, -21907, -33323, -52667, -55328, -52403, -53761, -73510, -66038, -60763, -54086, -67167, -112578, -37541, -52779, -79486, -58716, -53520, -38324, -44934, -18065, -50687, -65337, -32760, -99805, -32691, -28675, -19886, 7373, 17869, -29967, -33520, -35573, -7883, -7147, -65, -9406, 12802, 11192, -6374, -31980, -53283, -8691, -24162, -16447, -46936, -46967, -66949, -53737, -88977, -106916, -102142, -64572, -34911, 3844, -54068, -65193, -60014, -27818, -34624, -3674, -69380, -73050, -1692, -38578]
1625c8578l2061R44m921L5342J1103L509R491j1390l798Q900K1117j7857n648
1612b3847j9080L9767L7210p7423k9387K9987J8475K285l6058j8004L5231J7057
1600b3787j5178K8063m671K3964l4173m0280K6855k611j9869M8093J8155k8911
1588b4350Q051l518l1291j960J4743M055L1347j0538l6826K6195L4055j8753o1214
1575g0004j1958R1048j6183p0298M5501Q011J7643k6460l4629L5764L705L7403
1563I543K753J5669n1877j5885p222N0211P498k1403m5069J101P140N6835m6875
1550c7581o2410N5423l155K6072l1483p447J561k539M313J2866K7629l4932k652
1537e4335l9415J0032L9366j139j3912j475o254J3650j831m1509O3881j4492M1979
$$ y = [-38578, -70639, -69695, -74616, -39274, -28171, -24662, -15171, -26561, -30359, -21459, -342, -18199, -23847, -42927, -3160, 34050, -43373, -72760, -42773, -24298, -22013, -58071, -76075, -40844, -23787, -38965, -10902, -15573, 8391, -25782, -66062, -39207, -41818, -61687, -13594, 4561, -24350, -16299, -19817, -51108, -53068, -38325, -34270, -2923, -13461, -50287, -24092, 9963, -8790, -70004, -81962, 9086, -7097, -77395, -31894, -23883, -6240, -32700, -67329, -31565, -27860, 9543, 12296, 27965, -23912, -39797, -47019, 3192, 10690, -10713, -55782, -54681, -47541, 9294, -37581, -99991, -44568, -47723, -21651, -53134, -60581, -59020, -61559, -57246, -44380, -16751, -51683, -54335, -93750, -83718, -44352, -45491, -59403, -60878, -67132, -53482, -55313, -96822, -32941, -47433, -5454]
1524e454j8502L0170n9163K5882M3610l8598q594Q28q694j526K3663k5673K8134
1511a3917K0735n6142P416j3478P311j2165k631P0140m3959n2768L2965O6953
1499A0460j1538K3003l6821k2821j9164Q5215j0209k7912k3154k6340O6614O0233
1487F7566l9792q0637J6126Q931J1357M8715j5823m3382Q510l4055P147J748k6159
1474f9748l20j721J3423j5477L4721p160k7342M111M0679K4805J7695p238k2214
1461a5786k5321L6600m328m9804J6600L1939m0173K3391J0614m8941K9672J4118
1449b1419k6926m1068M9143l395J8909M5907l9194L5070L6629q9200K9558L5363
1437B9377l9188j3982l6617N926M3351l2988K2663j1231m4919K2214L9069k9108
$$ y = [-5454, -23956, 6214, -52949, -27067, 16543, -22055, -30649, -29821, -38515, -40041, -16378, -42051, -13917, 6818, -49324, -41908, -55386, -48075, -60240, -62871, 7269, -36690, -89458, -56493, 10460, -1078, 21925, -14896, -37717, -56881, 28334, 18125, -9787, -32941, -59281, 7333, 67566, 27774, -52863, -36737, -27806, -16449, 32266, 16443, -26939, -18429, -52484, -45337, -43589, -69748, -70068, -71789, -58366, -73843, -39122, -46282, -73624, -69513, -28834, -4029, 13666, 6428, -15786, -41107, -4507, -8835, -58639, -42039, -10100, -50273, -26882, -16268, -65209, -35537, -21419, -48345, -89413, -40270, -43665, -24756, 21151, -18043, 17027, 53656, -35544, -5986, 29377, -9811, -23793, -60410, -54484, -11133, -44121, -21458, -32689, -77608, -55394, -16325, -45433]
1425d5433J9767o5944K5755R1964o4649m3359R658K9065j8796K6854p505Q060
1413c4563n111j8822j6324K2805L4683k6185O9959r963o4713L8383L1355o9648
1401d8144J2606K631k4352N6243l7907K6541k760l241k0029l1888N8777R889k6637
1388b8271N056R722K7361J279o2932K4537j025J0073J3432j1654M002L3942k1298
1375D224J2808k3628K058l2183K7758P313q655K7788n940l6416r353M6920l4792
1362b2098M5418j7889j0278L5626r334j4522J3793j4383k9528N3773j8376n1472
1350c9270l2349N9106J9996l7761K5595J9126j1645J6781l5605j1452M4068j3782
1338B808l0798J1136L6835J131o6852O0492n6453j5774J4088r05K7259o884K5792
$$ y = [-45433, -25666, -91610, -65855, 26109, -38540, -81899, -72241, -43176, -61972, -35118, -42623, -34563, -39674, -58496, -74820, -52015, -17332, -43517, 26442, 16479, -48234, -9851, 21504, -48144, -35538, -32907, -57259, -1016, -38923, -12382, -15142, -18383, -38412, -70300, -11523, -1634, -28271, -23215, -13493, 13868, 15147, -47785, -23248, -24273, -14200, -768, -12422, -8420, 25522, 4224, 17032, -6596, -4538, -36721, -8963, -1650, -10305, 17483, 11543, -24873, -34226, 12694, -22098, 23320, 5431, -4847, 30779, 21445, 6923, 20716, 6333, -23195, 30578, 12202, -39270, -71619, -12513, 7483, -30278, -4683, 14443, 2798, 19579, -16026, -27478, 16590, 2808, -27990, -16854, 19981, 21112, -45740, 14752, -41701, -57475, -43387, -44292, -17033, -23917, 1875]
1325A875J0977L075J8281k9638j8962J0633k751O067l1075L7915k823J210K6622
1312C1406J0964o410j990k8340l8621L1720l7098p6223M3555N7737K2387m2442
1300c3355M400r279R716l710N820J3250m2812K0397N9496l264k9832l6599P7273
1287C1501n0091n4155L7476M8176j5670n8530l80O1272m16k2927L7227k1065K1680
1274A4098k5002k7564Q5810m245q3670J8460M593j8850J9402o797K5438m1327
1262c9654j1543K1017K682k274K9732j6930J7190K2065k4867K4365k7872O841
1250G52j2791m156K3312J4459q191l197n2682R304M1697j9198L1714n0409J7298
1237a2088l2052K0670J0662J4996m194m6150k5036P3129M934Q966j5962K6068
$$ y = [1875, 12852, 15927, 34208, 4570, -14392, -3759, -6510, -443, -31518, 6397, 3574, 4784, 31406, 42370, 35960, 33970, 5630, -32991, -1271, -38369, -114592, -71037, -13300, 9087, -33355, -28955, -38234, -28518, -32228, -26408, -13158, -55970, -35573, 23923, 20659, -9173, -45772, 31501, -18590, -72745, -35269, 12907, -2763, -61293, -61673, -401, -817, -23744, 13483, -7582, 14098, -10904, -38468, 47342, 43097, -40573, -22113, -17520, -36370, -16968, -23765, 1673, -39654, -51197, -30180, -27498, -29772, -40, -16970, 220, 22285, -2582, 21783, -6089, 752, -12039, -16195, 7117, 21576, 13385, 10188, -42494, -33190, 8507, -10691, 21023, -29386, -12088, -44140, -23470, -12808, 2188, -2006, -48156, -73192, -63, 4871, 13837, -2125, 23943]
1225B3943n0610J500k6610K5634J3538j5734K3949j3057O21K3280L4602o6704
1213b5648Q484J7608K7437l8381k5730R806O025J4987j0689l2295L9135k070J4685
1200C354j7603R310l4038L3038k1320K1737j2217K0109K5600k8396n845k001k6596
1187c4868j9455J0974N4411L1111k7788K9923m2688K6050j7892m427k6533l426
1175b4608J6996n50N5686l2131j3218j7800R742J9927L8943p576J6144k7029n5560
1162b1034J6709m5264J941L1K0544K0834j5955L052J775R441J619K2087j2285
1149C495n3531J1362Q4528q938K447r397j6892k2287l5623K6092P8365k6442l2239
1136I40k6553k1818r096J1859K7889k5787J4930J6093r495L3941Q644j9523k2136
$$ y = [23943, -26667, -25167, -51777, -26143, -12605, -28339, -4390, -17447, -16826, 6454, 41056, -25648, -17164, 444, 27881, -10500, -36230, -26424, -20399, -5412, -16101, -48396, -9261, -11331, 3354, -14249, -4939, -38977, -5939, -27259, -5522, -17739, 2370, 27970, -426, -6271, -8272, -34868, -54323, -43349, 11062, 42173, 14385, 44308, 1620, 27670, 9778, 5351, -21182, -24608, -7612, -8162, 47524, 15393, 2175, -15625, -5883, 14044, 52987, 45411, 61555, 34526, -21034, -4325, -49589, -47648, -47617, -27073, -6239, -22194, -19142, -17367, -7926, -6307, 15780, 3495, -50036, -38674, 45854, 36916, 39363, 29966, 13074, -9213, -44836, -18744, 59621, 33179, 940, -25613, -47431, -56527, -44668, -16779, -42566, -27636, -11543, -21038, 12903, 21547, 2024, -20112]
1123b0112l8911m283R557J5546N9538J1578O606n1346M1752r495j977l234k6130
1110a0911J8313l0831L9373j3746M474k0930K036M9346k2672r231k6236J0497
1098a0518j0417K9393J6862n9512J7773k0623R183O773N400J1888J0174M5119
1086E1495l5528j5523m3548M6387j2182l794N1314m7975r086M304p07J1836j9397
1073b2404j2824M0214N911k2882O013J9914j6580L7897n202N887L509k2925K0763
1060C7291m2922J4799j6370k4450l5669K3096M2123m4430K1048K9846k432l4938
1048c3008o978K3802J486P749K7146j7946k5428j0984K8729K0825k0865J2710
1036G238J9207n0723K4629j622p18l3900k113K5060L0928l2288k4003k2348L5321
$$ y = [-20112, -59023, -63306, -53749, -38203, 21335, 32913, 39519, -11827, 29925, 20430, 18453, 15219, -10911, 7402, -23429, 15944, 2198, 6672, -14258, -12222, 37124, 14452, 5221, -21015, -10518, -20935, 8458, 25320, -34192, -16419, -37042, -27859, -21086, -15686, -3798, 6376, 51495, 15967, 444, -43104, 3283, -8899, -12693, 38621, -9354, -18440, -14136, -14843, -3007, -22404, -35228, 4986, 10897, -11985, -5972, 13942, -2638, 35259, 30057, 35944, 39453, 16528, 37291, -5631, 9168, -7202, -31652, -67321, -44225, -2102, -46532, -25484, 4362, 1930, -33008, -39986, -16184, -14698, -6949, 20197, 2251, -23177, -34161, -5432, 15393, -5472, 7238, 26445, -24278, 351, -1271, -1989, -35889, -38002, -12942, 17986, -14302, -38305, -60653, -25332]
1023b5332K9356j2834L685J2123m444K552o1764O816P3790r086n3605J2861L3555
1010G673l381j5581K6818l078J4090J7765l1174j5097J7713L2649l4368k7983
998a3954P312j6040k7152K2203o906L089L5122K4446J909M374m9062N46J3787
985c26J1259M4634l9376k2268k0816Q684j4616L634j0331M1296J1880l9585L6928
972A0997L743J2222j4900J8711j3069l1533K3126j7953l5497Q619M3929L1012
960C9407l9556L147R909k2298K3974q466J0267n437P302j107M143l8911n29J2582
946e573j3151J4997K8965J9428j4400j8505k4381L3667L4596l4595l2985K2561
934A0624m9329K6330O733l2407k64J2531K2648k2708j6810J2343L4100K3781k8375
$$ y = [-25332, 4024, -8810, -5125, 6998, 2554, 5106, -56658, -49842, 23948, 14862, -38743, -25882, 7673, 4292, -11289, 15529, 12451, 26541, 44306, 13132, -1965, 15748, 48397, 14029, -13954, -6642, -22682, -49834, -27631, -34537, -31448, 3674, 28120, 30029, 34403, -14659, -14113, -326, 10933, 55567, 16191, -6077, -26893, -18209, -32825, -29191, -39522, 1774, 13654, -25931, 10997, 14740, 26962, 12062, 30773, 17704, -13829, 9297, -8656, -44153, -35534, 8395, 39407, -149, 2998, 12907, -9391, 14583, 6117, 16384, 10947, 18249, 17142, 21285, -17626, -18155, -5573, -18724, -3727, 25238, 44666, 30266, 11761, -12620, 21047, 55643, 21048, -11937, 10624, -38705, -12375, -5642, -38049, -38313, -25782, -3134, -25842, -42652, -30309, 3791, 27572, -803]
921h03k8652L4865J2319P392l098m9954M2944O4026n7881o9787j587L6269K2934
908H987p371K1804k6321J3197Q813J4241K2304l6670K376o201j1907o91k1846
895a9285n1404P5019M4669l0075J1986J153j0529l9855K9136l3848N3083j4790
883A5260k9177L5517J6785k139k6654k3605N3840J0824k4206J5617o4989l1942
871e4869O4347N608L4331n6447O119Q0593k4313k1080l7999J8403L800j2590Q920
858A4823Q82j6487K0515l8295L0445m0105j192K1596K3918m9817l2101L513K7734
845c4571L8271M003N860K5485p702j7661J2306J2308J2514j934L32k8793L6316
832E6734m3200j4008q183l2723M690J9500k670k315N2225j5751j7013L8347k1700
$$ y = [-803, -29455, 5410, 17729, 25121, 22023, -27931, 15013, 79039, 21158, -48629, -50216, -13947, 8987, 1616, 23420, -2901, 10296, 19109, 33350, 55654, 18984, 21360, 15159, 3252, 2561, -19285, -70689, 4330, 48999, 18924, 30910, 32063, 21534, -18321, 10815, -23033, 30050, 15260, -13917, 21600, 38385, 36246, 9592, -14013, 39827, 50651, 26445, 42062, -22927, -54869, 9478, 15086, 49417, -7030, -911, 79682, 55369, 34289, -3710, 14693, 18493, 5903, 14823, 15705, -782, 19733, -18562, 11883, -28222, -29414, -7818, 16100, -33717, -65818, -62305, -34571, 3700, 7703, 13563, 39048, 31346, 13685, 25991, 38299, 50813, 48879, 49211, 20418, 56734, 13534, -474, -8657, -41380, -36690, -17190, -19860, -22175, 30050, 14299, -2714, 35633, 13933]
819A3933j7078J1370J4113m8467J5345J0287J7227k80P597N459n3711K5926K4146
806B5867l6614q061R954L6965j1534J7736l563L7001k585k4911m4140L0971n353
793B1733J6237j6165n0027P168N7898l8223K3642j5006L933N4133j4080l5339
781A5904j3343K0484J7550K8096o7299J7646l081j0220k6906M6152J0211k9472
769E722j1720l7305J3045J2853L3495m217p90j447J0738J1365J0261j2771k6267
756B962K8907P832K5503m8165q663L9063j7631j7520J4226q332n6753L1335K0487
743A3251N905N6040n3876j6771O009L1711n3566K5852l349j2995l0504N2636M047
730B4390p090J2782l8831j7227N3676k5287P061m542L0921L8558j1712k4090J9182
$$ y = [13933, -3145, 8225, 22338, -26129, -10784, -497, 16730, 16450, 24047, 29506, -24205, 1721, 25867, -10747, -18808, -8854, 28111, 16577, 34313, 30750, 67751, 65166, 40255, -3885, 27086, 21733, 37970, 21805, -28222, -21054, 36844, -1379, 22263, 7257, 11190, 65323, 51243, 15904, 2561, 23045, 40595, 68691, 1392, 19038, 15957, 5737, -21169, 24983, 35194, 5722, -5998, -43303, -30258, -17405, 16090, 11873, 11083, 9636, 20374, 31739, 42000, 29229, 2962, 31869, 39701, 65204, 17039, 8376, 47439, 29808, 12288, 26514, 18182, -38571, -7236, 13251, 19156, 75196, 21320, 4549, 10558, 42269, -11297, 14555, 11206, -1789, -32293, 20343, 24390, 17300, 30082, -8749, -25976, 27700, 2413, 9474, 4932, 35853, 74411, 62699, 38609, 57791]
717E7791j1446p279j3592m3590K0076J3107J0105j3749j4855L9880J4947l1358
705B0037n2822N4547n0655M270L8382r316K5329O7284n0020J0990L833m4571J0499
692B7787n0186N690K7552J1011k9056R112l151l509J1661M3588k7285J3456L0266
679F6936l0793l196j6521L5846L1522q3840m1261K354O2001j4257M601K3729k5722
666A1399K820Q945j3625j5053k2234L2692J3840k9747O7992K6482m3419l6477
654C615M8671k1144l1356J3790m0405l9207J3940N3518n9974M5072M2793j9056
642A0257J3361R807j122p160K4745n2627K5917L2386N5l6050m358O1652p9145
629b282M3286m740J417l3880L5627L5518l4741J8082M6780m2279K2n4769Q776
$$ y = [57791, 46345, 39066, 25474, -18116, 1960, 15067, 25172, 11423, -3432, 36448, 51395, 20037, -32785, 21762, -28893, -24623, 13759, 4443, 29772, 97056, 47036, 58026, 61859, 17288, 27787, -22399, -16709, 10843, 21854, -7202, 1910, -1241, -4750, 6911, 50499, 23214, 36670, 66936, 36143, 32947, 16426, 52272, 83794, -46, -41307, -38953, 23048, 8791, 13392, 37121, 11399, 14219, 23164, 9539, -5514, -27748, 4944, 18784, -10963, 57029, 83511, 40092, 3615, 52286, 31142, -214, 13576, -26829, -66036, -52096, 1422, -58552, -13480, 29313, 10257, 23618, 33425, 32303, 25143, 49888, -2739, 23178, 55564, 55619, 19569, 15211, 76863, -2282, 41004, 36264, 37681, 3801, 39428, 74946, 40205, 58287, 105067, 62788, 62810, 8041, 16817]
616A6817j2218J6561L3384k0682k2505K0309j6256l940J4264L4816l356l0876
604B6318o411J8843N910k5645L2050K0965j2600n1977L0862m928P34L627M638
591D2386J0958J6773K4684n8752K1580m1499J9696L472K2773N330k8642J6037
579E4796k7381o240j0092J1177N5005j2781m080J715N807q550l1689J1820K1622
566F1129J4304k6377O1395k4948l9755j3243K745Q113K5552p791j4625m1766K7482
553C2215L5879l1039n3774L7592k7853K7482M2332N957Q096j8335m52N069l0182
540C2987k4776K6331L0723j1873J9242p0496k9658J3606K1486K3050k2795K4428
528C2255J4702M454R038j2301J0868O437r321j5616J9039R814n9788M6646j0073
$$ y = [16817, 4599, 21160, 54544, 33862, 11357, 31666, 15410, 11470, 25734, 60550, 57194, 26318, 19907, 38750, 44660, 19015, 51065, 72030, 59430, 7453, 38315, 33387, 34121, 37748, 42386, 53344, 70117, 94801, 36049, 57629, 16130, 35826, 39298, 62071, 67401, 38759, 54796, 27415, 21175, 11083, 22260, 77265, 64484, 60404, 62119, 67926, 59376, 27687, 39507, 61129, 75433, 49056, 110451, 85503, 45748, 32505, 35250, 43363, 68915, 61124, 46499, 4733, 32215, 68094, 37055, -16719, 20873, -6980, 20502, 62834, 68791, 76887, 58552, 58100, 63169, 32987, 8211, 34542, 65265, 53392, 72634, 2138, -27520, -13914, 7572, 30622, 7827, 32255, 46957, 51411, 60449, 48148, 59016, 65453, 56132, 40516, 59555, 69369, 9581, 56227, 46154]
515D6154k5448j8170Q9587J1692o8264l820J961l9074J813j763J2409k333K3351
502B8095L867K451J1367O833k7982N447N786m4961j4962O0630j8138L4857N1781
489A05071l6206M596l0622O693j2740o400k3569K4906K6778m7492J0446K6412
477D7873o6923M3269L5572k5807j2938K578M0160l893l9380M0401n6664l177M3782
464D4853K4617q756L2559o3448P662J9333m272j8253P568l3053m254J8334K1168
451D4058J0073m9451O8978j4135m3030J1654L1128K3543J6967k6710j2221O751
439F7605O381L821m1468L1689r426m5662K3024q833K1081M141l3602o5740M8678
426A689J12400l4966N079q161n5047j069J3232k3510O124L2670K822q364P318
$$ y = [46154, 20706, 2536, 92123, 103815, 35551, 31731, 33692, -5382, -3569, -5332, 7077, 4744, 28095, 31962, 34413, 45780, 52613, 24631, 30078, 35864, -9097, -24059, 36571, 18433, 53290, 105071, 68865, 73461, 42839, 49532, 36792, 30392, 6823, 31729, 58507, 11015, 21461, 47873, -19050, 24219, 59791, 33984, 21046, 23624, 63784, 59891, 20511, 60912, 4248, 1071, 44853, 69470, 60714, 93273, 29825, 37487, 56820, 52548, 34295, 41863, 8810, 4556, 22890, 44058, 54131, 4680, 73658, 59523, 16493, 28147, 59275, 82818, 99785, 73075, 60854, 67605, 73986, 77807, 36339, 68028, 58602, 12940, 35964, 27131, 48212, 52353, 18751, -46989, 1689, 114089, 79123, 84202, 76041, 20994, 19925, 33157, 9647, 15771, 48441, 51263, 42899, 50217]
413E0217L147k6911K4027l3206l3069P522j1715J3382k6170M2911K3399O4567
401I8101p5360l0328j5182P784K5324j4946L1132N992n199L3533p019j3502n715
$$ y = [50217, 53364, 26453, 50480, 17274, -15795, -8273, -19988, -6606, -32776, 10135, 33534, 98101, 22741, -7587, -22769, -14985, 10339, -4607, 26525, 32517, 27318, 60851, 53832, 40330, 34615]
$$ [...]
##END NTUPLES=NMR SPECTRUM
##END=
