##TITLE=1H_CG-1208-x2
 CDCl3
 8 sc, 
 8.8.2024
##JCAMPDX= 6.0         $$ Bruker NMR JCAMP-DX V2.0
##DATA TYPE= NMR SPECTRUM
##DATA CLASS= NTUPLES
##ORIGIN= UXNMR, Bruker Analytische Messtechnik GmbH
##OWNER= root
$$ XWIN-NMR		Version 3.5
$$ Thu Aug  8 14:06:07 2024 Russian Standard Time (UT+4h)  she@DPX200
##.OBSERVE FREQUENCY= 200.1313
##.OBSERVE NUCLEUS= ^1H
##.ACQUISITION MODE= SIMULTANEOUS
##.ACQUISITION SCHEME= undefined
##.AVERAGES= 8
##.DIGITISER RES= 18
##SPECTROMETER/DATA SYSTEM= spect
##.PULSE SEQUENCE= zg30
##.SOLVENT NAME= Acetone
##.SHIFT REFERENCE= (INTERNAL, Acetone, 0, 21.5307)
##AUDIT TRAIL= $$ (NUMBER, WHEN, WHO, WHERE, WHAT)
$$ ##TITLE= Audit trail, XWIN-NMR		Version 3.5
$$ ##JCAMPDX= 5.01
$$ ##ORIGIN= Bruker BioSpin GmbH
$$ ##OWNER= she
$$ F:/spectra/data/she/nmr/H-F/1/pdata/1/auditp.txt
$$ ##AUDIT TRAIL=  $$ (NUMBER, WHEN, WHO, WHERE, WHAT)
(   1,<2024-08-08 14:04:55.64 +0400>,<she>,<DPX200>,
      <created by zg, POWCHK disabled, PULCHK disabled
       configuration hash MD5:
       00 E9 B6 7A A2 85 ED C7 34 08 36 98 17 FE 4E 26
       data hash MD5: 16K
       48 AE D2 A3 53 C2 AB A4 12 A7 D9 2A DB 42 E0 0D>)
(   2,<2024-08-08 14:04:58.95 +0400>,<she>,<DPX200>,
      <Start of raw data processing
       efp BC_mod = 2 LB = 0.24 FT_mod = 6 PKNL = 1 PHC0 = -25636.92 PHC1 = 12.78749 SI = 16K 
       data hash MD5: 16K
       E3 C7 10 D8 ED 0E E2 D1 39 E7 47 E0 4B BB 1B B3>)
(   3,<2024-08-08 14:05:19.32 +0400>,<she>,<DPX200>,
      <pk PHC0 = 0.6785542 PHC1 = -0.3999998 
       data hash MD5: 16K
       85 02 43 F4 AF 05 CA 3F 7D A4 23 C4 40 22 9A 86>)
(   4,<2024-08-08 14:05:22.51 +0400>,<she>,<DPX200>,
      <abs ABSG = 5 
       data hash MD5: 16K
       2D 9B AD 82 C6 54 50 71 6B 8F 65 F7 3C 3E 1F 77>)
$$ ##END=
$$ 
$$ hash MD5
$$ 84 60 64 FD 25 00 79 37 34 4F F8 BC 52 A5 E0 0E
##$RELAX= 
##$RELAX= 
##$RELAX= 
##$RELAX= 
##$RELAX= 
##$RELAX= 
$$ Bruker specific parameters
$$ --------------------------
##$DU= <F:/spectra>
##$EXPNO= 1
##$NAME= <H-F>
##$PROCNO= 1
##$TYPE= <nmr>
##$USER= <she>
##$AMP= (0..31)
100 100 100 100 100 100 100 100 100 100 100 100 100 100 100 100 100 100 
100 100 100 100 100 100 100 100 100 100 100 100 100 100 
##$AQSEQ= 0
##$AQ_mod= 1
##$AUNM= <au_zg>
##$AUTOPOS= <>
##$BF1= 200.13
##$BF2= 200.13
##$BF3= 200.13
##$BF4= 200.13
##$BF5= 200.13
##$BF6= 200.13
##$BF7= 200.13
##$BF8= 200.13
##$BYTORDA= 1
##$CFDGTYP= 0
##$CFRGTYP= 5
##$CHEMSTR= <none>
##$CNST= (0..31)
1 1 145 1 1 1 1 1 1 1 1 1 1 1 1 1 1 1 1 1 1 1 1 1 1 1 1 1 1 1 1 1 
##$CPDPRG= <>
##$CPDPRG1= <>
##$CPDPRG2= <>
##$CPDPRG3= <>
##$CPDPRG4= <mlev>
##$CPDPRG5= <mlev>
##$CPDPRG6= <mlev>
##$CPDPRG7= <mlev>
##$CPDPRG8= <mlev>
##$CPDPRGB= <>
##$CPDPRGT= <>
##$D= (0..31)
0 1.2 0 0 0 0 0 0 0 0.06 0 0.03 0 0 0 0 0.0002 0 0 0 0 0 0 0 0 0 0 0 0 
0 0 0 
##$DATE= 1723111495
##$DBL= (0..7)
120 120 120 120 120 120 120 120 
##$DBP= (0..7)
150 150 150 150 150 150 150 150 
##$DBP07= 0
##$DBPNAM0= <>
##$DBPNAM1= <>
##$DBPNAM2= <>
##$DBPNAM3= <>
##$DBPNAM4= <>
$$ [...]
##$SUBNAM3= <"">
##$SUBNAM4= <"">
##$SUBNAM5= <"">
##$SUBNAM6= <"">
##$SUBNAM7= <"">
##$SUBNAM8= <"">
##$SUBNAM9= <"">
##$SW= 24.0689771365484
##$SWIBOX= (0..15)
0 0 2 0 0 0 0 0 0 0 0 0 0 0 0 0 
##$SW_h= 4816.95568400771
##$TD= 16384
##$TD0= 1
##$TE= 0
##$TE2= 300
##$TE3= 300
##$TEG= 300
##$TL= (0..7)
0 120 120 120 120 120 120 120 
##$TP= (0..7)
150 150 150 150 150 150 150 150 
##$TP07= 0
##$TPNAME0= <>
##$TPNAME1= <>
##$TPNAME2= <>
##$TPNAME3= <>
##$TPNAME4= <>
##$TPNAME5= <>
##$TPNAME6= <>
##$TPNAME7= <>
##$TPOAL= (0..7)
0.5 0.5 0.5 0.5 0.5 0.5 0.5 0.5 
##$TPOFFS= (0..7)
0 0 0 0 0 0 0 0 
##$TUNHIN= 0
##$TUNHOUT= 0
##$TUNXOUT= 0
##$USERA1= <user>
##$USERA2= <user>
##$USERA3= <user>
##$USERA4= <user>
##$USERA5= <user>
##$V9= 5
##$VALIST= <valist>
##$VCLIST= <CCCCCCCCCCCCCCC>
##$VD= 0
##$VDLIST= <DDDDDDDDDDDDDDD>
##$VPLIST= <PPPPPPPPPPPPPPP>
##$VTLIST= <TTTTTTTTTTTTTTT>
##$WBST= 1024
##$WBSW= 4
##$XGAIN= (0..3)
0 0 0 0 
##$XL= 0
##$YL= 0
##$YMAX_a= 198946
##$YMIN_a= -175707
##$ZGOPTNS= <>
##$ZL1= 120
##$ZL2= 120
##$ZL3= 120
##$ZL4= 120
##$ABSF1= 21.52184
##$ABSF2= -2.547367
##$ABSG= 5
##$ABSL= 3
##$ALPHA= 0
##$AQORDER= 0
##$ASSFAC= 0
##$ASSFACI= 0
##$ASSFACX= 0
##$ASSWID= 0
##$AUNMP= <proc_1d>
##$AZFE= 0.1
##$AZFW= 0.1
##$BCFW= 0
##$BC_mod= 2
##$BYTORDP= 0
##$COROFFS= 0
##$CY= -3
##$DATMOD= 1
##$DC= 0
##$DFILT= <>
##$DTYPP= 0
##$F1P= 0
##$F2P= 0
##$FCOR= 1
##$FTSIZE= 16384
##$FT_mod= 6
##$GAMMA= 0
##$GB= 0
##$INTBC= 1
##$INTSCL= 3.70164e-10
##$ISEN= 128
##$LB= 0.24
##$LEV0= 0
##$LPBIN= 0
##$MAXI= 10000
##$MC2= 0
##$MEAN= 0
##$ME_mod= 0
##$MI= 1.114404
##$NCOEF= 0
##$NC_proc= -8
##$NLEV= 6
##$NOISF1= 3.799351
##$NOISF2= 2.8
##$NSP= 0
##$NTH_PI= 0
##$NZP= 0
##$OFFSET= 21.53066
##$PC= 1
##$PHC0= -25636.24
##$PHC1= 12.38749
##$PH_mod= 1
##$PKNL= yes
##$PPARMOD= 0
##$PSCAL= 0
##$PSIGN= 0
##$REVERSE= no
##$SF= 200.129399559786
##$SI= 16384
##$SIGF1= 3
##$SIGF2= 2
##$SINO= 5.538805
##$SIOLD= 16384
##$SREGLST= <1H.CDCl3>
##$SSB= 0
##$STSI= 16384
##$STSR= 0
##$SW_p= 4816.95568400771
##$SYMM= 0
##$S_DEV= 0
##$TDeff= 16384
##$TDoff= 0
##$TI= <>
##$TILT= no
##$TM1= 0
##$TM2= 0
##$TOPLEV= 0
##$USERP1= <user>
##$USERP2= <user>
##$USERP3= <user>
##$USERP4= <user>
##$USERP5= <user>
##$WDW= 1
##$XDIM= 16384
##$YMAX_p= 407055839
##$YMIN_p= -1888245
$$ End of Bruker specific parameters
$$ ---------------------------------
##NTUPLES= NMR SPECTRUM
##VAR_NAME=  FREQUENCY,     SPECTRUM/REAL,   SPECTRUM/IMAG
##SYMBOL=    X,             R,               I
##VAR_TYPE=  INDEPENDENT,   DEPENDENT,       DEPENDENT
##VAR_FORM=  AFFN,          ASDF,            ASDF
##VAR_DIM=   16384,         16384,           16384
##UNITS=     HZ,            ARBITRARY UNITS, ARBITRARY UNITS
##FACTOR=    0.29402158847633, 1,            1
##FIRST=     4308.91818386182, 0,            0
##LAST=      -508.037500145888, 0,           0
##MIN=       -508.037500145888, -1888245,    0
##MAX=       4308.91818386182, 407055839,    0
$$ Real data points
##PAGE= N=1
##DATA TABLE= (X++(R..R)), XYDATA
$$ [...]
$$ plain form
5037 534787 739306 1285786 1402057 1083394 856123 877054 970058 677168 798526 1046915
5027 1046915 1039692 582526 763756 155060 881750 1743528 1615209 1769545 1183095 1261404
5017 1261404 1618743 1291604 1515566 1100731 1358999 1449225 1096447 1078957 1329166 1073208
5007 1073208 810393 928870 800410 1206422 750302 912422 911947 1429977 1032028 1525335
4997 1525335 2252845 2172603 1659168 1650181 1309335 1456962 1486609 1730362 1487590 1232150
4987 1232150 1208111 1216374 703952 973148 1601039 1149504 1180050 1057822 1680752 1242263
4977 1242263 1029723 1479919 1605601 1490990 1682950 1729404 2066717 2136868 1915033 1951454
4967 1951454 2288827 2058249 2122288 2018216 1848639 2455578 1961514 2750398 2943756 2525949
$$ packed form
5037E34787K04519N46480J16271l18663k27271K0931R3004k92890J21358K48389
5027A046915p223m57166J81230o08696P26690Q61778j28319J54336n86450P8309
5017A261404L57339l27139K23962m14835K58268R0226l52778j7490K50209k55958
5007A073208k62815J18477j28460M06012m56120J62120m75N18030l97949M93307
4997A525335P27510q0242n13435q987l40846J47627K9647K43753k42772k55440
4987A232150k4039Q263n12422K69196O27891m51535L0546j22228O22930m38489
4977A242263k12540M50196J25682j14611J91960M6454L37313P0151k21835L6421
4967A951454L37373k30578O4039j04072j69577O06939m94064P88884J93358m17807
$$ plain form
4957 2525949 2413377 2281293 1911856 2449558 2900511 2587315 2659703 2449727 2451024 3037381
4947 3037381 2727799 2775557 2437670 2450430 2840119 2652318 3239315 2967918 2949076 2741231
4937 2741231 2595334 2580424 3095647 2988875 2668815 2431750 2443058 2568650 1766682 2177357
4927 2177357 2320531 2197786 2084886 1402207 1729877 2280987 2357821 2446691 2072470 2049234
4917 2049234 1877602 2251578 2260765 1921273 2621116 2697657 2259752 2085577 2688799 2837284
4907 2837284 2280041 2460055 2391295 1956286 2523098 2551126 2284409 2504878 2502429 2795297
4897 2795297 2605511 2431371 2545522 2869718 2826522 2673742 2624817 2402547 1882434 2553271
4887 2553271 3073596 2962620 2414199 2167099 2661637 2185286 2698221 2287673 2309934 2857589
$$ packed form
4957B525949j12572j32084l69437N37702M50953l13196P2388k09976J297N86357
4947C037381l09582M7758l37887J2760L89689j87801N86997k71397j8842k07845
4937B741231j45897j4910N15223j06772l20060k37065J1308J25592q01968M10675
4927B177357J43174j22745j12900o82679L27670N51110P6834Q8870l74221k3236
4917B049234j71632L73976R187l39492O99843P6541m37905j74175O03222J48485
4907B837284n57243J80014o8760m35009N66812K8028k66717K20469k449K92868
4897B795297j89786j74140J14151L24196m3196j52780m8925k22270n20113O70837
4887B553271N20325j10976n48421k47100M94538m76351N12935m10548K2261N47655
$$ plain form
4877 2857589 2487607 2160549 2160302 2562432 2633642 2573841 1845222 2060680 2533799 2518067 2804161
4866 2804161 2322098 1994164 2311035 2326682 2685588 3079664 3174919 3637722 3929156 3455563
4856 3455563 3516442 3798448 3710830 3918875 4002734 3606377 3701260 4065184 4525144 3914450
4846 3914450 3893366 3795744 4030171 4323896 4314623 4316219 4255729 4590627 4888405 4653412 4563447
4835 4563447 4921771 5178525 5232700 4980524 5310157 5217945 5273587 5575382 5830056 5547543
4825 5547543 5478277 5873904 6507193 6061580 5773700 5449886 5937008 6102339 6584363 6144997
4815 6144997 5766321 5657679 6079485 6131844 5658616 6122347 5996732 5833431 5720363 6198221
4805 6198221 6542834 5677459 5878098 5505049 5954776 6035097 5948407 5328562 5364549 5314903
$$ packed form
4877B857589l69982l27058k47M02130P1210n9801p28619K15458M73119j5732K86094
4866B804161m82063l27934L16871J5647L58906L94076R5255M62803K91434m73593
4856C455563O0879K82006q7618K08045Q3859l96357R4883L63924M59960o10694
4846C914450k1084r7622K34427K93725r273J596o0490L34898K97778k34993q9965
4835D563447L58324K56754N4175k52176L29633r2212N5642L01795K54674k82513
4825E547543o9266L95627O33289m45613k87880l23814M87122J65331M82024m39366
4815F144997l78676j08642M21806N2359m73228M63731j25615j63301j13068M77858
4805F198221L44613q65375K00639l73049M49727Q0321q6690o19845L5987m9646
$$ plain form
4795 5314903 4674707 4955166 4958227 5537008 5672766 5273666 4831223 4721660 4295007 4255891
4785 4255891 4343821 4687822 5197657 4485902 4432826 4696393 4501504 4464937 4324842 4834332
4775 4834332 4594066 4364428 4169835 4886777 4749233 4131062 4256762 4347211 4714673 4630329
4765 4630329 4139309 3831145 3839634 4471788 4337175 4165277 4279692 3798325 3600781 4538812
4755 4538812 4243533 4162272 4160633 4012008 3898269 4227573 4421164 4389513 4013222 4161030
4745 4161030 3661403 3496912 4224462 4202081 4269405 4216307 3465662 3789937 4575706 4096227
4735 4096227 4426401 4006055 4141398 4331380 4687226 4478018 4481595 4158563 4511209 4378680
4725 4378680 3958957 4009918 3918031 4376651 4737358 5349159 5416911 4832901 4189588 4632400
$$ packed form
4795E314903o40196K80459L061N78781J35758l99100m42443j09563m26653l9116
4785D255891Q7930L44001N09835p11755n3076K63567j94889l6567j40095N09490
4775D834332k40266k29638j94593P16942j37544o18171J25700R0449L67462q4344
4765D630329m91020l08164Q489O32154j34613j71898J14415m81367j97544R38031
4755D538812k95279q1261j639j48625j13739L29304J93591l1651l76291J47808
4745D161030m99627j64491P27550k2381O7324n3098p50645L24275P85769m79479
4735D096227L30174m20346J35343J89982L55846k09208L577l23032L52646j32529
4725D378680m19723N0961r1887M58620L60707O11801O7752n84010o43313M42812
$$ plain form
4715 4632400 5181981 5665256 5324663 5500826 5258698 5211726 5353015 5887857 6189836 6231365
4705 6231365 5726790 6117236 6687260 7006664 6556878 6510629 7245322 7167926 6792991 7489911
4695 7489911 7481687 7252010 7233931 6939531 6970621 6830644 6937486 7135756 7192062 7682782
4685 7682782 7776119 7503263 8215537 7676244 7752904 7840446 7661705 7682549 7938613 7798817
4675 7798817 7961090 8309541 8735322 8564425 8422722 8473912 8586548 8759317 8611157 8307972
4665 8307972 8397716 8359939 8762924 8298725 9262874 9066244 9317091 9669621 9817226 9764281
4655 9764281 9856973 10266400 10118036 10037561 9844154 9880378 9957755 10508919 10703801 10973069
4645 10973069 11166665 11591116 11857318 12492455 12439975 12670326 13326772 13738728 14172228 13946434
$$ packed form
4715D632400N49581M83275l40593J76163k42128m6972J41289N34842L01979M1529
4705F231365n04575L90446N70024L19404m49786m6249P34693p7396l74935O96920
4695G489911q224k29677j8079k94400L1090j39977J06842J98270N6306M90720
4685G682782R3337k72856P12274n39293P6660Q7542j78741K0844K56064j39796
4675G798817J62273L48451M25781j70897j41703N1190J12636J72769j48160l03185
4665H307972Q9744l7777M02985m64199R64149j96630K50847L52530J47605n2945
4655I764281R2692M09427j48364q0475j93407L6224P7377N51164J94882K69268
4645A0973069J93596M24451K66202O35137n2480K30351O56446M11956M33500k25794
$$ plain form
4635 13946434 14309757 14231950 14912023 15918485 16088426 16549512 16599357 17131495 17787834 18680151
4625 18680151 19193698 19816550 20812470 21659612 22316026 23010555 23795173 24989699 25610007
4616 25610007 26607650 26972769 27888597 28944633 30188590 31115602 32089678 33234200 34971239
4607 34971239 35780341 36575435 37711981 38433862 39687209 40780911 41638920 42784833 43741382
4598 43741382 44139507 45234312 46236733 46728259 47113316 47160113 47082476 48071389 48819638
4589 48819638 48910025 49211855 49342789 48993343 48070446 47917220 47842930 47890543 47326511 47100160
4579 47100160 46739693 46083047 44790286 44258735 42840719 41575659 41236692 40371198 39422124
4570 39422124 38544002 37564304 36330549 35877487 35667499 34662959 33924543 32755375 31767847
$$ packed form
4635A3946434L63323p7807O80073J006462J69941M61086M9845N32138O56339Q92317
4625A8680151N13547O22852R95920Q47142O56414O94529P84618J194526O20308
4616B5610007R97643L65119R15828J056036J243957R27012R74076J144522J737039
4607C4971239Q09102P95094J136546P21881J253347J093702Q58009J145913R56549
4598D3741382L98125J094805J002421M91526L85057M6797p7637R88913P48249
4589D8819638R0387L01830J30934l49446r22897j53226p4290M7613n64032k26351
4579D7100160l60467o56646j292761n31551j418016j265060l38967q65494r49074
4570C9422124q78122r79698j233755m53062k09988j004540p38416j169168r87528
$$ plain form
4561 31767847 30839801 30135289 29876044 29015440 28720627 28583069 27810756 27196865 26564966
4552 26564966 26157306 25422054 24257425 23944611 23471455 22801320 21963281 21932497 21970979 21634084
4542 21634084 21113161 21182937 20105398 19858298 19416638 19491025 19134265 19193380 18573771 18248494
4532 18248494 17781506 17812300 17386895 16956385 16784338 16481235 16138218 16024418 16816474 17321915
4522 17321915 16774393 16049775 15552133 15799436 15671990 15867692 15006299 15677285 16135688
4513 16135688 15511072 15868692 15259321 15436731 16079912 16730535 16254681 16438566 16175395
4504 16175395 16471694 16160579 14761228 15336278 15263378 15370279 15734917 15543229 15865574
4495 15865574 16335612 16571450 16734406 16933540 17810555 18458517 18839946 18693579 18821674
$$ packed form
4561C1767847r28046p04512k59245q60604k94813j37558p72313o13891o31899
4552B6564966m07660p35252j164629l12814m73156o70135q38039l0784L8482l36895
4542B1634084n20923O9776j077539k47100m41660P4387l56760N9115o19609l25277
4532A8248494m66988L0794m25405m30510j72047l03103l43017j13800P92056N05441
4522A7321915n47522p24618m97642K47303j27446J95702q61393O70986M58403
4513A6135688o24616L57620o09371J77410O43181O50623m75854J83885k63171
4504A6175395K96299l11115j399351N75050p2900J06901L64638j91688L22345
4495A5865574M70038K35838J62956J99134Q77015O47962L81429j46367J28095
$$ plain form
4486 18821674 18627216 17600346 17674321 17192477 16258467 15812049 16127919 15846967 15358107
4477 15358107 15164106 14636464 14360790 14977236 14868682 15153465 15311641 15557236 16017536
4468 16017536 15921206 15461156 14605507 14531628 13993842 13609869 13872489 13212252 12922377 12659014
4458 12659014 12691568 12802867 12771490 12753250 13077777 13085947 12731869 12274763 12394974 12266956
4448 12266956 12309925 13061455 12669855 12832715 12879306 12865024 12997903 12833989 12740045 12895022
4438 12895022 12814083 12517428 13504397 13508061 13823863 13286165 12942217 13497456 13843066 14130842
4428 14130842 13673236 14123773 13926735 14327828 14961116 14536374 14578993 14312522 14592108 14871987
4418 14871987 15375246 15109042 15541060 15306013 15384472 15629187 16039906 16972539 16043483 16464638
$$ packed form
4486A8821674j94458j026870P3975m81844r34010m46418L15870k80952m88860
4477A5358107j94001n27642k75674O16446j08554K84783J58176K45595M60300
4468A6017536r6330m60050q55649p3879n37786l83973K62620o60237k89875k63363
4458A2659014L2554J11299l1377j8240L24527Q170l54078m57106J20211j28018
4448A2266956M2969P51530l91600J62860M6591j4282J32879j63914r3944J54977
4438A2895022q0939k96655R86969L664L15802n37698l43948N55239L45610K87776
4428A4130842m57606M50537j97038M01093O33288m24742M2619k66471K79586K79879
4418A4871987N03259k66204M32018k35047P8459K44715M10719R32633r29056M21155
$$ plain form
4408 16464638 17036333 16960113 16629670 17027893 17840617 18217946 18573773 18314930 18320586 18879266
4398 18879266 19305375 19770220 20141159 21053297 21287239 21224110 21936627 22232734 22897962 23265259
4388 23265259 23908926 23501907 24195755 24279662 24874677 25400916 25489002 26352146 27231753 27809730
4378 27809730 27905803 28509113 28814315 29243593 29371686 30503435 31048601 31611981 31844741
4369 31844741 32232309 32908445 33708119 34284183 34767374 35300746 35604553 36683037 37287377
4360 37287377 37700217 38236522 39232293 40611459 41838421 42473408 42401409 43740828 44447443
4351 44447443 45043061 46171739 46991977 48564274 49387655 50213509 51157363 51332867 52319552
4342 52319552 53133698 53611367 55043114 56085474 56789817 57261290 57646885 59011860 59495259
$$ packed form
4408A6464638N71695p6220l30443L98223Q12724L77329L55827k58843N656N58680
4398A8879266M26109M64845L70939R12138K33942o3129P12517K96107O65228L67297
4388B3265259O43667m07019O93848Q3907N95015N26239Q8086Q63144Q79607N77977
4378B7809730R6073O03310L05202M29278J28093J131749N45166N63380K32760
4369C1844741L87568O76136P99674N76064M83191N33372L03807J078484O04340
4360C7287377M12840N36305R95771J379166J226962O34987p1999J339419P06615
4351D4447443N95618J128678Q20238J572297Q23381Q25854R43854J75504R86685
4342E2319552Q14146M77669J431747J042360P04343M71473L85595J364975M83399
$$ plain form
4333 59495259 59869732 60890059 61385761 62398669 63296473 64176520 64347168 65063530 65442236
4324 65442236 65502089 66117535 66801246 66735285 67287600 68117722 67496086 67908340 68323318 68462428
4314 68462428 68221557 68314415 68332016 68901758 68933671 68680928 68878508 68939390 68612994 68010730
4304 68010730 68400498 68121247 67259512 67160302 67476728 66090694 65776799 65296000 64155611
4295 64155611 63501632 62649292 62701488 61946796 60895219 60226501 59604971 58279501 57459431
4286 57459431 56626006 55502938 53989683 52838609 52421154 51385874 49879723 49185355 48617582
4277 48617582 47258494 45732842 45118281 44086348 43438934 42977743 41546106 39694954 39035106
4268 39035106 38760430 37759385 36767571 36039097 35078110 34605947 34233702 33666606 32989202
$$ packed form
4333E9495259L74473J020327M95702J012908Q97804Q80047J70648P16362L78706
4324F5442236N9853O15446O83711o5961N52315Q30122o21636M12254M14978J39110
4314F8462428k40871R2858J7601N69742L1913k52743J97580O0882l26396o02264
4304F8010730L89768k79251q61735r9210L16426j386034l13895m80799j140389
4295F4155611o53979q52340N2196p54692j051577o68718o21530j325470q20070
4286E7459431q33425j123068j513255j151074m17455j035280j506151o94368n67773
4277D8617582j359088j525652o14561j031933o47414m61191j431637j851152o59848
4268C9035106k74676j001045r91814p28474r60987m72163l72245n67096o77404
$$ plain form
4259 32989202 32679725 32248239 31862078 31120766 30397747 29978958 29487732 28846407 28621513
4250 28621513 27638354 26920697 26401196 26231644 25393665 25272333 25487414 24679079 24008636
4241 24008636 24189548 24448533 23735482 23671002 22895919 22758399 22673948 21595812 21818648 21840294
4231 21840294 21081047 20697981 20105887 20056342 19979410 19518353 18965873 19047494 18915244 18921488
4221 18921488 19109662 19073189 19179054 19300223 18865998 18077270 17521602 17319593 16802073 16402013
4211 16402013 16456172 16270853 16254329 16134976 16275704 16249960 15601082 15197939 15388490 15200327
4201 15200327 14789341 15555009 16257944 15956334 15879663 15446271 15092812 15051144 14729656 14225966
4191 14225966 14139000 14393586 14595492 15016396 14384485 14490117 14139303 14238003 13922412 14122120
$$ packed form
4259C2989202l09477m31486l86161p41312p23019m18789m91226o41325k24894
4250B8621513r83159p17657n19501j69552q37979j21332K15081q08335o70443
4241B4008636J80912K58985p13051o4480p75083j37520q4451j078136K22836K1646
4231B1840294p59247l83066n92094m9545p6932m61057n52480Q1621j32250O244
4221A8921488J88174l6473J05865J21169m34225p88728n55668k02009n17520m00060
4211A6402013N4159j85319j6524j19353J40728k5744o48878m03143J90551j88163
4201A5200327m10986P65668P02935l01610p6671m33392l53459m1668l21488n03690
4191A4225966q6966K54586K01906M20904o31911J05632l50814R8700l15591J99708
$$ plain form
4181 14122120 13898147 13725101 13824494 14082137 14424940 14395545 14307726 14270758 14723811 14917567
4171 14917567 14789813 14431815 14409488 14730272 14931427 14753358 15025609 15139078 15015424 14800958
4161 14800958 15010580 16005223 16317883 16930340 17024583 17287669 17133283 17027614 17410246 17036111
4151 17036111 16552957 16605518 16064780 16313063 16195176 16044552 16099675 15985872 15921190 16116201
4141 16116201 17186071 17865006 18241183 19235506 19381849 19275497 19489671 19216645 18185899
4132 18185899 17902584 17637801 17170920 16456901 15390457 15721025 15776909 15811016 15223516 15319394
4122 15319394 15170348 15034751 15121555 15419571 15238170 15213850 15407603 14900199 14236672 14509838
4112 14509838 14713868 14940431 14161430 13964132 13853484 13521171 14072422 13611482 13860488
$$ packed form
4181A4122120k23973j73046R9393K57643L42803k9395q7819l6968M53053J93756
4171A4917567j27754l57998k2327L20784K01155j78069K72251J13469j23654k14466
4161A4800958K09622R94643L12660O12457R4243K63086j54386j05669L82632l74135
4151A7036111m83154N2561n40738K48283j17887j50624N5123j13803o4682J95011
4141A6116201J069870O78935L76177R94323J46343j06352K14174k73026j030746
4132A8185899k83315k64783m66881p14019j066444L30568N5884L4107n87500R5878
4122A5319394j49046j35597Q6804K98016j81401k4320J93753n07404o63527K73166
4112A4509838K04030K26563p79001j97298j10648l32313N51251m60940K49006
$$ plain form
4103 13860488 14136449 14845079 15202786 15961497 16262753 16167361 15524416 14675029 14176806 13540933
4093 13540933 13174781 12695155 12729838 12304179 11446774 11435549 11923676 11689616 11203700 11516958
4083 11516958 11389235 11456427 11676644 11528694 11586354 11944489 12046277 12044412 12308565 12512530
4073 12512530 12474093 12995673 13625762 13634665 14353846 14906141 15007874 14782984 14199733 13247395
4063 13247395 12609486 12237510 11805602 11232534 11262293 10191367 10052473 9837107 9584436
4054 9584436 9845634 9966520 9188944 9203546 9315847 9213131 9082479 8926960 8823208 8992540
4044 8992540 9221218 8747570 9313684 9651554 9464512 9308820 9329740 9500490 8914134 8140712
4034 8140712 8061090 7283527 7853725 7883941 7533667 7550351 7326523 7777843 7139797 6235735
$$ packed form
4103A3860488K75961P08630L57707P58711L01256r5392o42945q49387m98223o35873
4093A3540933l66152m79626L4683m25659q57405j1225M88127k34060m85916L13258
4083A1516958j27723O7192K20217j47950N7660L58135J01788j865K64153K03965
4073A2512530l8437N21580O30089Q903P19181N52295J01733k24890n83251r52338
4063A3247395o37909l71976m31908n73068K9759j070926j38894k15366k52671
4054I584436K61198J20886p77576J4602J12301j02716j30652j55519j03752J69332
4044H992540K28678m73648N66114L37870j87042j55692K0920J70750n86356p73422
4034H140712p9622p77563N70198L0216l50274J6684k23828M51320o38046r04062
$$ plain form
4024 6235735 7417975 7009337 7128693 7041154 6629559 6609822 6043029 6209542 6157695 6348637
4014 6348637 6734550 6540541 5381679 5265897 5818093 6094763 6278589 6257690 5904479 5832966
4004 5832966 5577734 5660094 5666792 5950699 5696629 6267156 5565479 5703098 5742427 5378355
3994 5378355 5116536 5184872 5384757 5217518 5545781 5474190 5192298 5216489 4966570 5020544
3984 5020544 5018476 5893037 5909641 6184579 5615260 5611181 5680939 5878443 5704006 5868684 6228085
3973 6228085 6408039 5979640 5608722 5716435 5152125 5365794 5321519 5489860 5321989 4910862
3963 4910862 4564366 4721238 5242346 5386928 5491777 4612015 4216250 4679132 5419893 5426087
3953 5426087 5423406 6224121 5856305 6382583 5587989 5971180 6283083 5763062 5463398 5368107
$$ packed form
4024F235735J182240m08638J19356q7539m11595j9737n66793J66513n1847J90942
4014F348637L85913j94009j158862j15782N52196K76670J83826k0899l53211p1513
4004E832966k55232Q2360O698K83907k54070N70527p01677J37619L9329l64072
3994E378355k61819O8336J99885j67239L28263p1591k81892K4191k49919N3974
3984E020544k068Q74561J6604K74938n69319m079O9758J97504j74437J64678L59401
3973F228085J79954m28399l70918J07713n64310K13669m4275J68341j67871m11127
3963D910862l46496J56872N21108J44582J04849q79762l95765M62882P40761O194
3953E426087k681Q00715l67816N26278p94594L83191L11903n20021k99664r5291
$$ plain form
3943 5368107 5080799 5607584 4957237 4936481 4548720 4811845 4872158 4861440 4502948 4532732
3933 4532732 4590480 4516540 4683925 5174313 4926827 4702964 4724992 4390465 4271320 4446214
3923 4446214 4128095 3988283 4101704 4559659 4341809 3921760 3896145 4095232 4644975 4457964
3913 4457964 4122344 4826366 4596547 4902475 4821980 4608983 4541208 4286223 4599760 4325515
3903 4325515 4008633 4628410 4871247 4654227 4028266 4105483 4263435 4221492 4290176 4432358
3893 4432358 4462784 4078194 4262368 4305329 4503090 4527973 4640125 5065847 4394080 4790201
3883 4790201 5350062 5380029 5682035 5003289 4744419 4228927 4863862 5030550 4491009 4174966
3873 4174966 4478460 4441082 4780242 4235169 4131649 4522646 4745341 4749913 4451496 4802508
$$ packed form
3943E368107k87308N26785o50347k0756l87761K63125O0313j0718l58492K9784
3933D532732N7748p3940J67385M90388k47486k23863K2028l34527j19145J74894
3923D446214l18119j39812J13421M57955k17850m20049k5615J99087N49743j87011
3913D457964l35620P04022k29819L05928q0495k12997o7775k54985L13537k74245
3903D325515l16882O19777K42837k17020o25961P7217J57952m1943O8684J42182
3893D432358L0426l84590J84174M2961J97761K4883J12152M25722o71767L96121
3883D790201N59861K9967L02006o78746k58870n15492O34935J66688n39541l16043
3873D174966L03494l7378L39160n45073j03520L90997K22695M572k98417L51012
$$ plain form
3863 4802508 5008110 4547954 4680267 4596287 4609479 5018321 5421741 5129217 4468547 4190617
3853 4190617 4255550 4578628 5166541 5336724 4804918 5269918 5040909 4554886 4683767 4237733
3843 4237733 4715457 4907463 5226788 5057656 4916794 5349704 5096609 5259314 5818539 5810646
3833 5810646 5469308 5099258 5549677 5210764 4894801 5395349 5177774 5471051 5881933 5526398
3823 5526398 5727512 6379652 6061358 5611820 6183508 6298482 6051445 6463272 6134761 5993066
3813 5993066 5632632 5856865 6164673 6477031 7188778 6773237 5983975 6156272 7123382 7047196
3803 7047196 6265260 6132348 6598082 7003067 7049833 7330863 6710826 6467216 7037745 7070238
3793 7070238 7235174 7796447 8396756 7812553 7130826 7364925 8219378 8414884 7908487 8417986
$$ packed form
3863D802508K05602m60156J32313q3980J3192M08842M03420k92524o60670k77930
3853D190617O4933L23078N87913J70183n31806M65000k29009m86023J28881m46034
3843D237733M77724J92006L19325j69132j40862M32910k53095J62705N59225p893
3833E810646l41338l70050M50419l38913l15963N00548k17575K93277M10882l55535
3823E526398K01114O52140l18294m49538N71688J14974k47037M11827l28511j41695
3813E993066l60434K24233L07808L12358P11747m15541p89262J72297R67110p6186
3803G047196p81936j32912M65734M04985M6766K81030o20037k43610N70529L2493
3793G070238J64936N61273O00309n84203o81727K34099Q54453J95506n06397N09499
$$ plain form
3783 8417986 8833130 8171997 8498484 9765289 9601332 9056482 9588083 9193120 9437163
3774 9437163 9655369 9772845 9810194 10434535 10561392 10102120 9695422 9883734 10376024 10336209
3764 10336209 10558616 11360960 11315900 11475914 11864629 12370343 12751364 12121811 11633187 11908164
3754 11908164 12151192 12433754 12701921 12521670 12714416 12956336 12646550 12802162 12902122 13581835
3744 13581835 14058003 14239264 14520528 14407702 13934334 14480355 14380181 14218001 14360598
3735 14360598 14667976 14447165 14215013 14649646 14611358 14798313 15091787 15491407 15251801 15059105
3725 15059105 15078050 15655473 15883612 16227730 16031708 16278019 16969271 17110018 17394022 17228929
3715 17228929 17656144 17742147 17988876 18503769 18690953 19168382 19496860 19567595 19796461 20380135
$$ packed form
3783H417986M15144o61133L26487J266805j63957n44850N31601l94963K44043
3774I437163K18206J17476L7349O24341J26857m59272m06698J88312M92290l9815
3764A0336209K22407Q02344m5060J60014L88715N05714L81021o29553m88624K74977
3754A1908164K43028K82562K68167j80251J92746K41920l09786J55612R9960O79713
3744A3581835M76168J81261K81264j12826m73368N46021j00174j62180J42597
3735A4360598L07378k20811k32152M34633l8288J86955K93474L99620k39606j92696
3725A5059105J8945N77423K28139L44118j96022K46311O91252J40747K84004j65093
3715A7228929M27215Q6003K46729N14893J87184M77429L28478P0735K28866N83674
$$ plain form
3705 20380135 20168055 21132824 20899005 20507384 21265105 21903959 22021475 22629860 22550341 23312587
3695 23312587 23716685 24684864 25270449 25381341 25802738 25875881 26497774 27081753 27123338 28114745
3685 28114745 29111717 29065612 29545421 29568231 30500870 31357446 31667460 32033695 32846237 33655481
3675 33655481 34370069 35210239 35655421 35842374 36208365 36858650 36259809 37431504 37674349
3666 37674349 39199693 39787257 39673029 40821748 41273378 41501826 42757479 43206145 43787573
3657 43787573 44213813 45133354 45826869 45345337 45828703 45673905 45543360 44920573 44389326
3648 44389326 43670031 43663035 44187479 44151507 43651295 43677703 43385174 43136092 43848868 43253690
3638 43253690 43352169 43678909 43041641 42992757 42907886 43217103 42672569 42890409 42707657 42248617
$$ packed form
3705B0380135k12080R64769k33819l91621P57721O38854J17516O08385p9519P62246
3695B3312587M04098R68179N85585J10892M21397P3143O21893N83979M1585R91407
3685B8114745R96972m6105M79809K2810R32639Q56576L10014L66235Q12542Q09244
3675C3655481P14588Q40170M45182J86953L65991O50285n98841J171695K42845
3666C7674349J525344N87564j14228J148719M51630K28448J255653M48666N81428
3657D3787573M26240R19541O93515m81532M83366j54798j30545o22787n31247
3648D4389326p19295o996N24444l5972n00212K6408k92529k49082P12776n95178
3638D3253690R8479L26740o37268m8884q4871L09217n44534K17840j82752m59040
$$ plain form
3628 42248617 42958553 43079115 43031052 42514050 42720257 43222685 43343293 43276379 43546009 44570002
3618 44570002 44848458 45687642 46169685 46392034 47127848 47632004 48723814 49135165 49867080
3609 49867080 51128327 52081336 53528166 54369934 55011131 55350768 56045924 56980934 58242927
3600 58242927 59631578 60555597 61749381 62817426 63824210 64420005 64977680 66161795 67479552
3591 67479552 68522023 69285260 70456262 70410803 71541818 72055843 72784974 73169274 73417690
3582 73417690 73486893 74112384 74306611 74394743 73876872 73654664 74050684 73763226 73692494 73803361
3572 73803361 74398790 74834284 74558046 74673862 75407598 76053014 76930239 78242455 78795325
3563 78795325 79437599 80249904 80966219 81255817 81804740 83056515 83242647 83355677 84756591
$$ packed form
3628D2248617P09936J20562m8063n17002K06207N02428J20608o6914K69630J023993
3618D4570002K78456Q39184M82043K22349P35814N04156J091810M11351P31915
3609D9867080J261247R53009J446830Q41768O41197L39637O95156R35010J261993
3600E8242927J388651R24019J193784J068045J006784N95795N57675J184115J317757
3591F7479552J042471P63237J171002m5459J131015N14025P29131L84300K48416
3582G3417690O9203O25491J94227Q8132n17871k22208L96020k87458p0732J10867
3572G3803361N95429M35494k76238J15816P33736O45416Q77225J312216N52870
3563G8795325O42274Q12305P16315K89598N48923J251775J86132J13030J400914
$$ plain form
3554 84756591 85079888 85275637 85647060 85942970 86599319 87374832 88222756 88025067 89271518
3545 89271518 90463300 91641140 92743787 94303980 95603694 97296374 98671514 99466434
3537 99466434 100189028 100781057 99910811 99722115 98607885 97467559 96298016 94714315 92774349
3528 92774349 91653723 90459469 88631715 87637537 86393800 85314164 83685325 82275480
3520 82275480 80704523 79342077 76911378 75298023 73022931 71242308 68643946 65767088
3512 65767088 63420657 60906160 58982321 57326548 55536780 53388350 52279463 50226301
3504 50226301 48395638 46760309 45793442 44056539 42749003 40950847 39765519 39456979
3496 39456979 37617068 36688527 35962654 34573936 33880192 33500889 32494228 31874429 31417484
$$ packed form
3554H4756591L23297J95749L71423K95910O56349P75513Q47924j97689J246451
3545H9271518J191782J177840J102647J560193J299714J692680J375140P94920
3537I9466434P22594N92029q70246j88696j114230j140326j169543j583701j939966
3528I2774349j120626j194254j827754r94178j243737j079636j628839j409845
3520H2275480j570957j362446k430699j613355k275092j780623k598362k876858
3512F5767088k346431k514497j923839j655773j789768k148430j108887k053162
3504E0226301j830663j635329r66867j736903j307536j798156j185328l08540
3496C9456979j839911r28541p25873j388718o93744l79303j006661o19799m56945
$$ plain form
3487 31417484 31363410 31019078 30710051 30028462 29409173 28600534 27895236 27262300 26466557 26372358
3477 26372358 25712679 24828662 24100996 23941274 23271835 22450892 21362908 21122488 20994151
3468 20994151 19917954 19542534 20141365 20067834 19111510 18896946 18739370 18358207 17637246
3459 17637246 16973176 16462809 16334490 15469962 15331605 15053934 14397695 14100494 14286212
3450 14286212 14223863 14194104 13765740 13225111 12912688 12952256 12454478 12139107 12160489 11685324
3440 11685324 12013634 12297163 11850273 11791230 11652356 11540545 11414227 11905748 11247786 10767655
3430 10767655 11002859 11006133 10729629 10208391 10260533 10474957 10274517 10141927 10090563 9931109
3420 9931109 9564819 9085709 9333295 9031221 8873936 8866035 9233138 9060941 9424046 9352212
$$ packed form
3487C1417484n4074l44332l09027o81589o19289q08639p05298o32936p95743r4199
3477B6372358o59679q84017p27666j59722o69439q20943j087984k40420j28337
3468B0994151j076197l75420N98831p3531r56324k14564j57576l81163p20961
3459A7637246o64070n10367j28319q64528j38357k77671o56239k97201J85718
3450A4286212o2349k9759m28364n40629l12423L9568m97778l15371K1382m75165
3440A1685324L28310K83529m46890n9043j38874j11811j26318M91521o57962m80131
3430A0767655K35204L274k76504n21238N2142K14424k00440j32590n1364j59454
3420I931109l66290m79110K47586l02074j57285p901L67103j72197L63105p1834
$$ plain form
3410 9352212 9007835 8211115 8248850 7793035 8213488 7889739 7888589 8111167 7951543 7440076
3400 7440076 7007312 6911823 7049726 7065815 7517244 7552562 6751962 7282771 7385937 7214376
3390 7214376 6744813 6703482 6708709 6493132 6661438 6080144 6565397 6950393 7215962 7325699
3380 7325699 6732304 6612030 6533106 6661128 6812152 7145135 6742377 6283128 6647426 7497957
3370 7497957 6737544 6446436 6501638 6165608 6547087 6354281 6123590 6686546 7207443 7228841
3360 7228841 6877257 6806488 6617057 6071435 6182399 6252948 6653358 6914049 6693773 6697555
3350 6697555 6843290 6408812 6566951 6238079 5907549 5934916 6729059 7158914 6611951 6844067
3340 6844067 6371949 6781646 6860994 6747716 6447652 6589440 6339631 6344851 6457663 6660358
$$ packed form
3410I352212l44377p96720L7735m55815M20453l23749j150K22578j59624n11467
3400G440076m32764r5489J37903J6089M51429L5318q00600N30809J03166j71561
3390G214376m69563m1331N227k15577J68306n81294M85253L84996K65569J09737
3380G325699n93395j20274p8924J28022J51024L32983m02758m59249L64298Q50531
3370G497957p60413k91108N5202l36030L81479j92806k30691N62956N20897K1398
3360G228841l51584p0769j89431n45622J10964P0549M00410K60691k20276L782
3350F697555J45735m34478J58139l28872l30530K7367P94143M29855n46963K32116
3340F844067m72118M09697P9348j13278l00064J41788k49809N220J12812K02695
$$ plain form
3330 6660358 6466962 6586327 6964251 6863834 6645958 6381459 6704555 6508640 6795397 6835899
3320 6835899 7244562 7156949 6802936 6974009 7232632 7250684 7439018 7508860 7113797 7546405
3310 7546405 8000632 7350310 7031296 7225070 7844176 7902822 7937455 7915162 8218743 8315801
3300 8315801 8087982 8528582 8707383 8273517 8384744 8828342 8998812 9362251 8899308 8851875
3290 8851875 9247169 9638843 9857672 10105595 10242172 10122568 10527694 10816619 11216999 11139136
3280 11139136 11010184 11110956 10771143 11567838 11723985 11731426 11515999 11920632 11395461 12218319
3270 12218319 12597831 13089390 13694469 13490181 13554396 13630987 14351982 14028147 14690110 15369287
3260 15369287 15172558 15552660 15966793 16078868 16678555 16405806 17504210 18087632 18022340
$$ packed form
3330F660358j93396J19365L77924j00417k17876k64499L23096j95915K86757M0502
3320F835899M08663q7613l54013J71073K58623J8052J88334O9842l95063M32608
3310G546405M54227o50322l19014J93774O19106N8646L4633k2293L03581R7058
3300H315801k27819M40600J78801m33866J11227M43598J70470L63439m62943m7433
3290H851875L95294L91674K18829K47923J36577j19604M05126K88925M00380p7863
3280A1139136j28952J00772l39813P96695J56147P441k15427M04633n25171Q22858
3270A2218319L79512M91559O05079k04288O4215P6591P20995l23835O61963O79177
3260A5369287j96729L80102M14133J12075N99687k72749J098404N83422o5292
$$ plain form
3251 18022340 17890223 17927758 19193778 19596142 20222794 20960904 21300415 21671970 21922921
3242 21922921 22388446 24132870 24523634 24904802 25958331 26641928 27309070 28721231 30085479
3233 30085479 31064324 31907467 33009841 33307674 35071533 35823344 37179403 38794702 40077426
3224 40077426 41972554 43642720 45320242 46670559 48466881 50547648 52798462 54845655
3216 54845655 56746952 59762259 63344416 67885553 73003662 78865380 86739404 95348899
3208 95348899 98404109 93261266 86156711 78562184 73145543 69251859 65579933 61245445
3200 61245445 59090843 56654934 54791115 53645889 51503038 49298353 47747826 46529263
3192 46529263 44985264 43210834 42248365 40739217 39297320 37876933 37312712 36177075
$$ packed form
3251A8022340j32117L7535J266020M02364O26652P38110L39511L71555K50951
3242B1922921M65525J744424L90764L81168J053529O83597O67142J412161J364248
3233C0085479R78845Q43143J102374K97833J763859P51811J356059J615299J282724
3224D0077426J895128J670166J677522J350317J796322K080767K250814K047193
3216E4845655J901297L015307L582157M541137N118109N861718P874024Q609495
3208I5348899L055210n142843p104555p594527n416641l893684l671926m334488
3200F1245445k154602k435909j863819j145226k142851k204685j550527j218563
3192D6529263j543999j774430r62469j509148j441897j420387n64221j135637
$$ plain form
3184 36177075 34908003 34226577 33456062 33003699 31481594 31528668 30617582 29466221 28752548
3175 28752548 27886904 26565400 26178197 26427802 25894433 25326056 24338506 24090390 24213272
3166 24213272 23356570 23095423 22978804 22436670 22427108 21823258 21723733 21702254 22031821 21328636
3156 21328636 20707642 20189757 20961565 20596262 20678251 20283939 19955218 20356073 20767498 20499047
3146 20499047 20591691 21047937 20724620 20645181 20625561 20678957 20206315 20236265 20162676 20566124
3136 20566124 20566923 20983630 20833214 21376832 21807162 21289563 21516133 21882283 22208550 22729029
3126 22729029 22660549 23420202 23491111 23658924 23929361 24120177 23836623 24512910 24935129 25010948
3116 25010948 25594722 25399005 25880591 26133811 27137004 27627875 27827726 28371810 27954809
$$ packed form
3184C6177075j269072o81426p70515m52363j522105M7074r11086j151361p13673
3175B8752548q65644j321504l87203K49605n33369n68377r87550k48116J22882
3166B4213272q56702k61147j16619n42134r562o03850r9525k1479L29567p03185
3156B1328636o20994n17885P71808l65303Q1989l94312l28721M00855M11425k68451
3146B0499047R2644M56246l23317p9439j9620N3396m72642K9950p3589M03448
3136B0566124P99M16707j50416N43618M30330n17599K26570L66150L26267N20479
3126B2729029o8480P59653P0909J67813K70437J90816k83554O76287M22219P5819
3116B5010948N83774j95717M81586K53220J003193M90871J99851N44084m17001
$$ plain form
3107 27954809 28227593 29129590 29571268 30515622 31475880 31710229 32158856 32627485 33410601
3098 33410601 34255459 35259055 36238835 36622373 37457488 37847930 38502893 39679146 40963837
3089 40963837 41292481 42635779 43771162 44495856 45707284 46519024 46925704 48889734 50353957
3080 50353957 50521848 52014352 53207236 54027139 55730726 57493777 58307259 59638923 61349097
3071 61349097 62333971 62893794 64488645 65457528 66756800 67982272 69384990 71169922 72814680
3062 72814680 73698339 75063425 76353890 77749334 79593216 80568204 82023542 83337733
3054 83337733 84426267 85340056 87187476 88784826 89507652 91011520 92707305 94318469
3046 94318469 95196538 96840339 98576616 99663309 101201180 102914888 104287038 105016650
$$ packed form
3107B7954809K72784R01997M41678R44354R60258K34349M48627M68629P83116
3098C3410601Q44858J003596R79780L83538Q35115L90442O54963J176253J284691
3089D0963837L28644J343298J135383P24694J211428Q11740M06680J964030J464223
3080E0353957J67891J492504J192884Q19903J703587J763051Q13482J331664J710174
3071F1349097R84874N59823J594851R68883J299272J225472J402718J784932J644758
3062G2814680Q83659J365086J290465J395444J843882R74988J455338J314191
3054H3337733J088534R13789J847420J597350P22826J503868J695785J611164
3046I4318469Q78069J643801J736277J086693J537871J713708J372150P29612
$$ plain form
3038 105016650 106386437 107772249 108968314 110254396 111555162 112452942 113686763 114774918
3030 114774918 115387653 116496653 117495836 118348244 118798055 119710647 119446278 119605284 119797965
3021 119797965 119503119 119839412 119949805 119638649 119181041 118934046 118124911 117993677 118619287
3012 118619287 118129657 117843188 117470893 116946527 116231885 115800635 114911495 113914672 113095295
3003 113095295 112283787 111244417 110192592 109005159 107707243 106478926 105261810 104620466
2995 104620466 104004086 102190856 101820380 101721978 100688569 99645940 98294810 97438094 95701583
2986 95701583 94695116 93373458 92138045 90973514 90342301 88997315 87415723 86398176
2978 86398176 84148850 82988221 82153744 80962460 79375450 77598775 76921046 75258486
$$ packed form
3038A05016650J369787J385812J196065J286082J300766Q97780J233821J088155
3030A14774918O12735J109000R99183Q52408M49811R12592k64369J59006J92681
3021A19797965k94846L36293J10393l11156m57608k46995q09135j31234O25610
3012A18619287m89630k86469l72295n24366p14642m31250q89140r96823q19377
3003A13095295q11508j039370j051825j187433j297916j228317j217116o41344
2995A04620466o16380j813230l70476r8402j033409j042629j351130q56716j736511
2986I5701583j006467j321658j235413j164531o31213j344986j581592j017547
2978H6398176k249326j160629q34477j191284j587010j776675o77729j662560
$$ plain form
2970 75258486 73456488 72557692 71309894 69015416 67945788 66627249 65633937 64186806
2962 64186806 62780980 61210315 59652645 58265037 56869182 55757433 55038471 54235221
2954 54235221 52650452 51202862 49868789 49206958 48280840 47369195 46603180 46322341 45232553
2945 45232553 43824969 42209758 41542042 41402700 40578664 39929715 39033794 38513281 38160290
2936 38160290 37158083 36924067 35960765 35462243 35328008 34876047 34605868 33963893 33854144
2927 33854144 32981833 32422108 32139737 31719217 31754059 31537764 31193883 31081409 31166751 30405850
2917 30405850 30544038 30157923 29827888 29670409 29628910 29503884 29468847 29429391 28616291 29287063
2907 29287063 29108989 28771415 29084812 28705704 28591900 28440602 28570296 28600886 29417820 29597720
$$ packed form
2970G5258486j801998q98796j247798k294478j069628j318539r93312j447131
2962F4186806j405826j570665j557670j387608j395855j111749p18962q03250
2954E4235221j584769j447590j334073o61831r26118r11645p66015k80839j089788
2945D5232553j407584j615211o67716j39342q24036o48949q95921n20513l52991
2936C8160290j002207k34016r63302m98522j34235m51961k70179o41975j09749
2927C3854144q72311n59725k82371m20520L4842k16295l43881j12474Q5342p60901
2917C0405850J38188l86115l30035j57479m1499j25026l5037l9456q13100O70772
2907B9287063j78074l37574L13397l79108j13804j51298J29694L0590Q16934J79900
$$ plain form
2897 29597720 29294026 29727686 29950229 30676161 31139403 30407298 30651992 31319156 31531642
2888 31531642 32174602 32706495 32821223 32595914 33052508 33376527 34113147 34802298 35177420
2879 35177420 35561293 36568397 37138611 37926419 38148499 39414293 39429877 40030106 40827954
2870 40827954 41434414 42535023 43288274 44071360 44779435 46030964 47520162 48007887 48770956
2861 48770956 50221485 51363500 52443370 53223765 53498312 54847550 56177494 57164864 57788129
2852 57788129 59427735 60411436 61111992 61511116 62383099 63523171 63359029 64285837 64437350
2843 64437350 64386287 64890928 65444599 65143920 64834645 64274736 64092336 63625046 62916052 62844050
2833 62844050 62470471 61501961 60774130 59747105 58269438 57232231 55683880 54863087 54201496
$$ packed form
2897B9597720l03694M33660K22543P25932M63242p32105K44694O67164K12486
2888C1531642O42960N31893J14728k25309M56594L24019P36620O89151L75122
2879C5177420L83873J007104N70214P87808K22080J265794J5584O00229P97848
2870D0827954O06460J100609P53251P83086P08075J251529J489198M87725P63069
2861D8770956J450529J142015J079870P80395K74547J349238J329944R87370O23265
2852E7788129J639606R83701P00556L99124Q71983J140072j64142R26808J51513
2843F4437350n1063N04641N53671l00679l09275n59909j82400m67290p08994p2002
2833F2844050l73579r68510p27831j027025j477667j037207j548351q20793o61591
$$ plain form
2824 54201496 52495739 51664444 50495748 50053083 48796526 47530050 46585991 45280245 44455632
2815 44455632 43242761 42488419 41808679 41087415 40818113 40124287 39586990 38506056 37986036
2806 37986036 37914384 36991672 36730904 36187479 34306676 34313510 34156957 34776964 34316159 33713882
2796 33713882 33262694 32729146 32834513 33377685 32958867 32175721 32023209 32305665 32111501
2787 32111501 31748969 31480682 31115216 30465247 30737303 31638034 31194610 31040084 31193214
2778 31193214 30924834 30628060 30411646 30043254 30432534 30695129 30880026 30615778 30661640 31072293
2768 31072293 31286925 30645636 31156727 31812811 31937400 31618066 31573120 31998260 31784237 32289530
2758 32289530 33138369 33009841 33032744 33007363 33114896 33555613 33877269 34511718 34520509 34896588
$$ packed form
2824E4201496j705757q31295j168696m42665j256557j266476r44059j305746q24613
2815D4455632j212871p54342o79740p21264k69302o93826n37297j080934n20020
2806C7986036p1652r22712k60768n43425j880803O834j56553O20007m60805o02277
2796C3713882m51188n33548J05367N43172m18818p83146j52512K82456j94164
2787C2111501l62532k68287l65466o49969K72056R00731m43424j54526J53130
2778C1193214k68380k96774k16414l68392L89280K62595J84897k64248M5862M10653
2768C1072293K14632o41289N11091O56084J24589l19334m4946M25140k14023N05293
2758C2289530Q48839j28528K2903k5381J07533M40717L21656O34449Q791L76079
$$ plain form
2748 34896588 35048094 35628941 36234250 36651973 36752073 37296555 38153876 38899904 39219569
2739 39219569 39960555 40356528 40517938 40742322 41250242 42542195 42617038 43554116 44074047
2730 44074047 45327730 44983936 45796795 46933442 48007810 48927728 49431353 49584405 50259998
2721 50259998 50985559 50998082 51732940 52472592 52947857 53503597 53754012 54765134 55357845
2712 55357845 56467114 57012942 57279038 57792950 58705926 59326121 60311508 61354170 61928415
2703 61928415 62808624 63730510 64481649 65732748 66365031 66964158 69040876 69487444 70320133
2694 70320133 71622530 73320544 74569691 75481059 76671894 77943222 78209478 79264774
2686 79264774 80650110 81812061 82687338 83800794 84788215 85835408 86775559 87767730 88047482
$$ packed form
2748C4896588J51506N80847O05309M17723J00100N44482Q57321P46028L19665
2739C9219569P40986L95973J61410K24384N07920J291953P4843R37078N19931
2730D4074047J253683l43794Q12859J136647J074368R19918N03625J53052O75593
2721E0259998P25561J2523P34858P39652M75265N55740K50415J011122N92711
2712E5357845J109269N45828K66096N13912R12976O20195R85387J042662N74245
2703F1928415Q80209R21886P51139J251099O32283N99127K076718M46568Q32689
2694G0320133J302397J698014J249147R11368J190835J271328K66256J055296
2686G9264774J385336J161951Q75277J113456R87421J047193R40151R92171K79752
$$ plain form
2677 88047482 89558942 90319859 92027472 92867507 93848042 94638838 95890966 97121608 97703615
2668 97703615 99014319 99967354 100675206 101687671 102597105 103619151 105243562 106180037 107265276
2659 107265276 108082362 109347856 110975338 112552269 114299420 116384181 117501719 119087733
2651 119087733 121666730 123419650 125138832 126599340 129301568 130863383 133397954 135698152
2643 135698152 137842510 140765954 143574169 146104944 149118983 152553310 155603002 159598566
2635 159598566 164095809 169153747 174651135 180138851 185376108 192826968 199725931 207335385
2627 207335385 213934721 220331505 226682956 233868866 239773305 245406239 250583745 254890766
2619 254890766 258518773 261254210 263758325 264685279 264950310 264203663 262944140 262414177 261179494
$$ packed form
2677H8047482J511460P60917J707613Q40035R80535P90796J252128J230642N82007
2668I7703615J310704R53035P07852J012465R09434J022046J624411R36475J085239
2659A07265276Q17086J265494J627482J576931J747151K084761J117538J586014
2651A19087733K578997J752920J719182J460508K702228J561815K534571K300198
2643A35698152K144358K923444K808215K530775L014039L434327L049692L995564
2635A59598566M497243N057938N497388N487716N237257P450860O898963P609454
2627B07335385O599336O396784O351451P185910N904439N632934N177506M307021
2619B54890766L628007K735437K504115R26954K65031p46647j259523n29963j234683
$$ plain form
2610 261179494 259220553 257295620 255329515 253771706 251468505 248416308 247340446 246455468
2602 246455468 245807209 246299010 248920700 251313139 256080870 263165971 270595671 278561213
2594 278561213 286485839 293688909 299251008 302398356 302277504 298850636 291663613 282141016
2586 282141016 272023775 261346175 251434146 241605869 230911444 221171318 211622557 201937899
2578 201937899 191774607 181719953 172675440 164277591 155425733 148607966 141225213 134043752
2570 134043752 128091124 122010816 116867262 111600288 106512355 102088787 98159373 94332846
2562 94332846 92209620 88930296 86633800 83851777 81298407 78957564 76766787 75032938
2554 75032938 73445512 71748662 69924664 68319198 66179018 64327388 63215963 62436092
$$ packed form
2610B61179494j958941j924933j966105j557809k303201l052197j075862q84978
2602B46455468o48259M91801K621690K392439M767731P085101P429700P965542
2594B78561213P924626P203070N562099L147348j20852l426868p187023r522597
2586B82141016j0117241j0677600r912029r828277j0694425r740126r548761r684658
2578B01937899j0163292j0054654r044513q397849q851858o817767p382753p181461
2570A34043752n952628o080308n143554n266974n087933m423568l929414l826527
2562I4332846k123226l279324k296496k782023k553370k340843k190777j733849
2554G5032938j587426j696850j823998j605466k140180j851630j111425p79871
$$ plain form
2546 62436092 61554478 60520748 59467982 58967744 57974780 57474453 56649368 56652504 56318036
2537 56318036 56667561 56731214 57139540 57251058 57185727 57272377 58538786 58413188 59210907 60159577
2527 60159577 60375548 60602459 61850737 63032689 63957161 64516784 65861923 67189078 68742390
2518 68742390 69585897 71039170 73541042 74686497 76669380 79894986 83061986 86423889
2510 86423889 90091627 93196235 96952302 100601559 103677414 106984017 110642733 114055862
2502 114055862 116201953 117796658 118752207 118040440 116935477 114331192 111273528 107581665
2494 107581665 102987675 99177637 95140279 90831357 87159935 83263760 78788034 74339651
2486 74339651 70499573 67323582 63991401 60616600 57202417 54831642 53269592 51323783
$$ packed form
2546F2436092q81614j033730j052766n00238r92964n00327q25085L136l34468
2537E6318036L49525O3653M08326J11518o5331Q6650J266409j25598P97719R48670
2527F0159577K15971K26911J248278J181952R24472N59623J345139J327155J553312
2518F8742390Q43507J453273K501872J145455J982883L225606L167000L361903
2510H6423889L667738L104608L756067L649257L075855L306603L658716L413129
2502A14055862K146091J594705R55549p11767j104963k604285l057664l691863
2494A07581665m593990l810038m037358m308922l671422l896175m475726m448383
2486G4339651l840078l175991l332181l374801l414183k370775j562050j945809
$$ plain form
2478 51323783 49282391 47732898 46343750 44309084 43385431 42108359 40938777 39862107
2470 39862107 38669532 38133670 36990579 36112241 35135073 33918992 33319568 32107769 31236860
2461 31236860 30719046 30252287 29139542 28410153 27692323 27382861 26467487 25556027 25146093
2452 25146093 24527545 23722477 23959497 23669976 23352949 23049229 22626833 22274120 21864120
2443 21864120 21316847 21082803 20758004 20806044 20321573 19498910 19945956 19396936 19816947 19904149
2433 19904149 19715747 19185573 18749958 18852851 19005039 18844141 18588574 18886692 18774569
2424 18774569 18370119 18511711 18780487 18944527 18643943 19173145 19253347 18645945 18989715 19154143
2414 19154143 19654347 19528992 19876410 19775520 20181456 20130312 20494021 20906394 20868229 20908267
$$ packed form
2478E1323783k041392j549493j389148k034666r23653j277072j169582j076670
2470C9862107j192575n35862j143091q78338r77168j216081n99424j211799q70909
2461C1236860n17814m66759j112745p29389p17830l09462r15374r11460m09934
2452B5146093o18548q05068K37020k89521l17027l03720m22396l52713m10000
2443B1864120n47273k34044l24799M8040m84471q22663M47046n49020M20011Q7202
2433A9904149j88402n30174m35615J02893J52188j60898k55567K98118j12123
2424A8774569m04450J41592K68776J64040l00584N29202Q0202o07402L43770J64428
2414A9154143N00204j25355L47418j00890M05936n1144L63709M12373l8165M0038
$$ plain form
2404 20908267 21121128 21131074 21031757 21538467 21880497 22151795 22867478 23256677 23466371 23994655
2394 23994655 24489967 25320508 24874592 25029218 25386276 26216182 26787910 27926610 28602934
2385 28602934 28451427 28833785 29993607 30207644 31165239 32336024 32693394 33439200 34732087
2376 34732087 35568162 37079776 38870778 40360088 41786145 43486630 45260362 46731250
2368 46731250 48726541 51121674 53203139 55755644 58509531 61155437 64411511 68150452
2360 68150452 72504800 76708846 81434880 86824288 92210736 98363485 104528191 111228861
2352 111228861 117306562 122929030 127955657 131914136 135248940 138323326 141851902 145521179
2344 145521179 149545013 154171873 159249884 163809554 169563058 176214491 183521787 191962714
$$ packed form
2404B0908267K12861R946r9317N06710L42030K71298P15683L89199K09694N28284
2394B3994655M95312Q30541m45916J54626L57058Q29906N71728J138700O76324
2385B8602934j51507L82358J159822K14037R57595J170785L57370P45806J292887
2376C4732087Q36075J511614J791002J489310J426057J700485J773732J470888
2368D6731250J995291K395133K081465K552505K753887K645906L256074L738941
2360F8150452M354348M204046M726034N389408N386448O152749O164706O700670
2352A11228861O077701N622468N026627L958479L334804L074386L528576L669277
2344A45521179M023834M626860N078011M559670N753504O651433P307296Q440927
$$ plain form
2336 191962714 200867272 209845026 220952930 234471652 249811660 268218502 287955760
2329 287955760 300176960 302797353 300731030 297968653 296309459 295995264 298441418 304778957
2321 304778957 312971949 323351911 334575719 347676818 361415819 375259689 388512447
2314 388512447 398861741 405208963 407055839 403686288 396476377 385722269 372423593 357554424
2306 357554424 341016802 322488739 303613708 285319394 267635534 250223232 233963964
2299 233963964 218548747 204453907 192227197 180321865 170268600 160983623 151992913
2292 151992913 144213176 137259996 130611993 123736078 117605209 112223524 107238029 102288986
2284 102288986 97099086 92418167 88272719 83901788 79777988 76111487 72804771 69264264
$$ packed form
2336A91962714Q904558Q977754J1107904J3518722J5340008J8406842J9737258
2329B87955760J2221200K620393k066323k762377j659194l14195K446154O337539
2321C04778957Q192992J0379962J1223808J3101099J3739001J3843870J3252758
2314C88512447J0349294O347222J846876l369551p209911j0754108j3298676j4869169
2306C57554424j6537622j8528063j8875031j8294314j7683860j7412302j6259268
2299B33963964j5415217j4094840j2226710j1905332j0053265r284977q990710
2292A51992913p779737o953180o648003o875915o130869n381685m985495m949043
2284A02288986n189900m680919m145448m370931m123800l666501l306716l540507
$$ plain form
2276 69264264 65997842 62956814 60245547 57842827 55714503 54148855 51850484 49309601
2268 49309601 47982641 46324888 43767127 42184430 40768967 39581232 37934387 37134443
2260 37134443 35925909 34728371 33828889 32664972 31458585 30215236 29022651 28599358
2252 28599358 27417501 26840972 26619184 25226578 24136552 23875431 22697219 22091874 21423460
2243 21423460 21150630 20421099 19587178 19109018 19507682 19134347 18482122 18062210 17201918
2234 17201918 17113606 16642120 16714505 16699737 15933962 15618159 15513468 15346199 14654895 13805229
2224 13805229 13603629 13903626 13787023 13695002 13015582 12945403 12458696 12553670 12427723 12201369
2214 12201369 12190746 11659406 11737898 11139259 10975076 10804087 10944450 10808276 10173445 10122231
$$ packed form
2276F9264264l266422l041028k711267k402720k128324j565648k298371k540883
2268D9309601j326960j657753k557761j582697j415463j187735j646845p99944
2260C7134443j208534j197538q99482j163917j206387j243349j192585m23293
2252B8599358j181857n76529k21788j392606j090026k61121j178212o05345o68414
2243B1423460k72830p29531q33921m78160L98664l73335o52225m19912q60292
2234A7201918q8312m71486P2385j4768p65775l15803j04691j67269o91304q49666
2224A3805229k01600K99997j16603r2021o79420p0179m86707R4974j25947k26354
2214A2201369j0623n31340P8492n98639j64183j70989J40363j36174o34831n1214
$$ plain form
2204 10122231 9748838 9133989 9151770 9647164 9781062 8762111 8571037 8722094 8745235 8358144
2194 8358144 8960298 8984271 8472934 8189714 7711606 7890044 7963355 8130641 7691899 7229954
2184 7229954 7479814 7173985 6825130 7420953 7628344 7487931 7153416 7240760 6934379 6663368
2174 6663368 5911823 5768731 6091933 6381581 5976432 5573767 6580159 5617139 5073485
2165 5073485 5102331 5542063 5863255 5697576 5049601 5609606 5291946 5837268 5710609 5608354
2155 5608354 5256984 4690025 4730283 4343129 5138599 4967079 5433183 5271621 4811373 4476431
2145 4476431 4698224 4222469 4164862 3580376 4236125 5162586 4408139 4344087 5088332 5197856
2135 5197856 4769053 4561769 4650414 5108091 4411869 4218166 4353282 4494442 4556687 4025981
$$ packed form
2204A0122231l73393o14849J7781M95394J33898j018951j91074J51057K3141l87091
2194H358144O02154K3973n11337k83220m78108J78438P3311J67286m38742m61945
2184G229954K49860l05829l48855N95823K07391j40413l34515Q7344l06381k71011
2174F663368p51545j43092L23202K89648m05149m02665J006392r63020n43654
2165E073485K8846M39732L21192j65679o47975N60005l17660N45322j26659j02255
2155E608354l51370n66959M0258l87154P95470j71520M66104j61562m60248l34942
2145D476431K21793m75755n7607n84486O55749R26461p54447o4052P44245J09524
2135E197856m28803k07284Q8645M57677o96222j93703J35116J41160O2245n30706
$$ plain form
2125 4025981 4271396 4782156 5039552 4962438 4957089 4723882 4416228 5119938 5253903 5088429
2115 5088429 4876051 5404356 4065708 4396615 5139694 4780234 4804953 4550632 4190640 4449163
2105 4449163 4575675 5135966 5296711 4870708 5035532 5315575 4867810 4751581 5551022 5512190
2095 5512190 4849126 4990351 4804797 4359831 3977078 4415879 4270499 4094384 3126672 3295119
2085 3295119 3116912 3583427 3045357 2733942 3409412 3073671 3379375 3284537 3432338 3495248
2075 3495248 2995375 2430431 2557158 2529803 2885429 3120884 3232369 2523158 2699782 3333725
2065 3333725 3205844 3009690 2783252 2487018 3198223 3095136 2833699 2321956 2343554 2584466
2055 2584466 2348408 2144135 2258070 2776041 3062833 2424104 2874621 2500474 2000480 1990490
$$ packed form
2125D025981K45415N10760K57396p7114n349k33207l07654P03710J33965j65474
2115E088429k12378N28305j338648L30907P43079l59460K4719k54321l59992K58523
2105D449163J26512N60291J60745m26003J64824K80043m47765j16229P99441l8832
2095E512190o63064J41225j85554m44966l82753M38801j45380j76115r67712J68447
2085C295119j78207M66515n38070l11415O75470l35741L05704r4838J47801O2910
2075C495248m99873n64944J26727k7355L55626K35455J11485p09211J76624O33943
2065C333725j27881j96154k26438k96234P11205j03087k61437n11743K1598K40912
2055B584466k36058k04273J13935N17971K86792o38729M50517l74147m99994r990
$$ plain form
2045 1990490 1708514 1898021 2078497 1844913 1928457 1948136 1237735 1245544 1282526 1470797
2035 1470797 2213443 1589248 1575145 1654739 1533090 1448650 2024683 1712058 2192614 1951897
2025 1951897 2130135 1576045 1414956 1916224 2123627 1742211 1659773 1542755 1495666 1734575
2015 1734575 1997975 2255641 2171038 1868038 2010086 1691213 1200164 1768557 1667111 1096470
2005 1096470 869554 1330324 1347136 988305 1643322 2034887 1948002 2264120 1709357 1691561
1995 1691561 1532651 2230023 1769297 1483633 1953589 1915633 1797029 2162864 2189062 1837623
1985 1837623 2041041 1821253 1812784 1715190 1245536 1545988 1303042 1175144 1598036 1493283
1975 1493283 1537252 1444955 1117043 1266965 1483008 1539071 1498566 1124364 1592347 1275004
$$ packed form
2045A990490k81976J89507J80476k33584Q3544J9679p10401P809L6982J88271
2035A470797P42646o24195j4103P9594j21649q4440N76033l12625M80556k40717
2025A951897J78238n54090j61089N01268K07403l81416q2438j17018m7089K38909
2015A734575K63400K57666q4603l03000J42048l18873m91049N68393j01446n70641
2005A096470k26916M60770J6812l58831O55017L91565q6885L16118n54763j7796
1995A691561j58910O97372m60726k85664M69956l7956j18604L65835K6198l51439
1985A837623K03418k19788q469r7594m69654L00452k42946j27898M22892j04753
1975A493283M3969r2297l27912J49922K16043N6063m0505l74202M67983l17343
$$ plain form
1965 1275004 1058840 1082220 1173391 1803656 1537080 1415464 1041674 428933 932605 1093051
1955 1093051 631984 1066078 801119 1163277 854933 640183 1370240 1013105 524223 1219767
1945 1219767 1041550 1792333 1664328 1238001 1336322 1276456 1313610 1358023 1407701 1528091
1935 1528091 1825381 1931768 1280523 1194283 1360802 1430315 721899 1283894 1505551 1658623
1925 1658623 1939536 980287 1479544 1355873 1156973 1550580 1020709 1314081 1808815 1469113
1915 1469113 907966 607247 404687 -34718 303614 843728 1203425 777532 609748 1253403
1905 1253403 1294142 1587854 1184390 975040 1166494 1011687 411566 607650 1169241 1723798
1895 1723798 1507446 1241297 1433518 1134206 1056407 970445 776581 1215737 1118716 838538
$$ packed form
1965A275004k16164K3380R1171O30265k66576j21616l73790o12741N03672J60446
1955A093051m61067M34094k64959L62158l08344k14750P30057l57135m88882O95544
1945A219767j78217P50783j28005m26327R8321n9866L7154M4413M9678J20390
1935A528091K97290J06387o51245q6240J66519O9513p08416N61995K21657J53072
1925A658623K80913r59249M99257j23671j98900L93607n29871K93372M94734l39702
1915A469113n61147l00719k02560m39405L38332N40114L59697m25893j67784O43655
1905A253403M0739K93712m03464k09350J91454j54807o00121J96084N61591N54557
1895A723798k16352k66149J92221k99312p7799q5962j93864M39156r7021k80178
$$ plain form
1885 838538 988166 652670 531936 570067 1130702 817287 1129982 839739 795312 1495069
1875 1495069 1243206 1449945 1366587 833403 1090507 942077 570948 452580 745925 1091827
1865 1091827 1380990 863543 797234 1122756 1354079 1473618 812083 721760 934080 1072840
1855 1072840 1390128 1200673 897624 1334315 1551898 637779 924013 943375 803940 952107
1845 952107 966123 523700 567812 684623 1066348 1048268 1282275 1300370 1521379 996461
1835 996461 879543 1204077 1595073 1582221 1464882 1645860 1077342 948032 1470738 1665415
1825 1665415 1101566 829684 1036067 877515 1239190 1317490 952424 1285227 1219618 1952079
1815 1952079 1641323 1584139 1901042 1165846 488180 1017545 1516759 2142229 1551519 1236885
$$ packed form
1885H38538J49628l35496j20734L8131N60635l13415L12695k90243m4427O99757
1875A495069k51863K06739q3358n33184K57104j48430l71129j18368K93345L45902
1865A091827K89163n17447o6309L25522K31323J19539o61535r0323K12320J38760
1855A072840L17288j89455l03049M36691K17583r14119K86234J9362j39435J48167
1845I52107J4016m42423M4112J16811L81725j8080K34007J8095K21009n24918
1835I96461j16918L24534L90996j2852j17339J80978n68518j29310N22706J94677
1825A665415n63849k71882K06383j58552L61675P8300l65066L32803o5609P32461
1815A952079l10756n7184L16903p35196o77666N29365M99214O25470n90710l14634
$$ plain form
1805 1236885 1405760 837233 665477 281218 818260 1475210 2250612 2197058 1828012 2171161
1795 2171161 1842391 1563434 1827743 2111595 1405794 1362464 1848684 2266898 2190927 1773706
1785 1773706 1977045 2445003 2365781 1904847 1692159 2501892 2194262 2267637 2637097 2248347
1775 2248347 2490095 2433881 2888261 2899664 2750361 3659687 3640154 3434229 3652790 3276225
1765 3276225 4124040 4381846 4136806 4320206 4671263 5356953 5776155 6474605 7058452 7542964
1755 7542964 7774303 8623634 9938186 10717046 10882958 11289624 12076016 12411220 12936551
1746 12936551 13819484 14902157 16572573 18347093 20384137 22898313 24551389 26345518
1738 26345518 28889601 31857545 35508806 40054522 46322963 54108830 64041226 77553223
$$ packed form
1805A236885J68875n68527j71756l84259N37042O56950P75402n3554l69046L43149
1795B171161l28770k78957K64309K83852p05801m3330M86220M18214p5971m17221
1785A773706K03339M67958p9222m60934k12688Q09733l07630P3375L69460l88750
1775B248347K41748n6214M54380J1403j49303R09326j9533k05925K18561l76565
1765C276225Q47815K57806k45040J83400L51057O85690M19202O98450N83847M84512
1755G542964K31339Q49331J314552P78860J65912M06666P86392L35204N25331
1746A2936551Q82933J082673J670416J774520K037044K514176J653076J794129
1738B6345518K544083K967944L651261M545716O268441P785867R932396J3511997
$$ plain form
1730 77553223 95287506 116343861 123616436 111970761 93641082 77270288 63536452
1723 63536452 53540170 45142736 39063388 34380596 30747869 28044552 25341304 22996979
1715 22996979 20747759 18424962 16842370 15848076 14435418 13015132 12134883 11318610 10652150
1706 10652150 9924016 9045198 9414365 9271918 8784115 7396435 7406295 6575949 6230047 5960638
1696 5960638 6229404 5635703 5305887 5003057 4456477 3989508 4125115 3861915 3573773 3226469
1686 3226469 3494778 3791718 3719998 3674321 3637532 3029977 3260219 2600220 2613170 2706113
1676 2706113 2101065 2225426 2692219 3053987 3233544 2852718 2486870 2331248 2451645 2179051
1666 2179051 2009556 2107363 1477551 1815209 1503331 1331646 1925144 2137856 2658692 1822403
$$ packed form
1730G7553223J7734283K1056355P272575j1645675j8329679j6370794j3733836
1723F3536452r996282q397434o079348m682792l632727k703317k703248k344325
1715B2996979k249220k322797j582592r94294j412658j420286q80249q16273o66460
1706A0652150p28134q78818L69167j42447m87803j387680R860q30346l45902k69409
1696E960638K68766n93701l29816l02830n46580m66969J35607k63200k88142l47304
1686C226469K68309K96940p1720m5677l6789o07555K30242o59999J2950R2943
1676B706113o05048J24361M66793L61768J79557l80826l65848j55622J20397k72594
1666B179051j69495R7807o29812L37658l11878j71685N93498K12712N20836q36289
$$ plain form
1656 1822403 1529033 1354798 1463409 1674289 1633458 952308 863129 1440908 1821813 1538990
1646 1538990 1144109 1885987 1336257 1214350 937845 1101454 1073011 953300 820467 605902
1636 605902 562121 685525 1155956 1825859 985025 1409587 1183089 1243115 1076829 1056051
1626 1056051 900332 871091 1289613 1035612 886600 1032995 1040880 1223037 1291757 1207016
1616 1207016 883572 1236728 455619 846063 1384350 1314597 1210089 680116 749444 722792
1606 722792 601859 511048 629436 812157 368668 1004586 1314921 1538467 1017102 602391
1596 602391 879643 789973 543205 854513 960760 1019767 1384507 1289375 1821712 911035
1586 911035 546402 701982 564931 989882 828114 1034229 977286 494829 679308 847309
$$ packed form
1656A822403k93370j74235J08611K10880m0831o81150q9179N77779L80905k82823
1646A538990l94881P41878n49730j21907k76505J63609k8443j19711j32833k14565
1636F05902m3781J23404M70431O69903q40834M24562k26498O0026j66286k0778
1626A056051j55719k9241M18522k54001j49012J46395P885J82157O8720q4741
1616A207016l23444L53156p81109L90444N38287o9753j04508n29973O9328k6652
1606G22792j20933r0811J18388J82721m43489O35918L10335K23546n21365m14711
1596F02391K77252q9670k46768L11308J06247N9007L64740r5132N32337r10677
1586I11035l64633J55580j37051M24951j61768K06115n6943m82457J84479J68001
$$ plain form
1576 847309 354073 20416 -60618 200533 -248194 178591 434824 -286808 19967 156614
1566 156614 287875 209538 506210 176370 253789 556644 534635 -224858 403790 109649
1556 109649 144783 397690 870379 982672 1199632 779059 634868 961466 895449 380400
1546 380400 43061 335257 12323 560059 203566 -123627 693860 616277 964935 827083
1536 827083 656622 809581 850314 839841 1082414 854814 285892 475859 848788 1066125
1526 1066125 950413 777340 748786 710971 662812 1227735 835768 760139 901928 870937
1516 870937 416118 711611 907541 1065637 731834 553605 349500 25319 565625 457989
1506 457989 195357 314720 336814 437539 731606 413417 -50983 734431 630774 581425
$$ packed form
1576H47309m93236l33657q1034K61151m48727M26785K56233p21632L06775J36647
1566A56614J31261p8337K96672l29840P7419L02855k2009p59493O28648k94141
1556A09649L5134K52907M72689J12293K16960m20573j44191L26598o6017n15049
1546C80400l37339K92196l22934N47736l56493l27193Q17487p7583L48658j37852
1536H27083j70461J52959M0733j0473K42573k27600n68922J89967L72929K17337
1526A066125j15712j73073k8554l7815m8159N64923l91967p5629J41789l0991
1516H70937m54819K95493J95930J58096l33803j78229k04105l24181N40306j07636
1506D57989k62632J19363K2094J00725K94067l18189m64400P85414j03657m9349
$$ plain form
1496 581425 458300 326912 459944 707553 329478 -316633 83753 304064 126203 172633
1486 172633 382799 512038 302726 898150 170220 -269205 635614 729673 612935 146657
1476 146657 152132 -60879 -280287 -126197 -362248 -263845 -271100 -119975 -265559 -342070 -57647
1465 -57647 -45368 -208319 223713 510088 669388 402184 -86914 49230 2119 475355
1455 475355 569536 262908 236278 252526 9697 296158 109897 810677 745056 1085703
1445 1085703 423439 466382 655895 840158 441911 597235 635252 527711 892918 985785
1435 985785 125520 -414507 -53629 14514 481137 -1839 -320270 7074 -10028 348157
1425 348157 267877 -116599 -614598 -193297 -230178 511449 410772 11580 261786 524075
$$ packed form
1496E81425j23125j31388J33032K47609l78075o46111M00386K20311j77861M6430
1486A72633K10166J29239k09312N95424p27930m39425R04819R4059j16738m66278
1476A46657N475k13011k19408J54090k36051R8403p255J51125j45584p6511K84423
1465e7647J2279j62951M32032K86375J59300k67204m89098J36144m7111M73236
1455D75355R4181l06628k6630J6248k42829K86461j86261P00780o5621L40647
1445A085703o62264M2943J89513J84263l98247J55324L8017j07541L65207R2867
1435I85785q60265n40027L60878O8143M66623m82976l18431L27344j7102L58185
1425C48157q0280l84476m97999M21301l6881P41627j00677l99192K50206K62289
$$ plain form
1415 524075 562276 -168764 -622996 -194827 -44349 62510 72505 268858 321647 230402 -24207
1404 -24207 239025 393300 499338 641593 551812 1336683 853923 738659 -163532 386526
1394 386526 417484 246047 683781 517463 192297 232469 91872 187159 -238923 -402104
1384 -402104 -571392 -329059 -277913 -171981 35371 186949 238274 331411 544570 183345
1374 183345 53701 -44296 -287871 -228623 10936 211637 -269686 -96532 -30664 -155085
1364 -155085 128688 652304 292068 44360 372634 556406 577004 74101 24115 627362
1354 627362 679974 296482 169062 355185 118188 800094 116573 244362 1400 159095
1344 159095 -397309 -525837 467236 -207286 38926 141759 130428 157644 -350868 -24582
$$ packed form
1415E24075L8201p31040m54232M28169J50478J06859R995J96353N2789r1245k54609
1404b4207K63232J54275J06038J42255q9781P84871m82760j15264r02191N50058
1394C86526L0958j71437M37734j66318l25166M0172j40597R5287m26082j63181
1384d02104j69288K42333N1146J05932K07352J51578N1325R3137K13159l61225
1374A83345j29644r7997k43575N9248K39559K00701m81323J73154O5868j24421
1364a55085K83773N23616l60236k47708L28274J83772K0598n02903m9986O03247
1354F27362N2612l83492j27420J86123k36997O81906o83521J27789k42962J57695
1344A59095n56404j28528R93073o74522K46212J02833j1331K7216n08512L26286
$$ plain form
1334 -24582 -604645 -101564 -237620 -300380 -466408 -305912 218941 239438 858223 246580
1324 246580 261076 279919 600344 396246 397009 55833 374393 889220 177800 274688 13424
1313 13424 -282032 78131 -99313 -452170 -652833 -104846 -83125 -59511 37318 683089
1303 683089 634643 761593 304640 78432 9061 11835 150910 113592 -34819 -266801 -276179
1292 -276179 -216960 -195275 415131 199744 49846 -237907 -117711 143267 -104356 574773
1282 574773 288565 -167071 491043 429293 1009244 1047839 617299 243843 -3612 -138499
1272 -138499 -494974 -286556 281096 169883 -251388 371345 180909 2477 203530 335848
1262 335848 547073 -158808 714075 484531 -224195 84792 75337 483088 -41374 188059
$$ packed form
1334b4582n80063N03081j36056o2760j66028J60496N24853K0497O18785o11643
1324B46580J4496J8843L20425k04098P63l41176L18560N14827p11420R6888k61264
1313A3424k95456L60163j77444l52857k00663N47987K1721K3614R6829O45771
1303F83089m8446J26950m56953k26208o9371K774J39075l7318j48411k31982r378
1292b76179N9219K1685O10406k15387j49898k87753J20196K60978k47623O79129
1282E74773k86208m55636O58114o1750N79951L8595m30540l73456k47455j34887
1272a38499l56475K08418N67652j11213m21271O22733j90436j78432K01053J32318
1262C35848K11225p05881Q72883k29544p08726L08987r455M07751n24462K29433
$$ plain form
1252 188059 596620 477231 253304 121018 317348 -535455 -212786 455720 209994 366597
1242 366597 336105 693479 610684 90969 132223 673611 138151 192976 305688 724132
1232 724132 118555 -80185 66285 33167 -207614 119699 -73557 -261578 66388 739683
1222 739683 145785 6474 1070914 152082 -33643 -74517 181479 -184207 -504607 123365
1212 123365 608319 291974 -92117 -176052 634424 203179 -189306 -44457 340832 542492
1202 542492 338439 18804 -83930 -381565 -215710 626266 785515 298764 -295337 -139669
1192 -139669 102215 -221665 -292230 49836 95250 63950 180946 63102 -23785 26403 328660
1181 328660 -13951 -86931 -130320 -228218 -459416 -286688 -174237 -504416 -300518 -73565
$$ packed form
1252A88059M08561j19389k23927j32286J96330q52803L22669O68506k45726J56603
1242C66597l0492L57374q2795n19715M1254N41388n35460N4825J12712M18444
1232G24132o05577j98740J46470l3118k40781L27313j93256j88021L27966O73295
1222G39683n93898j39311J064440r18832j85725m0874K55996l65686l20400O27972
1212A23365M84954l16345l84091q3935Q10476m31245l92485J44849L85289K01660
1202E42492k04053l19635j02734k97635J65855Q41976J59249m86751n94101J55668
1192a39669K41884l23880p0565L42066M5414l1300J16996j17844q6887N0188L02257
1181C28660l42611p2980m3389r7898k31198J72728J12451l30179K03898K26953
$$ plain form
1171 -73565 647429 358833 63497 -6252 -166290 -202803 -494980 -359991 18680 213653
1161 213653 228380 -213797 -353969 -231279 45151 172780 181741 758991 1236458 1320297
1151 1320297 524690 184719 -274315 -765690 -441696 113831 286517 511210 116725 276739
1141 276739 657689 676087 827897 50778 230547 460041 53538 544560 642070 728970
1131 728970 74762 -140000 -37801 -84837 -570926 -725211 -401443 -343838 30137 -208995
1121 -208995 -510156 -144267 330535 463630 272132 -184532 -108778 -324213 -99988 -162663
1111 -162663 108493 108690 373161 89808 69279 -510651 22294 199997 61303 106624 33006
1100 33006 -339216 -364514 -265820 266750 -6237 67415 817986 1028121 846007 684664
$$ packed form
1171g3565P20994k88596k95336o9749j60038l6513k92177J34989L78671J94973
1161B13653J4727m42177j40172J22690K76430J27629Q961N77250M77467Q3839
1151A320297p95607l39971m59034m91375L23994N55527J72686K24693l94485J60014
1141B76739L80950J8398J51810p77119J79769K29494m06503M91022R7510Q6900
1131G28970o54208k14762J02199m7036m86089j54285L23768N7605L73975k39132
1121b08995l01161L65889M74802J33095j91498m56664P5754k15435K24225o2675
1111a62663K71156J97K64471k83353k0529n79930N32945J77703j38694M5321p3618
1100C3006l72222k5298R8694N32570k72987P3652P50571K10135j82114j61343
$$ plain form
1090 684664 764012 901930 402069 34479 -313666 -237677 228835 177222 112073 576425
1080 576425 411259 -627509 -403945 -265128 43764 -86012 68718 -181624 -22064 269142
1070 269142 594316 -282706 309077 325121 -415796 361819 160171 -151000 45308 201078
1060 201078 -2038 112225 164092 197987 39117 37347 91830 358207 -211089 -196869 -212170
1049 -212170 84567 -148421 -299128 -60324 -42229 759979 365151 81151 336984 273345
1039 273345 -202971 -423443 269933 1074947 524960 99691 -45632 -525653 -19919 -14569
1029 -14569 -142041 508305 296501 201920 -101018 -321888 -156757 83860 -190200 -560343
1019 -560343 -254662 -583637 855340 821419 356831 408820 126846 -259318 417966 754108
$$ packed form
1090F84664P9348J37918m99861l67590l48145P5989M66512n1613o5149M64352
1080E76425j65166j038768K23564J38817L08892j29776J54730k50342J59560K91206
1070B69142L25174q77022N91783J6044p40917P77615k01648l11171J96308J55770
1060B01078k03116J14263N1867L3895j58870j770N4483K66377n69296J4220j5301
1049b12170K96737k32988j50707K38804J8095Q02208l94828k84000K55833o3639
1039B73345m76316k20472O93376Q05014n49987m25269j45323m80021N05734N350
1029a4569j27472O50346k11804r4581l02938k20870J65131K40617k74060l70143
1019e60343L05681l28975J438977l3921m64588N1989k81974l86164O77284L36142
$$ plain form
1009 754108 -128178 393810 191301 67997 -44119 63423 61423 184349 333610 201922
999 201922 37017 186108 -66828 -110324 -175674 -117794 352400 764441 186501 -198613
989 -198613 -244853 -271878 -96129 -75361 -666368 -236859 160292 230624 178473 664239 -3248
978 -3248 250471 -299479 -248164 616174 382096 100053 48957 111140 592108 46837 -446037
967 -446037 -364799 -350267 -40620 -18296 -650990 -590867 252779 303652 97350 -58482 40155
956 40155 -264836 297525 397237 796188 855222 293240 109720 -241162 -288219 225134 -51632
945 -51632 -11396 341059 521179 88319 283644 523840 393379 -299372 -218451 -323022
935 -323022 -190455 -34476 220490 208910 18269 -455346 -556784 -116818 -44065 230738
$$ packed form
1009G54108q82286N21988k02509j23304j12116J07542k000J22926J49261j31688
999B01922j64905J49091k52936m3496o5350N7880M70194M12041n77940l85114
989a98613m6240k7025J75749K0768n91007M29509L97151P0332n2151M85766o67487
978c248K53719n49950N1315Q64338k34078k82043n1096O2183M80968n45271m92874
967d46037Q1238J4532L09647K2324o32694O0123Q43646N0873k06302j55832R8637
956D0155l04991N62361R9712L98951N9034n61982j83520l50882m7057N13353k76766
945e1632M0236L52455J80120m32860J95325K40196j30461o92751Q0921j04571
935c23022J32567J55979K54966j1580j90641m73615j01438M39966P2753K74803
$$ plain form
925 230738 -344711 -168310 -183096 -390236 -187110 152092 -636449 -77553 -470702 -55584
915 -55584 188722 -70146 526521 92010 -7912 -82625 -81103 -87545 321893 122710 -192742
904 -192742 -115636 207744 364710 471049 -140254 -505179 81013 184941 53332 -53475
894 -53475 -436045 -175936 77524 -38401 -374424 -135124 103654 101510 263285 104063
884 104063 -229468 -343131 270916 63991 -135257 419106 653247 -319379 -481519 179730
874 179730 -192318 -33279 156384 514770 334055 518989 -203348 -1010752 -88907 528562
864 528562 90640 439542 385830 351839 -24663 -48959 -204799 -24561 -22997 -340064 -119171
853 -119171 -606598 -42712 202837 880011 798679 -134439 -1009160 -444265 -84301 134697
$$ packed form
925B30738n75449J76401j4786k07140K03126L39202p88541N58896l93149M15118
915e5584K44306k58868N96667m34511r9922p4713J522o442M09438j99183l15452
904a92742P7106L23380J56966J06339o11303l64925N86192J03928j31609j06807
894e3475l82570K60109K53460j15925l36023K39300K38778k144J61775j59222
884A04063l33531j13663O14047k06925j99248N54363K34141r72626j62140O61249
874A79730l72048J59039J89663L58386j80715J84934p22337q07404R21845O17469
864E28562m37922L48902n3712l3991l76502k4296j55840J80238J564l17067K20893
853a19171m87427N63886K45549O77174q1332r33118q74721N64895L59964K18998
$$ plain form
843 134697 194859 46018 -497025 -303539 86073 -766820 -112369 350286 477016 -92537
833 -92537 -39391 -19751 301169 418000 648535 188296 -430304 -441716 -145914 85483 -28777
822 -28777 -13289 -542007 -379915 98657 331863 479485 230989 651604 261471 -184982
812 -184982 -670469 -225443 272832 587132 380767 161452 598854 628269 218579 61976
802 61976 812039 180886 -30538 167164 -634864 55295 14553 -204528 -280415 29059
792 29059 -54336 -459993 -300414 -213833 54631 -146913 68108 298814 591346 601039 294823
781 294823 -69179 -164407 158287 400381 490553 632294 -5100 267914 -303555 -414000
771 -414000 -170669 -219104 96734 18570 -25602 -256414 -165822 202510 -83473 -418537 -456644
$$ packed form
843A34697O0162j48841n43043J93486L89612q52893O54451M62655J26730n69553
833i2537N3146J9640L20920J16831K30535m60239o18600j1412K95802K31397j14260
822b8777J5488n28718J62092M78572K33206J47622k48496M20615l90133m46453
812a84982m85487M45026M98275L14300k06365k19315M37402K9415m09690j56603
802F1976P50063o31153k11424J97702q02028O90159m0742k19081p5887L09474
792B9059q3395m05657J59579Q6581K68464k01544K15021K30706K92532R693l06216
781B94823l64002r5228L22694K42094R0172J41741o37394K73014n71469j10445
771d14000K43331m8435L15838p8164m4172k30812R0592L68332k85983l35064l8107
$$ plain form
760 -456644 -121999 -180763 130364 -21472 1157 397552 709455 392138 236110 82944
750 82944 79559 -462055 224663 -467424 -482295 36910 79343 -302079 -784210 -451413 -220912
739 -220912 -115891 -150667 -290515 29316 69588 -349504 -215461 -584577 -706268 -413745
729 -413745 173820 300665 269017 17687 -173572 -131332 -217707 365126 -33650 -1106754
719 -1106754 -66789 -616592 -454451 -89361 -90834 -31204 215726 -17592 -353309 147560
709 147560 416821 661644 -69088 -159615 -584104 -114124 -185960 -133894 43367 -157154
699 -157154 85504 -471198 -519024 -338134 -488684 11702 323747 -492787 -641131 114867
689 114867 -376348 341090 280200 -253204 -504391 -719862 -227125 -24936 222838 243348
$$ packed form
760d56644L34645n8764L11127j51836K2629L96395L11903l17317j56028j53166
750H2944l385n41614O86718o92087j4871N19205M2433l81422m82131L32797K30501
739b20912J05021l4776j39848L19831M0272m19092J34043l69116j21691K92523
729d13745N87565J26845l1648k51330j91259M2240q6375N82833l98776j073104
719a106754J039965n49803J62141L65090j473N9630K46930k33318l35717N00869
709A47560K69261K44823p30732r0527m24489M69980p1836N2066J77261k00521
699a57154K42658n56702m7826J80890j50550N00386L12045q16534j48344P55998
689A14867m91215P17438o0890n33404k51187k15471M92737K02189K47774K0510
$$ plain form
679 243348 122119 -52788 -22442 -77790 612346 -193191 -335762 122182 -379042 -657806
669 -657806 134593 -138133 -653084 40717 137977 -458883 102356 67698 -339482 -195664
659 -195664 -208979 -181670 -546624 -682211 -428020 -180426 307143 -484369 -949958 313358
649 313358 679627 -500773 -274938 -179703 -654532 -825899 -216027 34689 -414228 -53768
639 -53768 -603355 -940944 -503288 -711047 -676217 -14555 -108711 -297036 34008 768000
629 768000 535791 -590011 -868824 -652801 -456981 -411077 -51503 -640768 -775951 -276035
619 -276035 -255332 -107288 -452120 -396888 -222893 -15466 -143898 -557863 -272561 -520883
609 -520883 -638273 -337581 -759789 -695980 -505247 -512977 -3402 -31549 -429521 -193863 -15484
$$ packed form
679B43348j21229j74907L0346n5348O90136q05537j42571M57944n01224k78764
669f57806P92399k72726n14951O93801R7260n96860N61239l4658m07180J43818
659a95664j3315K7309l64954j35587K54191K47594M87569p91512m65589J263316
649C13358L66269j180400K25835R5235m74829j71367O09872K50716m48917L60460
639e3768n49587l37589M37656k07759L4830O61662r4156j88325L31044P33992
629G68000k32209j125802k78813K16023J95820M5904L59574n89265j35183M99916
619b76035K0703J48044l44832N5232J73995K07427j28432m13965K85302k48322
609e20883j17390L00692m22208O3809J90733p730N09575k8147l97972K35658J78379
$$ plain form
598 -15484 -161838 503881 845194 -22023 25974 132689 255118 337006 358509 361275 222916
587 222916 617114 216213 54704 83373 11322 335225 287123 429753 -235177 -147703 185400
576 185400 -57601 -116621 693477 626283 90587 -290586 -637731 -497026 275207 528748
566 528748 353054 284784 -340048 147311 74952 566131 387875 403329 594294 506290 661922
555 661922 174757 -323931 -434359 -535205 -577669 -105017 175873 -95406 -127403 -436220
545 -436220 -1066487 -584096 -146720 214461 -20006 -58876 -601322 -320502 507468 -156805
535 -156805 -18667 -210514 139380 -256997 -559089 -179748 -2053 -242239 277206 148201
525 148201 -174301 -334899 -187892 -65620 -206769 -75355 -237004 -604217 -200402 -71536
$$ packed form
598a5484j46354O65719L41313q67217M7997J06715J22429Q1888K1503K766j38359
587B22916L94198m00901j61509K8669p2051L23903m8102J42630o64930Q7474L33103
576A85400k43001n9020Q10098o7194n35696l81173l47145J40705P72233K53541
566E28748j75694o8270o24832M87359p2359M91179j78256J5454J90965q8004J55632
555F61922m87165m98688j10428j00846m2464M72652K80890k71279l1997l08817
545d36220o30267M82391M37376L61181k34467l8870n42446K80820Q27970o64273
535a56805J38138j91847L49894l96377l02092L79341J77695k40186N19445j29005
525A48201l22502j60598J47007J22272j41149J31414j61649l67213M03815J28866
$$ plain form
515 -71536 -482764 -657886 -255898 360104 22314 337369 -15688 -45880 110087 187279
505 187279 -304255 -218430 -58694 -53617 -145856 -375837 -364235 -199189 -96109 -164259 146924
494 146924 141634 71286 264213 -49319 196454 177387 -208551 176336 200320 -144135 -99560
483 -99560 155048 328509 -2084 -47734 -63246 -297618 -256070 -447572 -429758 -90191 -200097
472 -200097 -96037 -196082 -363957 -105627 -100408 213235 -31505 -106104 -70837 182702 344528
461 344528 227499 341194 388281 121310 122181 -86184 -22116 176429 170175 -349566 -631797
450 -631797 1622 -517542 8647 -116419 201560 -504634 -127860 -757879 -897246 -334980
440 -334980 39783 164988 -313693 -298108 -329407 -251571 -338386 -291642 -783843 -601269 -160013
$$ packed form
515g1536m11228j75122M01988O16002l37790L15055l53057l0192J55967P7192
505A87279m91534Q5825J59736N077r2239k29981J1602J65046J03080o8150L11183
494A46924n290p0348J92927l13532K45773j9067l85938L84887K3984l44455M4575
483i9560K54608J73461l30593m5650j5512k34372M1548j91502J7814L39567j09906
472b00097J04060j00045j67875K58330N219L13643k44740p4599L5267K53539J61826
461C44528j17029J13695M7087k66971Q71k08365O4068J98545o254n19741k82231
450f31797O33419n19164N26189j25066L17979p06194L76774o30019j39367N62266
440c34980L74763J25205m78681J5585l1299P7836q6815M6744m92201J82574M41256
$$ plain form
429 -160013 -55126 53807 36363 -787289 -1179214 -354490 300189 -399621 -690667 -667430
419 -667430 -581496 55960 -743697 -218066 298738 73511 -519705 -72088 84331 -509337
409 -509337 -444358 -269851 78519 -81391 -17830 169254 242178 -316598 -263671 -222591 14681
398 14681 -201215 -714217 -662855 -462017 -569481 -45921 -279256 -108302 646771 -372015
388 -372015 -625526 295120 -238889 -89317 -473832 -300649 -11062 -91777 -295878 19457
378 19457 -213485 -57406 -704794 -572674 -212131 186587 -30161 -71271 291679 -390921
368 -390921 -57198 166572 464187 99127 -438801 -522118 -245548 -270413 -17097 -283933
358 -283933 -133316 -271278 -255071 -131365 129039 441103 -124676 -182333 -548211 35971
$$ packed form
429a60013J04887J08933j7444q23652l91925Q24724O54679o99810k91046K3237
419f67430Q5934O37456p99657N25631N16804k25227n93216M47617J56419n93668
409e09337O4979J74507L48370j59910O3561J87084P2924n58776N2927M1080K37272
398A4681k15896n13002N1362K00838j07464N23560k33335J70954P55073j018786
388c72015k53511R20646n34009J49572l84515J73183K89587q0715k04101L15335
378A9457k32942J56079o47388J32120L60543L98718k16748m1110L62950o82600
368c90921L33723K23770K97615l65060n37928q3317K76570k4865K53316k66836
358b83933J50617j37962J6207J23706K60404L12064n65779n7657l65878N84182
$$ plain form
348 35971 -525968 -449149 -12409 291048 -29209 -500285 -517971 -718657 -1061409 -620788
338 -620788 -256412 -372871 -371258 -407319 -261660 -113860 -91910 -150204 425485 -10434 212857
327 212857 228921 134276 288549 284851 290987 -226669 -89792 -483222 -696594 -926973 -335987
316 -335987 -360398 -483667 83587 -14427 469811 -235518 -649348 -1013704 -204951 -229060
306 -229060 -61746 126648 -100602 -273288 -951615 -610780 -492602 108498 552831 267423
296 267423 -215246 -53855 -509224 -18691 -267672 -1069781 -568685 -485545 50388 -259705
286 -259705 -301990 544726 -334885 -1059286 -293556 -346862 -95177 -429533 -248281 -342610
276 -342610 -317179 -676130 -995434 -470035 -59144 -117942 -240902 -425727 17880 -514175
$$ packed form
348C5971n61939P6819M36740L03457l20257m71076j7686k00686l42752M40621
338f20788L64376j16459J613l6061J45659J47800K1950n8294N75689m35919K23291
327B12857J6064r4645J54273l698O136n17656J36877l93430k13372k30379N90986
316c35987k4411j23269N67254r8014M84238p05329m13830l64356Q08753k4109
306b29060J67314J88394k27250j72686o78327L40835J18178O01100M44333k85408
296B67423m82669J61391m55369M90533k48981q02109N01096Q3140N35933l10093
286b59705m2285Q46716q79611p24401P65730n3306K51685l34356J81252r4329
276c42610K5431l58951l19304N25399M10891n8798j22960j84825M43607n32055
$$ plain form
266 -514175 -607713 -186912 106337 623501 276506 -190719 -310240 -169916 44872 -334084
256 -334084 -5798 63850 -589460 -673467 -296068 95481 -56025 75128 -242895 -184281
246 -184281 -445565 -313677 -439942 -369231 -32715 342260 390064 -582051 -811833 -646663
236 -646663 -1027140 -212455 24228 27921 27734 -163490 226854 -355281 -53136 6981 -71106
225 -71106 -684003 -859977 -265810 191659 -50550 -213369 100445 51970 132258 52445 -496846
214 -496846 -789117 33832 -442809 -267576 349606 -55974 -401151 -852491 -376176 -347168
204 -347168 -511616 -760045 -64452 279080 99407 -428679 -291227 134843 -195564 -526716
194 -526716 113773 520103 -440832 -312321 -89280 17185 -648583 -641969 -172627 436176
$$ packed form
266e14175r3538M20801K93249N17164l46995m67225j19521J40324K14788l78956
256c34084L28286O9648o53310q4007L77399L91549j51506J31153l18023N8614
246a84281k61284J31888j26265P0711L36516L74975M7804r72115k29782J65170
236f46663l80477Q14685K36683L693j87j91224L90344n82135L02145O0117p8087
225g1106o12897j75974N94167M57469k42209j62819L13814m8475Q0288p9813n49291
214d96846k92271Q22949m76641J75233O17182m05580l45177m51340M76315K9008
204c47168j64448k48429O95593L43532j79673n28086J37452M26070l30407l31152
194e26716O40489M06330r60935J28511K23041J06465o65768O614M69342O08803
$$ plain form
184 436176 445077 -1255 -218691 -7849 -32982 500972 121078 44983 -549077 -347321 -392546
173 -392546 817 -252448 -495848 -226766 -369241 -148949 -327095 59108 -575011 106272
163 106272 393807 -140691 -568650 -598359 -595148 -299425 -1081586 -1067814 1622 -40428 257855
152 257855 -278228 96256 410 -744925 -526850 -228120 -508539 -310029 -369354 -935677
142 -935677 -926897 -574271 -486814 -467010 -368094 -436297 -339446 -287466 -222633 204116 98091
131 98091 -216818 -436384 -489823 -274032 -470883 -270218 -614375 -449595 -410117 -33313
121 -33313 -62588 -351279 -260156 -79708 -608252 -517320 -780374 -454898 -599707 -534824 -803302
110 -803302 -919649 -997434 -488556 -296393 -707705 -639850 -365277 488172 -64634 -219216
$$ packed form
184D36176Q901m46332k17436K10842k5133N33954l79894p6095n94060K01756m5225
173c92546L93363k53265k43400K69082j42475K20292j78146L86203o34119O81283
163A06272K87535n34498m27959k9709L211K95723p82161J3772J069436m2050K98283
152B57855n36083L74484r5846p45335K18075K98730k80419J98510n9325n66323
142i35677Q780L52626Q7457J9804R8916o8203R6851N1980O4833M26749j06025
131I8091l14909k19566n3439K15791j96851K00665l44157J64780L9478L76804
121c3313k9275k88691R1123J80448n28544R0932k63054L25476j44809O4883k68478
110h03302j16347p7785N08878J92163m11312O7855K74573Q53449n52806j54582
$$ plain form
100 -219216 -298000 -29941 -70040 -275843 -1708 -494938 97854 628229 249967 -264344
90 -264344 -338517 -470930 -429489 45850 -261216 113753 -46097 -243607 -494208 -310624
80 -310624 214217 150368 -199030 -365608 21660 72018 -101411 -174421 -5356 -70431 -90960
69 -90960 -9222 -3538 -273838 -260803 -169001 -722581 -646755 -573997 -619342 -676345 -466069 -268982
57 -268982 -376167 -433379 -139731 253473 166336 -23178 -50314 -84782 -324066 -237220 -126353
46 -126353 -342102 -470421 -753303 -353429 -254052 -97828 -177831 -275259 -401168 -471882 -227649
35 -227649 -554343 -519452 -448283 -724298 -604880 -518169 -564248 -486048 68619 -244138 286514
24 286514 162739 -796652 -709476 -100022 -143394 -277875 -466630 -120645 -282554 -217002 -292681
$$ packed form
100b19216p8784K68059m0099k05803K74135m93230N92792N30375l78262n14311
90b64344p4173j32413M1441M75339l07066L74969j59850j97510k50601J83584
80c10624N24841o3849l49398j66578L87268N0358j73429p3010J69065o5075k0529
69i0960Q1738N684k70300J3035R1802n53580P5826P2758m5345n7003K10276J97087
57b68982j07185n7212K93648L93204q7137j89514k7136l4468k39284Q6846J10867
46a26353k15749j28319k82882L99874R9377J56224q0003r7428j25909p0714K44233
35b27649l26694L4891P1169k76015J19418Q6711m6079P8200N54667l12757N30652
24B86514j23775r59391Q7176O09454m3372j34481j88755L45985j61909O5552p5679
$$ plain form
13 -292681 -509929 -502775 -27738 -107627 -258707 -521880 -286864 26215 -245189 -365501 -294011
2 -294011 -421660 -621326
0 -621326
$$ packed form
13b92681k17248P154M75037p9889j51080k63173K35016L13079k71404j20312P1490
2b94011j27649j99666
0f21326
$$ Imaginary data points
##PAGE= N=2
##DATA TABLE= (X++(I..I)), XYDATA
$$ plain form
16383 -5106553 -4827698 -5254767 -4970423 -4733021 -4798511 -4687976 -4640965 -4274648 -4572888 -4981091
16373 -4981091 -5005484 -4501937 -4124931 -4350405 -4294071 -3996129 -4032661 -4081958 -4097881 -4322951
16363 -4322951 -4197090 -3822614 -4060717 -4327602 -3802184 -4069974 -3930304 -3637584 -3409889
16354 -3409889 -3605148 -3794407 -3629672 -3327227 -3061981 -3318990 -3558274 -3434475 -2767943
16345 -2767943 -2860221 -2933763 -2847332 -3401502 -2992610 -2653010 -2307964 -2305879 -2577535 -2300332
16335 -2300332 -2067143 -2155286 -2612185 -2685225 -2609606 -2454992 -2219622 -2621406 -2382110 -2318411
16325 -2318411 -2042506 -1985570 -2083618 -1992342 -1957660 -1914190 -1912855 -1493288 -1793776 -1930472 -1495400
16314 -1495400 -1616314 -1389325 -1305285 -1685624 -1241129 -1321482 -1468115 -1378813 -1464038 -1247113
$$ packed form
16383e106553K78855m27069K84344K37402o5490J10535M7011L66317k98240m08203
16373d981091k4393N03547L77006k25474N6334K97942l6532m9297j5923k25070
16363d322951J25861L74476k38103k66885N25418k67790J39670K92720K27695
16354c409889j95259j89259J64735L02445K65246k57009k39284J23799O66532
16345b767943r2278p3542Q6431n54170M08892L39600L45046K085k71656K77203
16335b300332K33189q8143m56899p3040P5619J54614K35370m01784K39296O3699
16325b318411K75905N6936r8048R1276L4682M3470J335M19567l00488j36696M35072
16314a495400j20914K26989Q4040l80339M44495q0353j46633Q9302q5225K16925
$$ plain form
16304 -1247113 -1674445 -1457647 -764258 -1025789 -524220 -555168 -448674 -722407 -898040 -530572
16294 -530572 -431943 -572471 -833060 -1159574 -957707 -657403 -649168 -429673 -814142 -684108
16284 -684108 -352448 -662951 -201341 -115147 -273006 72895 -65676 -404393 257491 539401
16274 539401 278427 497185 632568 43157 232426 170538 518228 375072 310456 564080
16264 564080 711347 336248 436346 989404 841095 869684 1031305 664946 290014 357470
16254 357470 362233 307653 684145 802401 941088 999111 910431 1362042 1066939 810532
16244 810532 1000446 1184290 1179158 1576377 1525660 1211471 1633379 1366089 1380139 1487596
16234 1487596 1933214 1752608 1441446 1365836 1464990 1783329 1986030 1470407 1248618 1533940
$$ packed form
16304a247113m27332K16798O93389k61531N01569l0948J06494k73733j75633L67468
16294e30572R8629j40528k60589l26514K01867L00304Q235K19495l84469J30034
16284f84108L31660l10503M61610Q6194j57859L45901j38571l38717O61884K81910
16274E39401k60974K18758J35383n89411J89269o1888L47690j43156o4616K53624
16264E64080J47267l75099J00098N53058j48309K8589J61621l66359l74932O7456
16254C57470M763n4580L76492J18256J38687N8023q8680M51611k95103k56407
16244H10532J89914J83844n132L97219n0717l14189M21908k67290J4050J07457
16234A487596M45618j80606l11162p5610R9154L18339K02701n15623k21789K85322
$$ plain form
16224 1533940 1740653 1504394 1621185 1865146 2492106 2417733 2051573 2266402 2291553 1855998
16214 1855998 1623644 1920620 1821902 1869452 1568838 1945400 1951585 1943892 2031561 2290421 2156079
16203 2156079 2582245 2618414 3266905 3275023 2545433 2720830 2240906 2425585 2702992 2402305
16193 2402305 2378332 2071443 2391362 2411598 2589108 2909935 2797555 2500774 2295064 2487028
16183 2487028 2746398 2416342 2642596 2453233 2627466 2382270 2176138 2272743 2676382 2811176
16173 2811176 2682742 2484227 2188009 2146648 2231794 3189474 2917455 3301442 3114819 2858904
16163 2858904 2812004 2632654 2789436 2763820 3057640 2779246 2762691 2849385 3312774 2851155
16153 2851155 2733840 3207509 3205200 3584278 3156482 3592470 3255032 3115937 3363100 3479219
$$ packed form
16224A533940K06713k36259J16791K43961O26960p4373l66160K14829K5151m35555
16214A855998k32354K96976r8718M7550l00614L76562O185p693Q7669K58860j34342
16203B156079M26166L6169O48491Q118p29590J75397m79924J84679K77407l00687
16193B402305k3973l06889L19919K0236J77510L20827j12380k96781k05710J91964
16183B487028K59370l30056K26254j89363J74233k45196k06132R6605M03639J34794
16173B811176j28434j98515k96218m1361Q5146R57680k72019L83987j86623k55915
16163B858904m6900j79350J56782k5616K93820k78394j6555Q6694M63389m61619
16153B851155j17315M73669k309L79078m27796M35988l37438j39095K47163J16119
$$ plain form
16143 3479219 3375145 3227705 3698150 3593780 3431402 3148082 3224054 2961660 2748513 3150205
16133 3150205 3029443 2630417 2283931 2834496 3493999 3418073 3445142 3712886 3626433 3197054
16123 3197054 3417724 3229610 3110233 2916643 3172128 3484097 3844917 3695892 3271895
16114 3271895 3156259 2705157 3529233 3519613 4004887 4378527 3763189 4073419 3665286 3811330
16104 3811330 3298633 2998469 3043218 3650211 3563688 3412308 3801844 3421053 3743503 3877141
16094 3877141 3255662 3742774 3679188 3551364 3190205 3285495 3591381 3608904 3628199 3305165
16084 3305165 3409021 3763125 3341941 3117710 3999947 3876884 3722627 4117935 3634212
16075 3634212 3262602 3571413 3252080 3717473 4397503 3792471 3659658 3598006 3397626 3448760
$$ packed form
16143C479219j04074j47440M70445j04370j62378k83320P5972k62394k13147M01692
16133C150205j20762l99026l46486N50565O59503p5926K7069K67744q6453m29379
16123C197054K20670j88114j19377j93590K55485L11969L60820j49025m23997
16114C271895j15636m51102Q24076r620M85274L73640o15338L10230m08133J46044
16104C811330n12697l00164M4749O06993q6523j51380L89536l80791L22450J33638
16094C877141o21479M87112o3586j27824l61159R5290L05886J7523J9295l23034
16084C305165J03856L54104m21184k24231Q82237j23063j54257L95308m83723
16075C634212l71610L08811l19333M65393O80030o05032j32813o1652k00380N1134
$$ plain form
16065 3448760 3435242 3593387 3193217 3786201 4111880 4480919 3617878 4277627 4319320 3831626
16055 3831626 3856345 3484660 3132203 3574132 3660739 3766972 3588763 3448988 3661712 3212402
16045 3212402 3453900 2896217 3074111 3894994 3966666 4141568 4081009 3642407 3467683 3299279
16035 3299279 3017720 2906821 2612093 3242882 3422959 3660510 3729150 4005624 3690944 2909689
16025 2909689 3668318 4294833 3597362 3808864 3196109 3192403 3480149 2944404 3777559 3232256
16015 3232256 3320774 2788330 3254179 3342162 3400346 3429168 3430135 3675219 3706894 3411343 3613719
16004 3613719 4084504 3062371 3536692 4144083 3596399 3383806 3604775 3335497 3572891
15995 3572891 3299978 3181131 3689386 3547303 4071190 3682596 3429541 3484184 3145565 3114309
$$ packed form
16065C448760j3518J58145m00170N92984L25679L69039q63041O59749M1693m87694
16055C831626K4719l71685l52457M41929Q6607J06233j78209j39775K12724m49310
16045C212402K41498n57683J77894Q20883P1672J74902o0559m38602j74724j68404
16035C299279k81559j10899k94728O30789J80077K37551O8640K76474l14680p81255
16025B909689P58629O26515o97471K11502o12755l706K87746n35745Q33155n45303
16015C232256Q8518n32444M65849Q7983N8184K8822R67K45084L1675k95551K02376
16004C613719M70785j022133M74321O07391n47684k12593K20969k69278K37394
15995C572891k72913j18847N08255j42083N23887l88594k53055N4643l38619l1256
$$ plain form
15985 3114309 3152674 3520896 3594106 3770769 3677015 3325989 3638948 3350385 4005993 3652620
15975 3652620 3719099 4272315 4226854 3421208 3257675 3739779 3546117 3893287 3972398 3728188
15965 3728188 3765446 3439039 3263013 3512118 3416424 4122684 3608053 3378680 3056622 2959039
15955 2959039 2848757 3224176 4188811 4003293 4330511 4151430 3835527 3880363 4043316 3682810
15945 3682810 3123550 3240219 3606371 4329282 4229200 4133911 3328843 3913777 4154496 3738174
15935 3738174 3322210 3513568 3921483 3793176 3717216 3283331 3661984 3755128 3189708 3218763
15925 3218763 3577210 3352660 3681150 4283106 3768247 3405454 3451136 3272871 3577981 3682380
15915 3682380 3385355 3060480 3329804 3748597 3558543 3268136 3499582 2952962 3817158
$$ packed form
15985C114309L8365L68222P3210J76663r3754l51026L12959k88563O55608l53373
15975C652620O6479N53216m5461q05646j63533M82104j93662L47170P9111k44210
15965C728188L7258l26407j76026K49105r5694P06260n14631k29373l22058r7583
15955B959039j10282L75419R64635j85518L27218j79081l15903M4836J62953l60506
15945C682810n59260J16669L66152P22911j00082r5289q05068N84934K40719m16322
15935C738174m15964J91358M07915j28307p5960m33885L78653R3144n65420K9055
15925C218763L58447k24550L28490O01956n14859l62793M5682j78265L05110J04399
15915C682380k97025l24875K69324M18793j90054k90407K31446n46620Q64196
$$ plain form
15906 3817158 4192132 3903613 3580485 3656993 3631452 3972737 3722477 3312560 3570033 3653360
15896 3653360 4027559 3609945 4120895 4338173 3935862 3505498 3280776 3439584 3539565 3229018
15886 3229018 3710954 3966975 3932011 3266991 3541013 3921734 3819156 3815248 3731126 3776142
15876 3776142 4067629 4168804 3903248 3546138 3151191 3744238 3969391 4634062 4082217
15867 4082217 3879145 3538137 2873274 3096655 3878409 3637672 3259393 3452680 3073216
15858 3073216 3188342 3479904 3903733 4243663 3632262 2999078 3461113 3548336 3820297 3591205
15848 3591205 3988051 4071768 4397190 4368053 3817042 3802489 3902500 3562950 3506977 4230359
15838 4230359 3377123 3685969 3835468 3453183 3509380 3328365 3208397 3787218 4215421 4133841
$$ packed form
15906C817158L74974k88519l23128P6508k5541L41285k50260m09917K57473Q3327
15896C653360L74199m17614N10950K17278m02311m30364k24722J58808R9981l10547
15886C229018M81936K56021l4964o65020K74022L80721j02578l908q4122M5016
15876C776142K91487J01175k65556l57110l94947N93047K25153O64671n51845
15867D082217k03072l41008o64863K23381P81754k40737l78279J93287l79464
15858C073216J15126K91562M23829L39930o11401o33184M62035Q7223K71961k29092
15848C591205L96846Q3717L25422k9137n51011j4553J00011l39550n5973P23382
15838D230359q53236L08846J49499l82285N6197j81015j19968N78821M28203q1580
$$ plain form
15828 4133841 4349392 3841169 3341122 3493248 3887826 4218852 3950347 4248319 4162907 4249930
15818 4249930 3672223 3904319 4202080 3889564 3762653 3479071 3676527 3602596 3859649 4018679
$$ packed form
15828D133841K15551n08223n00047J52126L94578L31026k68505K97972q5412Q7023
15818D249930n77707K32096K97761l12516j26911k83582J97456p3931K57053J59030
$$ [...]
##END NTUPLES=NMR SPECTRUM
##END=
