##TITLE=1H_CG-1208-x1
 CDCl3
 8 sc, 
 5.8.2024
##JCAMPDX= 6.0         $$ Bruker NMR JCAMP-DX V2.0
##DATA TYPE= NMR SPECTRUM
##DATA CLASS= NTUPLES
##ORIGIN= UXNMR, Bruker Analytische Messtechnik GmbH
##OWNER= root
$$ XWIN-NMR		Version 3.5
$$ Mon Aug  5 13:47:01 2024 Russian Standard Time (UT+4h)  she@DPX200
##.OBSERVE FREQUENCY= 200.1314
##.OBSERVE NUCLEUS= ^1H
##.ACQUISITION MODE= SIMULTANEOUS
##.ACQUISITION SCHEME= undefined
##.AVERAGES= 8
##.DIGITISER RES= 18
##SPECTROMETER/DATA SYSTEM= spect
##.PULSE SEQUENCE= zg30
##.SOLVENT NAME= Acetone
##.SHIFT REFERENCE= (INTERNAL, Acetone, 0, 21.9729)
##AUDIT TRAIL= $$ (NUMBER, WHEN, WHO, WHERE, WHAT)
$$ ##TITLE= Audit trail, XWIN-NMR		Version 3.5
$$ ##JCAMPDX= 5.01
$$ ##ORIGIN= Bruker BioSpin GmbH
$$ ##OWNER= she
$$ F:/spectra/data/she/nmr/H-F/1/pdata/1/auditp.txt
$$ ##AUDIT TRAIL=  $$ (NUMBER, WHEN, WHO, WHERE, WHAT)
(   1,<2024-08-05 13:45:23.28 +0400>,<she>,<DPX200>,
      <created by zg, POWCHK disabled, PULCHK disabled
       configuration hash MD5:
       00 E9 B6 7A A2 85 ED C7 34 08 36 98 17 FE 4E 26
       data hash MD5: 16K
       D7 5A 81 81 DB 4C DC 4B 4F 7D 2A 0B 95 3E 30 66>)
(   2,<2024-08-05 13:45:37.20 +0400>,<she>,<DPX200>,
      <Start of raw data processing
       efp BC_mod = 2 LB = 0.24 FT_mod = 6 PKNL = 1 PHC0 = -25636.06 PHC1 = 12.38749 SI = 16K 
       data hash MD5: 16K
       40 9C 06 72 65 8F 5A CD 3E FD 4C 86 F7 81 77 CE>)
(   3,<2024-08-05 13:45:56.68 +0400>,<she>,<DPX200>,
      <pk PHC0 = -5.504215 PHC1 = 5.800001 
       data hash MD5: 16K
       24 A9 2F 0E 51 07 2A 99 A7 C1 FE B4 81 D7 8C 95>)
(   4,<2024-08-05 13:46:00.67 +0400>,<she>,<DPX200>,
      <abs ABSG = 5 
       data hash MD5: 16K
       39 A2 87 51 ED 74 D2 0E D8 CE 1E 35 96 F9 E0 5F>)
$$ ##END=
$$ 
$$ hash MD5
$$ D6 2D D8 18 B4 BE 4D EE 7A 0B 73 6B 30 1A F4 44
##$RELAX= 
##$RELAX= 
##$RELAX= 
##$RELAX= 
##$RELAX= 
##$RELAX= 
$$ Bruker specific parameters
$$ --------------------------
##$DU= <F:/spectra>
##$EXPNO= 1
##$NAME= <H-F>
##$PROCNO= 1
##$TYPE= <nmr>
##$USER= <she>
##$AMP= (0..31)
100 100 100 100 100 100 100 100 100 100 100 100 100 100 100 100 100 100 
100 100 100 100 100 100 100 100 100 100 100 100 100 100 
##$AQSEQ= 0
##$AQ_mod= 1
##$AUNM= <au_zg>
##$AUTOPOS= <>
##$BF1= 200.13
##$BF2= 200.13
##$BF3= 200.13
##$BF4= 200.13
##$BF5= 200.13
##$BF6= 200.13
##$BF7= 200.13
##$BF8= 200.13
##$BYTORDA= 1
##$CFDGTYP= 0
##$CFRGTYP= 5
##$CHEMSTR= <none>
##$CNST= (0..31)
1 1 145 1 1 1 1 1 1 1 1 1 1 1 1 1 1 1 1 1 1 1 1 1 1 1 1 1 1 1 1 1 
##$CPDPRG= <>
##$CPDPRG1= <>
##$CPDPRG2= <>
##$CPDPRG3= <>
##$CPDPRG4= <mlev>
##$CPDPRG5= <mlev>
##$CPDPRG6= <mlev>
##$CPDPRG7= <mlev>
##$CPDPRG8= <mlev>
##$CPDPRGB= <>
##$CPDPRGT= <>
##$D= (0..31)
0 1.2 0 0 0 0 0 0 0 0.06 0 0.03 0 0 0 0 0.0002 0 0 0 0 0 0 0 0 0 0 0 0 
0 0 0 
##$DATE= 1722851122
##$DBL= (0..7)
120 120 120 120 120 120 120 120 
##$DBP= (0..7)
150 150 150 150 150 150 150 150 
##$DBP07= 0
##$DBPNAM0= <>
##$DBPNAM1= <>
##$DBPNAM2= <>
##$DBPNAM3= <>
##$DBPNAM4= <>
$$ [...]
##$SUBNAM3= <"">
##$SUBNAM4= <"">
##$SUBNAM5= <"">
##$SUBNAM6= <"">
##$SUBNAM7= <"">
##$SUBNAM8= <"">
##$SUBNAM9= <"">
##$SW= 24.0689651099613
##$SWIBOX= (0..15)
0 0 2 0 0 0 0 0 0 0 0 0 0 0 0 0 
##$SW_h= 4816.95568400771
##$TD= 16384
##$TD0= 1
##$TE= 0
##$TE2= 300
##$TE3= 300
##$TEG= 300
##$TL= (0..7)
0 120 120 120 120 120 120 120 
##$TP= (0..7)
150 150 150 150 150 150 150 150 
##$TP07= 0
##$TPNAME0= <>
##$TPNAME1= <>
##$TPNAME2= <>
##$TPNAME3= <>
##$TPNAME4= <>
##$TPNAME5= <>
##$TPNAME6= <>
##$TPNAME7= <>
##$TPOAL= (0..7)
0.5 0.5 0.5 0.5 0.5 0.5 0.5 0.5 
##$TPOFFS= (0..7)
0 0 0 0 0 0 0 0 
##$TUNHIN= 0
##$TUNHOUT= 0
##$TUNXOUT= 0
##$USERA1= <user>
##$USERA2= <user>
##$USERA3= <user>
##$USERA4= <user>
##$USERA5= <user>
##$V9= 5
##$VALIST= <valist>
##$VCLIST= <CCCCCCCCCCCCCCC>
##$VD= 0
##$VDLIST= <DDDDDDDDDDDDDDD>
##$VPLIST= <PPPPPPPPPPPPPPP>
##$VTLIST= <TTTTTTTTTTTTTTT>
##$WBST= 1024
##$WBSW= 4
##$XGAIN= (0..3)
0 0 0 0 
##$XL= 0
##$YL= 0
##$YMAX_a= 167394
##$YMIN_a= -136899
##$ZGOPTNS= <>
##$ZL1= 120
##$ZL2= 120
##$ZL3= 120
##$ZL4= 120
##$ABSF1= 22.05511
##$ABSF2= -2.014095
##$ABSG= 5
##$ABSL= 3
##$ALPHA= 0
##$AQORDER= 0
##$ASSFAC= 0
##$ASSFACI= 0
##$ASSFACX= 0
##$ASSWID= 0
##$AUNMP= <proc_1d>
##$AZFE= 0.1
##$AZFW= 0.1
##$BCFW= 0
##$BC_mod= 2
##$BYTORDP= 0
##$COROFFS= 0
##$CY= -3
##$DATMOD= 1
##$DC= 0
##$DFILT= <>
##$DTYPP= 0
##$F1P= 0
##$F2P= 0
##$FCOR= 1
##$FTSIZE= 16384
##$FT_mod= 6
##$GAMMA= 0
##$GB= 0
##$INTBC= 1
##$INTSCL= 3.70164e-10
##$ISEN= 128
##$LB= 0.24
##$LEV0= 0
##$LPBIN= 0
##$MAXI= 10000
##$MC2= 0
##$MEAN= 0
##$ME_mod= 0
##$MI= 1.114404
##$NCOEF= 0
##$NC_proc= -9
##$NLEV= 6
##$NOISF1= 3.799351
##$NOISF2= 2.8
##$NSP= 0
##$NTH_PI= 0
##$NZP= 0
##$OFFSET= 21.97285
##$PC= 1
##$PHC0= -25641.56
##$PHC1= 18.18749
##$PH_mod= 1
##$PKNL= yes
##$PPARMOD= 0
##$PSCAL= 0
##$PSIGN= 0
##$REVERSE= no
##$SF= 200.129411065149
##$SI= 16384
##$SIGF1= 3
##$SIGF2= 2
##$SINO= 5.538805
##$SIOLD= 16384
##$SREGLST= <1H.CDCl3>
##$SSB= 0
##$STSI= 16384
##$STSR= 0
##$SW_p= 4816.95568400771
##$SYMM= 0
##$S_DEV= 0
##$TDeff= 16384
##$TDoff= 0
##$TI= <>
##$TILT= no
##$TM1= 0
##$TM2= 0
##$TOPLEV= 0
##$USERP1= <user>
##$USERP2= <user>
##$USERP3= <user>
##$USERP4= <user>
##$USERP5= <user>
##$WDW= 1
##$XDIM= 16384
##$YMAX_p= 444644593
##$YMIN_p= -5281450
$$ End of Bruker specific parameters
$$ ---------------------------------
##NTUPLES= NMR SPECTRUM
##VAR_NAME=  FREQUENCY,     SPECTRUM/REAL,   SPECTRUM/IMAG
##SYMBOL=    X,             R,               I
##VAR_TYPE=  INDEPENDENT,   DEPENDENT,       DEPENDENT
##VAR_FORM=  AFFN,          ASDF,            ASDF
##VAR_DIM=   16384,         16384,           16384
##UNITS=     HZ,            ARBITRARY UNITS, ARBITRARY UNITS
##FACTOR=    0.29402158847633, 1,            1
##FIRST=     4397.41368993844, 0,            0
##LAST=      -419.54199406927, 0,            0
##MIN=       -419.54199406927, -5281450,     0
##MAX=       4397.41368993844, 444644593,    0
$$ Real data points
##PAGE= N=1
##DATA TABLE= (X++(R..R)), XYDATA
$$ [...]
4622A955606K534494J16474Q29579j003562L44747K53023n3090m28192K42416
4613D791495k27826r98133P10736R92674p99304j42860O86452o38093L08773n87295
4603D096619J064331K16871O03525j72572n33097k85443M85683K20529n98852
4594E097594J63607Q89321j683808k70125J56074m62514J013917P50953j331751
4585D323268J084840k98658k15171J207555k29290P74016Q04063k513943K027067
4576F963747k64171k13204j16857q77622J158878M90551j005742o18019n07665
4567E009896M06870N54901J49373K21562o32078P59730J39677N53957R61958M00161
4557H526007o86377j61617p80624J322625m54280k06608j68290l97484O72104
$$ y = [1955606, 4490100, 4606574, 5436153, 4432591, 4777338, 5030361, 4977271, 4549079, 4791495, 4563669, 3565536, 4276272, 5268946, 4469642, 4326782, 5013234, 4375141, 4683914, 4096619, 5160950, 5377821, 5981346, 5808774, 5275677, 4990234, 5475917, 5696446, 5097594, 5261201, 6150522, 4466714, 4196589, 4352663, 3890149, 4904066, 5655019, 4323268, 5408108, 5109450, 4894279, 6101834, 5872544, 6646560, 7450623, 4936680, 6963747, 6699576, 6486372, 6369515, 5491893, 6650771, 7141322, 6135580, 5517561, 5009896, 5416766, 5971667, 6121040, 6342602, 5710524, 6470254, 6609931, 7163888, 8125846, 8526007, 7839630, 7678013, 6897389, 8220014, 7765734, 7559126, 7390836, 6993352, 7665456]
4548G665456k37860M42480r61657O27297p60533l7111o66264Q83481J927707q59122
4538H023874r7774p63837M08928N81107j13586N30811J38473m89367J207327j42764
4528I283192q78133q38310l77155J322064j109359K91342M11639l90914N06048
4519H220414q97742L8847J88191L86566L35930M14230m04o56753Q4203J018170
4509I131652n93135N8283n09160J41345k00485n27863J341431p2408K02606M8496
4499I020762j073441m64378P63517K33795j12392P0797Q2822j92179J99122J59476
4489H687901O98290r73767Q22704N13121L0685J88829j653517J02776j21431J399916
4479I695507K34658K01985J295559j787511n36403O03481n40476K46165r43451
$$ y = [7665456, 7427596, 7870076, 6908419, 7535716, 6775183, 6738072, 6071808, 6955289, 8882996, 8023874, 7926100, 7162263, 7571191, 8152298, 8038712, 8569523, 8707996, 8218629, 9425956, 9283192, 8405059, 7566749, 7189594, 8511658, 7402299, 7693641, 8105280, 7714366, 8220414, 7322672, 7361519, 7549710, 7936276, 8272206, 8686436, 8686032, 8029279, 8113482, 9131652, 8538517, 8596800, 8087640, 8228985, 8028500, 7500637, 8842068, 8769660, 8972266, 9020762, 7947321, 7482943, 8246460, 8480255, 8367863, 8438660, 8521482, 8329303, 8528425, 8687901, 9386191, 8412424, 9235128, 9748249, 9778934, 9967763, 8314246, 8417022, 8295591, 9695507, 9930165, 10132150, 11427709, 9640198, 9103795, 9707276, 9166800, 9412965, 8469514]
4470H469514J582521L37569p33684j571320J076647J122952j43611R82559J69080
4461A1292227o53861j67137R64726m42251o63847j174948R78457o70429J263577
4452A0726514R37187n76690J98639K60102P01162m35782r70668K62375J28491
4443A1231330O43216K69560r00356R64744l70700l48832R9402J293791J44786
4434A3026941j147977n69283K47325R1697J109841o38093L53728R98784Q38563
4425A4311526Q05990l07301n92946J87289n16983M61534K84414L46374j641985
4416A3337912Q88679Q67612O20522O49236o04331q5527k51743P08187l69560J43882
4406A5904869N67271N51170R1771p1315P40122o22517o10784J685759j234293
$$ y = [8469514, 10052035, 10389604, 9655920, 8084600, 9161247, 10284199, 10140588, 11123147, 11292227, 10638366, 10471229, 11435955, 10993704, 10329857, 9154909, 10133366, 9462937, 10726514, 11663701, 11087011, 11285650, 11545752, 12246914, 11811132, 10840464, 11102839, 11231330, 11874546, 12144106, 11243750, 12208494, 11837794, 11488962, 11588364, 12882155, 13026941, 11878964, 11309681, 11557006, 11648703, 12758544, 12120451, 12474179, 13472963, 14311526, 15117516, 14810215, 14217269, 14404558, 13887575, 14349109, 14633523, 14979897, 13337912, 14226591, 15094203, 15714725, 16363961, 15759630, 15674103, 15422360, 16130547, 15760987, 15904869, 16472140, 17023310, 17115081, 17043766, 17783888, 17161371, 16550587, 18236346, 17002053]
4397A7002053J021946K08348P61410j001037J157696R14371k45974m14629L08975
4388A9713159n16886M16498J402403J23404n40516L60085J388057N08825m66375
4379B2388654L24813L90741k43064L33806n69070P71941N46546J97252J91778
4370B4333397n72204J172434R73695O0618J455198p37230p6472J83060R87275
4361B7779771J503160L46822n44654R18729j75417J161586J134208m37216M98900
4352C2185889N54781L7028O64785O29112q44406J469282K32109K66366R28464
4343C6123410Q00418J508894N01299k72981J469409J127862k34516l53578N47889
4334D1218106Q97019m5304J818747J63059K079927m23930j140651J972516N96331
$$ y = [17002053, 18023999, 18232347, 18993757, 17992720, 19150416, 20064787, 19818813, 19404184, 19713159, 19196273, 19612771, 21015174, 21138578, 20598062, 20958147, 22346204, 22855029, 22388654, 22713467, 23104208, 22861144, 23194950, 22625880, 23397821, 23944367, 24141619, 24333397, 23761193, 24933627, 25907322, 25967940, 27423138, 26685908, 26609436, 26792496, 27779771, 29282931, 29629753, 29085099, 30003828, 29828411, 30989997, 32124205, 31686989, 32185889, 32740670, 32777698, 33442483, 34071595, 33227189, 34696471, 34928580, 35194946, 36123410, 36923828, 38432722, 38934021, 38661040, 40130449, 41258311, 41023795, 40670217, 41218106, 42115125, 42069821, 43888568, 44051627, 46131554, 45707624, 44566973, 46539489, 47135820]
4325D7135820P19450N19386J215457L24838J31398P16203Q49626k88916K013761
4316E3337023J103481j69859L52554k22369K322987j91588N81851P86145l189
4307E7897036N24881l63885m05279L20788J015064N70841m88745J164004j046074
4298E9188631K26696J199494o13974P78414j031932k76390p38992N56208l23934
4289E8964221K31699p55700R25519p57983n24894K06913k81041J17629p51751
4280E7374612l200m55539N9062o59743o15534n46619n6611q60701J31666j377651
4270E2989742j690084K47060j155044J39484p46875L11728k72901k480485j0356
4261D7332269k28227q07511k47517L65382j05483L28522j957090O7094o83684
$$ y = [47135820, 47855270, 48374656, 49590113, 49914951, 50046349, 50762552, 51612178, 51323262, 53337023, 54440504, 54270645, 54623199, 54400830, 56723817, 56532229, 57114080, 57900225, 57897036, 58421917, 58058032, 57652753, 57973541, 58988605, 59559446, 59070701, 60234705, 59188631, 59415327, 60614821, 60000847, 60779261, 59747329, 59470939, 58731947, 59288155, 58964221, 59195920, 58440220, 59365739, 58607756, 58082862, 58289775, 58008734, 58126363, 57374612, 57371412, 56915873, 56974935, 56315192, 55699658, 55153039, 55096428, 54235727, 54367393, 52989742, 51299658, 51546718, 50391674, 50531158, 49784283, 50096011, 49823110, 47342625, 47332269, 47104042, 46296531, 46049014, 46414396, 46308913, 46637435, 44680345, 44747439, 44063755]
4252D4063755q19831n93693l99425L79588q59898j145929n74636J968101j894515
4243D0123517k47878m14647N74555j106688l67457m17250m32934K55669J6828
4234C7983715K73027M56750r76437l50265M3973j292287J646991K16394p26397
4225C7275464L21497o12401j343056O31546k32470L8632J88244k1583J81841J99919
4215C6627633n00933R8611R77765L37888N15630q42703J62455M66403L50534M16925
4205C8610208j406257R15129M46783J466700j164593j664148K104618k70571K38181
4196C9276050n3088m3651N88014k45193O25937Q47183P86738o98195R55889r8777
4186D1940907j9045l42264l97441j030075q44844O68710n76132j183598K00619
$$ y = [44063755, 43243924, 42650231, 42250806, 42630394, 41770496, 40624567, 40049931, 42018032, 40123517, 39875639, 39460992, 40035547, 38928859, 38561402, 38144152, 37711218, 37966887, 37983715, 38256742, 38713492, 37737055, 37386790, 37430763, 36138476, 37785467, 38001861, 37275464, 37596961, 36984560, 35641504, 36273050, 36040580, 36079212, 36267456, 36245873, 36427714, 36627633, 36126700, 36225311, 37203076, 37540964, 38056594, 37213891, 37376346, 37842749, 38193283, 38610208, 37203951, 38119080, 38565863, 40032563, 38867970, 37203822, 39308440, 39037869, 39276050, 39222962, 39179311, 39767325, 39522132, 40148069, 40995252, 41781990, 41083795, 42039684, 41940907, 41921862, 41579598, 41182157, 40152082, 39307238, 39975948, 39399816, 38216218, 38416837]
4177C8416837j981980O42675K24716O6478J17083m61838J182013Q71982M441k113300
4167C6969107R99970k09306q97555o61419Q78240n24169O93477p88096j248349
4158C5211900j7483o87129J626863p91257J76278R80391o92872q19843J006320
4149C5993168L40993N7269q37442J063054n52350p6752J155289j739172R54935
4140C6358992J69238o37658J003189J814901Q51766j459676j17474P82882Q17319
4131C9583479J97556j27154n70153K25732l51504M87624R35480N93007R4174J310829
4121D2379070k8639j584562O70534q1071J232744P29675l41946Q14709R41150
4112D4731664N98086P22991N67863K4880j90113K94844P33844J016875o76380
$$ y = [38416837, 36434857, 37077532, 37302248, 37368726, 37485809, 37023971, 38205984, 39077966, 39082407, 36969107, 37969077, 37759771, 36862216, 36200797, 37079037, 36554868, 37248345, 36460249, 35211900, 35194417, 34507288, 36134151, 35342894, 35519172, 36499563, 35806691, 34986848, 35993168, 36334161, 36391430, 35553988, 36617042, 36064692, 35987940, 37143229, 35404057, 36358992, 36528230, 35890572, 36893761, 38708662, 39560428, 38100752, 37983278, 38766160, 39583479, 39781035, 39653881, 39083728, 39309460, 38957956, 39445580, 40381060, 40974067, 41068241, 42379070, 42350431, 40765869, 41436403, 41355332, 42588076, 43317751, 42975805, 43790514, 44731664, 45329750, 46052741, 46620604, 46645484, 46455371, 46750215, 47484059, 48500934, 47824554]
4103D7824554O79074J65410Q10861J676856J86345O74386j6964l78285J300824
4094E2923061J385759q90100P70873j34822M26410J699995J06110Q99849l9937
4085E7147198N88940J203984L27074J1248K50701N45384J779709r67563R14387
4076F1801062J009487p93906J178978J92784O28441R18416l33246j4427J243565
4067F5831154P2188K35267P70308J016186K55711M98882l50924l44846J344606
4058F9328532J02824R33676n82294L28799M69930K14214j05391R11533M23816
4049G2025639J042973r19577K21288m33514Q42509P42344p31791L09313J288018
4040G4387202K35539m26748M16280M79989m5490n86560M96116j033318J97505
$$ y = [47824554, 48503628, 48669038, 49479899, 51156755, 51343100, 52017486, 52000522, 51622237, 52923061, 54308820, 53418720, 54189593, 54054771, 54481181, 56181176, 56287286, 57187135, 57147198, 57736138, 58940122, 59267196, 59278444, 59529145, 60074529, 61854238, 60886675, 61801062, 62810549, 62016643, 63195621, 63388405, 64016846, 64935262, 64602016, 64587589, 65831154, 65903342, 66138609, 66908917, 67925103, 68180814, 68679696, 68328772, 67983926, 69328532, 69431356, 70365032, 69782738, 70111537, 70581467, 70795681, 70690290, 71601823, 72025639, 73068612, 72149035, 72370323, 71936809, 72779318, 73521662, 72789871, 73099184, 74387202, 74622741, 74195993, 74612273, 75092262, 75046772, 74460212, 74956328, 73923010, 74120515]
4031G4120515m52353J752714j49176j91812K73875j900460q9283O09236o74631
4022G3298625M39236L03675j160063J03362p65298j195296l30148Q72597m5751
4013G1520939j231356q15838n29793N80753n7847j746214j87917j21624r2831
4004F7318272M28395j087804j053612K50329j724956k76705K40788k65909j419150
3995F2409648q6287j400436l98942J67918m79057o46772k023529n72739J79339
3986E7149143o70443o64934l66012L82576j72107j215894k8535J35996n91502
3977E3958288k75067q14262j760240j2420q75675M3291j163523P39703L55578
3968E0195673k89847j511310p92040j88611q97625K9121P5627p5680K76040m51087
$$ y = [74120515, 73668162, 75420876, 75271700, 75079888, 75353763, 73453303, 73364020, 73973256, 73298625, 73737861, 74041536, 72881473, 72984835, 72219537, 71024241, 70694093, 71566690, 71520939, 70289583, 69473745, 68943952, 69524705, 69466858, 67720644, 67532727, 67411103, 67318272, 67746667, 66658863, 65605251, 65855580, 64130624, 63853919, 64094707, 63828798, 62409648, 62323361, 60922925, 60523983, 60691901, 60212844, 59566072, 57542543, 56969804, 57149143, 56478700, 55813766, 55447754, 55830330, 55658223, 54442329, 54413794, 54549790, 53958288, 53683221, 52868959, 51108719, 51096299, 50220624, 50263915, 49100392, 49840095, 50195673, 49905826, 48394516, 47602476, 47413865, 46516240, 46545361, 46620988, 46545308, 46821348, 46370261]
3958D6370261n5094j889413q72079l0089m32305o7203K93537o71750k97549r48630
3948D1399686L16007o42232R30656j236757j610893K85506n02235l58844j112543
3939C7468351J547939J711837k451115L44597j025819j291990Q85559r26645q18399
3930C5444315K18051J335965m11128j653500J88142Q28387m37373j29907p60677
3921C4622275r77101N43112n40650p37061J85888L32680j284643N82136j064404
3912C1662232Q991O64807j180175k72970M49627j93068N86000P60052j504627
3903C0980869m63962p47907p1191p79547P63944N48997N52185k57651m23491j039887
3893B9062359l9060n08104J610087l35644j059570K99247M323P6832o0882L26454
$$ y = [46370261, 46315167, 44425754, 43553675, 43523586, 43091281, 43024078, 43317615, 42645865, 42348316, 41399686, 41715693, 41073461, 42004117, 40767360, 39156467, 39441973, 38939738, 38580894, 37468351, 39016290, 40728127, 38277012, 38621609, 37595790, 36303800, 37189359, 36262714, 35444315, 35662366, 36998331, 36587203, 34933703, 35121845, 35950232, 35512859, 35382952, 34622275, 33645174, 34188286, 33647636, 32910575, 33096463, 33429143, 32144500, 32726636, 31662232, 31671223, 32336030, 31155855, 30882885, 31332512, 31139444, 31725444, 32485496, 30980869, 30516907, 29769000, 29697809, 28918262, 29682206, 30231203, 30783388, 30525737, 30102246, 29062359, 29023299, 28515195, 30125282, 29789638, 28730068, 29029315, 29033638, 29110470, 29049588, 29376042]
3883B9376042j115471l25227N15337J496154l10584j440900Q76629M17911N9366
3874B9549257r41880p73150N33101R00365k31978n27820P95749Q83894j20895
3865C0066643l09800P67883p60010k16238J085457k85448J100191N26605J335808
3856C3311091J29827n65258L8861Q09082q49019Q27064q51158n20383j696j189956
3846C1138455O31672J268688m72617J466292J077162K4164m21929k29579Q79017
3837C5361325M69518l85744j107935l59833K23935j083166r31540l06658r2402
3828C1787500M0367j279004k30202p97004Q37637O82243o59249o67125o41198
3819B9073965R29646P32379o54061k28671K31411j474269K29088L45723j63084
$$ y = [29376042, 28260571, 27935344, 28450681, 29946835, 29636251, 28195351, 29071980, 29489891, 29549257, 28607377, 27834227, 28367328, 29267693, 29035715, 28507895, 29303644, 30187538, 30066643, 29756843, 30524726, 29764716, 29548478, 30633935, 30348487, 31448678, 31975283, 33311091, 33440918, 32875660, 32914521, 33723603, 32874584, 33701648, 32850490, 32330107, 32328411, 31138455, 31770127, 33038815, 32566198, 34032490, 35109652, 35133816, 34711887, 34482308, 35361325, 35830843, 35445099, 34337164, 33977331, 34201266, 33118100, 32186560, 31879902, 31787500, 31827867, 30548863, 30318661, 29521657, 30359294, 31041537, 30382288, 29715163, 29073965, 30003611, 30735990, 30081929, 29853258, 30084669, 28610400, 28839488, 29185211, 29022127]
3810B9022127O6608j443732m59369R8836k55943j65381J276716M42663M73266
3801B9055791K58960N68698Q60155L24387j96401q86283p77969r30749j996281
3792B6280308q05779m18530o23320K34102p00213J010775Q21500j194658R769
3783B4613954j041441O75572j92459k39323j383939N13433J217302q07912q73391
3774B2481796P06460M48759K211753n91233N26200K246620j199032M72680J235844
3765B8539847p6831j931472j009799J29846j224685k325336l34263n56574r81159
3756B0229574O74893n03056o60889m43969K75733q64959r74220L08097m01827
3747A7639377R8940J235242r96021n6869O03484M22224O95669j573367L15385
$$ y = [29022127, 29088735, 27645003, 27185634, 27284470, 27028527, 26863146, 28139862, 28582525, 29055791, 29314751, 29883449, 30743604, 31067991, 30871590, 29985307, 29207338, 28276589, 26280308, 25474529, 25055999, 24432679, 24666781, 23966568, 24977343, 25798843, 24604185, 24613954, 23572513, 24248085, 24055626, 23816303, 22432364, 22945797, 24163099, 23355187, 22481796, 23188256, 23637015, 25848768, 25257535, 25783735, 28030355, 26831323, 27304003, 28539847, 28463016, 26531544, 25521745, 25651591, 24426906, 22101570, 21767307, 21210733, 20229574, 20904467, 20401411, 19740522, 19296553, 19572286, 18707327, 17733107, 18041204, 17639377, 17738317, 18973559, 17977538, 17920669, 18524153, 18946377, 19642046, 18068679, 18384064]
3738A8384064J58222n11840l16601j46744j204276j10539M78544p35985l24416
3729A5670429j055610q07258K05551J13814k14313N0732O46662L7124m6591J4158
3719A4614698J84221p87291j135094K24279M63182M92525L09140k19605q92649
3710A3253406J51328N71353j375598K97510J39492N29261m77364q53817k92993
3701A1942578K109909l37680o53668O11875j41720k65120k25868M44935K7073
3692A3512314J444830o92322j368998N65461Q39677n30412j002029J79179j55990
3683A2791710J35336P40696L12578L00541N23684O62575p14323p9757p6895o71212
3673A3924933j43704O74637K68716o81616k37152j006836K56372k88404m59882
$$ y = [18384064, 18542286, 18030446, 17713845, 17567101, 16362825, 16252286, 16730830, 15994845, 15670429, 14614819, 13807561, 14013112, 14126926, 13912613, 13963345, 14610007, 14647131, 14600540, 14614698, 14798919, 14011628, 12876534, 13100813, 13563995, 14056520, 14365660, 14146055, 13253406, 13404734, 13976087, 12600489, 12897999, 13037491, 13566752, 13089388, 12235571, 11942578, 14052487, 13714807, 13061139, 13673014, 13531294, 13266174, 13040306, 13485241, 13512314, 14957144, 14264822, 12895824, 13461285, 14300962, 13770550, 12768521, 12947700, 12791710, 12927046, 13667742, 13980320, 14280861, 14804545, 15467120, 14752797, 14673040, 14596145, 13924933, 13781229, 14455866, 14724582, 14042966, 13805814, 12798978, 13055350, 12766946, 12307064]
3664A2307064m81555J365404m70290j28817J035184P0487M51826M68712j2948
3655A4605067p0021j215027O14248J044721J48362K6913j64085J270454j484059
3646A4776573r76333K88419N70536q63687q23900q6710M82040J20348R38202k58471
3636A4167017j170420l25716l05617N63813R72941p92563j50334O4671k5114O70844
3626A3669522J070906j679321j084109L51184m36871J94541K148350M4533j365802
3617A2912933l49369P29119p32971N39583M12360K19143m4260J40109j134802
3608A2691845M00975r09796O26583m12502j54458J457991n46291k89245p08575
3599A2156527P01571j46601n2948J134421K82796j437285q0632l72694R15461
$$ y = [12307064, 11825509, 13190913, 12720623, 12591806, 13626990, 13697477, 14149303, 14618015, 14605067, 14535046, 13320019, 13934267, 14978988, 15127350, 15154263, 14990178, 16260632, 14776573, 13800240, 14088659, 14659195, 13795508, 12971608, 12884898, 13366938, 13487286, 14425488, 14167017, 12996597, 12670881, 12365264, 12929077, 13902018, 13109455, 12959121, 13023792, 12998678, 13669522, 14740428, 13061107, 11976998, 12328182, 11891311, 12085852, 14234202, 14278735, 12912933, 12563564, 13292683, 12559712, 13099295, 13511655, 13730798, 13686538, 13826647, 12691845, 13092820, 12183024, 12809607, 12397105, 12242647, 13700638, 13154347, 12865102, 12156527, 12858098, 12711497, 12658549, 13792970, 14075766, 12638481, 12557849, 12185155, 13100616]
3590A3100616P35983O01430n7349k7606l30705J427949j546706R01884J78830
3581A4984326q29788O71021p28234j001488M49837J412575j095399n331N57096
3572A4414615J154241K75135n45187j938794r2959J52654K65903P60478J62962
3563A4609048K4364K09629l46716J2158l13631K58269r15777P90902J772322m29928
3553A5670640n30009J68078j31673j474571O39219m9511K688788p85928l4782
3544A6160251N72451p03816q42292Q55656M1287j67301l43133M8086J55602K27788
3534A6004579j25950k17203j91951J121824K28443Q07852r38148r81450J560692
3525A7268688N46645j511786J372609M32562J37336N79160n61598J30349j69188
$$ y = [13100616, 13836599, 14438029, 14380680, 14353074, 14022369, 15450318, 13903612, 14805496, 14984326, 14154538, 14825559, 14097325, 13095837, 13545674, 14958249, 13862850, 13857519, 14414615, 15568856, 15843991, 15298804, 13360010, 13267051, 13419705, 13685608, 14446086, 14609048, 14633412, 14843041, 14496325, 14508483, 14194852, 14453121, 13537344, 14328246, 16100568, 15670640, 15140631, 15308709, 15177036, 13702465, 14341684, 14292173, 16980961, 16195033, 16160251, 16732702, 16028886, 15186594, 16042250, 16083537, 15916236, 15573103, 15621189, 15776791, 16004579, 15878629, 15661426, 15469475, 16591299, 16819742, 17627594, 16689446, 15707996, 17268688, 17815333, 16303547, 17676156, 18108718, 18246054, 18825214, 18263616, 18393965, 18224777]
3516A8224777q20390N62421J341174o87922R1503o07617P30001J043326n042J29634
3506B0001865R65801p62713J09396N97883K40795P1146M20327k5534J00048N34886
3496B2253900N39412J43640M33508q10261j451560j94203K095301q00695J131129
3487B3340171J021027q97254o0815P72991m35594M91152J470216m37402O01226
3478B5865718l934m23758J315811L91591j77855K82434J49628J60896N3926l23196
3468B7291261N89696Q46194J28803k34949N33687M89305p39119k51525J07372
3459B8760725J200182m87749k457J445410J76715R08913J87080K43858l74302
3450C2058375P85735j3032N73201P85904O04298q09953J67336M8983n76390J081490
$$ y = [18224777, 17404387, 17966808, 19307982, 18620060, 18711563, 18103946, 18833947, 19877273, 19872231, 20001865, 20967666, 20204953, 20314349, 20912232, 21153027, 21224173, 21644500, 21618966, 21719014, 22253900, 22793312, 22936952, 23370460, 22560199, 21108639, 20914436, 23009737, 22209042, 23340171, 24361198, 23463944, 23403129, 24176120, 23740526, 24231678, 25701894, 25264492, 25865718, 25861784, 25438026, 26753837, 27145428, 26967573, 27250007, 27399635, 27560531, 27614457, 27291261, 27880957, 28727151, 28855954, 28621005, 29154692, 29643997, 28904878, 28653353, 28760725, 29960907, 29473158, 29470701, 30916111, 31092826, 32001739, 32188819, 32432677, 32058375, 32844110, 32831078, 33404279, 34190183, 34794481, 33984528, 34151864, 34200847, 33624457, 34705947]
3440C4705947k28884J074659M4736N59817M03103R46299l40721J587883K293567
3431D1046406p79403j275231j80234L07287J18825K07761J117625o76180o7757
3422C9819099J382577K86754j30109R20662j0689r2039Q22513q22322J149788
3413D3326234J339368j312303j99002Q58579Q59134N97843K54823J115421n09597
3404D6330500R10051M35253M58186m64069k45621J026849L46061O69348Q58329
3395E0324887Q58890r98760K1813J111543J156126O09417N84068O6195K58596
3386E3992775o77396J884096J630383p48410K32773n14127P38499k25797M51197
3377E6763993L71937J130302O47553J64699L47984L941K54939J712208j2967J137702
$$ y = [34705947, 34477063, 35551722, 35596458, 36156275, 36559378, 37505677, 37164956, 38752839, 41046406, 40267003, 38991772, 38811538, 39118825, 39237650, 39445411, 40563036, 39886856, 39819099, 41201676, 41488430, 41358321, 42278983, 42268294, 42176255, 42998768, 42176446, 43326234, 44665602, 43353299, 43154297, 44012876, 44872010, 45469853, 45724676, 46840097, 46330500, 47240551, 47675804, 48133990, 47669921, 47424300, 48451149, 48797210, 49466558, 50324887, 51183777, 50185017, 50206830, 51318373, 52474499, 53083916, 53667984, 53734179, 53992775, 53315379, 55199475, 56829858, 56081448, 56314221, 55800094, 56538593, 56312796, 56763993, 57135930, 58266232, 58913785, 59078484, 59426468, 59430409, 59685348, 61397556, 61384589, 62522291]
3367F2522291k80768J224456M98619K79883N25306J337657J339900q6884N76500
3358F7936960Q33072K87747m3755J411770O446P97368J056079M86010q57096k27694
3348G1686907j084249L64218m13778J251178M85852m3106q12568P98211Q18339
3339G3051004N49754m15771Q58942J783398l64780J645230Q93660P69337j7468
3330G8753306P7376J028468J211408l0067O1795K096538J405570J063764O13899
3321H6282057R28773m29820K508513J054818K18530K480504J58034J086849L70384
3312I4658642J090035J276958J483813K2077J099746P11098K347941Q44823R90998
3303A04526131J503739M22190O34062R7654o4931J133414J520858J284542M36932
$$ y = [62522291, 62241523, 63465979, 63964598, 64244481, 64769787, 66107444, 67447344, 67360460, 67936960, 68770032, 69057779, 69014024, 70425794, 70432240, 71229608, 72285687, 72771697, 71914601, 71686907, 70602658, 70966876, 70553098, 71804276, 72290128, 72247022, 71434454, 72232665, 73051004, 73600758, 73184987, 74043929, 75827327, 75462547, 77107777, 78001437, 78770774, 78753306, 78830682, 79859150, 81070558, 81040491, 81102286, 83198824, 84604394, 85668158, 86282057, 87210830, 86781010, 89289523, 90344341, 90562871, 93043375, 93201409, 94288258, 94658642, 95748677, 97025635, 98509448, 98531525, 99631271, 100342369, 102690310, 103535133, 104526131, 106029870, 106452060, 107086122, 107183776, 107118845, 108252259, 109773117, 111057659, 111494591]
3294A11494591J021331J986857P48440j88217R8722J979063L61138J091801q06988
3285A17786738N76002P63817P23912l98606J315547j3304J306025j83303R26733
3276A22803561R91620J318014R54585L91192J453880P69235J078595J022283N50971
3267A31333936Q35447K219471J824952J810956O91394J159422K764034J194218
3259A43833830J355848O69887N94764K434121J341279J786788J282770Q92837
3251A54192124J71130J377715J450824J219834K096969P61961J196934K123001
3243A64590492O0665P91965J580094j90827P91755q6449n98851r03660k565105
3234A63470079j223095k392585j788331l657436k007277k613255j013583k357173
$$ y = [111494591, 112515922, 114502779, 115251219, 115063002, 115161724, 117140787, 117501925, 118593726, 117786738, 118362740, 119126557, 119850469, 119451863, 120767410, 120754106, 122060131, 121876828, 122803561, 123795181, 125113195, 126067780, 126458972, 127912852, 128682087, 129760682, 130782965, 131333936, 132169383, 134388854, 136213806, 138024762, 138716156, 139875578, 142639612, 143833830, 145189678, 145859565, 146454329, 148888450, 150229729, 152016517, 153299287, 154192124, 154363254, 155740969, 157191793, 158411627, 160508596, 161270557, 162467491, 164590492, 164651157, 165443122, 167023216, 166832389, 167624144, 167537695, 166938844, 166035184, 163470079, 162246984, 159854399, 158066068, 154408632, 152401355, 149788100, 148774517, 146417344]
3226A46417344k952199j371690m892628k629945k816512l306082l551150k318491
3218A22578647l051346l789735k631124l969994m143967k914503l059055k323114
3210I6695809k337809m686836j581023k186044k705021k112097r79975k998422
3202G7108582k482563k082795l040717k568944L82157p12039k956483k9679k381244
3193F1236275j112685k56068j683558q78911j122152l69895j329372l50093k696275
3184E1437266j69382K93395j180861j605611j384438Q609j89866j465883k258478
3175D3484751o86547j291362J10518m80294k068717o43229j287281P07335j62150
3166C7683024k054796l25735K02893R50483r38999q33908j812897k74930P2901
$$ y = [146417344, 143465145, 142093455, 137200827, 134570882, 131754370, 128448288, 124897138, 122578647, 119527301, 115737566, 113106442, 109136448, 104992481, 102077978, 99018923, 96695809, 94358000, 89671164, 88090141, 85904097, 83199076, 81086979, 80107004, 77108582, 74626019, 72543224, 69502507, 66933563, 67315720, 66603681, 63647198, 63617519, 61236275, 60123590, 59867522, 58183964, 57305053, 56182901, 55813006, 54483634, 54133541, 51437266, 51267884, 51561279, 50380418, 48774807, 47390369, 47398978, 47209112, 45743229, 43484751, 42798204, 41506842, 41617360, 41137066, 39068349, 38425120, 37137839, 37845174, 37683024, 35628228, 35302493, 35505386, 36455869, 35516870, 34682962, 32870065, 32595135, 32668036]
3157C2668036Q93746q57673j213344j048608n50443m32770K81794l99072j43594
3148B9198072j148167j555772K1516K99562J375018n1821j669607n66426Q79807
3139B6782182k106162R00950P09527j308950K32135q72096k51283R01774M50619
3130B5438696P8204m63550n08223j52686k24028J353218O18604j288705K4749
3121B4876279n35489Q52115j238617j99267j26249p45280K65316j66513O72700
3112B3654995N58497o36867M98675K40978L22777j533278k256849P27655K48994
3103B1825577P42754o42452q12965J570211O4041q82012M83114p15958J023634
3094B2655944j139552J075458Q73537n4873r23667L31759Q74230j31979J77617
$$ y = [32668036, 33561782, 32704109, 31490765, 30442157, 29891714, 29458944, 29740738, 29341666, 29198072, 28049905, 26494133, 26515649, 26815211, 28190229, 28138408, 26468801, 25902375, 26782182, 24676020, 25576970, 26286497, 24977547, 25209682, 24337586, 24086303, 24988077, 25438696, 25516900, 25053350, 24545127, 24392441, 24168413, 25521631, 26140235, 24851530, 24876279, 24340790, 25192905, 23954288, 23755021, 23628772, 22883492, 23148808, 22982295, 23654995, 24213492, 23576625, 24075300, 24316278, 24639055, 23105777, 20848928, 21576583, 21825577, 22568331, 21925879, 21112914, 22683125, 22747166, 21865154, 22348268, 21632310, 22655944, 21516392, 22591850, 23465387, 23410514, 22486847, 22818606, 23692836, 23560857, 23738474]
3085B3738474P07557j332101l99895K62890K66703J037823j041214Q75368k02121
3076B3913484r93678N5463J13347Q54984L85849p78672J398302O90232j419727
3067B4219584O09535O77167p57519n86600N14723M95457Q04745r15417j152941
3058B3908734R45435R41972N58252N29605l03232m40388l6351R2264M62115m68820
3048B6189586J154501J402086q16803J329241P21609j448162k42302K21247J63874
3039B8674877J056694P40669p19553N40526j457034R99098J201708r8926P42850
3030C1680909J27355m65184m15028N89288q13014K716817M92722r24630l05069
3021C2684166M62100l45444k11350J702832O78872o49096O09863J200872o8912
$$ y = [23738474, 24446031, 23113930, 22714035, 22976925, 23243628, 24281451, 23240237, 24115605, 23913484, 22919806, 22975269, 23088616, 23943600, 24329449, 23550777, 24949079, 25639311, 24219584, 24829119, 25506286, 24748767, 24162167, 24676890, 25172347, 25977092, 25061675, 23908734, 24854169, 25796141, 26354393, 26883998, 26580766, 26140378, 26104027, 26196291, 26658406, 26189586, 27344087, 28746173, 27929370, 29258611, 29980220, 28532058, 28289756, 28511003, 28674877, 29731571, 30472240, 29752687, 30293213, 28836179, 29835277, 31036985, 30938059, 31680909, 31808264, 31343080, 30928052, 31517340, 30704326, 33421143, 33913865, 32989235, 32684166, 33146266, 32800822, 32589472, 34292304, 34971176, 34322080, 34931943, 36132815, 36063903]
3012C6063903k68400m16168J662658P31946n35574J05592Q14354P58608Q82581
3003C9799500r90987J630786J099175m84809N78470m2845J129394r9230r91906
2994D1627548Q95889L97397J157018M44929N79250j21278O09141J883921m27504
2985D7046311J97957K33348J125696J315452q21952P65754K817049L9350l7436
2976E2681529Q63472L06796J866707M07270J145803P15395L45154J636748J60085
2967F0128959j99184J703930P36478N48140P44901J678365J97868O24930J303628
2958F7468015J811295K56890O56085J934087J059217K198170K318974J833496
2950G9536229O35093K209385R06933K065920K573275J925725J364574J805313
$$ y = [36063903, 35795503, 35379335, 37041993, 37773939, 37238365, 37343957, 38158311, 38916919, 39799500, 38808513, 40439299, 41538474, 41053665, 41632135, 41589290, 42718684, 42619454, 41627548, 42523437, 42920834, 44077852, 44522781, 45102031, 44980753, 45589894, 47473815, 47046311, 47244268, 47477616, 48603312, 49918764, 49096812, 49862566, 52679615, 52718965, 52681529, 53545001, 53851797, 55718504, 56125774, 57271577, 57986972, 58332126, 59968874, 60128959, 59929775, 61633705, 62370183, 62918323, 63663224, 65341589, 65539457, 66164387, 67468015, 69279310, 69536200, 70192285, 72126372, 73185589, 75383759, 77702733, 79536229, 80171322, 82380707, 83287640, 85353560, 87926835, 89852560, 91217134, 93022447]
2942I3022447L136227J819573K923803K993490J296776O77453K296081K564767
2934A10730617K407375J321514J919522L042143K434188K472314J964960K030800
2926A28323433K188680L506493J068642K388836K375588K782114L388786M868509
2918A50891081M410106M715033O050791N111887O873148Q950612J1535178J5076725
2910B13614561J8864745K0456148J5177079K796507j4287530k4293015k5795804
2903B06532691k2024232j5948735j2965154j2649476r495652p006323o501971
2896A19941148n772636m215994n551224k853892j817299k945812l327942l079818
2888I0376531k109844j952049l85805k539979j403481j614155j204151l176241
$$ y = [93022447, 96158674, 97978247, 100902050, 103895540, 105192316, 105869769, 108165850, 110730617, 113137992, 114459506, 116379028, 119421171, 121855359, 124327673, 126292633, 128323433, 130512113, 134018606, 135087248, 137476084, 139851672, 142633786, 146022572, 150891081, 155301187, 160016220, 166067011, 171178898, 178052046, 187002658, 198537836, 213614561, 232479306, 252935454, 268112533, 270909040, 256621510, 232328495, 206532691, 184508459, 168559724, 155594570, 142945094, 133449442, 126443119, 119941148, 114168512, 109952518, 104401294, 101547402, 99730103, 96784291, 93456349, 90376531, 88266687, 86314638, 85928833, 83388854, 81985373, 80371218, 79167067, 75990826]
2880G5990826j330641j274089j679718j173260j136004j260161p92204k290900
2872F5053849p25787k28207k096437o43965n21178N4133j559436o28320j407287
2863E7297365j049270Q77423M01309o66548j309642m86539j32259o41772p81048
2854E3509019O33033m54819J53838N61361j653709j115999O01237j05997r67805
2845E1160159n07153J01870r1468J59364K4712N42216J089558k53390j411619
2836E0814249P42267J95597L2063J01631p00333L02742L08797N9073m70877k96024
2826E1089185J853895P4066k50662P67532J208638k59087n25688O51109J302726
2817E5911714J79037K53341P280J007842Q15556N48225J331912k8678O69564N53849
$$ y = [75990826, 74660185, 73386096, 71706378, 70533118, 69397114, 68136953, 67344749, 65053849, 64328062, 64099855, 62003418, 61359453, 60838275, 60892408, 59332972, 58704652, 57297365, 56248095, 57125518, 57526827, 56860279, 55550637, 55064098, 54931839, 54290067, 53509019, 54142052, 53687233, 53841071, 54402432, 52748723, 51632724, 52233961, 52127964, 51160159, 50653006, 50754876, 50663408, 50822772, 50847484, 51389700, 52479258, 52225868, 50814249, 51556516, 51752113, 51784176, 51885807, 51185474, 51488216, 51797013, 51856086, 51385209, 51089185, 52943080, 53017146, 52766484, 53534016, 54742654, 54483567, 53957879, 54608988, 55911714, 56090751, 56344092, 56351372, 57359214, 58174770, 58722995, 60054907, 60026229, 60695793, 61249642]
2807F1249642R28432j71643J695665O30771J718990m83564P69980R85309J315952
2798F8639534J651423J458593R14892J01260J153966L13391K99381K506553K128110
2789G9167103J692808O35777J830617J270420J182342J958108J413299J694909
2781I0845383J423457J145719J592818J485474J892406J887479J789471K346133
2773A04408340J347983J139082J926256K451108J618144J624283K047880M01582
2765A16964658J607685K025778J899277K289927J149470J739985P20869K684497
2757A31082146J128122J389606J891757L121567J954562J932976J765955J880459
2749A46147150Q84387K308585J570316J679300J882483J685738K044562K415698
$$ y = [61249642, 62178074, 62006431, 63702096, 64332867, 66051857, 65568293, 66338273, 67323582, 68639534, 70290957, 71749550, 72664442, 72765702, 73919668, 74233059, 74532440, 77038993, 79167103, 80859911, 81495688, 83326305, 84596725, 85779067, 87737175, 89150474, 90845383, 92268840, 93414559, 95007377, 96492851, 98385257, 100272736, 102062207, 104408340, 105756323, 106895405, 108821661, 111272769, 112890913, 114515196, 116563076, 116964658, 118572343, 120598121, 122497398, 124787325, 125936795, 127676780, 128397649, 131082146, 132210268, 133599874, 135491631, 138613198, 140567760, 142500736, 144266691, 146147150, 147031537, 149340122, 150910438, 152589738, 154472221, 156157959, 158202521, 160618219]
2741A60618219J375450P22485J862043J045625K846846J386225J383830J397802
2733A72638525J382207K95053K70892J882604M62469Q0067J246392O51830r62488
2724A77947551k02888J376832r4674m40820O93381K48489j81825J14196l76198
2715A79084044L92241k94287J74251J12248o004n78813p62057j261081p83379
2706A76077163n71928j564316k525726j881317r72520k826892j57376j10640j680860
2697A63785588p38118k292489j368740j059000j949789j855331q06212j828603
2689A51887306j483879j649366k935068j408220k297917k547820j197356k550398
2681A35817282j743333k199232j480507k514618j778982j941113l281712j978015
$$ y = [160618219, 161993669, 162716154, 164578197, 165623822, 168470668, 169856893, 171240723, 172638525, 174020732, 174315785, 174586677, 176469281, 176931750, 177011817, 178258209, 178910039, 177947551, 177744663, 179121495, 179026821, 178586001, 179279382, 179527871, 179346046, 179460242, 179084044, 179476285, 179181998, 179356249, 179468497, 179462493, 178883680, 178121623, 176860542, 176077163, 175505235, 173940919, 171415193, 169533876, 168561356, 165734464, 165577088, 165466448, 163785588, 163047470, 160754981, 159386241, 158327241, 156377452, 154522121, 153715909, 151887306, 150403427, 148754061, 145818993, 144410773, 142112856, 139565036, 138367680, 135817282, 134073949, 131874717, 130394210, 127879592, 126100610, 124159497, 120877785, 118899770]
2673A18899770k549241q89725j515377l183688j511075q08173k844282k636800
2665A02961409j402213j748115k137525j919888k795555j582148j168339j438159
2657H8769467j281890k929900k282159N53454j154624k211411r65474l34776j947261
2648G6215426j600386j347199J69304j75908j022351j369056q69690j87348k28783
2639F9584009j411091n60309j165231l88168j279504N0743k67354p5563N1226
2630F4538758p41322K54271m2015O69000j119444N35751J73797j741303l38203
2621F2189290J23816J178331M39714Q74056m37357j038198L97470j51298j06204
2612F3469620l40851J514988L58663K93536P13168J060799j68539K58577j046661
$$ y = [118899770, 116350529, 115460804, 113945427, 110761739, 109250664, 108442491, 105598209, 102961409, 101559196, 99811081, 97673556, 95753668, 92958113, 91375965, 90207626, 88769467, 87487577, 84557677, 82275518, 82828972, 81674348, 79462937, 78497463, 78162687, 76215426, 74615040, 73267841, 73437145, 73261237, 72238886, 70869830, 70000140, 69812792, 69584009, 68172918, 67612609, 66447378, 66059210, 64779706, 64830449, 64563095, 64487532, 64538758, 63797436, 64051707, 64009692, 64678692, 63559248, 64094999, 64268796, 62527493, 62189290, 62313106, 63491437, 63931151, 64805207, 64367850, 63329652, 63727122, 63575824, 63469620, 63128769, 64643757, 65002420, 65295956, 66009124, 67069923, 66901384, 67159961, 66113300]
2603F6113300J008084J80083J424531O17219Q98787k04412Q21171J843618m04235
2594G2298146M16224J384151J202483J409246L20288M16119K309612K70488J228718
2585H1255475L03394q79260Q40423M93266j71612M04619k79738J630510Q48545
2576H4445622P91118M60184K94327O51087J252806p06881J220392Q85370j15841
2567H9178184Q58286P30071J104816q1692Q48709R13224k88234K13656J290748
2558I4767768o27251K19602m27822j05727O17984l6644K30519q38202Q8411j36353
2548I3752285j102601R2324K91564j611826K76954n30550n27727K44408q65001
2539I0019830r97845r27104l62563J08247n44826j122108n81024n06756o09023
$$ y = [66113300, 67121384, 67301467, 68725998, 69343217, 70242004, 70037592, 70858763, 72702381, 72298146, 72714370, 74098521, 75301004, 76710250, 77030538, 77446657, 79756269, 80026757, 81255475, 81558869, 80679609, 81520032, 82013298, 81841686, 82246305, 81966567, 83597077, 84445622, 85236740, 85696924, 85991251, 86642338, 87895144, 87188263, 88408655, 89294025, 89178184, 90036470, 90766541, 91871357, 91789665, 92638374, 93551598, 93263364, 93477020, 94767768, 94140517, 94360119, 93932297, 93826570, 94444554, 94407910, 94638429, 93800227, 93888638, 93752285, 92649684, 92742008, 93033572, 91421746, 91698700, 91168150, 90640423, 90884831, 90019830, 89021985, 88094881, 87732318, 87840565, 87295739, 86173631, 85592607, 85085851, 84476828]
2530H4476828P5893p14638m68368j670182K73459J18556j657071p52814q77465
2521G8804198m50035m20125j033626j41406R9091l85794j636955j55110l40088
2512G4340150J29172L91847k03647m53977k440818k00594R2054J19657p52023
2503G1021821m29418o69365k72345j268488k66497J006930m72184j001014O11515
2494F8260955L74955k64323m01791P76310l89818l33413j097381M04983J420964
2485F8751441r44968n05982q82399M20673Q6345n8424K26508J0710j42660k11573
2475F6749671O11034m82976Q01207J446874j50276j7647L35229P29649J328612
2466G1351377j2532n3256k89776K30193O29903O73792O17801J68162J058104k27888
$$ y = [84476828, 84552721, 83838083, 83369715, 81699533, 81972992, 82091548, 80434477, 79681663, 78804198, 78354163, 77934038, 76900412, 76759006, 76858097, 76472303, 74835348, 74680238, 74340150, 74469322, 74861169, 74657522, 74203545, 71762727, 71562133, 71654187, 71773844, 71021821, 70592403, 69923038, 69650693, 68382205, 68115708, 69122638, 68650454, 67649440, 68260955, 68635910, 68371587, 67969796, 68746106, 68356288, 68022875, 66925494, 67330477, 68751441, 67806473, 67300491, 66418092, 66838765, 66925110, 66866686, 67093194, 67103904, 66961244, 66749671, 67360705, 66877729, 67678936, 69125810, 68975534, 68957887, 69293116, 70022765, 71351377, 71338845, 71285589, 70995813, 71226006, 71855909, 72529701, 73147502, 73315664, 74373768, 74145880]
2456G4145880O38116L060O20415N00352j78941J781650P46890J539318j7072J240492
2446H1020160k3734L35864K37552J767905K22796N37799l54854R43440J544152
2437H6231080P29514J172840O33104J90221J475860P67265P16714K441063K21322
2428I4578983O62212J501557O15333N04032N85797K219632J583849J66012R85651
2419A03403058N47236J288496R62965J304330O32323J238479J338352J062595
2411A11777834J410965J475732P67168J692527K55750R95287Q53546K247735J315877
2402A22792421J150859R08596J570159J106299L48854J807107J551480P37096
2394A31972871J537857J222315J992429R21544J000693J209321R12789P10957
$$ y = [74145880, 74783996, 74787056, 75407471, 75907823, 75728882, 77510532, 78257422, 79796740, 79779668, 81020160, 80996426, 81332290, 81569842, 83337747, 83560543, 84098342, 83743488, 84686928, 86231080, 86960594, 88133434, 88766538, 88956759, 90432619, 91199884, 91916598, 94357661, 94578983, 95241195, 96742752, 97358085, 97862117, 98447914, 100667546, 102251395, 102417407, 103403058, 103950294, 105238790, 106201755, 107506085, 108138408, 109376887, 110715239, 111777834, 113188799, 114664531, 115431699, 117124226, 117379976, 118375263, 119228809, 121476544, 122792421, 123943280, 124851876, 126422035, 127528334, 127877188, 129684295, 131235775, 131972871, 133510728, 134733043, 136725472, 137647016, 138647709, 139857030, 140769819, 141480776]
2386A41480776K007194K183571J162962R88613J341012J822906K917914P48230
2378A54653178P82395J303019K335381J750606J021025J632271J966491K17041
2370A65661407J855137K310373K319824P87326J691564K743957J121883L013506
2362A81504977L325255K000895J266446J627246L387583J630931K291020K136497
2354A99170850J591443L585687J552334K464186L048690K452659N336617J754854
2346B20957320J752074J934915L663513L284748K331208L645332K630149K656972
2338B42856231M178563N014522L227365L807762L252589L404526K445173L996896
2330B72183627L192419N042441M018082K481156K981482K015075J473665J688464
$$ y = [141480776, 143487970, 145671541, 146834503, 147823116, 149164128, 150987034, 153904948, 154653178, 155435573, 156738592, 159073973, 160824579, 161845604, 163477875, 165444366, 165661407, 167516544, 169826917, 172146741, 172934067, 174625631, 177369588, 178491471, 181504977, 184830232, 186831127, 188097573, 189724819, 193112402, 194743333, 197034353, 199170850, 200762293, 204347980, 205900314, 208364500, 211413190, 213865849, 219202466, 220957320, 222709394, 224644309, 228307822, 231592570, 233923778, 237569110, 240199259, 242856231, 247034794, 252049316, 255276681, 259084443, 262337032, 265741558, 268186731, 272183627, 275376046, 280418487, 284436569, 286917725, 289899207, 291914282, 293387947, 295076411]
2322B95076411l04195N35433j748027p03498k699810k913935k976046l977634
2314B80288699m956593n075188n667275m579017n038338o553922o782515n921671
2306B35714180n156171m974041p253060n752685m800804m890121m193273n251652
2298A93442373m021340l949372m776200l534934k139810k105434l097901j949298
2290A67868084q73676j753075k798598j208n79611j123537m57789k518212k125342
2281A55637036j689269j664422j901877l055488l842710l558672m265107j747622
2273A33911869m180949j875125l307622k480548p66977l190281j692153p11887
2265A15706327n12607k232877n26571p10545j375475q28402n23197j395054m03447
$$ y = [295076411, 294772216, 295307649, 293559622, 292856124, 290156314, 287242379, 284266333, 280288699, 275332106, 270256918, 264589643, 260010626, 254972288, 248418366, 241635851, 235714180, 230558009, 225583968, 218330908, 212578223, 207777419, 202887298, 198694025, 193442373, 189421033, 185471661, 180695461, 177160527, 175020717, 172915283, 169817382, 167868084, 166994408, 165241333, 162442735, 162441527, 161861916, 160738379, 160280590, 157762378, 155637036, 153947767, 152283345, 150381468, 147325980, 143483270, 139924598, 135659491, 133911869, 129730920, 127855795, 124548173, 122067625, 121300648, 118110367, 116418214, 115706327, 115193720, 112960843, 112434272, 111723727, 110348252, 109519850, 108996653, 107601599, 107198152]
2256A07198152Q38090j066009J42364N48338k470904l43924O37990j008876j32111
2247A04343110K7113o64605M00380K350112J42857P83115J015756K67967K60034
2238A08925839Q98480J956554L14149J101966J899833J177165L034128K254616
2230A21562730K73265J89613J968325K607921J021480N99346J247164J860691
2222A31330535K030276K246232L53334J962997J164329K602929K009967J040869
2214A44741468L035800J966627K435775K108123L299341J332755J857287J727472
2206A62504648r04732J103570m51777j594514q71161q75873k338373l094071j979375
2197A51498342l956589m156596l439956n943197k620162l068267n496951k982432
$$ y = [107198152, 108036242, 106970233, 107112597, 107660935, 105190031, 104846107, 105484097, 104475221, 104343110, 104370223, 103705618, 104105998, 106456110, 106598967, 107382082, 108397838, 108665805, 108925839, 109824319, 111780873, 112095022, 113196988, 115096821, 116273986, 119308114, 121562730, 121835995, 122025608, 123993933, 126601854, 127623334, 128222680, 129469844, 131330535, 133360811, 135607043, 135960377, 137923374, 139087703, 141690632, 143700599, 144741468, 147777268, 149743895, 152179670, 154287793, 157587134, 158919889, 160777176, 162504648, 161599916, 162703486, 162251709, 160657195, 159786034, 158910161, 156571788, 153477717, 151498342, 147541753, 143385157, 139945201, 134002004, 131381842, 128313575, 122816624, 119834192]
2189A19834192m242188l223386m130041k885113m492417m147334l423118l908382
2181H9382213m463554l188019k761642j806201j657625k703952k454680k439761
2173F7906779j175986j706838j703819r70095q57914j021041j302308j690177
2165E7478601j082765p98340o22501p09959P029p40237p95326j197006q48771
2156E0690725p48810l41568n38505l99395L06222r60674O36009q98280K9165R26259
2146D8701148o74722m03558n53694m96922P04932m98230k28444r1194n06341O06243
2136D6559218l33436j15732O82839l87055K94514l82864m02846Q07166M43226
2127D7165030p28836N68906k71069j036647Q52644K80059m13316N66208P7665
$$ y = [119834192, 115592004, 112368618, 108238577, 105353464, 100861047, 96713713, 93290595, 89382213, 84918659, 81730640, 78968998, 77162797, 75505172, 72801220, 70346540, 67906779, 66730793, 65023955, 63320136, 62350041, 61492127, 60471086, 59168778, 57478601, 56395836, 55597496, 54974995, 54265036, 54272065, 53531828, 52736502, 51539496, 50690725, 49941915, 49600347, 49061842, 48662447, 48968669, 48007995, 48644004, 47745724, 47774889, 48701148, 48026426, 47622868, 47069174, 46572252, 47277184, 46778954, 46550510, 46459316, 45952975, 46559218, 46225782, 46110050, 46792889, 46405834, 46700348, 46317484, 45914638, 46721804, 47165030, 46436194, 47005100, 46734031, 45697384, 46550028, 46830087, 46416771, 46982979, 47060644]
2118D7060644k64681O85301L60782K021008n86376O10813k62991P65507R86348
2109E1376355Q43705Q6486m42524K157093p419j024751K234166P83446k87061
2100E5719496j59027J389365K089004O32494L98108M29898J643014O01064J853644
2091F4597060o36057O72825J174652K259222J595998n493J713039J778309Q47432
2082G3996987k02984J069482L437330J447012K374683Q15352J021808L075230
2074H7034900J800964Q98554J76339L551327K566690J542492K570288L164376
2066A03305930J029086K803016K736456J735768L129615M565005J898749K847100
2058A24050725M145904K633940N066577L470579M000986N239604M265351M657712
$$ y = [47060644, 46795963, 47481264, 47842046, 49863054, 49276678, 49887491, 49624500, 50390007, 51376355, 52220060, 52306546, 51864022, 54021115, 54013696, 52988945, 55223111, 56006557, 55719496, 55560469, 56949834, 59038838, 59671332, 60069440, 60499338, 62142352, 62743416, 64597060, 63961003, 64633828, 65808480, 68067702, 69663700, 69658207, 71371246, 73149555, 73996987, 73794003, 74863485, 78300815, 79747827, 82122510, 82937862, 83959670, 87034900, 88835864, 89734418, 89910757, 93462084, 96028774, 97571266, 100141554, 103305930, 104335016, 107138032, 109874488, 111610256, 114739871, 119304876, 121203625, 124050725, 128196629, 130830569, 135897146, 139367725, 143368711, 148608315, 152873666, 157531378]
2050A57531378N236819N127691N124361N052182M826742O186437O753979O489655
2042B02329244N439293O754688P031406N918481O814467Q624848P077606P582882
2034B57572915Q274479J0161539Q640439Q856258R688593J0653290J0725763J0295041
2026C34868317J0939944J0695524J0888388J1050307J1503445R991621J1664136
2019D11601682J0301523Q213961N878714M600894K689615J358204k263838n456402
2011D36924353q992985j1830046j3964627j3989063j6363327j7934915j5538661
2004C38310729j7152288j6813727j6235211j5868487j3869782j5645904j3159163
1997B29566167j2314464j2108341q564680r783494r007588q571953p210825p406561
$$ y = [157531378, 162768197, 167895888, 173020249, 178072431, 182899173, 189085610, 195839589, 202329244, 207768537, 214523225, 221554631, 227473112, 234287579, 242912427, 249990033, 257572915, 265847394, 276008933, 284649372, 293505630, 303194223, 313847513, 324573276, 334868317, 345808261, 356503785, 367392173, 378442480, 389945925, 399937546, 411601682, 421903205, 430117166, 435995880, 440596774, 443286389, 444644593, 442380755, 436924353, 427931368, 416101322, 402136695, 388147632, 371784305, 353849390, 338310729, 321158441, 304344714, 288109503, 272241016, 258371234, 242725330, 229566167, 217251703, 205143362, 196578682, 186795188, 177787600, 169215647, 162004822, 154598261]
1989A54598261q015147n854074o889456n484273n246141m901062n331952m376932
1981A08499224l794749n021139l841557m211093j956140k593561m429458l213499
1973G9438028j796589k350247l695229l227090k797185j161980r92792k315550
1965F1101366j814479j565446j875471j274904j187746j254893r88890j832680
1957D9306857j548558k691331j288719l66913j13954j886116j888995j265440
1949C8256831q32834j14132o5173j419166L7040M97967j059544k634912q53679
1940C1812398N64684n47856j127714n44181o94007l19460N51014j434915n12548
1931B7747415j408239p40011o49078j90512N99751j184236L72466k38539j461230
$$ y = [154598261, 146583114, 140729040, 133839584, 128355311, 123109170, 118208108, 112876156, 108499224, 104704475, 99683336, 95841779, 91630686, 89674546, 87080985, 82651527, 79438028, 77641439, 75291192, 71595963, 68368873, 65571688, 64409708, 63416916, 61101366, 59286887, 57721441, 55845970, 54571066, 53383320, 52128427, 51139537, 49306857, 47758299, 45066968, 43778249, 43411336, 43297382, 41411266, 39522271, 38256831, 37423997, 37309865, 37244692, 35825526, 35862566, 36360533, 35300989, 32666077, 31812398, 32377082, 31829226, 30701512, 30157331, 29463324, 29143864, 29694878, 28259963, 27747415, 26339176, 25599165, 24950087, 24759575, 25359326, 24175090, 24547556, 24309017, 22847787]
1922B2847787M25377M50631j288076o50389j163217p89878J133229r10608m42232
1913A9612624L5813o80509N44132o5722q74676j5330p5916k95543j274238J060152
1903A7970787n40195L20844o57663m24086o16668l29664r09155J40426L08969
1894A5263595p43263j86597k84520J06344l79838q75571N22935k82427L36305
1885A3476963M66196L00063P90496j327994m43434p10523K57539N72341o7939
1876A3313708q28786j421667n36734J174634L75559R975m31284n63185R19748
1867A2011968Q68334j081359q42269k44578J058494N2904q4004q20391K66574
1858A1185673J325458q19614j591413j095252J993872N59266r8909j053612M33206
$$ y = [22847787, 23273164, 23723795, 22435719, 21785330, 20622113, 19832235, 20965464, 20054856, 19612624, 19648437, 18967928, 19512060, 19446338, 18571662, 18556332, 18480416, 18184873, 16910635, 17970787, 17430592, 17751436, 17093773, 16669687, 16053019, 15723355, 14814200, 14954626, 15263595, 14520332, 14333735, 14049215, 14155559, 13775721, 12900150, 13423085, 13140658, 13476963, 13943159, 14243222, 15033718, 13705724, 13262290, 12551767, 12809306, 13381647, 13313708, 12484922, 11063255, 10526521, 11701155, 12076714, 12086689, 11655405, 11092220, 12011968, 12880302, 11798943, 10956674, 10712096, 11770590, 11823494, 11739490, 10919099, 11185673, 12511131, 11691517, 10100104, 9004852, 10998724, 11557990, 11459081, 10405469, 10838675]
1849A0838675J011482j467125l79015j65722j156767k01950J229979k20359N6099
1840I545297p80607l39323O15118k96652m73672N6658k01168J346413M55053n97329
1830I329788j372101n02133N94972J630695J64064q02164J239385r29658q67110
1821H485738J203512o69691r24655O58372o35587L42154J84446J389323P10068
1812A0743680j433665k15553q19186P79884M24476n46532O9991N30336j116249
1803H417182N97659Q89081r50741m92265q22279J043104K45392n06731l2439o36304
1793G751659o19006N89074k70636k75322p55240R9948M74450o13369J082205L79162
1783G842925q1487q59358k91720r42971O19299L4018O55517k57942O20160L28136
$$ y = [10838675, 11850157, 10383032, 10004017, 9838295, 8681528, 8479578, 9709557, 9489198, 9545297, 8764690, 8425367, 9040485, 8743833, 8270161, 8326819, 8125651, 9472064, 9927117, 9329788, 7957687, 7455554, 8050526, 9681221, 9845285, 9043121, 10282506, 9352848, 8485738, 9689250, 9019559, 8094904, 8753276, 8117689, 8459843, 8644289, 10033612, 10743680, 9310015, 9094462, 8275276, 9055160, 9479636, 8933104, 9003095, 9533431, 8417182, 9014841, 9903922, 8953181, 8460916, 7638637, 8681741, 8927133, 8420402, 8387963, 7751659, 7132653, 7721727, 7451091, 7175769, 6420529, 6520477, 6994927, 6381558, 7463763, 7842925, 7761438, 6902080, 6610360, 5667389, 6286688, 6320706, 6976223, 6718281, 7338441, 7666577]
1773G666577j129153o66880p03746Q79018K72096n03089k2281J50918o79524P88884
1763F052820K93064R56835j271443m05344j21605o37265J462018q77218O9588
1754E521450J037089o89310K99178m34624o63489r82282L13918K62248Q55360
1745E519538p80156m09878J065999j70874r27472O86721J20227m1065m33385M11092
1735E040747O73376M075k28943O30770j085128r0579J04155n47085J016529L90255
1725E908172r10676j35048n871r69635q4383J110817O1624O43709j64556j792562
1715C661591J502707m14442M93062O27529j279601m39365O92751Q17159N8578
1706E719969p18947l88862n82718M50342l8475l43878J168236o34411O566j23228
$$ y = [7666577, 6537424, 5870544, 5166798, 6045816, 6317912, 5814823, 5792542, 5943460, 5263936, 6052820, 6345884, 7302719, 6031276, 5625932, 5504327, 4867062, 6329080, 5451862, 5521450, 6558539, 5869229, 6168407, 5733783, 5070294, 4088012, 4401930, 4664178, 5519538, 4739382, 4329504, 5395503, 5224629, 4297157, 4983878, 5104105, 5063040, 4629655, 5040747, 5714123, 5718198, 5489255, 6120025, 5034897, 4944318, 5048473, 4501388, 5517917, 5908172, 4997496, 4862448, 4856577, 3886942, 3802559, 4913376, 4975000, 5618709, 5454153, 3661591, 5164298, 4749856, 5242918, 5870447, 4590846, 4151481, 4844232, 5661391, 5719969, 5001022, 4612160, 4029442, 4479784, 4441309, 4097431, 5265667, 4631256, 4637822, 4514594]
1696D514594j181087o83205J253819l34683q66666Q0095O76202j13583K78071
1687C623557J546921j004070q31407L25978M02285j401990L54526J26042p95850
1678B345992L52353K000919n58137N2148j939202K181026L52856j987844l5578
1669B764533M63831J63117K39513Q64553L59620m18045l32590o86306j33092M1787
1659C326921N24792R7695l53360p1870M76592q70664l21668Q82956o58803m47565
1649B585026M16461j8551Q00673k5396o87673O28207q6962o77041J13992J51732
1639C200468k52566J230810Q71011j427075L95007k98545P7079J629849l36501
1630E089537n87424N3739N42390n73645r74698K49888J282950j109399j86703
$$ y = [4514594, 3333507, 2650302, 3904121, 3569438, 2702772, 2782867, 3459069, 3345486, 3623557, 5170478, 4166408, 3335001, 3660979, 4063264, 2661274, 3015800, 3141842, 2345992, 2698345, 4699264, 4141127, 4193275, 2254073, 4435099, 4787955, 2800111, 2764533, 3228364, 3391481, 3630994, 4495547, 4855167, 4437122, 4104532, 3418226, 3285134, 3326921, 3851713, 3949408, 3596048, 3524178, 4000770, 3130106, 2808438, 3691394, 3032591, 2585026, 3001487, 2982936, 3783609, 3758213, 3070540, 3698747, 3611785, 2934744, 3048736, 3200468, 2947902, 4178712, 5049723, 3622648, 4017655, 3719110, 3796189, 5426038, 5089537, 4502113, 4555852, 5098242, 4524597, 3549899, 3799787, 5082737, 3973338, 3786635]
1621C786635M15556q88864J54151N89830l66625n1646l42495J210202j150877
1612C355867J94085O23089n72683P91520L39725j404250L91009m78037K49317
1603C489642l14016m56540q4106L86817p51356K26100J87402J016326o05724Q51707
1593C946252K70551j005177N71752k78236j923541P18440Q32552R46337K24406
1584D303336j56525L01305j459490J19934j79867j484287O92447N53332l18188
1575B371997L04115J447897j15003r53763J293793k14218j018100j203176N81256
1566B494798P91766o03254J242417l16947O97743M47931q0786r06907m09200l8470
1556C319091J05909J757560l46739p06185P8197J066072K93490j66731r86816
$$ y = [3786635, 4202191, 3313327, 3467478, 4057308, 3690683, 3639037, 3296542, 4506744, 3355867, 3549952, 4173041, 3600358, 4391878, 4731603, 3327353, 3718362, 3240325, 3489642, 3175626, 2719086, 2634980, 3021797, 2270441, 2496541, 2683943, 3700269, 3094545, 3946252, 4216803, 3211626, 3783378, 3505142, 1581601, 2300041, 3132593, 4078930, 4303336, 4146811, 4448116, 2988626, 3108560, 2928693, 1444406, 2136853, 2690185, 2371997, 2676112, 4124009, 4009006, 3055243, 4349036, 4134818, 3116718, 1913542, 2494798, 3286564, 2683310, 3925727, 3608780, 4306523, 4754454, 4673668, 3766761, 3357561, 3319091, 3425000, 5182560, 4835821, 4129636, 4207833, 5273905, 5567395, 5400664, 4413848]
1547D413848J513019j002124l08089R88382n70878o78238l12034j39254l65874
1538C538758M83342J221058j748798J118854o99952L78989R82282j073585J016449
1529E217397o3734l59141J178471j019608N26540m17343r28319R28146J5822L1518
1519E109749J218321k6242r21781N98853q78985O51638L96059N9262q0196L87792
1509F514470k85598o3904J222884o7528J001587r34730q85485J45981L25944k02298
1499F771323M68430L09925l83480m82368J096793N76518O19726q44439N01281
1490H633709J020251J047151Q96713j667396n02577M07931K91576P39990J20613
1481A0987961j71259r05695K52385P66119j47940N52534J553259J715846l291
$$ y = [4413848, 5926867, 4924743, 4616654, 5605036, 5034158, 4355920, 4043886, 3904632, 3538758, 4022100, 5243158, 3494360, 4613214, 3913262, 4292251, 5274533, 4200948, 5217397, 5153663, 4794522, 5972993, 4953385, 5479925, 5062582, 4134263, 5062409, 5078231, 5109749, 6328070, 6301828, 5380047, 5978900, 5099915, 5751553, 6147612, 6206874, 6126678, 6514470, 6228872, 6164968, 7387852, 7320324, 8321911, 7387181, 6501696, 6647677, 6973621, 6771323, 7239753, 7549678, 7166198, 6683830, 7780623, 8357141, 8976867, 8132428, 8633709, 9653960, 10701111, 11597824, 9930428, 9427851, 9835782, 10127358, 10867348, 10987961, 10816702, 9911007, 10163392, 10929511, 10781571, 11334105, 12887364, 14603210, 14599919]
1472A4599919q41584P38849J125380n38079J435469Q91544j20255R53626N59910
1463A8804779J055811K307899J218589K071423J380683Q28582J278464J225024
1455C0171254N33079J345062J003801J538268J654208J813400K222599J069372
1447D1351043J396908J058578J463462K237092K467229J833124J829759L589687
1439E7226882L059722M820262N202028M680108N054351N790232Q927673R700106
1431A04461364J5212227K0910298K3522747K5876779J8714666K04558k2370526
1424A86532113k9517883l0744602k2886176j8346904j4024402j0308381p558670
1417E3145095o441435n138855l897871l993866k566225l334846k594290k725512
$$ y = [14599919, 13758335, 14497184, 15622564, 15084485, 16519954, 17411498, 17291243, 18244869, 18804779, 19860590, 22168489, 23387078, 25458501, 26839184, 27667766, 28946230, 30171254, 30704333, 32049395, 33053196, 34591464, 36245672, 38059072, 40281671, 41351043, 42747951, 43806529, 45269991, 47507083, 49974312, 51807436, 53637195, 57226882, 60286604, 65106866, 70308894, 74989002, 80043353, 85833585, 94761258, 104461364, 119673591, 140583889, 164106636, 189983415, 208698081, 208902639, 186532113, 157014230, 126269628, 103383452, 85036548, 71012146, 60703765, 53145095, 46703660, 41564805, 37666934, 33673068, 31106843, 27771997, 25177707, 22452195]
1409B2452195k218522j990533M34733j504020k270406k37313j007913j263095
1401A2395126p6333j28837p38177n40138R92875j827254j401454L00394O96252
1392I672454o77418j016647O7942L04324o11239m82784r98213j24432L07601N36429
1382F978017k18453j57035j352399N1831L99891k07339J87069j111230k96953
1373D273399M01293o25767q70950P53954O5170L53204o75040J91987R42230k71758
1363D537722l53884J700L31639j04353q65147r02395P51076K64850l68329O91570
1353C984449k21081m70552j23870M29143j230067n58937J49577l20954K94798
1344A932506M01129J44672N43334M70993k27843p84907R41522N36169K18243p95213
$$ y = [22452195, 20233673, 18243140, 18677873, 17173853, 14903447, 14666134, 13658221, 12395126, 12318793, 12189956, 11451779, 10911641, 11904516, 10077262, 8675808, 8976202, 9672454, 8995036, 7978389, 8046331, 8350655, 7739416, 7256632, 6258419, 6133987, 6441588, 6978017, 6759564, 6602529, 5250130, 5301961, 5701852, 5494513, 5681582, 4570352, 4273399, 4674692, 4048925, 3177975, 3931929, 3997099, 4350303, 3675263, 3867250, 4809480, 4537722, 4183838, 4185538, 4517177, 4412824, 3547677, 2645282, 3396358, 3661208, 3292879, 3984449, 3763368, 3292816, 3168946, 3598089, 2368022, 1809085, 1958662, 1637708, 1932506, 2333635, 2478307, 3021641, 3492634, 3264791, 2479884, 3421406, 3957575, 4175818, 3380605]
1334C380605o35441p286J95868p15512Q27792J388294m66714n71021q08239P56471
1324C344817j625704o50716P30547L28223j21330j097496L56048j21321j52984
1315I90084R20513n93119P87686l21493k0503k26075j47262k19548L96579n5285
1305A511577Q44900O72127q18078l08332m01269N79211N58114k94956J26792j849204
1295F20882P38292K03965L13259o5919p3068M87325j344157R54592R77759q55734
1285A957196m04409J339201j259893O31428j315873R89188Q12194j686265r82499
1276H0268J203837J335243N2705n53522M8105p80565o92573l71399J106918m7859
1266A381158j167095j32998K98036R13050L88753l14776J208931q42091p87926
$$ y = [3380605, 2745164, 2737878, 2933746, 2218234, 3046026, 4434320, 3967606, 3396585, 2588346, 3344817, 1719113, 1068397, 1798944, 2127167, 2005837, 908341, 1264389, 1143068, 990084, 1910597, 1317478, 2105164, 1783671, 1763168, 1537093, 1389831, 1170283, 1566862, 1511577, 2356477, 3028604, 2210526, 1902194, 1500925, 2080136, 2638250, 2343294, 2470086, 620882, 1359174, 1563139, 1876398, 1810479, 1737411, 2224736, 880579, 1835171, 2812930, 1957196, 1552787, 2891988, 1632095, 2263523, 947650, 1936838, 2749032, 1062767, 80268, 1284105, 2619348, 2672053, 2118531, 2166636, 1386071, 693498, 322099, 1429017, 1381158, 214063, 81065, 379101, 1292151, 1680904, 1366128, 2575059, 1732968, 945042]
1257I45042J23347l78495R66612l17150j53023N60535j50221M16780Q20188j110741
1247A722874L51194K4621j174374o74421L91652R97926N3641N40660o58988k63963
1237A310822J23484n82330J528811j009198R53054m57801l35637N00352p46458
1228A285099l81275k31604P09199N82770n30782N05470L19746l62367k82388Q35343
1218B449211r83671P93659r21253q47863Q00065q74961J563208K75995n0554m60051
1208A743785j32202J88930j305507R4411P36729j56397l9897j042563q9598l38678
1198c40987L52885M23808Q19603l11244p56481O41688m21984N17087N8815m3444
1188I39746l07987J19285M58812O69779q08740n1416l78780j004661P74355J19589
$$ y = [945042, 1068389, 689894, 1656506, 1339356, 1186333, 1746868, 1596647, 2013427, 2833615, 1722874, 2074068, 2098689, 924315, 249894, 641546, 1639472, 1693113, 2233773, 1574785, 1310822, 1434306, 851976, 2380787, 1371589, 2324643, 1866842, 1531205, 2031557, 1285099, 903824, 672220, 1381419, 1964189, 1433407, 1938877, 2258623, 1896256, 1613868, 2449211, 1465540, 2259199, 1337946, 490083, 1290148, 415187, 1978395, 2254390, 2203836, 1743785, 1611583, 1800513, 495006, 589417, 1326146, 1169749, 1129852, 87289, -2309, -340987, 11898, 435706, 1255309, 944065, 187584, 829272, 407288, 924375, 983190, 939746, 631759, 751044, 1209856, 1879635, 1070895, 1019479, 640699, -363962, 410393, 529982]
1178E29982L14768k90132k51422k56858p9868p620R37252K92193N64013k71182
1168A481126q17033n71078j51154J703888k07101q67974L89349l50327Q19461
1159A429157O02503p86454m01687K02217q900J31997j28532j786089j58660J971848
1149A067400O5938N2525K98965n47938J33519m09623p7121J258029j222592k67828
1139C51274N73173K32495p5832L83576n72183o34058Q57594k36694q1167l78153
1129D20025R7656L9826p03384m38519J722788P90694k055612l00704n4571J220134
1119G38333R72000q15748p15255k22728J101723q61665Q15639O3979p75690J62398
1109D62986N94777q16666K92767o1535m7515K21922K05734r68647N27478N63916
$$ y = [529982, 844750, 554618, 303196, 46338, -33530, -41150, 896102, 1188295, 1752308, 1481126, 664093, 93015, -58139, 1645749, 1438648, 570674, 960023, 609696, 1429157, 2031660, 1245206, 843519, 1045736, 1036836, 1168833, 1040301, -745788, -904448, 1067400, 1133338, 1185863, 1484828, 936890, 1070409, 660786, 583665, 1841694, 619102, 351274, 924447, 1156942, 1081110, 1464686, 892503, 258445, 1116039, 879345, 798178, 420025, 517681, 557507, -145877, -584396, 1138392, 1929086, -126526, -427230, -481801, 738333, 1710333, 894585, 179330, -43398, 1058325, 196660, 1012299, 1076278, 300588, 462986, 1057763, 241097, 533864, 472329, 424814, 646736, 852470, -116177, 411301, 975217]
1099I75217o49607k65963q8098L88256R55222j84968j302154P06383K40559m2973
1089G31874j9831Q81608j098066P09331N94798j39296j29851o90298O2573k55904
1079F46938O07617J023215o31904j58709j009599M83263k00813m96351J128341
1070A391998k29723k44604m36820N58996l73943P82636j08264r6344m49843p30549
1060F3540l12399j04168O15092m15412l59721J137287j32946J110798j442175
1051A59896m91162k43053n29345K049689k67846j106475M34208J536072N46572
1042B088556j122326k152509J925001j028129k6343J410981j635181l83369J032045
1033A08726m66959L28378N66961L33378o34132O51385m849Q296P38000r75831
$$ y = [975217, 325610, 59647, -28451, 359805, 1315027, 1130059, -172095, 534288, 774847, 731874, 712043, 1593651, 495585, 1204916, 1799714, 1660418, 1530567, 840269, 902842, 646938, 1254555, 2277770, 1645866, 1487157, 477558, 960821, 760008, 263657, 1391998, 1162275, 917671, 480851, 1039847, 665904, 1448540, 1340276, 1243932, 794089, 63540, -248859, -353027, 262065, -153347, -513068, 624219, 491273, 1602071, 159896, -331266, -574319, -1103664, 946025, 678179, -428296, 5912, 1541984, 2088556, 966230, -1186279, 738722, -289407, -315750, 1095231, -539950, -923319, 108726, -358233, -29855, 537106, 870484, 236352, 887737, 882888, 891184, 1629184, 653353]
1023F53353j71291Q50562m24015k56933r53538J653833j993947J140083l24951
1014A73156P81852j07891q13085M70657m47421L41080P2621o33798q88706J415449
1004C63914m69865N01194k36077R4182J065267j301350r9051J01971O11577M45243
994A077005q89728P06278o4834j53257o50565J175217q96946j035487j51501J446728
984E62910k80498l69065k24288Q72722j369203N49209J190721q97843J22763L01272
974D58700p90967O10449j727003L42431P10008R33461l57001O99389n7310j795529
964i73372N37576P68844l3467n51391j44969J031295q9683M79256j006165N0881
954F8805k17345o48846M57685j178374J210015R1970N29465o08204k17936M27502
$$ y = [653353, 482062, 1332624, 908609, 651676, -301862, 1351971, -641976, 498107, 173156, 955008, 847117, 34032, 504689, 57268, 398348, 470969, -162829, -1051535, 363914, -105951, 395243, 159166, 253348, 1318615, 17265, -81786, 20185, 631762, 1077005, 187277, 893555, 828721, 675464, 24899, 1200116, 303170, -732317, -883818, 562910, 282412, -86653, -310941, 561781, -807422, -258213, 932508, 34665, 157428, 458700, -332267, 278182, -1448821, -1106390, -396382, 537079, 180078, 879467, 822157, -973372, -435796, 333048, 299581, -251810, -396779, 634516, 544833, 1024089, 17924, 68805, -148540, -797386, -339701, -1518075, -308060, -216090, 313375, -294829, -512765, -85263]
944h5263L86280M86800j02827m51088k09024j043322N97494l21896R25096R28152
934A110402l89804Q75136q99356L24497N67677j200124p46120k57928P88184J41013
924C13577P64264q81247o51078o14108q53407P46980O70686N99735j965l75618
914b82181n33758m31755P56115J30596n460J049245k56254P81593j051446j63355
904f660J224556o72149J020889j346852o49914J208380k04430j229126j41331
895g96637q62450J411228Q04527j216828J612027L23065r21934n72128R32285
886G13155J14925R1768l44296n7786k88540k69676k45987L14638O74193L8535
876G40929n80278J63644l85703o87720J083230n79134r10531Q78910J063199J080539
$$ y = [-85263, 301017, 787817, 684990, 233902, 24878, -1018444, -420950, -742846, 182250, 1110402, 720598, 1595734, 696378, 1020875, 1588552, 388428, -357692, -615620, 172564, 313577, 1077841, 196594, -454484, -1068592, -1921999, -1175019, -504333, 95402, 93437, -282181, -815939, -1247694, -491579, -360983, -366443, 682802, 426548, 1208141, 156695, -6660, 1217896, 545747, 1566636, 219784, -430130, 778250, 573820, -655306, -796637, -1659087, -247859, 556668, -660160, 951867, 1274932, 352998, -219130, 713155, 828080, 919848, 575552, 517766, 229226, -40450, -286437, 28201, 702394, 740929, 160651, 324295, -61408, -749128, 334102, -245032, -1155563, -276653, 786546, 1867085]
866A867085j562205J326256L90753j048216j103610L72223L53859L33410K15146
857A144701n42636J540171J69477j036358j53337r08267j235913J426336j129930
848g25756P14678k20569O74631N35660k22402r2381p57937j020062J283668O40876
838H10406j305310L6960Q47690K28214L44196p17470p81834P60394P57404j125610
828a44960K42718K92364M93717k57228p22020m8016L00191k45326k68723J08808
818b48475M4004J141241k25757j450240M22248N76872q32046o7989J031145K33575
808F24578j134383l75138J553290k87407k10482j81815o90469P69979J5127j013094
798i29814J20010J051228l28444l84465J7112N18295L32621P5617m86191P28819
$$ y = [1867085, 304880, 1631136, 2021889, 973673, -129937, 242286, 596145, 929555, 1144701, 602065, 2142236, 2311713, 1275355, 1122018, 213751, -1022162, 404174, -725756, -11078, -231647, 442984, 978644, 756242, 663861, -94076, -1114138, 169530, 810406, -494904, -457944, 389746, 617960, 962156, 244686, -537148, 223246, 980650, -144960, 97758, 390122, 883839, 626611, -95409, -143425, 156766, -88560, -357283, -248475, -204471, 936770, 711013, -739227, -316979, 259893, -572153, -640142, 391003, 624578, -509805, -884943, 668347, 380940, 170458, -11357, -701826, 68153, 83280, -929814, -809804, 241424, -87020, -471485, -454373, 63922, 396543, 472160, -14031, 714788]
788G14788o60541o93527Q78315K82962j515299N08660J174030J75412K447j29894
778G37353n37260j081372M14762R54899n87417R97020j66321k62298L37099K43049
768A049514j118669j388980J131265m84805O62391Q0903R3993j00287n31431O92704
758H6598o34131j53074M13515m56672n19123M13149k73235M01602k5907P49662
748B384K08175m96852k85069m95006L08118K40942p6617m07697O04503L54587
738d2532J028262K96925j242020p03804P49031L29475N60515o8350j4765l25391
728E67346Q89j614512n6656J318484p66949j96468l55044k44189j03984J114161
718c36922p31781P1001M59931L58874P13923l28599l32045L05810q42578Q7734
$$ y = [714788, 54247, -639280, 239035, 521997, -993302, -484642, 689388, 864800, 867247, 737353, 200093, -881279, -466517, 488382, -99035, 897985, 731664, 469366, 806465, 1049514, -69155, -1458135, -326870, -811675, -149284, -68381, 25612, -74675, -606106, 86598, -547533, -700607, -287092, -743764, -1262887, -849738, -1122973, -721371, -747278, 2384, 210559, -286293, -571362, -1066368, -758250, -517308, -593925, -1001622, -397119, -42532, 985730, 1282655, 40635, -663169, 85862, 415337, 975852, 907502, 892737, 567346, 568235, -1046277, -1102933, 215551, -551398, -747866, -1102910, -1347099, -1451083, -336922, -1068703, -997702, -537771, -178897, 535026, 206427, -125618, 180192, -662386, -574652]
708e74652j7995J159093O29311r1391o56943Q6049j33850n95965Q3017Q51631
698G38305n60733j93208M46501p56569K27782N25820n4675n27666m6724M42597
688B41430J9113p0953N0485k22664J28618P48652J439481n13464j154857l64577
678C01264l5955p82704M88042r67359N42216j171339J699802L48074j40452O86633
668I68222l03363j682557j23732L23688r9343L96516k24086J496212o30609j12360
658H588m9371L6073M73861L51055n12578n51443P88515J22195j846825P03920
648d76010j01199L36303m08374r50021M72540J961717j229957J20053M37155k11820
638d9613j10478p52859J0342N83465M73416n56170n81637n81175J770695n26985
$$ y = [-574652, -592647, 566446, 1195757, 1104366, 447423, 533472, 399622, -196343, -113326, 738305, 177572, -15636, 430865, -325704, -97922, 427898, 373223, -154443, -201167, 241430, 260543, 189590, 240075, 17411, 146029, 894681, 2334162, 1820698, 665841, 301264, 265309, -517395, -29353, -996712, -454496, -1625835, 73967, 422041, 281589, 968222, 664859, -1017698, -1141430, -817742, -917085, -520569, -744655, 751557, 120948, 8588, -40783, -4710, 469151, 820206, 307628, -243815, 544700, 666895, -1179930, -476010, -577209, -240906, -649280, -1599301, -1126761, 834956, -395001, -274948, 162207, -49613, -160091, -912950, -902608, -319143, 154273, -401897, -983534, -1564709, 205986, -320999]
628c20999P52319K44572J53347m60814n67280P66965p22532l11574j96098J812404
618A150310j48353j657283J9262J346742l4442o59522n35688r9548L19398M95971
608A96847r35932q53099J351641N17289l49249M92371K41021n58199l73842j80711
598d51863M93854n35680L00263K96243l27299J90118m98583J75349j618081K76009
588a699670R85322m49683l38398J274433N69743l28542o16558o64544Q7697J310795
578A30595q46043R34912Q1066Q4936J37063p64866N86689q85872K85093k82604
568e39031L49598M79397r40364N07363K61075n45501P59826o91826l37338j85999
558h82800J236916j281466K14228J86383L12671j120790O51333N69500R05190
$$ y = [-320999, 431320, 675892, 829239, 368425, -198855, 568110, -154422, -465996, -662094, 1150310, 1001957, -655326, -636064, 710678, 676236, 16714, -518974, -618522, -299124, 196847, -739085, -1592184, -240543, 276746, -72503, 419868, 660889, 102690, -271152, -451863, 41991, -493689, -193426, 102817, -224482, -34364, -532947, -357598, -1975679, -1699670, -714348, -1164031, -1502429, -227996, 341747, 13205, -603353, -1267897, -1180200, 130595, -715448, 219464, 300530, 385466, 522529, -242337, 344352, -541520, -256427, -539031, -189433, 289964, -650400, -143037, 118038, -427463, 332363, -359463, -696801, -882800, 354116, -927350, -713122, -526739, -214068, -1334858, -683525, -114025, 791165]
549G91165j115926k40328q1398k0444L1147M13520M59808k93259p82381k58637
539a096733M23024N80407K07809j9067M84888j236360j69178R36208l06409N36977
529C41566j235170M06515L26880j360243N58755M21395q26586P38310M52529K85200
519A09151R1071O89483r18852P8525l06758j087152J283512K68900p81089j41805
509g15014P22068J48164L50927R6286O03189q49095l02258j287635K55713J381008
499D03353J90984n92343j264229j823820K055954N80300k69073j61352J020177
490A39951o65411J204212p82636P69953m31214q21265L9283M95137m83128l66851
480i01969l94845P05958l46564o38116J362536n38325k38351K77067j29948Q25761
$$ y = [791165, -324761, -565089, -646487, -666931, -635784, -222264, 237544, -55715, -838096, -1096733, -673709, -93302, 114507, 95440, 580328, -656032, -825210, 110998, -195411, 341566, -893604, -487089, -160209, -1520452, -961697, -540302, -1366888, -628578, -176049, 109151, 200222, 889705, -29147, 49378, -257380, -1344532, -61020, 207880, -573209, -715014, 7054, 155218, 506145, 602431, 1205620, 356525, 54267, -1233368, -977655, 403353, 594337, 1994, -1262235, -3086055, -1030101, -449801, -718874, -880226, 139951, -525460, 678752, -103884, 666069, 234855, -586410, -547127, -51990, -535118, -901969, -1296814, -590856, -937420, -1575536, -213000, -751325, -989676, -712609, -842557, -16796]
470a6796k15881p23231q26882l12508N97133M33231J161449N86470j185909m24502
460i27426N64952j269768K194866M85793J2394j105336J35518j05479r11788O66105
450b60169Q78906J10178p70412M77074p58118K36872R073N20432J58879q91140
440b88425K32620m83707K59498N56975J08229j176413J181809L58594j225402
431d76222Q4743k09758j145341J029444O21227n98967j20523Q02579j50875m40899
421f04592j142484N50297r4605Q52770L34667q35447m5068r83000K63398J514346
411a89718K79095N59513l10435o43492n22084Q63807M52322q95906Q82116j093207
401f17989K90943j177098J865099m92738J649190j38701j240293r12796L8751
$$ y = [-16796, -232677, -955908, -1782790, -2095298, -1498165, -1064934, 96515, 682985, -502924, -927426, -362474, -1632242, 562624, 1048417, 1060811, -44525, 90993, -14486, -926274, -260169, 618737, 728915, -41497, 435577, -322541, -85669, -76596, 443836, 602715, -288425, -55805, -539512, -280014, 276961, 385190, -791223, 390586, 749180, -476222, -391479, -601237, -1746578, -717134, -95907, -694874, -815397, -12818, -163693, -604592, -1747076, -1196779, -1291384, -438614, -103947, -939394, -984462, -1967462, -1704064, -189718, 89377, 648890, 338455, -305037, -827121, 36686, 489008, -406898, 475218, -617989, -327046, -1504144, 360955, -131783, 1517407, 1378706, 138413, -774383, -735632]
392g35632P68731J75642O8542q90091L08552N46084p09126R94410L829J26896
382F57837M58465o25419p28586N35676j97888j016959J801456q3954p48676n426
372D6526M22299j491266M30384L91653j61569o626P5624q51660k66125P03420
362g07340J06637O88934L70546L91043k27165j363534k02439O12613n07209N87002
352b50912R22231n29679R72391k83981j112124J33364Q10046K34521l47453j330851
342g82447P0904M69967J024593k83222M86148l26948l61149n06639o26889J493551
332F57869r66350m89513p4340p11186J386115j63763Q3906P96380r5020q85680
322d61582K95831p64097J43406k05294N22607N36188M03091q51681r30586R50226
$$ y = [-735632, 33099, 208741, 277283, -612808, -304256, 241828, -467298, 527112, 530941, 657837, 1116302, 490883, -237703, 297973, 100085, -916874, 884582, 800628, 51952, 46526, 468825, -1022441, -592057, -200404, -361973, -368599, -292975, -1144635, -1410760, -707340, -600703, 88231, 458777, 849820, 622655, -740879, -943318, -330705, -837914, -250912, 671319, 141640, 1114031, 830050, -282074, -148710, 661336, 895857, 548404, -782447, -711543, -241576, 783017, 499795, 985943, 658995, 297846, -208793, -835682, 657869, -308481, -797994, -872334, -1583520, -197405, -361168, -277262, 519118, 424098, -461582, -165751, -929848, -786442, -991736, -469129, 67059, 470150, -381531, -1312117, -361891]
312c61891M88800p19949l97495Q92548k38824k41104n00878l99685K86413J470641
302B78576j291675l18748K53523J249227J176689j99862K29939j182637N43852
293G38884j22430q58944O15775k87486l67638M37726k86907L6189l89539q26031
283a310401J543575P9832l09533P07056m74404M16678r12051m92753N92041J00708
273e9252m8746K66817N30337k38550K74912n3497k168259J223911J374990j233417
263a30754j33558K99403l17164R09395J012157j717069k35415J36582O25354J294546
253A743477j327398p99949j19164j5596N4648O9456L94124m44051P38706l43803
243d9550o86081m28528K30719L64972J028606m99621n81401K01872J351911l95985
$$ y = [-361891, 126909, -593040, -990535, -97987, -336811, -577915, -1078793, -1478478, -1192065, 278576, -1013099, -1331847, -1078324, 170903, 1347592, 1147730, 1377669, 195032, 738884, 616454, -242490, 373285, 85799, -281839, 155887, -131020, -94831, -484370, -1310401, 233174, 313006, 3473, 710529, 236125, 652803, -259248, -752001, -159960, -59252, -107998, 158819, 689156, 450606, 725518, 672021, -1496238, -272327, 1102663, -130754, -264312, 35091, -282073, 627322, 1639479, -77590, -313005, -176423, 448931, 1743477, 416079, -383870, -503034, -518630, -463982, -394526, -402, -444453, 294253, -49550, -735631, -1164159, -933440, -568468, 460138, -39483, -620884, -419012, 932899, 536914]
233E36914n46697n73867M75507p39983l25364J31059R70153K49957J39285n07838
223a90874N41385p34921r57394J154198k62148K53311l92833J15078o8731K52363
213b90566J052440k43034r61022J25466n29325n70991K18940J317364m65188N70362
203B24446m36284J77897q73504Q1411N83214l13850n8219K75638m14032M97293
193b55990m00052J16729l0176N24906M69279r80270n62127N19804Q88995m24412
183a33314M88783O5923L37345k09562j69570J47679j330197R1479J477590k224670
173a458514p29840J103369m26867J249717J020469l48692L62488j463026K54905
164d35991M16435N91246j12320n65073p17241N33757p1180L50682M65709k41313
$$ y = [536914, -9783, -583650, -108143, -848126, -1173490, -1042431, -72278, 177679, 316964, -190874, 350511, -384410, -1341804, -187606, -449754, -196443, -589276, -474198, -542929, -290566, 761874, 518840, -442182, -316716, -846041, -1417032, -1198092, 119272, -345916, 224446, -211838, -33941, -907445, -826034, -242820, -556670, -614889, -339251, -753283, -255990, -656042, -539313, -569489, -44583, 424696, -555574, -1117701, -597897, 291098, -133314, 355469, 421392, 758737, 549175, 379605, 527284, -802913, -711434, 766156, -1458514, -2188354, -1084985, -1511852, -262135, 758334, 409642, 772130, -690896, -435991, -19556, 571690, 459370, -105703, -822944, -289187, -360367, -9685, 456024, 214711]
154B14711K37600j044550J59332Q23004j417871k0114J279775Q23828k235588
145a179873P97750K00996k69318R0527k33928M05251m94709m435n01801R09270
135b80270J34312L16254L96965p82403r72779O19805L80348N5854R8949j46440
125a79405l19620m63725N70184J83988m25292L66563M56939n24645O64552N6746
115C86285p57663O925n73763K03828n87431J443959k87845p78300P81744N28591
105C66330j479200n99414M55239L05452M91985N21455M56446J20681q41440O21886
95D19420m09110m91740L48664k2614k2203K28092k8031k89362N74528r22942l38867
84i54165L65254p23193L32545r65r922N45070P6566l3017n71806M78355N94426
$$ y = [214711, 452311, -592239, -432907, 390097, -1027774, -1047888, 231887, 1055715, -1179873, -382123, -181127, -450445, -359918, -593846, -188595, -683304, -687739, -1189540, -280270, -145958, 170296, 567261, -215142, -1187921, -568116, -187768, -131914, -32965, -179405, -499025, -962750, -392566, -208578, -633870, -267307, 189632, -335013, 329539, 386285, -371378, -364453, -938216, -734388, -1321819, 122140, -165705, -944005, -162261, 366330, -1112870, -1712284, -1257045, -951593, -459608, 61847, 518293, 638974, -202466, 419420, 10310, -481430, -132766, -155380, -177583, 50509, 22478, -266884, 307644, -615298, -954165, -588911, -1312104, -979559, -980524, -990446, -445376, -368810, -401827, -973633, -495278, 99148]
73I9148O667N82400n87370m17126M64546M5220j2421l91418n63340O22719j11987
62b62962k86460n5628J87223m02271N70805n6980N4155m866J85260m78721n06131
51a056576J89558l22878J045087k02014m02140M66111m4819l28615l97417P7592
41i76111J010378n8451p06607n85145J37854L72427o30039R27566L48477K03693
31D4042j37613P04141k53687j013291L2824Q02874K9149o97810N51267p92861
21g30965N81185O99350k97685q80678R0640K1364P98396l69747L30952P46790
11I89602r29467l13433l64524L80429n25419p32067J57065M51176o66750K63920
1a289468J305424
$$ y = [99148, 105815, 688215, 100845, -316281, 148265, 193485, 181064, -210354, -773694, -150975, -262962, -549422, -605050, -417827, -820098, -249293, -306273, -252118, -256984, -71724, -550445, -1056576, -867018, -1189896, -144809, -346823, -748963, -282852, -327671, -656286, -1053703, -976111, 34267, -24184, -730791, -1315936, -1178082, -805655, -1435694, -508128, -159651, 44042, -93571, 610570, 356883, -656408, -623584, 179290, 208439, -489371, 61896, -730965, -149780, 549570, 251885, -628793, -538153, -516789, 281607, -88140, 242812, 989602, 60135, -253298, -617822, -237393, -762812, -1494879, -1337814, -886638, -1553388, -1289468, 15956]
0A5956
$$ y = [15956]
$$ Imaginary data points
##PAGE= N=2
##DATA TABLE= (X++(I..I)), XYDATA
16383i115181N6021p03948j49268O24159l19404P16601l6282K34593N09160n25390
16373h708939M56528O57975K7779j55064o78819J69159J35871J05774K44977m2784
16363g787543N24653j2197n08345N52686K64536M9620j15170K23482j60457K35226
16353f733509P90680q12355J86955K82377M50420m83063J02145O77956K67115
16344e271279J05830K34843p16693n26709n3903J069952q7949K43131M01091k82960
16334d884646P67245M2907M14538l29802r89215J92953j04062O53047L68539q31106
16324d699602R3688O2961r6791J83286k80256M76583J049638j16638p16986K50408
16314c793709J019670o94336p22500J052942J49388k78097K77636Q93923J36785
$$ y = [-9115181, -9059160, -9763108, -9912376, -9288217, -9607621, -8891020, -8927302, -8692709, -8183549, -8708939, -8252411, -7594436, -7566657, -7721721, -8400540, -8231381, -8095510, -7989736, -7744759, -7787543, -7262890, -7275087, -7783432, -7230746, -6966210, -6916590, -7031760, -6808278, -6968735, -6733509, -5942829, -6755184, -6568229, -6285852, -5835432, -6318495, -6216350, -5538394, -5271279, -5165449, -4930606, -5647299, -6174008, -6227911, -5157959, -5245908, -5002777, -4601686, -4884646, -4117401, -4074494, -3659956, -3989758, -4978973, -4786020, -4890082, -4237035, -3868496, -4699602, -4605914, -4542953, -4639744, -4456458, -4736714, -4260131, -3210493, -3327131, -4044117, -3793709, -2774039, -3468375, -4190875, -3137933, -2988545, -3266642, -2989006, -2095083, -1958298]
16305a958298n99887L20492K90178N23540L1116o10220q28821R81998n3284p32153
16295b635339O61586m49043L98877K30187K11669N62936M4762j71755K33695O6560
16285h45865o66330P24201p39281K90128L79551q3773p03908J195613J188220
16276G38556j205248J48928j059l15739R91157m53337J57936M04471o5960q69346
16266d69641M31637J031045j39237n05592R6127P20155o7254L29690j85863j011353
16256B29714N12916N93008Q35757k85183m94049K71831o6718J41237k78086n9484
16246A400943m96374N7535Q6866L77942k85335N3014l24775J080155L88308J386994
16236C725273k227221n74522J423573j149161J289053P46725j169383J158853
$$ y = [-1958298, -2558185, -2237693, -1947515, -1423975, -1392859, -2003079, -2831900, -1849902, -1903186, -2635339, -1973753, -2422796, -2023919, -1793732, -1582063, -1019127, -974365, -1146120, -912425, -845865, -1512195, -787994, -1527275, -1237147, -857596, -941369, -1645277, -449664, 738556, -466692, -317764, -318823, -634562, 356595, -96742, 61194, 465665, 399705, -469641, -38004, 993041, 853804, 348212, 444339, 1164494, 1097240, 1426930, 1241067, 229714, 742630, 1335638, 2171395, 1886212, 1392163, 1663994, 1597276, 1738513, 1460427, 1400943, 904569, 962104, 1048970, 1426912, 1141577, 1194591, 869816, 1949971, 2338279, 3725273, 1498052, 923530, 2347103, 1197942, 2486995, 3233720, 2064337, 3223190]
16228C223190k81720K29007p63483J14502K0145L61296J27463K6191l24765J22290
16218B854116j34429K92218j284752K68608M07732P27648j203660L23378M41266
16209B692125J147875q80577k37860J165607j472151J521403p78485O22053O5233
16200C845223r53174n54033M14192M24043J476763j045765R3203L59950l74576
16191C685826P30583O09772j63269N28340j532183m9009m13281l41741J299704
16182D354742j013888L53971k6380j07719M99691K61335j73993m1784K90618p719
16172D388874k56901J64419R96803p31695n88909J260539o07714n06846m9106
16163D069464K34608J077951m17814O68550P3640n28271r6525K84600K23583P49414
$$ y = [3223190, 2941470, 3170477, 2406994, 2521496, 2541641, 2902937, 3030400, 3056591, 2731826, 2854116, 2719687, 3011905, 1727153, 1995761, 2403493, 3131141, 1927481, 2250859, 2692125, 3840000, 2959423, 2721563, 3887170, 2415019, 3936422, 3157937, 3779990, 3845223, 2892049, 2338016, 2752208, 3176251, 4653014, 3607249, 3700452, 4060402, 3685826, 4416409, 5026181, 4862912, 5391252, 3859069, 3810060, 3396779, 3055038, 4354742, 3340854, 3694825, 3668445, 3560726, 4060417, 4321752, 4147759, 4105975, 4396593, 4388874, 4131973, 4296392, 5293195, 4561500, 3972591, 5233130, 4625416, 4118570, 4069464, 4304072, 5382023, 4964209, 5632759, 5706399, 5178128, 5081603, 5366203, 5589786, 6339200]
16153F339200j101445j86705j77035P10437O4586o52802L56125k68868K96349
16144E379842K16513q60672J17870P6195n01969P08236j58989J235793j93414
16135F019405l72726N19068o6559p83515q01749J759377N61361j5140j381495
16126E438027l10557J602845L26339L7057M49019j229305l87813K28134L07448
16117F461194j433930N54460L06407Q83784n25324j404494R11824p20632r03055
16108D130234J479893p06066J97780J307814m14031k88477K82885k72933N9781
16099E776880j051791K03984J489514j44620j060692r15469m50332R01830J77796
16090D927100N36152J030277L58437n17374J90908j89060j022090M56643p02508
$$ y = [6339200, 5237755, 5051050, 4874015, 5584452, 5649038, 4996236, 5352361, 5083493, 5379842, 5596355, 4735683, 4853553, 4929748, 4427779, 5136015, 4977026, 6212819, 6019405, 5646679, 6165747, 6099188, 5315673, 4513924, 6273301, 6834662, 6819522, 5438027, 5127470, 6730315, 7056654, 7093711, 7542730, 6313425, 5925612, 6153746, 6461194, 5027264, 5581724, 5888131, 6771915, 6246591, 4842097, 5753921, 5033289, 4130234, 5610127, 4904061, 5101841, 6409655, 5995624, 5707147, 5990032, 5717099, 5776880, 4725089, 4929073, 6418587, 6273967, 5213275, 4297806, 3847474, 4749304, 4927100, 5463252, 6493529, 6851966, 6334592, 6525500, 6336440, 5314350, 5770993, 5068485]
16081E068485j69513l734L89177o95996K84156R11085O41226p25057J48581M40298
16071F288708P20244j302284M46255J16453j092447J353061j065858n53262J471757
16062F382627j219644n7819J503882k60420q24670j1080O72269j334012L29996
16053E181129Q22495k62273O43334K4601l41443P5591M89943r29753R1229J34254
16043E929107q71870L29851J339835j17274N77111J8547q07693o28455M13313
16034F182472P31324j89628J04813l81896o59592j36829k53405O32821m1744m96007
16024E492329l36691M44158k50882J062178j539507M17723N03501N61143N09966
16015F863918m37698q90013L69299Q58316j750586j266942J866116J541854q80263
$$ y = [5068485, 4898972, 4895238, 5284415, 4588419, 4872575, 5783660, 6424886, 5699829, 5848410, 6288708, 7008952, 5706668, 6152923, 6269376, 5176929, 6529990, 5464132, 4910870, 6382627, 5162983, 5105164, 6609046, 6348626, 5523956, 5512876, 6185145, 4851133, 5181129, 6003624, 5741351, 6384685, 6409286, 6067843, 6143434, 6633377, 5703624, 5794853, 5929107, 5057237, 5387088, 6726923, 6609649, 7186760, 7205307, 6397614, 5769159, 6182472, 6913796, 6724168, 6828981, 6447085, 5787493, 5650664, 5397259, 6030080, 5988336, 5492329, 5155638, 5599796, 5348914, 6411092, 4871585, 5289308, 5792809, 6353952, 6863918, 6426220, 5536207, 5905506, 6763822, 5013236, 3746294, 5612410, 7154264, 6274001]
16006F274001P62637j51185n49911n67309M23080M62739k72691J37783p45227
15997E773917j71648K62989J34388o14252r5802M90053L45337K4933r63628J043611
15987F229898M972j637448O9730R47539Q8094R89115K16808n46802R42808m38242
15977F866472K49629m87868k56372L7862j8383o26367K58845L46663l93788o51381
15967E325312K70709J181288j79475k14575j51369O25223n3382j64756n11270
15958F127705L6427J276115K26309n58556m43353n69378j23368j468434O65978
15949E169445K94294O64536n94134J03942q26981M99062K76702M82770K38149
15940F307785K25891k26497J60006Q53183p90849o6722M44704j22468o54175o68074
$$ y = [6274001, 7036638, 6885453, 6335542, 5768233, 6191313, 6654052, 6381361, 6519144, 5773917, 5602269, 5865258, 5999646, 5385394, 5289592, 5779645, 6124982, 6149915, 5186287, 6229898, 6234870, 4597422, 4667152, 5614691, 5702785, 6691900, 6908708, 6361906, 7304714, 6866472, 7116101, 6628233, 6371861, 6409723, 6391340, 5764973, 6023818, 6370481, 5976693, 5325312, 5596021, 6777309, 6597834, 6383259, 6231890, 6857113, 6803731, 6638975, 6127705, 6164132, 7440247, 7666556, 7108000, 6664647, 6095269, 5971901, 4503467, 5169445, 5463739, 6128275, 5534141, 5638083, 4811102, 5310164, 5586866, 6069636, 6307785, 6533676, 6307179, 6467185, 7320368, 6529519, 6462797, 6907501, 6785033, 6130858, 5462784]
15930E462784n81913J11570P24952P34596p82176J287391j77373k85190o22046
15921E872595n08917R79249m23087q7488J197174m23081r76626j624922Q80218
15912D885115P25460Q88302l32911J4744L64639m1255N58602q90870k22658M9270
15902E998438L7290j094388m12746J92297N37407N8805Q3564N45547k31449j063269
15892D651496K02254J378469L05212j288368J935542k01496p38990q59209J72035
15883E556945p33468k4007N93619P89003J454986p72839Q7684J533385k449094
15874F036214j76084R93476j010639K8497J688066p54675m28339k31129j95629
15865E949758N28725J88526l28371o7093m66957L35944M809j16871j2977k70511
$$ y = [5462784, 4880871, 4992441, 5717393, 6451989, 5669813, 6957204, 6779831, 6494641, 5872595, 5363678, 6342927, 5919840, 5832352, 7029526, 6606445, 5629819, 4004897, 4885115, 5610575, 6498877, 6165966, 6180710, 6545349, 6504094, 7062696, 6171826, 5949168, 5998438, 6035728, 4941340, 4528594, 4720891, 5258298, 5317103, 5400667, 5946214, 5714765, 4651496, 4853750, 6232219, 6537431, 5249063, 7184605, 6983109, 6244119, 5384910, 5556945, 4823477, 4799470, 5393089, 6182092, 7637078, 6864239, 6951923, 8485308, 6036214, 5860130, 6853606, 5842967, 5871464, 7559530, 6804855, 6376516, 6145387, 5949758, 6478483, 6667009, 6338638, 6271545, 5804588, 6140532, 6145341, 6028470, 6015493, 5744982]
15855E744982K27272J86930M46706k78886p87674j93958J048028n97115q1356
15846E714929l70782O62321J277722q09086j302264R41260j73977M6839l28634
15837E658328O05106L46584j12153P82118K05521j433694R47806j017675O42944
15828F624885L38784j049242r19461O70364k80029K43790p63073O76981R30847
15819F473846l8042l58575m13265R05229n66787L47924L70949q85596J85292K29581
15809F250556o33380N95021M1343L66373j07781j39778o41249N69459p18758L64389
15799E946195j19478k03909o84254P28347l26374j611982J913432j24087K55937
15790E773827m58607K85152N67739o45105J878702o95368j34498k99672L01931
$$ y = [5744982, 5972254, 6159184, 6605890, 6327004, 5539330, 5345372, 6393400, 5796285, 5714929, 5344147, 6006468, 7284190, 6475104, 5172840, 6114100, 5940123, 5986962, 5658328, 6263434, 6610018, 6497865, 7279983, 7485504, 6051810, 6999616, 5981941, 6624885, 6963669, 5914427, 4994966, 5665330, 5385301, 5629091, 4866018, 5542999, 6473846, 6435804, 6077229, 5663964, 6569193, 6002406, 6350330, 6721279, 5835683, 6020975, 6250556, 5617176, 6212197, 6253540, 6619913, 6512132, 6372354, 5731105, 6300564, 5581806, 5946195, 5826717, 5622808, 4938554, 5666901, 5340527, 3728545, 5641977, 5517890, 5773827, 5315220, 5600372, 6168111, 5523006, 7401708, 6706340, 6571842, 6272170, 6574101]
15781F574101J38193j383730N33924k51667J28014O49662J025109o55071k21558
15772F536977j64212m18811J632593o97654j091454p4249K18652Q73544r22143
15763E893243M66561l2684O05749p0973j056926P4538m19539L23484J214038j451344
15753E546147Q55387R67194k01718j012700j182161Q76356J275864j43083n57225
15744F424061P23714j605902M42104O88804j166433K71951o18715K67448M21901
15735E848933R58065L73669l27201j001733k88682p6987R04700m11337Q90938
15726F870365Q21350r02044R5604r49746O6201M62889r3501J58474j016576P27135
15716F240151l68082m18690K439108M77769j006998p33394m25704o0130J916812
$$ y = [6574101, 6712294, 5328564, 5862488, 5610821, 5738835, 6388497, 7413606, 6758535, 6536977, 6372765, 5953954, 7586547, 6888893, 5797439, 5723190, 5941842, 6815386, 5893243, 6359804, 6327120, 6932869, 6861896, 5804970, 5879508, 5459969, 5783453, 6997491, 5546147, 6401534, 7368728, 7167010, 6154310, 4972149, 5848505, 7124369, 6981286, 6424061, 7147775, 5541873, 5983977, 6672781, 5506348, 5778299, 5159584, 5427032, 5848933, 6806998, 7180667, 6853466, 5851733, 5563051, 5486064, 6390764, 5979427, 6870365, 7691715, 6789671, 6885275, 5935529, 6001730, 6464619, 6371118, 6529592, 5513016, 6240151, 5872069, 5453379, 7892487, 8370256, 7363258, 6629864, 6204160, 6144030, 8060842]
15707H060842m84479j268381Q4766j68877o69897N88618l070k64308j01131N9183
15697E833266J31208N50295M1141n94445K56029R22886k67439M25893j140293
15688F158541M72097j75310J353455j028695j382749J20821l30621Q56351q3679
15679E960211q6950Q89580q0223J29250j41857o07120K87414M05902r73323L45686
15669F128570P98421o61323O42596m35632r17809m75493J594165m44444L08695
15660F537746N30585q12669n02981Q7978K63487n36479N55471m80847K58774O44473
15650F545538k02286j91338m16473J036010J141038j44890n19254j213465P75362
$$ y = [8060842, 7576363, 6307982, 6392748, 6223871, 5553974, 6142592, 6139522, 5875214, 5774083, 5833266, 5964474, 6514769, 6555910, 5961465, 6217494, 7140380, 6872941, 7298834, 6158541, 6630638, 6455328, 7808783, 6780088, 5397339, 5518160, 5187539, 6043890, 5960211, 5873261, 6762841, 6682618, 6811868, 6670011, 6062891, 6350305, 6756207, 5782884, 6128570, 6926991, 6265668, 6908264, 6472632, 5554823, 5079330, 6673495, 6229051, 6537746, 7068331, 6255662, 5752681, 5840659, 6104146, 5567667, 6123138, 5642291, 5901065, 6545538, 6343252, 6151914, 5735441, 6771451, 7912489, 7767599, 7248345, 6034880, 6810242]
$$ [...]
##END NTUPLES=NMR SPECTRUM
##END=
