##TITLE=1H_CG-1208-x
 DMSO
 8 sc, 
 2.8.2024
##JCAMPDX= 6.0         $$ Bruker NMR JCAMP-DX V2.0
##DATA TYPE= NMR SPECTRUM
##DATA CLASS= NTUPLES
##ORIGIN= UXNMR, Bruker Analytische Messtechnik GmbH
##OWNER= root
$$ XWIN-NMR		Version 3.5
$$ Fri Aug  2 13:43:23 2024 Russian Standard Time (UT+4h)  she@DPX200
##.OBSERVE FREQUENCY= 200.1315
##.OBSERVE NUCLEUS= ^1H
##.ACQUISITION MODE= SIMULTANEOUS
##.ACQUISITION SCHEME= undefined
##.AVERAGES= 8
##.DIGITISER RES= 18
##SPECTROMETER/DATA SYSTEM= spect
##.PULSE SEQUENCE= zg30
##.SOLVENT NAME= Acetone
##.SHIFT REFERENCE= (INTERNAL, Acetone, 0, 21.9949)
##AUDIT TRAIL= $$ (NUMBER, WHEN, WHO, WHERE, WHAT)
$$ ##TITLE= Audit trail, XWIN-NMR		Version 3.5
$$ ##JCAMPDX= 5.01
$$ ##ORIGIN= Bruker BioSpin GmbH
$$ ##OWNER= she
$$ F:/spectra/data/she/nmr/H-F/1/pdata/1/auditp.txt
$$ ##AUDIT TRAIL=  $$ (NUMBER, WHEN, WHO, WHERE, WHAT)
(   1,<2024-08-02 13:41:44.12 +0400>,<she>,<DPX200>,
      <created by zg, POWCHK disabled, PULCHK disabled
       configuration hash MD5:
       00 E9 B6 7A A2 85 ED C7 34 08 36 98 17 FE 4E 26
       data hash MD5: 16K
       48 07 26 74 C9 EC 32 82 17 A2 14 56 42 56 74 BC>)
(   2,<2024-08-02 13:41:46.48 +0400>,<she>,<DPX200>,
      <Start of raw data processing
       efp BC_mod = 2 LB = 0.24 FT_mod = 6 PKNL = 1 PHC0 = -25635.81 PHC1 = 5.787489 SI = 16K 
       data hash MD5: 16K
       44 8E 7C 8B 3A AD 98 B2 72 EC 11 14 F1 8B 1E DB>)
(   3,<2024-08-02 13:42:05.96 +0400>,<she>,<DPX200>,
      <pk PHC0 = 1.797492 PHC1 = 0 
       data hash MD5: 16K
       7F 9E 51 37 1D 8A 2C 85 BE F4 A7 CE 57 D5 4D B8>)
(   4,<2024-08-02 13:42:12.12 +0400>,<she>,<DPX200>,
      <abs ABSG = 5 
       data hash MD5: 16K
       CF 82 D4 C5 09 98 7C 56 73 67 EF A0 4B 5A B2 FC>)
(   5,<2024-08-02 13:42:35.65 +0400>,<she>,<DPX200>,
      <abs ABSG = 5 
       data hash MD5: 16K
       47 60 AE E0 46 43 82 D8 A8 59 F8 9E A7 9C 67 EC>)
$$ ##END=
$$ 
$$ hash MD5
$$ 51 FD 7C 70 A6 18 AB 88 17 C0 F4 7E B5 B6 79 98
##$RELAX= 
##$RELAX= 
##$RELAX= 
##$RELAX= 
##$RELAX= 
##$RELAX= 
$$ Bruker specific parameters
$$ --------------------------
##$DU= <F:/spectra>
##$EXPNO= 1
##$NAME= <H-F>
##$PROCNO= 1
##$TYPE= <nmr>
##$USER= <she>
##$AMP= (0..31)
100 100 100 100 100 100 100 100 100 100 100 100 100 100 100 100 100 100 
100 100 100 100 100 100 100 100 100 100 100 100 100 100 
##$AQSEQ= 0
##$AQ_mod= 1
##$AUNM= <au_zg>
##$AUTOPOS= <>
##$BF1= 200.13
##$BF2= 200.13
##$BF3= 200.13
##$BF4= 200.13
##$BF5= 200.13
##$BF6= 200.13
##$BF7= 200.13
##$BF8= 200.13
##$BYTORDA= 1
##$CFDGTYP= 0
##$CFRGTYP= 5
##$CHEMSTR= <none>
##$CNST= (0..31)
1 1 145 1 1 1 1 1 1 1 1 1 1 1 1 1 1 1 1 1 1 1 1 1 1 1 1 1 1 1 1 1 
##$CPDPRG= <>
##$CPDPRG1= <>
##$CPDPRG2= <>
##$CPDPRG3= <>
##$CPDPRG4= <mlev>
##$CPDPRG5= <mlev>
##$CPDPRG6= <mlev>
##$CPDPRG7= <mlev>
##$CPDPRG8= <mlev>
##$CPDPRGB= <>
##$CPDPRGT= <>
##$D= (0..31)
0 1.2 0 0 0 0 0 0 0 0.06 0 0.03 0 0 0 0 0.0002 0 0 0 0 0 0 0 0 0 0 0 0 
0 0 0 
##$DATE= 1722591703
##$DBL= (0..7)
$$ [...]
##$SUBNAM3= <"">
##$SUBNAM4= <"">
##$SUBNAM5= <"">
##$SUBNAM6= <"">
##$SUBNAM7= <"">
##$SUBNAM8= <"">
##$SUBNAM9= <"">
##$SW= 24.0689530833862
##$SWIBOX= (0..15)
0 0 2 0 0 0 0 0 0 0 0 0 0 0 0 0 
##$SW_h= 4816.95568400771
##$TD= 16384
##$TD0= 1
##$TE= 0
##$TE2= 300
##$TE3= 300
##$TEG= 300
##$TL= (0..7)
0 120 120 120 120 120 120 120 
##$TP= (0..7)
150 150 150 150 150 150 150 150 
##$TP07= 0
##$TPNAME0= <>
##$TPNAME1= <>
##$TPNAME2= <>
##$TPNAME3= <>
##$TPNAME4= <>
##$TPNAME5= <>
##$TPNAME6= <>
##$TPNAME7= <>
##$TPOAL= (0..7)
0.5 0.5 0.5 0.5 0.5 0.5 0.5 0.5 
##$TPOFFS= (0..7)
0 0 0 0 0 0 0 0 
##$TUNHIN= 0
##$TUNHOUT= 0
##$TUNXOUT= 0
##$USERA1= <user>
##$USERA2= <user>
##$USERA3= <user>
##$USERA4= <user>
##$USERA5= <user>
##$V9= 5
##$VALIST= <valist>
##$VCLIST= <CCCCCCCCCCCCCCC>
##$VD= 0
##$VDLIST= <DDDDDDDDDDDDDDD>
##$VPLIST= <PPPPPPPPPPPPPPP>
##$VTLIST= <TTTTTTTTTTTTTTT>
##$WBST= 1024
##$WBSW= 4
##$XGAIN= (0..3)
0 0 0 0 
##$XL= 0
##$YL= 0
##$YMAX_a= 96428
##$YMIN_a= -99599
##$ZGOPTNS= <>
##$ZL1= 120
##$ZL2= 120
##$ZL3= 120
##$ZL4= 120
##$ABSF1= 21.99487
##$ABSF2= -2.074324
##$ABSG= 5
##$ABSL= 3
##$ALPHA= 0
##$AQORDER= 0
##$ASSFAC= 0
##$ASSFACI= 0
##$ASSFACX= 0
##$ASSWID= 0
##$AUNMP= <proc_1d>
##$AZFE= 0.1
##$AZFW= 0.1
##$BCFW= 0
##$BC_mod= 2
##$BYTORDP= 0
##$COROFFS= 0
##$CY= -3
##$DATMOD= 1
##$DC= 0
##$DFILT= <>
##$DTYPP= 0
##$F1P= 0
##$F2P= 0
##$FCOR= 1
##$FTSIZE= 16384
##$FT_mod= 6
##$GAMMA= 0
##$GB= 0
##$INTBC= 1
##$INTSCL= 3.70164e-10
##$ISEN= 128
##$LB= 0.24
##$LEV0= 0
##$LPBIN= 0
##$MAXI= 10000
##$MC2= 0
##$MEAN= 0
##$ME_mod= 0
##$MI= 1.114404
##$NCOEF= 0
##$NC_proc= -6
##$NLEV= 6
##$NOISF1= 3.799351
##$NOISF2= 2.8
##$NSP= 0
##$NTH_PI= 0
##$NZP= 0
##$OFFSET= 21.99487
##$PC= 1
##$PHC0= -25634.01
##$PHC1= 5.787489
##$PH_mod= 1
##$PKNL= yes
##$PPARMOD= 0
##$PSCAL= 0
##$PSIGN= 0
##$REVERSE= no
##$SF= 200.129506655893
##$SI= 16384
##$SIGF1= 3
##$SIGF2= 2
##$SINO= 5.538805
##$SIOLD= 16384
##$SREGLST= <1H.CDCl3>
##$SSB= 0
##$STSI= 16384
##$STSR= 0
##$SW_p= 4816.95568400771
##$SYMM= 0
##$S_DEV= 0
##$TDeff= 16384
##$TDoff= 0
##$TI= <>
##$TILT= no
##$TM1= 0
##$TM2= 0
##$TOPLEV= 0
##$USERP1= <user>
##$USERP2= <user>
##$USERP3= <user>
##$USERP4= <user>
##$USERP5= <user>
##$WDW= 1
##$XDIM= 16384
##$YMAX_p= 480623268
##$YMIN_p= -746535
$$ End of Bruker specific parameters
$$ ---------------------------------
##NTUPLES= NMR SPECTRUM
##VAR_NAME=  FREQUENCY,     SPECTRUM/REAL,   SPECTRUM/IMAG
##SYMBOL=    X,             R,               I
##VAR_TYPE=  INDEPENDENT,   DEPENDENT,       DEPENDENT
##VAR_FORM=  AFFN,          ASDF,            ASDF
##VAR_DIM=   16384,         16384,           16384
##UNITS=     HZ,            ARBITRARY UNITS, ARBITRARY UNITS
##FACTOR=    0.29402158847633, 1,            1
##FIRST=     4401.82232839661, 0,            0
##LAST=      -415.1333556111, 0,             0
##MIN=       -415.1333556111, -746535,       0
##MAX=       4401.82232839661, 480623268,    0
$$ Real data points
##PAGE= N=1
##DATA TABLE= (X++(R..R)), XYDATA
$$ [...]
7010B78973m3318J63645j179Q4093o0820n0994J14631l2610K7434O4002j9404
$$ 278973 235655 399300 398121 482214 421394 370400 485031 452421 479855 543857 524453
6999E24453P1748K8394L3044j52553O9430p2146q5073P9207K9790p5366J80251
$$ 524453 596201 624595 657639 505086 574516 502370 417297 496504 526294 450928 631179
6988F31179l0674J16041J9587J18495j35022J9258N8629J16919r9621o4528P2048
$$ 631179 600505 716546 736133 854628 719606 738864 797493 914412 814791 750263 822311
6977H22311n1011Q4942R1518q5074n0181J01851J37826P374L3958J90834j6438
$$ 822311 771300 856242 947760 862686 812505 914356 1052182 1059556 1093514 1284348 1267910
6966A267910J8435J74959j21840n1970L687j9J44279J35191o663j50134j4069
$$ 1267910 1286345 1461304 1339464 1287494 1291181 1291162 1435441 1570632 1563969 1413835 1399766
6955A399766K21194n9039J023N0938J26609J51285j6087j52093J31303K46046
$$ 1399766 1620960 1561921 1562944 1613882 1740491 1891776 1875689 1723596 1854899 2100945
6945B100945l3199q697J86892j7202k14342P0230J55822p5619K01463n7507p1656
$$ 2100945 2067746 2059049 2245941 2228739 2014397 2084627 2240449 2164830 2366293 2308786 2237130
6934B237130l0191L33384J6326k8953n2711N5920R5646J24296L9395M5287k8760
$$ 2237130 2206939 2540323 2556649 2527696 2474985 2530905 2626551 2750847 2790242 2835529 2806769
6923B806769J01987M7894J10983k4623N3021J449n1786M7846J34967o1745N7353
$$ 2806769 2908756 2956650 3067633 3043010 3096031 3097480 3045694 3093540 3228507 3166762 3224115
6912C224115N6358J9429R1889k6103J41202k2462K5818k8639L1357j301K20733
$$ 3224115 3280473 3299902 3391791 3365688 3506890 3484428 3510246 3481607 3512964 3511663 3732396
6901C732396r0357J08422O21o9454j11629J05373k9820M7923p6294p9608Q1283
$$ 3732396 3642039 3750461 3751082 3681628 3569999 3675372 3645552 3693475 3617181 3537573 3618856
6890C618856N9868Q631k5046O929o128k5461J54845k03784n8338R9632j91441
$$ 3618856 3678724 3687355 3662309 3669238 3663110 3637649 3792494 3588710 3530372 3630004 3438563
6879C438563p3590J65220j71130k34931M2511n1262n7200J21415j77171n1509
$$ 3438563 3364973 3530193 3359063 3124132 3166643 3115381 3058181 3179596 3002425 2950916
6869B950916O3822n596K07q935j11335o1313j34605j23325J10678m1592k57113
$$ 2950916 3014738 3009142 3009349 3000414 2889079 2827766 2693161 2569836 2680514 2638922 2381809
6858B381809j04851N7190J12854m3837m351j1966R8663l21289j23651m4538M8550
$$ 2381809 2276958 2334148 2447002 2403165 2398814 2386848 2485511 2164222 2040571 1996033 2044583
6847B044583p5990P6351j52665J11060l774j79775m4051J99788m6044j72311m1417
$$ 2044583 1968593 2044944 1892279 2003339 1999565 1819790 1775739 1975527 1929483 1757172 1715755
6836A715755p6531J3324l7246M8287K2047o2873j75630j35380L3618J50104p7037
$$ 1715755 1639224 1652548 1615302 1663589 1685636 1622763 1447133 1311753 1345371 1495475 1418438
6825A418438j14858R7958l5390l2447q9191j05253J13144j77597K5331l4233j23860
$$ 1418438 1303580 1401538 1366148 1333701 1244510 1139257 1252401 1074804 1100135 1065902 942042
6814I42042N7590n1399L1081R9386k02918J59883j46760k5960j01221R400J26784
$$ 942042 999632 948233 979314 1078700 875782 1035665 888905 862945 761724 771124 897908
6803H97908J3120j03137j4889j03946Q0512J7277j4161m8106p8325K4366l4131
$$ 897908 911028 807891 793002 689056 769568 786845 772684 724578 646253 670619 636488
6792F36488r2667O9561P0640j0945j22762j4477N6231j40226O4753M0831M2156
$$ 636488 543821 613382 684022 673077 550315 535838 592069 451843 516596 557427 599583
6781E99583j86270J66589J5999J8026n4063n2676j0792j61336J71960l6269p5262
$$ 599583 413313 579902 595901 613927 559864 507188 496396 335060 507020 470751 395489
6770C95489N091p3431J14193J18354q3701K4845n6715K6616k07054M1348r6952
$$ 395489 400580 327149 441342 559696 475995 500840 444125 470741 263687 305035 208083
6759B08083O0493L7199O2375M7583k04635N3456J25207o4178n0175J02757j38857
$$ 208083 268576 305775 368150 415733 211098 264554 389761 325583 275408 378165 239308
6748B39308l1123O0448N2165Q6529j29289j28745M2117m908J0236n470J5818L2934
$$ 239308 208185 268633 320798 407327 278038 149293 191410 186502 196738 191268 207086 240020
6736B40020O1042r6146J29930M5382l0008o2273j39802r0938j11600J27875m2937
$$ 240020 301062 204916 334846 380228 350220 287947 148145 57207 -54393 73482 30545
6725C0545K04901K8036j55270K1190Q2950M9887j0042K9938k666k0902j08204
$$ 30545 235446 263482 108212 129402 212352 262239 252197 282135 279469 258567 150363
6714A50363l3902n4149J43980J3563j71733P8669K6343k348n645j27823J61648
$$ 150363 116461 62312 206292 219855 48122 126791 153134 150786 145141 17318 178966
6703A78966J02595j02867p8832K8589N4717o6260L4870J2107k2863K8939k05918
$$ 178966 281561 178694 99862 128451 183168 116908 151778 163885 141022 169961 -35957
6692c5957R4367J06581j00712K6883n2142Q0603O0674M909p138q8304j24831J93362
$$ -35957 58410 164991 64279 91162 39020 119623 180297 185206 178068 89764 -35067 158295
6680A58295q4882l0940k684j15509Q9605J18777N8851j4525k630k3230J7552J3459
$$ 158295 73413 42473 39789 -75720 13885 132662 191513 176988 174358 151128 168680 182139
6668A82139J9632j05842M568L6482q0901p4980Q3651o6295j00155J85822R3037
$$ 182139 201771 95929 100497 136979 56078 -18902 64749 -1546 -101701 84121 177158
6657A77158K2872n8915o7758o3714j6762M2515k0239K41852K3839j29874q5880
$$ 177158 200030 141115 73357 9643 -7119 35396 15157 257009 280848 150974 65094
6646F5094l9917l741J3639P7805R210L2718j09945k1150J3466n2699J48444N9551
$$ 65094 25177 21436 35075 112880 122090 154808 44863 23713 37179 -15520 132924 192475
6634A92475j5843r0527p8293m9820J40070K5033j72028K04170M9051K6592j40717
$$ 192475 176632 86105 7812 -42008 98062 123095 -48933 155237 204288 230880 90163
6623I0163j00641R0164p7537m376k6199J50317R102O7149J7755N4028p7255j46943
$$ 90163 -10478 79686 2149 -2227 -28426 121891 130993 198142 215897 269925 192670 45727
6611D5727n6481j60212J05098J36122O115p7501O9922K3519o3733K2135J0796
$$ 45727 -10754 -170966 -65868 70254 76369 -1132 68790 92309 28576 50711 61507
6600F1507m3943j8798j76741J05791R4129M1891N5574L1016K564j84505o3548
$$ 61507 17564 -1234 -177975 -72184 21945 63836 119410 150426 152990 -31515 -95063
6589i5063O5837M0891O516Q8169o0958j69582J71984M5753P4335r3173p2493J02039
$$ -95063 -29226 11665 18181 106350 45392 -124190 47794 93547 167882 74709 2216 104255
6577A04255q555o9362j05072J32309j04682j96723J73220R0542R2713P0674j84359
$$ 104255 95700 26338 -78734 53575 -51107 -247830 -74610 15932 108645 179319 -5040
6566e040m4405J7362r0159J4568K16084j08625M6327j34814l1052J08683N7829
$$ -5040 -49445 -32083 -122242 -107674 108410 -215 46112 -88702 -119754 -11071 46758
6555D6758N6749J17308k585j41493j93203J85520O3506l8929K0456j00199L8283
$$ 46758 103507 220815 218230 76737 -116466 69054 132560 93631 114087 13888 52171
6544E2171m590O6908k6826j16569J07728R2038k16636k2091J40631j7526j65156
$$ 52171 47581 114489 87663 -28906 78822 170860 -45776 -67867 72764 55238 -109918
6533a09918J09145Q2993r3572J13954j57214j08456N2018K9421R890p3358Q7408
$$ -109918 -773 82220 -11352 102602 -54612 -163068 -111050 -81629 -71739 -145097 -57689
6522e7689O7616M4333L2070k14590K43961j52917J3254N9666r7531R5632j02543
$$ -57689 9927 54260 86330 -128260 115701 -37216 -23962 35704 -61827 33805 -68738
6511f8738j1806J5327L01L5446k9983J9785J1107M9225l292j8388m6303p6811
$$ -68738 -80544 -65217 -64916 -29470 -59453 -39668 -28561 20664 17372 -1016 -47319 -124130
6499a24130O982J32132J01706K0960p1168r2075N5166q5823N2965Q2468M3785
$$ -124130 -117148 14984 116690 137650 66482 -25593 29573 -56250 -3285 79183 122968
6488A22968m0899P4920j3831n6159n4651Q4647K4469N8073m7014k0620j23713
$$ 122968 82069 156989 143158 86999 32348 116995 141464 199537 152523 131903 8190
6477H190M396P2876N1108r7225K5380q5902N1139J74698n344j41917j64357o0243
$$ 8190 12586 85462 136570 39345 64725 -21177 29962 204660 199316 57399 -106958 -167201
6465a67201K11877N5963m1208O7312M6322J892L4792j10105J22206J37778o6327
$$ -167201 44676 100639 59431 126743 173065 174957 209749 99644 221850 359628 293301
6454B93301q1983m4214r5957r9063r4444J41169J39239j65028r6081J58071K08951
$$ 293301 211318 167104 71147 -27916 -122360 18809 158048 -6980 -103061 55010 263961
6443B63961k15188J1582K89992j24640j49923n0775J02710k7177L0812L7306j34119
$$ 263961 48773 60355 350347 225707 75784 25009 127719 100542 131354 168660 34541
6432C4541R3024n0956q4328J20077r4853Q2746J12480j86491O7287J26008j09042
$$ 34541 127565 76609 -7719 112358 17505 100251 212731 26240 93527 219535 110493
6421A10493j7942Q6231j57526R5051J8775n3917p3985k4369O1465J00653j64959
$$ 110493 92551 178782 21256 116307 135082 81165 7180 -17189 44276 144929 -20030
6410b0030P919O7327L1413p3116R078m0914j4972J05273o6432l912J5502p9736
$$ -20030 -12111 55216 86629 13513 22591 -18323 -33295 71978 5546 1634 17136 -62600
6398f2600k2897l9581J17516M56j18333J95719N0994j04122P0415j4999p5053
$$ -62600 -85497 -125078 -7562 -7106 -125439 70280 121274 17152 87567 72568 -2485
6387b485j8144r3072m0832N9731r4821m6920K62733m1660q6120J62642R7671q7915
$$ -2485 -20629 -113701 -154533 -94802 -189623 -236543 26190 -15470 -101590 61052 158723 70808
6375G0808r9582M0301k866P9196p1495N2722l426M9642r3221r620P1111l1926
$$ 70808 -28774 11527 8661 87857 16362 69084 65658 115300 22079 12459 83570 51644
6363E1644m393K3993R4305m0085j73682J15341J7024j33665O3842J3982J09266
$$ 51644 47251 71244 165549 125464 -48218 67123 84147 -49518 14324 28306 137572
6352A37572r7939M8617K6576j1150k9648k6977m5595J58693J8129k00121J11636
$$ 137572 39633 88250 114826 103676 74028 47051 1456 160149 178278 -21843 89793
6341H9793K183l1131J01480k3740p3497O5361o1123m354J28725p0238o6587M1010
$$ 89793 91976 60845 162325 138585 65088 130449 69326 64972 193697 123459 56872 97882
6329I7882p708j7331O9667m6303J5837r9046J19646p3448k27331K8733J33040
$$ 97882 90174 72843 142510 96207 112044 12998 132644 59196 -168135 -139402 -6362
6318f362N9119j00180m8186J3707K07256j24611J13602J6201K8780j16620p7743
$$ -6362 52757 -47423 -95609 -81902 125354 743 114345 130546 159326 42706 -35037
6307c5037J28612m923p490p4737J02500n2752p5446o746r295P026q165q9916J06078
$$ -35037 93575 88652 81162 6425 108925 56173 -19273 -26019 -35314 -28288 -36453 -126369 -20291
6294b0291N8258n1897L7159l3187j86995K28197j61716Q4534Q5741J15780J04971
$$ -20291 37967 -13930 23229 -9958 -196953 31244 -130472 -45938 39803 155583 260554
6283B60554j14033p4984l6661l5135L396J02355j26862j00004K77152n902j68215
$$ 260554 146521 71537 34876 -259 3137 105492 -21370 -121374 155778 149876 -18339
6272a8339K58257q6682j13573l6464J47034r8787L421P0093J00508K7983k0140
$$ -18339 239918 153236 39663 3199 150233 51446 54867 124960 225468 253451 233311
6261B33311k02816Q5736l9135K23m6669K4287j825k7563J54930n7837p0247Q658
$$ 233311 30495 116231 77096 77319 30650 54937 53112 25549 180479 122642 52395 61053
6249F1053q1641K8798l3702j7760J95722J8018O7556q0714l1607n433j711m0345
$$ 61053 -20588 8210 -25492 -43252 152470 170488 238044 157330 125723 120290 118579 78234
6237G8234j7420Q2661R8456O4776q393o9437j47123J10965J3322o2283j09566
$$ 78234 60814 143475 241931 306707 298314 228877 81754 192719 206041 143758 34192
6226C4192m3738K5078N0600q2576l1088J31188j02932J67801l9484k49357P4646
$$ 34192 -9546 15532 66132 -16444 -47532 83656 -19276 148525 109041 -140316 -65670
6215f5670J14162Q064N531k05052J26716Q022k2647M4274O115L1948q71j02990
$$ -65670 48492 56556 62087 -142965 -16249 -8227 -30874 13400 19515 51463 50592 -52398
6203e2398P0287p9486L6570R7752p4746k1133k3752k7216j2429j7661N2755R7945
$$ -52398 17889 -61597 -25027 72725 -2021 -23154 -46906 -74122 -86551 -104212 -51457 46488
6191D6488o5253Q1127r8339K1597K1928K6624l3526L1461n8104l7560N3945n895
$$ 46488 -18765 62362 -35977 -14380 7548 34172 646 32107 -25997 -63557 -9612 -15507
6179a5507K43854j21636N8079j57827j70000M8607L2083N7149k4400M2228q0113
$$ -15507 228347 106711 164790 6963 -163037 -114430 -82347 -25198 -49598 -7370 -87483
6168h7483q5490K5003L8198J19523m4815K0426m1606k3613Q1539p172Q2635l7880
$$ -87483 -172973 -147970 -109772 9751 -35064 -14638 -56244 -79857 1682 -5490 77145 39265
6156C9265n2654k0672P1193j1951n1466o4698K3063Q7887k1049m0843L041j17442
$$ 39265 -13389 -34061 37132 25181 -26285 -90983 -67920 19967 -1082 -41925 -38884 -156326
6144a56326M8776J92664m4996q9572q6430J80889J26381o7804k6212q9943j54769
$$ -156326 -107550 85114 40118 -49454 -135884 45005 171386 103582 77370 -12573 -167342
6133a67342j03635K26417P5103j13386J13445j52793k0535L9843J6440K20807
$$ -167342 -270977 -44560 30543 -82843 30602 -122191 -142726 -102883 -86443 134364
6123A34364o624J8465k9750j14101J7144K4687M4679j29054Q1782M0584k6838
$$ 134364 127740 146205 116455 2354 19498 44185 88864 -40190 41592 82176 55338
6112E5338J1167j30549J97102q9569N5764o4244o1966R475o0420j09189K13054
$$ 55338 66505 -64044 133058 43489 99253 35009 -26957 -17482 -77902 -187091 25963
6101B5963r3941k8210O3866J60231L0923k0672O1578j16547Q6476n9860j8902
$$ 25963 -67978 -96188 -32322 127909 158832 138160 199738 83191 169667 109807 90905
6090I0905l4482L1190o4272m384P8782P9861r5909j39773J87374j11935m6432
$$ 90905 56423 87613 23341 18957 97739 177600 81691 -58082 129292 17357 -29075
6079b9075N7054J35525n9097p8097q0658Q909K05525k8132j58881o0410J70840
$$ -29075 27979 163504 104407 26310 -54348 -45439 160086 131954 -26927 -87337 83503
6068H3503R9733j13220j61417P317K13707o8857o5451J0738q5426J41636L1050
$$ 83503 183236 70016 -91401 -84084 129623 60766 -4685 6053 -79373 62263 93313
6057I3313q4644P0500J36402n2125q3946P254o3466r1783N6413l7817K384J14977
$$ 93313 8669 79169 215571 163446 79500 86754 23288 -68495 -12082 -49899 -47515 67462
6045F7462M0215k09160J70463p2096K5160j69132J62174M6670q0445N7077N4576
$$ 67462 107677 -101483 68980 -3116 22044 -147088 15086 61756 -18689 38388 92964
6034I2964j04484o254p3077L6469J7207j73O8010J0196j59049l8357L0156m2017
$$ 92964 -11520 -17774 -90851 -54382 -37175 -37348 30662 40858 -118191 -156548 -126392 -168409
6022a68409J45476L5795p028o3767j804J38443l3150j14631P6240m8885J99241
$$ -168409 -22933 12862 5834 -57933 -59737 78706 45556 -69075 7165 -41720 157521
6011A57521o9971r8018l5219P579O2606l6505Q1994j64502k1587J2433J13771
$$ 157521 87550 -10468 -45687 -38108 24498 -12007 69987 -94515 -116102 -103669 10102
6000A0102J96739j97216j46265m2262p5122Q2495K0981K53105R693k11437L6761
$$ 10102 206841 9625 -136640 -178902 -254024 -171529 -150548 102557 112250 -99187 -62426
5989f2426O4985l1314o2968L4868J33686O4247j15393j16909l3033Q9463K4393
$$ -62426 2559 -28755 -91723 -56855 76831 141078 25685 -91224 -124257 -34794 -10401
5978a0401L0377L252j13428p4741P3821l2540L9438j27803R2190R8912L7621j24669
$$ -10401 19976 23228 -90200 -164941 -91120 -123660 -84222 -212025 -119835 -20923 16698 -107971
5966a07971K9046O4106R4881p1826o2506o1872L8448Q5351m4694n3483l7162N1211
$$ -107971 -78925 -14819 80062 8236 -54270 -116142 -77694 7657 -37037 -90520 -127682 -76471
5954g6471K44311j59058j74655N495J11791k6721p3867j4920J86338m3417j959
$$ -76471 167840 8782 -165873 -160378 -48587 -75308 -149175 -164095 22243 -21174 -23133
5943b3133P0554k2637m2267k3022Q614R4218m8647N7702q4241q1709J56790o6386
$$ -23133 47421 24784 -17483 -40505 -31891 62327 13680 71382 -12859 -94568 62222 -4164
5931d164P3440j15885r7470k517Q5416Q7479j01490P5353M5236o808m6791n8703
$$ -4164 69276 -46609 -144079 -146596 -61180 26299 -75191 162 45398 38590 -8201 -66904
5919f6904K5335q3903n0898J43770j23381J78289J04353j54275j03991N5592L9209
$$ -66904 -41569 -125472 -176370 -32600 -155981 22308 126661 -27614 -131605 -76013 -36804
5908c6804P5539K2114j19161J3810L3034j61747j21017J47925Q889K06646o3312
$$ -36804 38735 60849 -58312 -44502 -11468 -173215 -294232 -146307 -137418 69228 5916
5897E916k9364r182n3310k4847K2307J41545j03243m8610L9698l1394O7242J1144
$$ 5916 -23448 -32630 -85940 -110787 -88480 53065 -50178 -98788 -59090 -90484 -23242 -12098
5885a2098P7076o6583j96099L7112K34055q6949P8541j44141j6002N3212K5113
$$ -12098 64978 -1605 -197704 -160592 73463 -13486 65055 -79086 -95088 -41876 -16763
5874a6763j16892J42558j88745J5186l3179J38548n8156J45267K6104q6747Q204
$$ -16763 -133655 8903 -179842 -164656 -197835 -59287 -117443 27824 53928 -32819 -24615
5863b4615p9590J798J86273o5692j9892j28852J13212R6479j0211r5911l9157
$$ -24615 -104205 -102407 83866 18174 -1718 -130570 -17358 79121 68910 -27001 -66158
5852f6158L721k1284J9334J01784J06066p3592O083r9854p4421j24829L7873R2091
$$ -66158 -62437 -83721 -64387 37397 143463 69871 75954 -23900 -98321 -223150 -185277 -93186
5840i3186P6814l3711J11708j22930K947k5527q0673Q1980L7082J727J35828K719
$$ -93186 -16372 -50083 61625 -61305 -58358 -83885 -164558 -82578 -45496 -43769 92059 94778
5828I4778k0779j33652o1692k5717J87880P5624j34113J0594L9194n6779J6789
$$ 94778 73999 -59653 -121345 -147062 40818 116442 -17671 -7077 32117 -24662 -7873
5817g873M274q395l7555L746p520j9140M3141l692j33109J62675J3244j37077
$$ -7873 -3599 -11994 -49549 -45803 -53323 -72463 -29322 -33014 -166123 -3448 9796 -127281
5805a27281P6477J41391j25656L4714L0613j16219n6073O0661p755J59261r8030
$$ -127281 -50804 90587 -35069 -355 30258 -85961 -142034 -81373 -89128 70133 -27897
5794b7897m1152k1480K06706j15050q0176Q2885L8296j69458P5406Q0776j03613
$$ -27897 -69049 -90529 116177 1127 -79049 3836 42132 -127326 -51920 28856 -74757
5783g4757K8517K1380K1821R7100N1998j84280l3103K7881n0390l734J40620o3290
$$ -74757 -46240 -24860 -3039 94061 146059 -38221 -71324 -43443 -93833 -97567 43053 -20237
5771b0237J7048K8465j3524K1556m7141j26906P8071J4966j2237m8318K2482J2555
$$ -20237 -3189 25276 11752 33308 -13833 -140739 -62668 -47702 -59939 -108257 -85775 -73220
5759g3220n8495K9537O4132N9395R0185j10342q7870R6684k7031j2667k9677j3411
$$ -73220 -131715 -102178 -38046 21349 111534 1192 -86678 10006 -17025 -29692 -59369 -72780
5747g2780o5935l2128l5463N2755K2625m4237O0820L6684J72824j19845j8606
$$ -72780 -138715 -170843 -206306 -153551 -130926 -175163 -114343 -77659 95165 -24680 -43286
5736d3286k0434P5311m173J42078j57365J7617Q5925j47441q676r4018R7508n3275
$$ -43286 -63720 11591 7418 149496 -7869 9748 95673 -51768 -60444 -154462 -56954 -110229
5724a10229J05891j41601l6953K07365J32124n1805j1552m4957J13411K0395j30251
$$ -110229 -4338 -145939 -182892 24473 156597 104792 93240 48283 161694 182089 51838
5713E1838p8761O2507R9802j21985K0918J4637P4191p6474K05542j58015r97j64120
$$ 51838 -26923 35584 135386 13401 34319 48956 123147 46673 252215 94200 93203 -70917
5701g0917q6120J02675j17226l8437K01974J49700q905j84598L71Q9981j4264
$$ -70917 -157037 -54362 -171588 -210025 -8051 141649 132744 -51854 -51483 38498 24234
5690B4234J12045j15201m6149M6453O0375o8446J27571j00915O131l2786P9095
$$ 24234 136279 21078 -25071 21382 81757 13311 140882 39967 46098 13312 92407
5679I2407j82281r6628L8395n2521J2784K8882J64229k695J32773l9348j17497
$$ 92407 -89874 -186502 -148107 -200628 -187844 -158962 5267 2572 135345 95997 -21500
5668b1500K3664L3913K2826q0270r5434m441M6506K1939J28874q4880m4890j36174
$$ -21500 2164 36077 58903 -21367 -116801 -121242 -74736 -52797 76077 -8803 -53693 -189867
5656a89867M8429J90658o1905N0015j79654j5140J60205j4825j3690o8206m5055
$$ -189867 -141438 49220 -12685 37330 -142324 -157464 2741 -12084 -25774 -93980 -139035
5645a39035m9940j1308K03258p7647M4691R1889q2081j01173P7316M4233K5095
$$ -139035 -188975 -200283 2975 -74672 -29981 61908 -20173 -121346 -44030 203 25298
5634B5298o5953k2571n6714J78810K2478j06494J25077p0453k9550j11785J19950
$$ 25298 -40655 -63226 -119940 58870 81348 -25146 99931 29478 -72 -111857 8093
5623H093p4041k2702j61384Q6781J59960M2916l4191J13763j31775k5274P6401
$$ 8093 -65948 -88650 -250034 -163253 -3293 39623 5432 119195 -12580 -37854 38547
5612C8547r771j00097k7181N6196Q2512j24245k5170K23799j68552k24O1277n4308
$$ 38547 28776 -71321 -98502 -42306 40206 -84039 -109209 114590 -53962 -54186 7091 -47217
5600d7217n7907J48188o9786J20039j93913r2911J74192l9274L4421P3938k43162
$$ -47217 -105124 43064 -26722 93317 -100596 -193507 -19315 -58589 -24168 49770 -193392
5589a93392J40619Q2398j71804J03067L251j0405L5546M6020j4009k1768J3078
$$ -193392 -52773 29625 -142179 -39112 -35861 -46266 -10720 35300 21291 -477 12601
5578A2601j3987p3136p7210Q7642K4601J13986l4745J03962j66593k7726l6785
$$ 12601 -1386 -74522 -151732 -64090 -39489 74497 39752 143714 -22879 -50605 -87390
5567h7390Q3858L3933j53631J16000l9737N9422P6220K3849j24148j55403o4501
$$ -87390 -3532 30401 -123230 -7230 -46967 12455 88675 112524 -11624 -167027 -231528
5556b31528R0733R7006L0447O5544j6995j56962K9538O605P1164O3756j51543
$$ -231528 -140795 -43789 -13342 52202 35207 -121755 -92217 -85612 -14448 49308 -102235
5545a02235Q2780L252j25620J0468M3011N874K6062J9724n6359J206Q5637j65952
$$ -102235 -19455 -16203 -141823 -131355 -88344 -82470 -56408 -36684 -93043 -91837 -6200 -172152
5533a72152K0044j6539n1283J20943N9710m4658k928q856J2057P2804l2383J16628
$$ -172152 -152108 -168647 -219930 -98987 -39277 -83935 -86863 -95719 -83662 -10858 -43241 73387
5521G3387j73937P7687J2152J16747j42487O723p1059M8422j33467M9364K3985
$$ 73387 -100550 -22863 -10711 106036 -36451 -29728 -100787 -52365 -185832 -136468 -112483
5510a12483J5523n515J0898N218j14669O4519Q4866O6939k5686o7401J66077N1975
$$ -112483 -96960 -102475 -91577 -86359 -201028 -136509 -51643 15296 -10390 -77791 88286 140261
5498A40261j42269Q794K9344P7279j59517P7952q1009O9954j4472m8613M4375
$$ 140261 -2008 6786 36130 113409 -46108 31844 -49165 20789 6317 -42296 2079
5487B079Q7397j35522q1444M3540j1552k8802P1121N8782l4708n622m4918j5036
$$ 2079 89476 -46046 -127490 -83950 -95502 -124304 -53183 5599 -29109 -34731 -79649 -94685
5475i4685Q4800j32895J79344k4947l8486N7377n2495J8054m0853J02751o1611
$$ -94685 -9885 -142780 36564 11617 -26869 30508 -21987 -3933 -44786 57965 -3646
5464c646M3571J05271J5110k15419k02000J51682l5523J16589K9401j11950o863
$$ -3646 39925 145196 160306 -55113 -257113 -105431 -140954 -24365 5036 -106914 -113777
5453a13777j9594K067Q86J25553O0934q7887N5358O570N6797o1662k3295J57440
$$ -113777 -133371 -131304 -130418 -4865 56069 -31818 23540 30110 86907 25245 1950 159390
5441A59390o6502k00029N4802R8267o3705J39413n7949R507L5687j50494K9739
$$ 159390 92888 -107141 -52339 45928 -17777 121636 63687 73194 108881 -41613 -11874
5430a1874N845J2636J36156j78599L3649j3152K0768M158m2521j05790J07642
$$ -11874 -6029 6607 142763 -35836 -2187 -15339 5429 9587 -32934 -138724 -31082
5419c1082J05102o0813N4057k2504p1073l8979m284m0431n0994J10215Q1016P8638
$$ -31082 74020 13207 67264 44760 -26313 -65292 -69576 -110007 -161001 -50786 30230 108868
5407A08868j14163J7469L0676J6848l3664q2896J96629j9191p1145q3243O1720
$$ 108868 -5295 12174 42850 59698 26034 -56862 139767 120576 49431 -33812 27908
5396B7908j07275J4997J49760j06139l6250J28711P2915m1992p1180Q9873M5713
$$ 27908 -79367 -64370 85390 -20749 -56999 71712 144627 102635 31455 121328 167041
5385A67041j43483j8481j8209L6249m5360O9822P1434j17459j23682J63528O0761
$$ 167041 23558 5077 -13132 23117 -22243 47579 119013 1554 -122128 41400 102161
5374A02161n2535K6397J8434J6333o4417r0431J0274o9180J26210L9336M9472
$$ 102161 49626 76023 94457 110790 46373 -44058 -33784 -102964 23246 62582 112054
5363A12054k11888j59654R6664M2110N4975o0002L9906J04190M0647k7568p5384
$$ 112054 -99834 -259488 -162824 -120714 -65739 -125741 -85835 18355 59002 31434 -43950
5352d3950M3974K812Q7321j18504m2533j58074J25291K5692M0230K9317j46921
$$ -43950 24 2836 90157 -28347 -70880 -228954 -103663 -77971 -37741 -8424 -155345
5341a55345J25974k31837J82603M5347M3204m0135O8834j37934k4795P6842n7393
$$ -155345 -29371 -261208 -78605 -33258 9946 -30189 38645 -99289 -124084 -47242 -104635
5330a04635J73503j58814N6810Q4804r402K4975m3325J15278N4779n8972j06601
$$ -104635 68868 -89946 -33136 51668 42266 67241 23916 139194 193973 135001 28400
5319B8400j15527j05226K35944j2604k03137M0720J94230l8660K0406j59412J69753
$$ 28400 -87127 -192353 43591 30987 -172150 -131430 62800 24140 44546 -114866 54887
5308E4887r6417k1455J9764O0052p4124L5593p4951j56915P1675J14889J44736
$$ 54887 -41530 -62985 -43221 16831 -57293 -21700 -96651 -253566 -181891 -67002 77734
5297G7734j0727k37830n9622J23631J71320J17940J8482k42787M3460R4079j47965
$$ 77734 67007 -170823 -230445 -106814 64506 182446 200928 -41859 1601 95680 -52285
5286e2285j50016J8430Q0161J9525q8853K5987J740q181J22567k1403N8088O9380
$$ -52285 -202301 -183871 -103710 -84185 -173038 -147051 -145311 -153492 -30925 -52328 5760 75140
5274G5140o2858j45625P2207K2520K7495J3516J878R4390r4733j25018J85150
$$ 75140 12282 -133343 -61136 -38616 -11121 2395 4273 98663 3930 -121088 64062
5263F4062j11260N741M429J16704j5114j03890L43q5019J25384n6629n5826J46899
$$ 64062 -47198 -41457 -37028 79676 64562 -39328 -38985 -124004 1380 -55249 -111075 35824
5251C5824K1306j38886J8509m8118K8797j285n7283m2420K2526J05446j0616p7933
$$ 35824 57130 -81756 -63247 -111365 -82568 -83853 -141136 -183556 -161030 -55584 -66200 -144133
5239a44133R6871J06597o6783j8449k9727J49192j22859l2801k8778J18540j01615
$$ -144133 -47262 59335 -7448 -25897 -55624 93568 -29291 -62092 -90870 27670 -73945
5228g3945L9348J20772j94892k4599l8988M3182K34195p5361n9118J5864L6250
$$ -73945 -34597 86175 -108717 -133316 -172304 -129122 105073 29712 -29406 -13542 22708
5217B2708k3102j39473k5012O5210j01858N9639K41907J33087j68545k564q3192
$$ 22708 -394 -139867 -164879 -99669 -201527 -141888 100019 233106 64561 61997 -21195
5206b1195L7999j4378m5816P815J09691k19834M9545J02541m342Q2694q0530j81311
$$ -21195 16804 2426 -43390 -35575 74116 -145718 -96173 6368 2026 84720 4190 -177121
5194a77121L4218Q6911l4893J4282L5357J3405K738N0361o4931J0502K1613n9667
$$ -177121 -142903 -55992 -90885 -76603 -41246 -27841 -25103 25258 -39673 -29171 -7558 -67225
5182f7225p070N5778O921o2151p3769j32741K39917R4754l5479r3435O5833k8457
$$ -67225 -74295 -18517 -11596 -73747 -147516 -280257 -40340 54414 18935 -74500 -8667 -37124
5170c7124o8334K6616m720R2137J5541N6467p6478j49858j8680N6822m8258L2722
$$ -37124 -105458 -78842 -83562 8575 24116 80583 4105 -145753 -164433 -107611 -155869 -123147
5158a23147J22741K4242O8316l43338K8965J48820N894J8799j7794n456o1330
$$ -123147 -406 23836 92152 -251186 -222221 -73401 -67507 -48708 -66502 -71958 -133288
5147a33288L8498j3729L8325M5225J26442o9145n4721L5010P1288j13718K0002
$$ -133288 -94790 -108519 -70194 -24969 101473 32328 -22393 12617 83905 -29813 -9811
5136i811Q8564M0044q6057P8792j20518j9973P3170L2677r9405N2636j29606R7256
$$ -9811 78753 118797 32740 111532 -8986 -28959 44211 76888 -22517 30119 -99487 -2231
5124b231p059k1035J8878L725K6934q6235J39498O5183k2171j15572q7944O7214
$$ -2231 -9290 -30325 -11447 -7722 19212 -67023 72475 137658 115487 -85 -88029 -20815
5112b0815q5476J28961o3870K3870p1847O4767l5500P9669k3971j40791R5603
$$ -20815 -106291 22670 -41200 -17330 -89177 -24410 -59910 19759 -4212 -145003 -49400
5101d9400Q1361r8601R5536m8201n1493J3775o655P2531l4383N0420J6919p8854
$$ -49400 31961 -66640 28896 -19305 -70798 -57023 -63678 8853 -25530 24890 41809 -37045
5089c7045N7066j33202M7065J2535q5463M7185K7535p9242Q0014j8929p9164J10149
$$ -37045 20021 -113181 -66116 -53581 -139044 -91859 -64324 -143566 -63552 -82481 -161645 -51496
5077e1496K3204L6792m2282n3125j88387N6461J39408j2552J4471J58857j02837
$$ -51496 -28292 8500 -33782 -86907 -275294 -218833 -79425 -91977 -77506 81351 -21486
5066b1486j49432Q8303J45508j82849J99224L7380j10024p1205m077J89558o0258
$$ -21486 -170918 -82615 62893 -119956 79268 116648 6624 -64581 -68658 120900 60642
5055F0642J20580n1001j23148P9660L4053r9685q8421q9000R2100J24790l7636
$$ 60642 181222 130221 7073 86733 120786 21101 -67320 -156320 -64220 60570 22934
5044B2934l5572n9065J70133l428k25731J39633L5810o7504J23634p2575k3136
$$ 22934 -12638 -71703 98430 95002 -130729 8904 44714 -22790 100844 28269 5133
5033E133n5925n2842l8638J66902K1986m2057r5330N6470K9451k0065j09845R7732
$$ 5133 -50792 -103634 -142272 24630 46616 4559 -90771 -34301 -4850 -24915 -134760 -37028
5021c7028J26301j77640N6557p3345p7344O8370J36460L3699j34814k1778J50592
$$ -37028 89273 -88367 -31810 -105155 -182499 -114129 22331 56030 -78784 -100562 50030
5010E0030N9536p9722q3771j28243J09022J45701o419j76709Q4917r979k5294
$$ 50030 109566 29844 -53927 -182170 -73148 72553 66134 -110575 -25658 -35637 -60931
4999f0931q9535k6543J50190N9170j1360J3530Q788m2927j87158J85810n9386
$$ -60931 -150466 -177009 -26819 32351 20991 34521 43309 382 -186776 -966 -60352
4988f0352l2679P4768j69259j61383K27525K4386k9653M8676o5922O4848o7903
$$ -60352 -93031 -18263 -187522 -348905 -121380 -96994 -126647 -77971 -143893 -79045 -146948
4977a46948J52540n6840j25840J11477J53829j73044j21225Q8305l169L4450P53
$$ -146948 5592 -51248 -177088 -65611 88218 -84826 -206051 -117746 -120915 -86465 -85712
4966h5712K1852O00J12245j118p8633O0759l764K2960k09668O7100R9956m5182
$$ -85712 -63860 -63260 48985 47867 -30766 29993 26229 49189 -160479 -93379 6577 -38605
4954c8605J8606q0242j70081J27620J56847J50673n1175j63817o7454J41830Q098
$$ -38605 -19999 -100241 -270322 -142702 14145 164818 113643 -50174 -117628 24202 32300
4943C2300n0464L199j67542J33917J32526j5932J00438j85048j14061j8718J43878
$$ 32300 -18164 -14965 -182507 -48590 83936 68004 168442 -16606 -130667 -149385 -5507
4932e507n7990M5636P061j72575J25491j11281P3896J45823K9480k1974j39602
$$ -5507 -63497 -17861 -10800 -183375 -57884 -169165 -95269 50554 80034 58060 -81542
4921h1542j8627Q1547P4795j6231n6312j03016K4544K7400j7561N6284n1199k8844
$$ -81542 -100169 -18622 56173 39942 -16370 -119386 -94842 -67442 -85003 -28719 -79918 -108762
4909a08762J12520M4440k5797P4359j25825j6518n8856N0695l6150M943N0650
$$ -108762 3758 48198 22401 96760 -29065 -45583 -104439 -53744 -89894 -84951 -34301
4898c4301m7291M2779j39432m5767K30921J07829j01767k14427J79958K760q7521
$$ -34301 -81592 -38813 -178245 -224012 6909 114738 12971 -201456 -21498 -18738 -106259
4887a06259N2653J0235r3587o1894J6970J59990K9248p8458j34771q3112R1266
$$ -106259 -53606 -43371 -136958 -198852 -181882 -21892 7356 -71102 -205873 -288985 -197719
4876a97719J7257Q6763J32076m8497L8698J4150l1966J44938j62913l3179R3850
$$ -197719 -180462 -93699 38377 -10120 28578 42728 10762 155700 -7213 -40392 53458
4865E3458q4400L4226Q1739j05729O9696M8299R5241j15069p7757j7773N0134
$$ 53458 -30942 3284 85023 -20706 48990 97289 192530 77461 -296 -18069 32065
4854C2065n1584n469n7495O6716J8901M3850j87169o0672L4988J10819J23638
$$ 32065 -19519 -24988 -82483 -15767 3134 46984 -140185 -200857 -165869 -55050 68588
4843F8588j78374r0808J25617M0223P763P8521j39441M2251m4293P844J64445
$$ 68588 -109786 -200594 -74977 -34754 -26991 51530 -87911 -45660 -89953 -82109 82336
4832H2336m7128N3903m3672j3596k69879L1499J24042J07J18004m4086O4668j27052
$$ 82336 35208 89111 45439 31843 -238036 -206537 -82495 -82388 35616 -8470 56198 -70854
4820g0854j74555J93725O9560j2415p6954J22465m843P1902r62j39149J98134
$$ -70854 -245409 -51684 17876 5461 -71493 50972 46129 118031 117069 -22080 176054
4809A76054m2043j87289k1987J99772m0764k15548P3290J12924k01471J83230
$$ 176054 134011 -53278 -75265 124507 83743 -131805 -58515 54409 -147062 36168
4799C6168Q299j57695q6863J42844n0737J04104o2466m4999o3906R7122j28751
$$ 36168 44467 -113228 -200091 -57247 -107984 -3880 -66346 -111345 -175251 -78129 -206880
4788b06880J31016m3414l1174O0777K9897K3383j45014J91015o2974k4103l3136
$$ -206880 -75864 -119278 -150452 -89675 -59778 -36395 -181409 9606 -53368 -77471 -110607
4777a10607J1684R450J01179Q7074m5101q059k1315q8381m1954K8318R6091p2041
$$ -110607 -98923 -89473 11706 98780 53679 45620 24305 -64076 -106030 -77712 18379 -53662
4765e3662n0910o5042m3943J81496K21154j83386j25692J60967N9763o0253P6001
$$ -53662 -104572 -169614 -213557 -32061 189093 5707 -119985 40982 100745 40492 116493
4754A16493j75467k8843P4867n5722J9560j156J049N4151J80002j02292q2262
$$ 116493 -58974 -87817 -12950 -68672 -49112 -50268 -49219 4932 184934 82642 380
4743C80l179K9461o136r0511O8131q2991r335J20640l5331J61448l371j17140
$$ 380 -2799 26662 20526 -69985 -1854 -84845 -94180 26460 -8871 152577 149206 32066
4731C2066K9561j4190j7038o1240l9911n4230J7666R9575J16826j37894J38454
$$ 32066 61627 47437 30399 -30841 -70752 -124982 -107316 -7741 109085 -28809 109645
4720A09645n8660J4130n3541R7478O4100j46834n616N9423k5701j46704J29407
$$ 109645 50985 65115 11574 109052 173152 26318 20702 80125 54424 -92280 37127
4709C7127J03340Q0828j46452l3981L670j19903K2710J76775k2019l6373l0188
$$ 37127 140467 221295 74843 40862 44532 -75371 -52661 124114 102095 65722 35534
4698C5534n7966l2429J7327q6927k6060K5709J721r866l7952r452Q2355J39635
$$ 35534 -22432 -54861 -37534 -124461 -150521 -124812 -123091 -132957 -170909 -180361 -98006 41629
4686D1629k2606N3049N1083j32566o438l6462q4761J08791J56483m8177k63217
$$ 41629 19023 72072 123155 -9411 -15849 -52311 -137072 -28281 128202 80025 -183192
4675a83192R8930J12556q5732O6122k611r9743J26320o4111n2837l9589K6075
$$ -183192 -84262 28294 -57438 8684 6073 -93670 32650 -31461 -84298 -123887 -97812
4664i7812J30274j81482J03739L1687q2113k025J81440n1463L1790m2863j25185
$$ -97812 32462 -149020 -45281 -13594 -95707 -97732 83708 32245 64035 21172 -104013
4653a04013J44311j9018p7053l5351r3570J00061r6117N6102K6524M3462l7157
$$ -104013 40298 21280 -55773 -91124 -184694 -84633 -180750 -124648 -98124 -54662 -91819
4642i1819L8525l5743N2401O9583r7732R108m5167K05576Q2292j53884m5201J18528
$$ -91819 -53294 -89037 -36636 32947 -64785 -55677 -100844 104732 187024 33140 -12061 106467
4630A06467k12818n1791o8501J22319o3324K727L7083L2262K6530J17291P8381
$$ 106467 -106351 -158142 -226643 -104324 -167648 -164921 -127838 -95576 -69046 48245 126626
4619A26626j64695m4487N0934l8647o6520j8029P736Q6996K4130J6599q6005P677
$$ 126626 -38069 -82556 -31622 -70269 -136789 -154818 -147082 -60086 -35956 -19357 -105362 -97685
4607i7685n8564J66903K0865L3588m0152j05199K14943l2102m4737m9385p1812
$$ -97685 -156249 10654 31519 65107 24955 -80244 134699 102597 57860 8475 -63337
4596f3337O8903K7219j54316K31898k9063J2826o4899p7991J2747m8379l3725
$$ -63337 5566 32785 -121531 110367 81304 94130 29231 -48760 -36013 -84392 -118117
4585a18117k9303K13448m1635O1988J9391J0390j18707k829j84569Q9599Q3528
$$ -118117 -147420 66028 24393 86381 105772 116162 -2545 -5374 -189943 -100344 -16816
4574a6816q1630O2148Q8551r1588Q3247J3635m3834J5488M6367j11309j4591R9070
$$ -16816 -98446 -36298 52253 -39335 43912 57547 13713 29201 75568 -35741 -50332 48738
4562D8738k7940J61441j63236q4527J09140j15969Q1554p5940m5431J82568j24895
$$ 48738 20798 182239 19003 -65524 43616 -72353 9201 -66739 -112170 70398 -54497
4551e4497l0714j2844p2294P5527J36963J05976p7942j41046j9695M9024J6087
$$ -54497 -85211 -98055 -170349 -94822 42141 148117 70175 -70871 -90566 -41542 -25455
4540b5455p6941L7110J5111J73268r1523L9332K910K2717j61035k9716K05247
$$ -25455 -102396 -65286 -50175 123093 31570 70902 73812 96529 -64506 -94222 111025
4529A11025l20648J53004J3125n273R6154p5165R3133l6665p6003L458R586K3164
$$ 111025 -209623 -56619 -43494 -48767 47387 -27778 65355 28690 -47313 -43855 -34269 -11105
4517a1105J40759O28m2020j53701J04925O7399l9983q3794k7891K5820m2205j3717
$$ -11105 129654 130282 88262 -65439 39486 106885 66902 -16892 -44783 -18963 -61168 -74885
4505g4885P9932p2573q3099Q6619J10950j2130J9357J10544R4725j00689j30137
$$ -74885 5047 -67526 -150625 -64006 46944 34814 54171 164715 259440 158751 28614
4494B8614p2405R5983l7611N0645q9702j2566n5347J62378j31747L0433J23044
$$ 28614 -43791 52192 14581 65226 -24476 -37042 -92389 69989 -61758 -31325 91719
4483I1719j39876L2588J2474k0202J4189r4376o4320Q1206Q2666J5779R7645m2978
$$ 91719 -48157 -15569 -3095 -23297 -9108 -103484 -167804 -86598 -3932 11847 109492 66514
4471F6514n8179l3500J6937J3791j17745Q3541N5870j50522J9510l0573P4733
$$ 66514 8335 -25165 -8228 5563 -112182 -28641 27229 -123293 -103783 -134356 -59623
4460e9623Q9065R432K9656j30278J09484J8086R3812J7725j04596o500l6897k01213
$$ -59623 29442 38874 68530 -61748 47736 65822 159634 177359 72763 66263 29366 -171847
4448a71847J38343Q2349L0266p365k6829Q2094M1592l5505O0671n1296j19286
$$ -171847 -33504 48845 79111 71746 44917 127011 168603 133098 193769 142473 23187
4437B3187K8098J056q0551N0439O614l1691P4817k781l2237O7966j34678R9072
$$ 23187 51285 52341 -28210 22229 28843 -2848 71969 69188 36951 104917 -29761 69311
4425F9311q5990L203m4502K9473K8122P7228q9871Q943K4746P027j9487j19326
$$ 69311 -16679 -13476 -57978 -28505 -383 76845 -13026 -4083 20663 27690 8203 -111123
4413a11123p6369J22106K2854Q4005Q4135O785r6710l1562J06372k9609J7626
$$ -111123 -187492 -65386 -42532 41473 125608 132393 35683 4121 110493 80884 98510
4402I8510M3840j71121j6j171J42631o4260j61503J23643j53158J18764Q2564
$$ 98510 142350 -28771 -28787 -29958 112673 48413 -113090 10553 -142605 -23841 58723
4391E8723j31578m5498Q7757m3493l3339l6075Q1444Q3585J5422J32120r9251
$$ 58723 -72855 -118353 -30596 -74089 -107428 -143503 -62059 21526 36948 169068 69817
4380F9817K376p7006M6607l7944K8230J29859J9162L0708q3416j16692J00755
$$ 69817 72193 -4813 41794 3850 32080 161939 181101 211809 128393 11701 112456
4369A12456M1815j89992n8863N8235n432R7700m79N0092N447j04625Q3343j7895
$$ 112456 154271 -35721 -94584 -36349 -41781 55919 55440 105532 110979 6354 89697 71802
4357G1802O426J3826r0199R4283p2197Q374l4302P6412Q9533l1826j07129q5293
$$ 71802 78228 92054 1855 96138 23941 32315 -1987 74425 163958 132132 25003 -60290
4345f0290J21198k154R8533j973j57019K130N7320m7316N6501j38480J64968o6657
$$ -60290 60908 58754 157287 155314 -1705 425 57745 10429 66930 -71550 93418 26761
4333B6761O2639J21372k1353l8816r3660M1593l8022R1659L8533P8917j7407k4891
$$ 26761 89400 210772 189419 150603 56943 98536 60514 152173 190706 269623 252216 227325
4321B27325J54328k29547O9869j3388K534M4268J2579L5919M666j12247J2843
$$ 227325 381653 152106 221975 208587 211121 255389 267968 303887 308553 196306 209149
4310B09149Q5596J41832m2469L4717m6201o1674O7269r282k0085j19885q067m6079
$$ 209149 294745 436577 394108 428825 382624 320950 388219 378937 358852 238967 230900 184821
4298A84821m3768J74778l8107n1362q5859K7234m515O3980n4755P4060n9216o1322
$$ 184821 141053 315831 277724 226362 140503 167737 163222 227202 172447 246507 187291 125969
4286A25969R9264n3018N1234M7551j65775l4361n1341N9029K694J51835p8499
$$ 125969 225233 172215 223449 271000 105225 70864 19523 78552 81246 233081 154582
4275A54582l7971J27891j18623j08562Q1704j2960J03320K2623j08702Q0826n5105
$$ 154582 116611 244502 125879 17317 99021 86061 189381 212004 103302 184128 129023
4264A29023m6128p4245J6073n8542k6978K3979J49065q6099N6382j33183j9113
$$ 129023 82895 8650 24723 -33819 -60797 -36818 112247 26148 82530 -50653 -69766
4253f9766R0913L460l5841J31L8686p0658M2237r6807O4305O4968l3524J15996
$$ -69766 21147 24607 -11234 -11103 27583 -43075 -838 -97645 -33340 31628 -1896 114100
4241A14100j43362J84117J13606o8441p7614j79095o1158J42340K03702j08999
$$ 114100 -29262 154855 268461 200020 122406 -56689 -117847 24493 228195 119196
4231A19196o1901j2705J41799M1245j36563n3093J00573J2898j64483O8865p2025
$$ 119196 57295 44590 186389 227634 91071 37978 138551 151449 -13034 55831 -16194
4220a6194R8632K7830j94668M3736l3836k5550J36094K14945j11054P9449k6879
$$ -16194 82438 110268 -84400 -40664 -74500 -100050 36044 250989 139935 219384 192505
4209A92505k79076L4699J37799N9978j44085Q0006k4425J24154q3262l1479K3744
$$ 192505 -86571 -51872 85927 145905 1820 81826 57401 181555 98293 66814 90558
4198I0558m3012j976J385M0044k4129O4090K8209r0279O5228l6486l6638K0665
$$ 90558 47546 45570 46955 86999 62870 126960 155169 64890 130118 93632 56994 77659
4186G7659j05552k1169m6929K2598J10358J26822p6572j14245J73276j42125m7787
$$ 77659 -27893 -49062 -95991 -73393 36965 163787 87215 -27030 146246 4121 -43666
4175d3666J158J49342R5452k4661r4192J6082M1166R7933j75518K6639K8636l9427
$$ -43666 -42508 106834 202286 177625 83433 99515 140681 238614 63096 89735 118371 78944
4163G8944m9699n2920J24883j46966m1621J33265L7108O0190P1892j66756R514
$$ 78944 29245 -23675 101208 -45758 -87379 45886 82994 143184 215076 48320 57834
4152E7834J6930o5547o6898L09978l8129k12373N0764J08315j00982o1748R2556
$$ 57834 74764 9217 -57681 252297 214168 1795 52559 160874 59892 -1856 90700
4141I0700j916j9082M1574o4387N7808k3391L2896m3791j04735J0317k5168Q8513
$$ 90700 88784 69702 111276 46889 104697 81306 114202 70411 -34324 -24007 -49175 39338
4129C9338k5050P1169J5805l7175O547n0712J0578L8298J4068j18306Q131J52356
$$ 39338 14288 85457 101262 64087 70634 19922 30500 68798 82866 -35440 -27309 125047
4117A25047k4703o5639k1665r2071O3182J82616m4453m351N8735n9036Q6106P9811
$$ 125047 100344 34705 13040 -79031 -15849 166767 122314 117963 176698 117662 203768 283579
4105B83579k94472N7536r6754J01020m830p049q89M6870K00752j5768k14908R7794
$$ 283579 -10893 46643 -50111 50909 46079 39030 38141 85011 285763 269995 55087 152881
4093A52881p6069R2162K3102l94J5799j61433m5718J67621m406j259L2668j32336
$$ 152881 76812 168974 192076 191682 207481 46048 330 167951 163545 162286 194954 62618
4081F2618R8476m0043K1629k772k8648q7574J12019K5185o288j10421J3032l2477
$$ 62618 161094 121051 142680 139908 111260 23686 135705 160890 154602 44181 57213 24736
4069B4736J58183k9653r379p7319O6108l5639l8589o2100K21433j9612n2932J1270
$$ 24736 182919 153266 143887 66568 132676 97037 58448 -3652 217781 198169 145237 156507
4057A56507L2137p3384l8172K16886K0984k3372k8971j12917n0936J1854P4980
$$ 156507 188644 115260 77088 293974 314958 291586 262615 149698 98762 110616 185596
4046A85596k7164j73350L668N175P9002R0343q400l7941r0713J01685p924N2173
$$ 185596 158432 -14918 -11250 -6075 72927 163270 154870 116929 26216 127901 119977 172150
4034A72150R2242p8311n4283N1942N4667j01110j06317L5714Q7157L2658m3893
$$ 172150 264392 186081 131798 183740 238407 137297 30980 66694 153851 186509 142616
4023A42616K6456R3002j40341J05479J862K08474l6628n0551j92972o1963J51914
$$ 142616 169072 262074 121733 227212 229074 437548 400920 350369 157397 95434 247348
4012B47348l7826k3633j6437M4923l6828J18369l5675K7701J7790L4775j75050
$$ 247348 209522 185889 169452 214375 177547 295916 260241 287942 305732 340507 165457
4001A65457M5789J26910n5397j43711P0151J2205N6572m0917K0690p0335o8090
$$ 165457 211246 338156 282759 139048 209199 221404 277976 237059 257749 187414 119324
3990A19324Q0140P5904r955m7513J7017J0991k2723J54928r6603l9128J09047
$$ 119324 199464 275368 265413 217900 234917 245908 223185 378113 281510 242382 351429
3979C51429j20459K5961j29199n2513J44595Q9711p893J4768K3291K5019j55555
$$ 351429 230970 256931 127732 75219 219814 309525 301632 316400 339691 364710 209155
3968B09155J17652K5932l5402q085r2125J0703J22256R4261m5700r2820J64117
$$ 209155 326807 352739 317337 309252 217127 227830 350086 444347 398647 305827 469944
3957D69944k0517o8308m5904L7132N013M6016J15348j38493r3513L023n490J87360
$$ 469944 449427 381119 335215 372347 377360 423376 538724 400231 306718 309741 304251 491611
3945D91611Q158k5970k1708O5061Q8845P8256K6984j56035l619j3383l2953Q388
$$ 491611 499769 473799 452091 517152 605997 684253 711237 555202 551583 538200 505247 513635
3933E13635J15792M2850j45054Q2249M6224O3842o6764j6128J43542j01646M4608
$$ 513635 629427 672277 527223 609472 655696 719538 652774 636646 780188 678542 723150
3922G23150J72338j92513j47503R6569N3508N2620J9840N0045j03032n1718O2257
$$ 723150 895488 702975 555472 652041 705549 758169 778009 828054 725022 673304 735561
3911G35561q5674N2185K7699J6933J02049q5452Q9452k13381J18421J17609p9799
$$ 735561 649887 702072 729771 746704 848753 763301 852753 639372 757793 875402 795603
3900G95603L5368m4083M7961p6109n0889r9997J20382R1709j21063M3542J7361
$$ 795603 830971 786888 834849 758740 707851 607854 728236 819945 698882 742424 759785
3889G59785Q7850N4988n5936J08174J01887p5635j17799N8681J26158j04134k6817
$$ 759785 847635 902623 846687 954861 1056748 981113 863314 921995 1048153 944019 917202
3878I17202J08096K1782k996l9546K17256r0096j07667J51814p4429r0567N0675
$$ 917202 1025298 1047080 1044084 1004538 1221794 1131698 1024031 1175845 1101416 1010849 1061524
3867A061524N9818o4041l7883J02227J65844j80433K6408L8279Q3134O7450M8065
$$ 1061524 1121342 1057301 1019418 1121645 1287489 1107056 1133464 1171743 1254877 1322327 1370392
3856A370392o2028J08329J52504j33997K04857n016r1816j48165m9411K0005J65613
$$ 1370392 1308364 1416693 1569197 1435200 1640057 1635041 1543225 1395060 1345649 1365654 1531267
3845A531267k00978O4552K3941O7210J1001j43248K49976k1315j79365J15858
$$ 1531267 1330289 1394841 1418782 1485992 1496993 1353745 1603721 1582406 1403041 1518899
3835A518899K3685M6227l814k1594M0319Q3004L7836j29867P7440J44148j15366
$$ 1518899 1542584 1588811 1584997 1563403 1603722 1686726 1724562 1594695 1672135 1816283 1700917
3824A700917n327J29126L1528j93565l4721L5519P2811P4530M3089k335M3929
$$ 1700917 1695590 1824716 1856244 1662679 1627958 1663477 1736288 1810818 1853907 1851572 1895501
3813A895501k2536J99887l1880J55953l4059Q0401j59282P247J97817n8797O8438
$$ 1895501 1872965 2072852 2040972 2196925 2162866 2243267 2083985 2091232 2289049 2230252 2298690
3802B298690j50q2277J91842j1259Q2635J9513l3481o6498q2373j25341M4212
$$ 2298690 2298540 2216263 2408105 2396846 2479481 2498994 2465513 2399015 2316642 2191301 2235513
3791B235513K7954J99506J81853O1083K48090J35930p2969R1247K13141P3335
$$ 2235513 2263467 2462973 2644826 2705909 2953999 3089929 3016960 3108207 3321348 3394683
3781C394683N2051J11224K06808K35721N7928K85067K5154M7911J60069R3640
$$ 3394683 3446734 3557958 3764766 4000487 4058415 4343482 4368636 4416547 4576616 4670256
3771D670256K47558J88407K28571K27103L63387Q2294K57255K02901M35780K65949
$$ 4670256 4917814 5106221 5334792 5561895 5925282 6007576 6264831 6467732 6903512 7169461
3761G169461K52788K86148M50859N91799O12668M64403O69296N36558N91032Q13291
$$ 7169461 7422249 7708397 8159256 8751055 9363723 9828126 10497422 11033980 11625012 12438303
3751A2438303R46793J052575J579403J214858J637164J492183J923043J798621
$$ 12438303 13385096 14437671 16017074 17231932 18869096 20361279 22284322 24082943
3743B4082943K080369K432710K889071L347764M093288L043666J845645J252872
$$ 24082943 26163312 28596022 31485093 34832857 38926145 41969811 43815456 45068328
3735D5068328J485415J593695K145337K198812K480256L016189L878177L757880
$$ 45068328 46553743 48147438 50292775 52491587 54971843 57988032 61866209 65624089
3727F5624089M760571N176600O050552O053195P181295P642056R468757J0541782
$$ 65624089 70384660 75561260 81611812 87665007 94846302 102488358 111957115 122498897
3719A22498897J3706518J5434899K1225304K6291178L4772028M3203670N9243474
$$ 122498897 136205415 151640314 172865618 199156796 233928824 277132494 336375968
3712C36375968O8512053P0768077M967170p5619112p3264102n9494969m7354703
$$ 336375968 404888021 475656098 480623268 405004156 331740054 272245085 224890382
3705B24890382m1226811l1494070k3709960j7702147j4028569j0790754r531128
$$ 224890382 183663571 152169501 128459541 110757394 96728825 85938071 76406943
3698G6406943p681216o542018n155229m763314l891215l566745l208892k899992
$$ 76406943 68725727 62183709 57028480 52265166 48373951 44807206 41598314 38698322
3690C8698322k304472k379273j847591j801134j662438j768634j518831j423441
$$ 38698322 36393850 34014577 32166986 30365852 28703414 26934780 25415949 23992508
3682B3992508j357535j309014r37279j091084r47167r01249q42562q06192o30890
$$ 23992508 22634973 21325959 20388680 19297596 18350429 17449180 16606618 15800426 15169536
3673A5169536n81783p45118p23116n61589m97892m44652o27879n03312l54619
$$ 15169536 14587753 13842635 13119519 12557930 12060038 11615386 10987507 10484195 10129576
3664A0129576k90836m66270k29908l31573k91846k94979k56333j89803k21954
$$ 10129576 9838740 9372470 9142562 8810989 8519143 8224164 7967831 7778028 7556074
3655G556074l44273l42330n6071j12076l00476l44321m7349j65436j47768j91403
$$ 7556074 7211801 6869471 6813400 6701324 6400848 6056527 6009178 5843742 5695974 5504571
3645E504571p1394j83726j91785j05030k01677M6804p981r5728j97933r7872q1338
$$ 5504571 5433177 5249451 5057666 4952636 4750959 4797763 4789782 4694054 4496121 4398249 4316911
3634D316911k45519p6495l7802J15386p6949R6994k10639k40311j19092L2823
$$ 4316911 4071392 3994897 3957095 4072481 3995532 4092526 3881887 3641576 3522484 3555307
3624C555307k83659j20172o3709q7015M5012j45779q2021j56655l5891O2083l2002
$$ 3555307 3271648 3151476 3087767 3000752 3045764 2899985 2817964 2661309 2625418 2687501 2655499
3613B655499N8136k31281l0293j1132q7367M6210m9016p4017j20533O0520R8977
$$ 2655499 2713635 2482354 2452061 2440929 2353562 2399772 2350756 2276739 2156206 2216726 2315703
3602B315703j91090M1500k32080o4568j01880J03303n0218J55777k6445l1429
$$ 2315703 2124613 2166113 1934033 1869465 1767585 1870888 1820670 1976447 1950002 1918573
3592A918573j20003l8824J7866P5759p8457k0158j55223L5648j93550j3814k1231
$$ 1918573 1798570 1759746 1777612 1853371 1774914 1754756 1599533 1635181 1441631 1427817 1406586
3581A406586J1314K2689p6936j02117P9243q5039j25686o596N0987j15340j5794
$$ 1406586 1417900 1440589 1363653 1261536 1340779 1255740 1130054 1123458 1174445 1059105 1043311
3570A043311m9271L2870j0299n6183j7310J28829j21525j0446J45802J845P2724
$$ 1043311 994040 1026910 1016611 960428 943118 1071947 950422 939976 1085778 1087623 1160347
3559A160347j83606m9618k1884K4392K1275P7023n8090m9291J29881k39796m7310
$$ 1160347 976741 927123 905239 929631 950906 1027929 969839 920548 1050429 810633 763323
3548G63323K2432J36268J601j04894J03663j23371J4278R2419O584m1153o8053
$$ 763323 785755 922023 923624 818730 922393 799022 813300 905719 912303 871150 803097
3537H03097R2641j7335m267j69508k3604o6697m150J66201m1186k0164l9223r9160
$$ 803097 895738 878403 874136 704628 681024 614327 610177 776378 735192 715028 675805 576645
3525E76645M3697J31657L2506r5262L7443L9592J775j04937O7431j28396J73341
$$ 576645 620342 751999 784505 689243 726686 766278 768053 663116 730547 602151 775492
3514G75492R2597r5958m7838q5048P7920N1447L6981j62823k625q6024R3252M9282
$$ 775492 868089 772131 724293 639245 717165 768612 805593 642770 640145 554121 647373 696655
3502F96655l818L3425M6471j30373N0813O3410J3940l493q9317J9871O8262N4982
$$ 696655 692837 726262 772733 642360 693173 756583 770523 767030 677713 697584 765846 820828
3490H20828o8078j8437L0244j80351N0597J23408N500j19862N5142k7302n8894
$$ 820828 752750 734313 764557 584206 634803 758211 763711 643849 698991 671689 612795
3479F12795j16054j8212L1453J51992J4650j01568n033K2926o7289K4929J4873
$$ 612795 496741 478529 509982 661974 676624 575056 570023 592949 525660 550589 565462
3468E65462K3082j09014J2912K4938R681k5162J04682N1947p9994J48311R0147
$$ 565462 588544 479530 492442 517380 527061 501899 606581 658528 578534 726845 816992
3457H16992j23574j24277P168k12167j03378K66659l830o1579L3820K384J68823
$$ 816992 693418 569141 576309 364142 260764 527423 523593 462014 495834 498218 667041
3446F67041q3695o1496Q2135o5933J53793m2484O8358j83948k5018P9624N30j4759
$$ 667041 583346 521850 603985 538052 691845 649361 717719 533771 508753 588377 588907 574148
3434E74148p662j4138k9948o857N6984j87937R0190J43286j89618J0913O9808
$$ 574148 566486 552348 522400 515543 572527 384590 474780 618066 428448 439361 509169
3423E09169o8785J42432l0460k10766J9254O950N632Q9021n3202M2162p1110P8684
$$ 509169 440384 582816 552356 341590 360844 367794 373426 462447 409245 451407 380297 458981
3411D58981J2423Q0051r639q9671R8383j9695N6766P7048p5331j19215r864J42404
$$ 458981 471404 551455 541816 452145 550528 530833 587599 664647 589316 470101 460237 602641
3399F02641j31364P0311j13440M4908R1560m7841M7816k7572L277n7320P5881
$$ 602641 471277 541588 428148 473056 564616 516775 564591 537019 540296 482976 558857
3388E58857j5796m3825J7166J94081m2235O4536m2767k4362n2777j21266l9570
$$ 558857 543061 499236 516402 710483 668248 732784 690017 665655 612878 491612 452042
3377D52042k752k948j74789J67957K44980M7853r4370L1863l0740O913J64391
$$ 452042 449290 446342 271553 439510 684490 732343 637973 669836 639096 646009 810400
3366H10400R7586J5473k4125j16365k5355P2128q3367j45451m0793N7089N8912
$$ 810400 907986 923459 899334 782969 757614 829742 746375 600924 560131 617220 676132
3355F76132J11505L9726J5733p4829L8929J3118K45362j39453j6679j32051J27246
$$ 676132 787637 827363 843096 768267 807196 820314 1065676 926223 909544 777493 904739
3344I04739q757j14982j365Q2073n6771m7235l6494N9837q1318p8798K9567r5877
$$ 904739 895982 781000 779635 861708 804937 757702 721208 781045 699727 620929 650496 554619
3332E54619k1195J69631j0937n9484j02048K46929l0897j00641j9156L9470q5154
$$ 554619 533424 703055 692118 632634 530586 777515 746618 645977 626821 666291 581137
3321E81137j55800o3422L52089p052n3702j40j54828j3036M5858L9973n4870k4639
$$ 581137 425337 361915 714004 706952 653250 653110 498282 485246 531104 571077 516207 491568
3309D91568N6048n6124K2503L0470m0758o7458j08774J1720J27158J07414r5098
$$ 491568 547616 491492 513995 544465 503707 436249 327475 339195 466353 573767 478669
3298D78669l6310Q8244J7220m796J43740j6401j03397j5755J87530q8239P9772
$$ 478669 442359 530603 547823 543027 686767 670366 566969 551214 738744 650505 730277
3287G30277p5170J0703m8429J25669j17146J08680l2445J0738J21311r0973o1337
$$ 730277 655107 665810 617381 743050 625904 734584 702139 712877 834188 743215 681878
3276F81878J04878l055J0818n5668L4224q2040J0124L8365r6322Q2318q8689j15012
$$ 681878 786756 783701 794519 738851 773075 691035 701159 739524 643202 725520 636831 521819
3264E21819J12110q063m1805J70538k9415r1697o3355J2394J52940j02003n3979
$$ 521819 633929 625866 584061 754599 725184 633487 570132 582526 735466 633463 579484
3253E79484M1854q2125K6108L5075J12395k45454J25180J28510j45218K7798k0021
$$ 579484 621338 539213 565321 600396 712791 467337 592517 721027 575809 603607 583586
3242E83586p0627N5410j0522J38901j28669j10071J01732R0949J01948j25240
$$ 583586 512959 568369 557847 696748 568079 458008 559740 650689 752637 627397
3232F27397p1533k4792k122J65217j0575J326O9340m6685q7906K6991O0602r6751
$$ 627397 555864 531072 528950 694167 683592 684918 754258 707573 619667 646658 707260 610509
3220F10509r9122J14989J2826K4061O964O5241q2718J53203k5123o5287J48434
$$ 610509 511387 626376 639202 663263 670227 735468 652750 805953 780830 715543 863977
3209H63977p3303M5022o0449O0975r0242l1959j8274J27603J0926O9895m2777
$$ 863977 790674 835696 775247 836222 745980 714021 695747 823350 834276 904171 861394
3198H61394J57877Q5348k43242J11909m9694m904J29238n0544J28992M3954j0437
$$ 861394 1019271 1104619 861377 973286 923592 918688 1047926 997382 1126374 1170328 1159891
3187A159891R2159o6954j9582K16865J1J11168Q4946N83J44332M5582J02655P2010
$$ 1159891 1252050 1185096 1165514 1382379 1382390 1493558 1578504 1579087 1723419 1769001 1871656 1943666
3175A943666j25296r8243J10921j2825R065O6826J23572k446Q1285L07540J8004
$$ 1943666 1818370 1720127 1831048 1818223 1827288 1894114 2017686 2015240 2096525 2404065 2422069
3164B422069J64372J25775J25491J78528J68673J35864K60512J56996L81409K14673
$$ 2422069 2586441 2712216 2837707 3016235 3184908 3320772 3581284 3738280 4119689 4334362
3154D334362L30104M27898J64517L23351O26401M50759M64197N04732N38880N25222
$$ 4334362 4664466 5092364 5256881 5580232 6206633 6657392 7121589 7626321 8165201 8690423
3144H690423N56790P30939Q02718R54307Q26612Q33446R04130Q84018J330114
$$ 8690423 9247213 9978152 10780870 11735177 12561789 13395235 14299365 15183383 16513497
3135A6513497J649026J851039J969709K389059K773069K478787K503502K146209
$$ 16513497 18162523 20013562 21983271 24372330 27145399 29624186 32127688 34273897
3127C4273897K449197K981082L385918L274762J950941J669649J212521J430566
$$ 34273897 36723094 39704176 43090094 46364856 48315797 49985446 51197967 52628533
3119E2628533K293962K152190L02037q11567j300073k000652j723160j114690
$$ 52628533 54922495 57074685 57376722 56565155 55265082 53264430 51541270 50426580
3111E0426580j829275k918919k856470l172059l122557k795727k458613k903603
$$ 50426580 48597305 45678386 42821916 39649857 36527300 33731573 31272960 28369357
3103B8369357k831241k680569k617933k390641j971010j808677j606936j274101
$$ 28369357 25538116 22857547 20239614 17848973 15877963 14069286 12462350 11188249
3095A1188249r17664r71328o74474n96884m38888n04442m74486m30983n93879
$$ 11188249 10270585 9299257 8624783 8027899 7589011 7084569 6610083 6179100 5585221
3086E585221k25655k10711l00083l54881k09233k6925k23762j20191k87674j12096
$$ 5585221 5359566 5148855 4848772 4493891 4284658 4257733 4033971 3913780 3626106 3514010
3076C514010j24764j46871j33428j04537j70160j07003j45119j86068M065r2025
$$ 3514010 3389246 3242375 3108947 3004410 2834250 2727247 2582128 2396060 2400125 2308100
3066B308100l9597j05033L8380j74225r7342j53534o8736N444o6616o5731P27
$$ 2308100 2268503 2163470 2201850 2027625 1930283 1776749 1708013 1713457 1646841 1581110 1581837
3055A581837J63256r1715K273j71500o2654k7856J2687J07175j22195k14707J17095
$$ 1581837 1745093 1653378 1655651 1484151 1421497 1393641 1406328 1513503 1391308 1176601 1293696
3044A293696j12997l4445q082j80314M5332o92J8936J0111j10045M4271P6282
$$ 1293696 1180699 1146254 1138172 957858 1003190 1002498 1021434 1031545 921500 965771 1042053
3033A042053o3442j22801O4237k9853j62113J9464Q450j0423m0387K3035K7301
$$ 1042053 978611 855810 920047 890194 728081 747545 755995 745572 705185 728220 755521
3022G55521K3955j74118M8107R240j32122Q2451P4185k43315J11296j6506p2015
$$ 755521 779476 605358 653465 662705 530583 613034 687219 443904 555200 538694 466679
3011D66679J34156L3663k8019J4954n1764O332k8995L0420p6408m4222o0009R1473
$$ 466679 600835 634498 606479 621433 569669 576001 547006 577426 501018 456796 396787 488260
2999D88260j2653p7747R9030P239K4426m7637m788j30856n1552R9039l5819j3554
$$ 488260 475607 397860 496890 504129 528555 480918 476130 345274 293722 392761 356942 343388
2987C43388J2880Q8834r1813n6186J30238n1687O8597j045L7949n3142l5857J18270
$$ 343388 356268 445102 353289 297103 427341 375654 444251 443206 481155 428013 392156 510426
2975E10426M6449m9290k64993r0031J9169M9804K5439M7506O0901o7461p3813
$$ 510426 556875 507585 242592 152561 171730 221534 246973 294479 355380 287919 214106
2964B14106Q0925m504k4940J32141k26354J20044J29037J5373k2738o8629n8459
$$ 214106 295031 290527 265587 397728 171374 291418 420455 435828 413090 344461 286002
2953B86002q1952K5941J22629J0538j18864n3588J06639P6393j3045J05109j05585
$$ 286002 204050 229991 352620 363158 244294 190706 297345 373738 360693 465802 360217
2942C60217K9381K3777l0083R8603o3921R1308J21630k07647j08624k8445Q3510
$$ 360217 389598 413375 383292 481895 417974 509282 630912 423265 314641 286196 369706
2931C69706N5399J9275M3334J785k0975J9727Q3040M2712k8625R5396l4511j02432
$$ 369706 425105 444380 487714 489499 468524 488251 571291 614003 585378 680774 646263 543831
2919E43831J4146N0630J08812k7381J08499M9800q4626J39045J41285o8442J70482
$$ 543831 557977 608607 717419 690038 798537 848337 763711 902756 1044041 975599 1146081
2908A146081J95524M7215J0279K6975k640J9474K37908Q0068k759N1443K28248
$$ 1146081 1341605 1388820 1399099 1426074 1423434 1442908 1680816 1760884 1758125 1809568 2037816
2897B037816P5722J77032K43259k3162L6026J66860J56500J2221K53387j9450
$$ 2037816 2113538 2290570 2533829 2510667 2546693 2713553 2870053 2882274 3135661 3116211
2887C116211J42596K20974R8139P3643m5503L9007J52407k6843q5792J59468p7875
$$ 3116211 3258807 3479781 3577920 3651563 3606060 3645067 3797474 3770631 3684839 3844307 3766432
2876C766432p0055J58318n0275j73357q3728l7554j79850m8338J01938j26162
$$ 3766432 3696377 3854695 3804420 3631063 3547335 3509781 3329931 3281593 3383531 3257369
2866C257369j65301J42183o6984j59958j42508l58971l506j10606k03273r4854
$$ 3257369 3092068 3234251 3167267 3007309 2864801 2505830 2502324 2391718 2188445 2093591
2856B093591q2362M4806o5351j93430r2345m9525K3116k85272o0959j53607j5595
$$ 2093591 2011229 2056035 1990684 1797254 1704909 1655384 1678500 1393228 1332269 1178662 1163067
2845A163067L6898o4964J63361N0286l1102j51971N9654j22660P7965K24349P3057
$$ 1163067 1199965 1135001 1298362 1348648 1317546 1165575 1225229 1102569 1180534 1404883 1477940
2834A477940K38945K7703o9602k3181n33j48233l44271o4706j14048j42250K7902
$$ 1477940 1716885 1744588 1674986 1651805 1651272 1503039 1158768 1094062 980014 837764 865666
2823H65666j26161r5273j56554K5835m4839P1898r765p6542M4061o6130j59753
$$ 865666 739505 644232 487678 513513 468674 540572 530807 454265 498326 432196 272443
2812B72443K19290Q9088j01332M6835j59739q2256L4734k5329M3143q1391Q4068
$$ 272443 491733 580821 479489 526324 366585 284329 319063 293734 336877 255486 339554
2801C39554L6630r5570O8498L5853K2031p1914j27771k6996K35O0303j31896Q4078
$$ 339554 376184 280614 349112 384965 406996 335082 207311 180315 180550 240853 108957 193035
2789A93035k0042Q2890o0870l5370K8239q8436M7191j30833Q2255N1246K4578
$$ 193035 172993 255883 195013 159643 187882 99446 146637 15804 98059 149305 173883
2778A73883o1635J9314J33979O3097j32747N7926P0294j17500q7484J64582n7457
$$ 173883 112248 131562 265541 328638 195891 253817 324111 206611 119127 283709 226252
2767B26252j09155p0329J13385R6409k4168K6394Q217m6244l7715O8376l8313
$$ 226252 117097 46768 160153 256562 232394 258788 267005 220761 183046 251422 213109
2756B13109r7202J84552j09396R189N5370P0605j12596p0682J01499p3958l7988
$$ 213109 115907 300459 191063 200252 255622 326227 213631 142949 244448 170490 132502
2745A32502O6299m1917J4792K2175L0704m9473O1192j2128l5889P9205m0042l7789
$$ 132502 198801 156884 171676 193851 224555 175082 236274 224146 188257 267462 227420 189631
2733A89631R9456j59320L0274k7n5095O9265O8221P4800q3369j38263P4342J04091
$$ 189631 289087 129767 160041 160014 104919 174184 242405 317205 233836 95573 169915 274006
2721B74006j4882j0508J06443J23013j84170q4284M2857j4827L5909l5290j4198
$$ 274006 259124 248616 355059 478072 293902 209618 252475 237648 273557 238267 224069
2710B24069M8652J17384j78414r749m2739q625R2358K1259J8370N4206k5988q2321
$$ 224069 272721 390105 211691 201942 159203 150578 242936 264195 282565 336771 310783 228462
2698B28462K5451l7785l8019N8645M7702J5383L157m5313J4845j37999J96335
$$ 228462 253913 216128 178109 236754 284456 299839 302996 257683 272528 134529 330864
2687C30864l7098J42364n6665l688J2668K1412l912J2512N6595m9371n3079R1425
$$ 330864 293766 436130 379465 375777 388445 409857 405945 418457 475052 425681 372602 464027
2675D64027k5166L2880N1447O0291o9680l3303N4629o2735m158Q6388J33684r2564
$$ 464027 438861 471741 523188 583479 513799 480496 535125 472390 468232 554620 688304 595740
2663E95740l5718k9896j19769K1717N3297N5607k9569L4126K4560k6466Q999N9472
$$ 595740 560022 530126 410357 432074 485371 540978 511409 545535 570095 543629 552628 612100
2651F12100l8718P5760J4041K4123L4861r3291q183L204l6162n9124r640Q3849
$$ 612100 573382 649142 663183 687306 722167 628876 620693 623897 587735 528611 518971 602820
2639F02820p3682k0609J63157M3196m2209O0264n8399J04142L7310k56732o0609
$$ 602820 529138 508529 671686 714882 672673 732937 674538 778680 815990 559258 498649
2628D98649R5286M7627N0603K4449r8073l7388l5410J4929l0175N0350n3437m1158
$$ 498649 593935 641562 692165 716614 618541 581153 545743 560672 530497 580847 527410 486252
2616D86252r023K609p4220N9742J05059j42207Q4839O9089K5863j38047J1399
$$ 486252 477229 479838 405618 465360 570419 428212 513051 582140 608003 469956 481355
2605D81355J68042L0356q99j25988q8573L0542Q0081r453k5727L6419J86085k9319
$$ 481355 649397 679753 678854 552866 464293 494835 574916 565463 539736 576155 762240 732921
2593G32921K9988j02030J461o69j57604n2160o6586K55819r0552J16790q2958
$$ 732921 762909 660879 662340 661671 504067 451907 385321 641140 550588 667378 584420
2582E84420j20606J72963J22738M8230p1612m9775L4116N4532k8162K1603R4916
$$ 584420 463814 636777 759515 807745 736133 686358 720474 775006 746844 768447 863363
2571H63363m6649l1151N8320M3630K3573O3951L1878m5132l9461M3692O3266j2889
$$ 863363 816714 785563 843883 887513 911086 975037 1006915 961783 922322 966014 1029280 1016391
2559A016391P9907J86925J21083o2888K8264K13274Q6422j2939K16556J48544
$$ 1016391 1096298 1283223 1404306 1341418 1369682 1582956 1669378 1656439 1872995 2021539
2549B021539M9719J78867J24864m1441O4516K59247J38225o1423K08776N3149
$$ 2021539 2071258 2250125 2374989 2333548 2398064 2657311 2795536 2734113 2942889 2996038
2539B996038J74969J20790K63811J44863J74710K47668L31776K44498K47322K15960
$$ 2996038 3171007 3291797 3555608 3700471 3875181 4122849 4454625 4699123 4946445 5162405
2529E162405K40407L67204M32821L95321L44548M08773L52084K10735K77936J02982
$$ 5162405 5402812 5770016 6202837 6598158 6942706 7351479 7703563 7914298 8192234 8295216
2519H295216J24428q0280L8198m5048k68308l2469n9303l0823j16252l34847k25649
$$ 8295216 8419644 8339364 8377562 8332514 8064206 8031737 7972434 7941611 7825359 7490512 7264863
2508G264863j39703l79196m68953m90278m04602o18847k09215m21289m59382l59915
$$ 7264863 7125160 6745964 6277011 5786733 5382131 4763284 4554069 4132780 3673398 3313483
2498C313483j99744o6826r6684k82374k43576j05083k18705r9119k3189q2925
$$ 3313483 3113739 3046913 2950229 2667855 2424279 2319196 2100491 2001372 1978183 1895258
2488A895258j59268o8239r195K8626p731r2478j39173r123o2169j64295K884K07900
$$ 1895258 1735990 1667751 1658556 1687182 1679451 1586973 1447800 1438677 1376508 1212213 1215097 1422997
2476A422997j50227n3598K0674j58868l223M8827o0531J29023K2729J20837k6370
$$ 1422997 1272770 1219172 1239846 1080978 1077755 1126582 1066051 1195074 1217803 1338640 1312270
2465A312270j8355M0992p6601L6826J3547j6499R3377j84151j1076Q8603r5743
$$ 1312270 1293915 1334907 1258306 1295132 1308679 1292180 1385557 1201406 1190330 1278933 1183190
2454A183190j3891L1883K3715R8082j9929J19932J7083l6140j15112k0335J48435
$$ 1183190 1169299 1201182 1224897 1322979 1303050 1422982 1440065 1403925 1288813 1268478 1416913
2443A416913Q4057K8354l2867J42540k7948K77832j3404K04124l1610J60581R4136
$$ 1416913 1500970 1529324 1496457 1638997 1611049 1888881 1875477 2079601 2047991 2208572 2302708
2432B302708J06322J01572K0915J64339J44580Q3198K25285O5223J8596N5532
$$ 2302708 2409030 2510602 2531517 2695856 2840436 2923634 3148919 3214142 3232738 3288270
2422C288270J23351J46078J96452M155L8458O5906J57018K5210P4857J22564k7644
$$ 3288270 3411621 3557699 3754151 3758306 3796764 3862670 4019688 4044898 4119755 4242319 4214675
2411D214675K35049J80769J20940K13448K11136J40192K14885K77045P7022L47281
$$ 4214675 4449724 4630493 4751433 4964881 5176017 5316209 5531094 5808139 5885161 6232442
2401F232442K57080M05444L14281K78017N29521L31475N35900O89835O36298N14152
$$ 6232442 6489522 6894966 7209247 7487264 8016785 8348260 8884160 9573995 10210293 10724445
2391A0724445N29091N89289O74227M06585M22659L91917K92156J22521J50497
$$ 10724445 11253536 11842825 12517052 12923637 13346296 13738213 14030369 14152890 14303387
2382A4303387j19984Q6781P1366l50477k44343j98628l31677j77642j93742l82074
$$ 14303387 14183403 14270184 14341550 13991073 13746730 13548102 13216425 13038783 12845041 12462967
2372A2462967l73905o15099o69062o60042o05165o99432p60695n16248n36867
$$ 12462967 12089062 11473963 10804901 10144859 9539694 8840262 8079567 7563319 7026452
2363G026452m24373n39747l39800m90104l36626j60469k35769j75464k07943k41200
$$ 7026452 6602079 6062332 5722532 5232428 4895802 4735333 4499564 4324100 4116157 3874957
2353C874957j17453j1315j85534p6857N0021j94563Q3942Q1902j95693j3645P2982
$$ 3874957 3757504 3746189 3560655 3483798 3533819 3339256 3423198 3505100 3309407 3295762 3368744
2342C368744j2577P1123J3896J13397O3427P868P6677k537J0663R6053j7771R2907
$$ 3368744 3356167 3427290 3441186 3554583 3618010 3625878 3702555 3700018 3710681 3806734 3788963 3881870
2330C881870K00208p4278j3298k4511p7626K13495K9128Q1437K46601M5356J50630
$$ 3881870 4082078 4007800 3994502 3969991 3892365 4105860 4134988 4216425 4463026 4508382 4659012
2319D659012K48678J33812K34699J63033L40027J57691K86426K58944J38725L74408
$$ 4659012 4907690 5041502 5276201 5439234 5779261 5936952 6223378 6482322 6621047 6995455
2309F995455J87162N03134L52777M55505O39448P84529N88535O64216O72306R37309
$$ 6995455 7182617 7685751 8038528 8494033 9133481 9918010 10506545 11170761 11843067 12780376
2299A2780376P97807Q52526Q98308P74678N09212M65761K15269K38306J59943
$$ 12780376 13578183 14430709 15329017 16103695 16612907 17078668 17293937 17532243 17692186
2290A7692186j80266j55565j22224j80993m29791k62394n19969m58129o66294
$$ 17692186 17511920 17356355 17234131 17053138 16623347 16360953 15840984 15382855 14716561
2281A4716561q57932r16276r14286q31795r32385j025231o99396n41984p67140
$$ 14716561 13858629 12942353 12028067 11196272 10263887 9238656 8539260 7997276 7230136
2272G230136m57023m16941n83875l90094m55188j79761k04668l49174o5580k11763
$$ 7230136 6773113 6356172 5772297 5382203 4927015 4747254 4542586 4193412 4127832 3916069
2262C916069k15880j47085j80244p3501j68805l2964j00326k31376r345j16689
$$ 3916069 3700189 3553104 3372860 3299359 3130554 3097590 2997264 2765888 2756543 2639854
2252B639854P3303j2389P3451j8520j64953M1777j06717l1711j20558n5319r3269
$$ 2639854 2713157 2700768 2774219 2755699 2590746 2632523 2525806 2494095 2373537 2318218 2224949
2241B224949k502L6691o2362J44072j19536O7485O4475p2130J31464K5867M0856
$$ 2224949 2222447 2259138 2196776 2340848 2221312 2288797 2353272 2281142 2412606 2438473 2479329
2230B479329j2608M2946J6607q6336k1928j8236j06080M1189j52419j34278j8943
$$ 2479329 2466721 2509667 2526274 2439938 2418010 2399774 2293694 2334883 2182464 2048186 2029243
2219B029243K1733j70329K1144L08945j17844j62439K7095K10637O1839J41470
$$ 2029243 2050976 1880647 1901791 2210736 2092892 1930453 1957548 2168185 2230024 2371494
2209B371494k1371J00181J51654j5585K3901j9764L04510N3227J0030K03980K71002
$$ 2371494 2350123 2450304 2601958 2586373 2610274 2590510 2895020 2948247 2958277 3162257 3433259
2198C433259M9637L00928L73172J32078J88980L16806K46121J70602L76636J92876
$$ 3433259 3482896 3783824 4156996 4289074 4478054 4794860 5040981 5211583 5588219 5781095
2188E781095K06457O5336R6044J47601J87069j79297k53599l6912j53946j34313
$$ 5781095 5987552 6052888 6148932 6296533 6483602 6304305 6050706 6013794 5859848 5725535
2178E725535j36723l44805o6586o0847n3682m9163o1153J52350J35549J46109
$$ 5725535 5588812 5244007 5177421 5116574 5062892 5013729 4952576 5104926 5240475 5386584
2168E386584K10831Q7754M8424P8639r4152o1695j67233k12421k74467k85552
$$ 5386584 5597415 5685169 5733593 5812232 5718080 5656385 5489152 5276731 5002264 4716712
2158D716712l24444k96802k91040l87691k33654j81767k57558j84049j96446j72824
$$ 4716712 4392268 4095466 3804426 3416735 3183081 3001314 2743756 2559707 2363261 2190437
2148B190437n7786j39949O8249p6078k36835m7012N3427j83993p7182J37376j20315
$$ 2190437 2132651 1992702 2060951 1984873 1748038 1701026 1754453 1570460 1493278 1630654 1510339
2137A510339j6082k5415N2175J25260j12257r8806P7353j3713J06203j69779K29427
$$ 1510339 1494257 1468842 1521017 1646277 1534020 1435214 1512567 1498854 1605057 1435278 1664705
2126A664705Q4167k8894l5520J12429j67506k6028K08639j72774p2184k0307k83622
$$ 1664705 1748872 1719978 1684458 1796887 1629381 1603353 1811992 1639218 1567034 1546727 1263105
2115A263105m8809J16050o8656r2175m3096m6246p5654P1968l9596k6769q5041
$$ 1263105 1214296 1330346 1261690 1169515 1126419 1080173 1004519 1076487 1036891 1010122 925081
2104I25081j0891j25760K7331N1684k2190l9702k5420j7455K4595M0541J13521
$$ 925081 914190 788430 815761 867445 845255 805553 780133 762678 787273 827814 941335
2093I41335l762q846K1559L0804k16178J1707J17527m5092j35475j42730K58322
$$ 941335 937573 928727 950286 981090 764912 776619 894146 849054 713579 570849 829171
2082H29171O2583R528k4412j61654M8950R0591m2130J6190J33631L2792q9346
$$ 829171 891754 901282 876870 715216 764166 854757 812627 828817 962448 995240 905894
2071I05894k5158P0212n1521l1156k6999J50372J06197q1877K8595L6860j42607
$$ 905894 880736 950948 899427 868271 841272 991644 1097841 1015964 1044559 1081419 938812
2060I38812o9589l1469O835O4142J67347p2187N6279P4612j40256J11207L3029
$$ 938812 869223 837754 844589 908731 1076078 1003891 1060170 1134782 994526 1105733 1138762
2049A138762L1665j15857P7698Q1123j02100J25654K491m0310L02623p6792J20370
$$ 1138762 1170427 1054570 1132268 1213391 1111291 1236945 1239436 1199126 1501749 1424957 1545327
2038A545327J33063m4169R1013J99065J28587j56224P8338J24047J80617J67436
$$ 1545327 1678390 1634221 1725234 1924299 2052886 1896662 1975000 2099047 2279664 2447100
2028B447100J89006K1463J03314L19002J87571L08699K80920L68196L38743J74032
$$ 2447100 2636106 2657569 2760883 3079885 3267456 3576155 3857075 4225271 4564014 4738046
2018D738046N61610N51911O18485N93845L99275N71106M57693O31955K46383J87994
$$ 4738046 5299656 5851567 6470052 7063897 7463172 8034278 8491971 9123926 9370309 9558303
2008I558303M34684K56902M95803N16748O82151P12418Q33911J006465J164759
$$ 9558303 9992987 10249889 10745692 11262440 11944591 12657009 13490920 14497385 15662144
1999A5662144J364898J567710J782371K173748K629029K784245K732411K666111
$$ 15662144 17027042 18594752 20377123 22550871 25179900 27964145 30696556 33362667
1991C3362667J925540J633491J088822j16422j503588l043520l713029l649552
$$ 33362667 35288207 36921698 38010520 37894098 36390510 33346990 29633961 25984409
1983B5984409l415339k796951k430368j824741j570876j280173j198385j054502
$$ 25984409 22569070 19772119 17341751 15517010 13946134 12665961 11467576 10413074
1975A0413074r53032p15083m99737n16201n66398n14982l73496m63721l55340
$$ 10413074 9460042 8744959 8245222 7729021 7162623 6647641 6274145 5810424 5455084
1966E455084l42241j85097l31501k77281j24687k62836k44586k47783j23891r1509
$$ 5455084 5112843 4927746 4596245 4318964 4194277 3931441 3686855 3439072 3315181 3223672
1956C223672p0291j80639q6307q5769j65674l8115j27442O576k10325k7544k08101
$$ 3223672 3153381 2972742 2886435 2800666 2634992 2596877 2469435 2476011 2265686 2238142 2030041
1945B030041r6292j35142j46736N7934N4666l14800k1777J14286j04169k28099
$$ 2030041 1933749 1798607 1651871 1709805 1764471 1449671 1427894 1542180 1438011 1209912
1935A209912J35220J39050j17327l6790j23887o7315j12583j20494L8238M7976
$$ 1209912 1345132 1484182 1366855 1330065 1206178 1138863 1026280 905786 944024 992000
1925I92000R78o1815J30880k28188l0590N3574j20905m3843N9274J66483o5050
$$ 992000 992978 931163 1062043 833855 803265 856839 735934 692091 751365 917848 852798
1914H52798j45185q3372J15421J28057j91342o0005n3869L382M6206m703j29667
$$ 852798 707613 624241 739662 867719 676377 616372 562503 565885 612091 607388 477721
1903D77721p5122J2606J33554j9898L7670L7397l5708R3728j15657j9106j04470
$$ 477721 402599 415205 548759 528861 566531 603928 568220 661948 546291 527185 422715
1892D22715L3641l6872K244L9882L4352j64121K7657K360p6197j26667M2366j8189
$$ 422715 456356 419484 421728 461610 495962 331841 359498 361858 285661 158994 201360 183171
1880A83171K7652J19698j5153J88548r4627k1998l129q6415M6721O460l9232q7130
$$ 183171 210823 330521 315368 503916 409289 387291 384162 297747 344468 350928 311696 224566
1868B24566q359j00767P7899Q4812l7881m7958l0860N3987N7197P4785j14739
$$ 224566 216207 115440 193339 278151 240270 192312 161452 215439 272636 347421 232682
1857B32682m25P3682O7547j78653o1949o4868J38127o0965q1139N6016L3998L4511
$$ 232682 232257 305939 373486 194833 132884 68016 206143 145178 64039 120055 154053 188564
1845A88564o5475J15057m5168j48139l228K85289M845K3578q1963m5696j52705
$$ 188564 123089 238146 192978 44839 41611 326900 331745 355323 273360 227664 74959
1834G4959R30k019k8291k47J39460j40214Q9775J21324p8651j09125o1821o1133
$$ 74959 75889 73870 45579 45332 184792 44578 134353 255677 177026 67901 6080 -55053
1822e5053J5635J41652P9002J064m9684R7142j07466m447J3778J88589m6077j92153
$$ -55053 -39418 102234 181236 182300 132616 229758 122292 117845 131623 320212 274135 81982
1810H1982P2274p5106J9449J07935j77305P1503Q8892J8074l7743O1122l7749
$$ 81982 154256 79150 98599 206534 29229 100732 189624 207698 169955 231077 193328
1799A93328j755Q904N9330j21318N3127P1221n6461M3569j47640q0241Q4445R8704
$$ 193328 191573 200477 259807 138489 191616 262837 206376 249945 102305 22064 106509 205213
1787B05213n7847O120r3724K35739j28283o0755k325L2617L887K7847J1163J2724
$$ 205213 147366 153486 59762 295501 167218 106463 104138 136755 140642 168489 179652 192376
1775A92376n0092P1176p566P3415r5950r5338k5735J68323o1411o4244j5959p9157
$$ 192376 142284 213460 205894 279309 183359 88021 62286 230609 169198 104954 88995 9838
1763I838o09L609L2483l6209M7388j59P0611P7916O5816k39755R634q2203O0794
$$ 9838 9229 12838 45321 9112 56500 56341 126952 204868 270684 30929 40563 -41640 19154
1750A9154m4625J28655j19787m5999R8915N8635l1835j4983l6726n8652K8535
$$ 19154 -25471 103184 -16603 -62602 36313 94948 63113 48130 11404 -47248 -18713
1739a8713R9008M2958j7209J13353j48619j3089M2249j65872P5095k1089J2760
$$ -18713 80295 123253 106044 219397 70778 57689 99938 -65934 9161 -11928 832
1728H32n0121P1010J52261k44773M6584o5615m2390M8712K6315J36857J8081m8333
$$ 832 -49289 21721 173982 -70791 -24207 -89822 -132212 -83500 -57185 79672 97753 49420
1716D9420q3297o5596P5703k3470n3539K46126K5986j03630j47488O1202L7440
$$ 49420 -33877 -99473 -23770 -47240 -100779 145347 171333 67703 -79785 -18583 18857
1705A8857j08726j50012J09687J75695O4814j45998Q5933O0945r6902J4622J923
$$ 18857 -89869 -239881 -130194 45501 110315 -35683 50250 111195 14293 28915 30838
1694C0838o0838K267M4469P5804M0646n9561P0819k10896P4501K0451p458j0776
$$ 30838 -30000 -27733 16736 92540 133186 73625 144444 -66452 8049 28500 21042 10266
1682A0266l3593q4283Q6377R5423j04758N334K1677L1402N6332Q0733j11349q5880
$$ 10266 -23327 -107610 -21233 74190 -30568 -25234 -3557 27845 84177 164910 53561 -32319
1670c2319q2508R730l494O0098q1905N9482K54585l1124j40817j11405J7900l7903
$$ -32319 -114827 -105097 -108591 -48493 -130398 -70916 183669 152545 11728 -99677 -81777 -119680
1658a19680J66246l158L7223O6424P658J2033p1696Q199o3118l4568O1447r2483
$$ -119680 46566 43408 80631 147055 154713 166746 95050 103249 40131 5563 67010 -25473
1646b5473m5637p9354R7825J37479j3852P7570l8541j81696L4512J06597m754
$$ -25473 -71110 -150464 -52639 84840 70988 148558 110017 -71679 -37167 69430 64676
1635F4676j1809N31j41848p071N5841K861R553j44660J32575J30787r0281r0243
$$ 64676 52867 53398 -88450 -95521 -39680 -36819 -27266 -171926 -39351 91436 1155 -89088
1623h9088K5575N6570Q0845Q6238j06743j1094Q943j09223K17608L7294q1364
$$ -89088 -63513 -6943 73902 160140 53397 42303 51246 -57977 159631 196925 115561
1612A15561j34868L1474L2353k8664o38l5842J41984N8496q3385k6612O653l1281
$$ 115561 -19307 12167 44520 15856 15218 -20624 121360 179856 96471 69859 76512 45231
1600D5231j09567J04729j1356p9151l6177J43111j01777J06796J03760j35879
$$ 45231 -64336 40393 29037 -50114 -86291 56820 -44957 61839 165599 29720
1590B9720J92227j81574o6630O6642m2881J15818j59399O5166q821O2378n5737
$$ 29720 221947 40373 -26257 40385 -2496 113322 -46077 19089 10268 72646 16909
1579A6909p1614Q9810N2157L3010q2428M7773j33000R5212N7062j69327M6726
$$ 16909 -54705 35105 87262 120272 37844 85617 -47383 47829 104891 -64436 -17710
1568a7710J85765j3351j03371j14384j8588k1590J15592j49950P9814J02450j18131
$$ -17710 168055 154704 51333 -63051 -81639 -103229 12363 -137587 -57773 44677 -73454
1557g3454L5249J670O4227m6200l049k1211J64410j71805o8328J05291M9683N7807
$$ -73454 -38205 -36535 27692 -18508 -21557 -42768 121642 -50163 -118491 -13200 36483 94290
1545I4290p6978n396q224R4100p2387M4356o839J50449m6728l5100L69J03471
$$ 94290 17312 11916 3692 97792 25405 69761 62922 213371 166643 131543 131912 235383
1533B35383j53442j59941J0797J78664r6907j58754R4836k9947k0489J50897R1416
$$ 235383 81941 -78000 -67203 111461 14554 -144200 -49364 -79311 -99800 51097 142513
1522A42513o6529m6251j13836L6196R4523m3770R1796j38678N8244q51k03864
$$ 142513 75984 29733 -84103 -47907 46616 2846 94642 -44036 14208 13357 -190507
1511a90507P1215l0517L900O1287R8066j12750j3403O9398k4204K07682m2995
$$ -190507 -119292 -149809 -145909 -84622 13444 -99306 -112709 -43311 -67515 140167 97172
1500I7172o3059L2159j06426J4272j9597L6603k8369q149q2681N0282R777N8013
$$ 97172 34113 66272 -40154 -25882 -45479 -8876 -37245 -45394 -128075 -77793 -68016 -10003
1488a0003K41436j50869k6585r1963j5636O185J4724q454j36720j7624k4258P6268
$$ -10003 231433 80564 53979 -37984 -53620 -47435 -32711 -41165 -177885 -195509 -219767 -143499
1476a43499M6814q860Q5993j4457j5101R945p7961k2687J10970J93822j58168
$$ -143499 -96685 -105545 -19552 -34009 -49110 -39165 -117126 -139813 -28843 164979 6811
1465F811n8341K21205j2101n2089J4181M8299r4733n7817M0112J56462m8984j82625
$$ 6811 -51530 169675 157574 105485 119666 167965 73232 15415 55527 211989 163005 -19620
1453a9620K8307P813M3322m510N4257R570r5673Q9823m7325o1184R5704j16037
$$ -19620 8687 16500 59822 55312 109569 119139 23466 113289 65964 4780 100484 -15553
1441a5553l4656J21014J07893j57198O1703J15407j6813O5318J46665j47536J1138
$$ -15553 -50209 70805 178698 21500 83203 198610 181797 247115 393780 246244 257382
1430B57382N8457M4934J01745k892l4311J34423m0875k1785J28236J11007J19275
$$ 257382 315839 360773 462518 459626 425315 559738 518863 497078 625314 736321 855596
1419H55596J9390P7639L06016K03909J61405M10966P17620N3451k16276R2580
$$ 855596 874986 952625 1258641 1462550 1623955 2034921 2752541 2805992 2589716 2682296
1409B682296l27520m24759l30016l56034l27322p4667k2500j82161n8117m2270
$$ 2682296 2354776 1930017 1600001 1243967 916645 841978 819478 637317 579200 536930
1399E36930q1112N4986K7787m8573j28131p8239m6906k8157l4928p3668N7023
$$ 536930 455818 510804 538591 490018 361887 283648 236742 208585 173657 99989 157012
1388A57012m5852m841J60188k3709q0186R0129j26655q2700J42686n0594j02211
$$ 157012 111160 106319 266507 242798 162612 252741 126086 43386 186072 135478 33267
1377C3267R5553j11917K4753P8330l0667j87034N1982M4147p1649R4380M3627
$$ 33267 128820 16903 41656 119986 89319 -97715 -45733 -1586 -73235 21145 64772
1366F4772j25517P0069J39569J4890L8488j63105r6044J4881N3282J01997J07527
$$ 64772 -60745 9324 148893 163783 202271 39166 -56878 -41997 11285 113282 220809
1355B20809j0445J2952r1527j03637n4048q1213q0447k354J00143Q5319m6636
$$ 220809 210364 223316 131789 28152 -25896 -107109 -187556 -189910 -89767 -4448 -51084
1344e1084J28921J11760r2899J2433j14569j9988L7609o6739k6953N2357l1200
$$ -51084 77837 189597 96698 109131 -5438 -25426 12183 -54556 -81509 -29152 -60352
1333f0352m8993L28807j01511m6948J06685j36277J12295j85643j16634R2330
$$ -60352 -109345 219462 117951 71003 177688 41411 153706 -31937 -148571 -56241
1323e6241K1732J08573j01894Q8850r8602N5799k9254l5911p4307k4253J32738
$$ -56241 -34509 74064 -27830 61020 -37582 18217 -11037 -46948 -121255 -145508 -12770
1312a2770J29185r7136J7296m1905m3477Q6993m9605k6237p9159J17482M1047
$$ -12770 116415 19279 36575 -5330 -48807 38186 -11419 -37656 -116815 667 41714
1301D1714o1535q8167N0874j8065Q0179R1322k54016N0813N4476J71336K2123
$$ 41714 -19821 -107988 -57114 -75179 5000 96322 -157694 -106881 -52405 118931 141054
1290A41054k42689l4101M4195O8817N9674k9007P5790j39165m911J71472j69951
$$ 141054 -101635 -135736 -91541 -22724 36950 7943 83733 -55432 -60343 111129 -58822
1279e8822J15699K8023M1220n9500K6832m1792r5527K4271r7583p2986P8702p257
$$ -58822 56877 84900 126120 66620 93452 51660 -43867 -19596 -117179 -190165 -111463 -118720
1267a18720P2540j19645N8045M138J2455J89468j01462m82N2261l689m9350o0933
$$ -118720 -46180 -165825 -107780 -103642 -91187 98281 -3181 -3663 48598 44909 -4441 -65374
1255f5374p006J75385j58352q372J00805M2143q046m6782j09900R3510l5166k4300
$$ -65374 -72380 103005 -55347 -63719 37086 79229 71183 24401 -85499 8011 -27155 -51455
1243e1455N5026P412j393j48348O8825J37083m4310q3761o5221J30494j5257l5590
$$ -51455 3571 10983 9590 -138758 -69933 67150 22840 -60921 -126142 4352 -10905 -46495
1231d6495R4670l4797k46l4755r4389J31276p5067Q9133r445N1422R0726l17936
$$ -46495 48175 13378 13132 -21623 -116012 15264 -59803 29330 19885 71307 162033 -155903
1219a55903l817J18420N0882j20594m2878J74507k675r9194p733J63290n9890
$$ -155903 -159720 -41300 9582 -111012 -153890 20617 17942 -81252 -88985 74305 14415
1208A4415n6057j5019O7969O204J7086k04925k1175O3216P5960K1222L1247q0997
$$ 14415 -41642 -56661 11308 17512 34598 -170327 -191502 -128286 -52326 -31104 143 -80854
1196h0854K6363l1709J0541K10674j12746j31148J02879R9103j60938K1517O390
$$ -80854 -54491 -86200 -75659 135015 22269 -108879 -6000 93103 -67835 -46318 -39928
1185c9928o4614j20811J42305j7372O6381J36050M0421j31601N8733j42673O0432
$$ -39928 -104542 -225353 -83048 -100420 -34039 102011 142432 10831 69564 -73109 -12677
1174a2677N6411o0354o4600L1296M991K3598P7904K085r4170m741r9489L4830
$$ -12677 43734 -16620 -81220 -49924 -44933 -21335 56569 58654 -35516 -40257 -139746 -104916
1162a04916k2105o435l5191N0298P8122K5374n18J25781j31067j07339J06922
$$ -104916 -127021 -133456 -168647 -118349 -40227 -14853 -15371 110410 -20657 -127996 -21074
1151b1074J04383j09413l5017R0463l1492k1075K3122N5753j8217r9375r310K4927
$$ -21074 83309 -26104 -61121 29342 -2150 -23225 -103 55650 37433 -61942 -71252 -46325
1139d6325R4582j16134j15347P2624J07637J0588J8687j3911O3770q478o533j75556
$$ -46325 48257 -67877 -183224 -110600 -2963 7625 26312 12401 76171 67693 61160 -114396
1127a14396k9959q6098R8197O5557J0849j6320M1306L4478j2959j8898m3622N4672
$$ -114396 -144355 -230453 -132256 -66699 -55850 -72170 -30864 3614 -9345 -28243 -71865 -17193
1115a7193Q2614m3520j15103J20971n3293N9412k1700q3843P2627k2387j9393
$$ -17193 65421 21901 -93202 27769 -25524 33888 12188 -71655 972 -21415 -40808
1104d0808K70546p0028q8475j25623L123J22462J02165k43706J35272l4380p7427
$$ -40808 229738 159710 71235 -54388 -51265 71197 173362 -70344 64928 30548 -46879
1093d6879j46755J12367M5687K4977L2749P4472j28100l3427J4124N2689r4080
$$ -46879 -193634 -81267 -35580 -10603 22146 96618 -31482 -64909 -50785 1904 -92176
1082i2176J05943J83301j81111J82474M1232j56071j77978k9150o8726J89599
$$ -92176 13767 197068 15957 198431 239663 83592 -94386 -123536 -192262 -2663
1072b663J01130k26678O062q594O1896m9893M6597p8912J32202P4651m4614K6884
$$ -2663 98467 -128211 -122149 -130743 -68847 -118740 -72143 -151055 -18853 55798 11184 38068
1060C8068J4700N4691n7309J30575m6253R174q4663J5889k9121M3244n1389n4801
$$ 38068 52768 107459 50150 180725 134472 143646 58983 74872 45751 88995 37606 -17195
1048a7195j12005P5278O0476k5044J39830l5647o9213P8374p8264k00558M4343
$$ -17195 -129200 -53922 6554 -18490 121340 85693 16480 94854 16590 -183968 -139625
1037a39625J66240l7831J7220R8725Q6755j72228j06873N2629n3730Q0966q0504
$$ -139625 26615 -11216 6004 104729 191484 19256 -87617 -34988 -88718 -7752 -88256
1026h8256L2014P1227q4033L1015l9923Q426J20998o2932k3931k325J30329p9992
$$ -88256 -56242 14985 -69048 -38033 -77956 -69530 51468 -11464 -35395 -37720 92609 12617
1014A2617m772N2858o1946l4042J68097j00002Q0849j19065j24097L2685L9405
$$ 12617 7845 60703 -1243 -35285 132812 32810 113659 -5406 -129503 -96818 -57413
1003e7413q457O6099P3257J06302j48180l0631J17296k8245n8068o491n4754r6863
$$ -57413 -65870 229 73486 179788 31608 977 118273 90028 31960 25469 -29285 -126148
991a26148p7246J05004M5269K0603K5231K144M127l7446M0020k16P5481r564m5099
$$ -126148 -203394 -98390 -53121 -32518 -7287 -5143 -1016 -38462 1558 1342 76823 67259 22160
978B2160r6717K28340l4746o6740J443R1939p4207k33160L1693M8385l3832k2224
$$ 22160 -74557 153783 119037 52297 53740 145679 71472 -161688 -129995 -81610 -115442 -137666
966a37666J15108N3775p0618K8662K6790J2403m461J27723j9979p0834m3601l6423
$$ -137666 -22558 31217 -39401 -10739 16051 28454 23993 151716 131737 60903 17302 -19121
954a9121Q5804j09879Q1465k3831k5264j60906R6016J30364p7425J18885j45502
$$ -19121 66683 -43196 38269 14438 -10826 -171732 -75716 54648 -22777 96108 -49394
943d9394r990O6947Q8946j15567Q7052j98317K207Q302L5446K41046p975l9597
$$ -49394 -59384 7563 96509 -19058 67994 -130323 -128116 -119814 -84368 156678 148703 109106
931A09106q706m9417J62627k05690J2497j02264L0319P8471j91138n5341R3644
$$ 109106 100400 50983 213610 7920 20417 -81847 -51528 26943 -164195 -219536 -125892
920a25892J34169N0826o6216q0353l9897J36534J3147r5685M3268O2028o3813
$$ -125892 8277 59103 -7113 -87466 -127363 9171 22318 -73367 -30099 31929 -31884
909c1884J00053R3206L0768j03779j13441K1288N1633J5980J16826j06843j19549
$$ -31884 68169 161375 192143 88364 -25077 -3789 47844 63824 180650 73807 -45742
898d5742k3705q2104J13852L4318N9723q5952J18386n3127J3362J26209J6629
$$ -45742 -69447 -151551 -37699 -3381 56342 -29610 88776 35649 49011 175220 191849
887A91849r2949n754j02337j03083P7439p1441L981J924R2859J5796l5048p7815
$$ 191849 98900 93146 -9191 -112274 -34835 -106276 -102295 -100371 -7512 8284 -26764 -104579
875a04579n7349n9574J12505N4742O6485J87329j93566p321N4756j01229j19717
$$ -104579 -161928 -221502 -108997 -54255 12230 199559 5993 -1328 53428 -47801 -167518
864a67518J19976r3946k4091Q3096J07713j7972j60737J38020J12948j87547j11809
$$ -167518 -47542 -141488 -165579 -82483 25230 7258 -153479 -15459 97489 -90058 -201867
853b01867J78605M4220j2736l8871N616k8073J1534n0606J212n3271K13390j63081
$$ -201867 -23262 20958 8222 -30649 -25033 -53106 -41572 -92178 -90966 -144237 69153 -93928
841i3928l5980K22145j69509N5248J12926J9369j65890n3686Q0593K5407l6221
$$ -93928 -129908 92237 -77272 -22024 90902 110271 -55619 -109305 -28712 -3305 -39526
830c9526J87021q955j5515j0991j7382j148K1315M7255j681m6962l6147j47048
$$ -39526 147495 138540 123025 112034 94652 93504 114819 162074 160393 113431 77284 -69764
818f9764j6134O6638P5488j30744R7144n0984L8929J5590j24020j72545N3967
$$ -69764 -85898 -19260 56228 -74516 22628 -28356 10573 26163 -97857 -270402 -216435
807b16435K43015p0493o1097J10001j76197J37679J3186j32194K06720J46341
$$ -216435 26580 -43913 -105010 4991 -171206 -33527 -20341 -152535 54185 200526
797B00526k51131J18134J07585j865k02248j0647K4147o885J2164J4689N4564
$$ 200526 -50605 67529 175114 173249 -28999 -39646 -15499 -22384 -10220 4469 59033
786E9033m7679l2973p5191M1801l4909J10831o036P8238p352M1107j17768K2889
$$ 59033 11354 -21619 -96810 -55009 -89918 20913 14877 93115 85763 126870 9102 31991
774C1991j6446k0697N9946l3104p2302P4758j0848Q6678O314k03461O7209j25626
$$ 31991 15545 -5152 54794 21690 -50612 24146 13298 99976 106290 -97171 -29962 -155588
762a55588R4595K22995L7883k00926k16430J17213L1593J15674K328j38806J19826
$$ -155588 -60993 162002 199885 -1041 -217471 -100258 -68665 47009 49337 -89469 30357
751C0357R6707o9450l3809l0249L1856Q7373j63451K9499J08819R676O4743o1492
$$ 30357 127064 57614 23805 -6444 25412 112785 -50666 -21167 87652 97328 162071 100579
739A00579o4936m3415P0701q7192n8593o9228N0868j04216M7135K07463N184N5330
$$ 100579 35643 -7772 62929 -24263 -82856 -152084 -101216 -205432 -158297 49166 54350 109680
727A09680m5566n7715Q3209o4017o5978P3467n6081l2345K25271J2451l7663j76366
$$ 109680 64114 6399 89608 25591 -40387 33080 -23001 -55346 169925 182376 144713 -31653
715c1653O7591K7853P8035k5113n2149n4835p0035l1375k2110q147O8238J15884
$$ -31653 35938 63791 141826 116713 64564 9729 -60306 -91681 -113791 -121938 -53700 62184
703F2184q2837r903k44461J81393p2049m1706J54954r1228O4194J949K8901m2399
$$ 62184 -20653 -30556 -275017 -93624 -165673 -207379 -52425 -143653 -79459 -77510 -48609 -91008
691i1008K80941j41367n7787J31001p9980n4737O3503k7927o2804L9190o3179
$$ -91008 189933 48566 -9221 121780 41800 -12937 50566 22639 -40165 -975 -64154
680f4154P923P8334j03397j34318K6483O5682N0043M5510m507K8705R3113N690
$$ -64154 -56231 22103 -81294 -215612 -189129 -123447 -73404 -27894 -32401 -3696 89417 95107
668I5107M379J29279p271j25166j44622r469J43787P4283m4661q2032N1542p8099
$$ 95107 99486 228765 221494 96328 -48294 -57763 86024 160307 115646 33614 85156 7057
656G057O0560Q9352l6092o0153Q4550j28980Q7342m3170p4669Q3368m3364p7855
$$ 7057 67617 156969 120877 60724 145274 16294 103636 60466 -14203 69165 25801 -52054
644e2054k1381K7084P0928L8642m5638O3024j125k9976r8946Q9137O5660l1998
$$ -52054 -73435 -46351 24577 63219 17581 80605 79480 49504 -49442 39695 105355 73357
632G3357k08887N3604J30505o7457j28283j9524J77455p780M215R6981o8491o4978
$$ 73357 -135530 -81926 48579 -18878 -147161 -166685 10770 2990 7205 104186 35695 -29283
620b9283P9788j84819R4030N7561q0159Q3203n1191R1613j9476j08722J55404
$$ -29283 50505 -134314 -40284 17277 -62882 20321 -30870 60743 41267 -67455 87949
609H7949o7190r0404P0888p4522Q8227r348o3344p926J0194J0389k2304K53585
$$ 87949 20759 -69645 1243 -73279 14948 5600 -57744 -65670 -55476 -45087 -67391 186194
597A86194m8450n9317o5124n6763R9045J27483j6438j18848n9154j63860Q4559
$$ 186194 137744 78427 13303 -43460 55585 183068 166630 47782 -11372 -175232 -90673
586i0673O9050M6371J19775r1924n416l2956J1366j11633j0780n4636J36520J17387
$$ -90673 -21623 24748 144523 52599 47183 14227 25593 -86040 -96820 -151456 -14936 102451
574A02451K4609j04162O2046m8639n5714j8918p3899R8077r6857l29J9881J24797
$$ 102451 127060 22898 84944 36305 -19409 -38327 -112226 -14149 -111006 -111335 -91454 33343
562C3343L9938j31167q6722J60957Q6448j82290Q381J02370o5880j49358O5441
$$ 33343 73281 -57886 -144608 16349 102797 -79493 -71112 31258 -34622 -183980 -118539
551a18539O3040n5120j31723Q1706K48439j81490R0442l1435j20301K09667J01216
$$ -118539 -55499 -110619 -242342 -160636 87803 -93687 -3245 -34680 -154981 54686 155902
540A55902j27835l4885r9840m3899J45347J1342j75336M3733L0347k2584J03919
$$ 155902 28067 -6818 -106658 -150557 -5210 6132 -169204 -125471 -95124 -117708 -13789
529a3789J14159N1186k10439n5264J62137J09099j35691o4743L3430j8912J04015
$$ -13789 100370 151556 -58883 -114147 47990 157089 21398 -43345 -9915 -28827 75188
518G5188k16340N2651J5444j58570J07612N9565j816J55845p0739o0128K2695
$$ 75188 -141152 -88501 -73057 -231627 -124015 -64450 -66266 89579 18840 -41288 -18593
507a8593j8933r9955j6380P1878K4149J66818k7342p7495P7733O5792o4947j50946
$$ -18593 -37526 -137481 -153861 -81983 -57834 108984 81642 4147 81880 147672 82725 -68221
495f8221J06994O3837l1874n5625k58551P7307L9115n4159J305O204K9127K4645
$$ -68221 38773 102610 70736 15111 -243440 -166133 -127018 -181177 -179872 -173668 -144541 -119896
483a19896K02793n977p9114r1628J5201R1797p3M8591k7743o380m7240P0782j9323
$$ -119896 82897 76920 -2194 -93822 -78621 13176 13103 61694 33951 27571 -19669 51113 31790
$$ [...]
##END NTUPLES=NMR SPECTRUM
##END=
