##TITLE=1H_CG-1208-x44
 CDCl3
 8 sc, 
 12.9.2024
##JCAMPDX= 6.0         $$ Bruker NMR JCAMP-DX V2.0
##DATA TYPE= NMR SPECTRUM
##DATA CLASS= NTUPLES
##ORIGIN= UXNMR, Bruker Analytische Messtechnik GmbH
##OWNER= root
$$ XWIN-NMR		Version 3.5
$$ Thu Sep 12 13:50:58 2024 Russian Standard Time (UT+4h)  she@DPX200
##.OBSERVE FREQUENCY= 200.1318
##.OBSERVE NUCLEUS= ^1H
##.ACQUISITION MODE= SIMULTANEOUS
##.ACQUISITION SCHEME= undefined
##.AVERAGES= 8
##.DIGITISER RES= 18
##SPECTROMETER/DATA SYSTEM= spect
##.PULSE SEQUENCE= zg30
##.SOLVENT NAME= CDCl3
##.SHIFT REFERENCE= (INTERNAL, CDCl3, 0, 21.0003)
##AUDIT TRAIL= $$ (NUMBER, WHEN, WHO, WHERE, WHAT)
$$ ##TITLE= Audit trail, XWIN-NMR		Version 3.5
$$ ##JCAMPDX= 5.01
$$ ##ORIGIN= Bruker BioSpin GmbH
$$ ##OWNER= she
$$ F:/spectra/data/she/nmr/H-F/1/pdata/1/auditp.txt
$$ ##AUDIT TRAIL=  $$ (NUMBER, WHEN, WHO, WHERE, WHAT)
(   1,<2024-09-12 13:49:19.53 +0400>,<she>,<DPX200>,
      <created by zg, POWCHK disabled, PULCHK disabled
       configuration hash MD5:
       00 E9 B6 7A A2 85 ED C7 34 08 36 98 17 FE 4E 26
       data hash MD5: 16K
       0E 81 EB 95 48 F9 E2 03 57 EF 4C 00 2D 8A 73 FE>)
(   2,<2024-09-12 13:49:44.62 +0400>,<she>,<DPX200>,
      <Start of raw data processing
       efp BC_mod = 2 LB = 0.24 FT_mod = 6 PKNL = 1 PHC0 = -26001.24 PHC1 = 23.98748 SI = 16K 
       data hash MD5: 16K
       98 3D 91 B2 8B 09 72 56 6A CE BF FD C0 3B EA 5B>)
(   3,<2024-09-12 13:50:13.62 +0400>,<she>,<DPX200>,
      <pk PHC0 = 5.998596 PHC1 = -18.4 
       data hash MD5: 16K
       89 6C 1E E4 4E 0C A4 17 FB F3 A4 39 BE 57 69 E6>)
(   4,<2024-09-12 13:50:17.53 +0400>,<she>,<DPX200>,
      <abs ABSG = 5 
       data hash MD5: 16K
       2D 55 C7 85 CC FC 40 89 63 A4 98 B9 A2 52 E6 A3>)
$$ ##END=
$$ 
$$ hash MD5
$$ 6E 28 7B 51 61 0F C9 18 DB 7E F1 48 F3 C2 BF D8
##$RELAX= 
##$RELAX= 
##$RELAX= 
##$RELAX= 
##$RELAX= 
##$RELAX= 
$$ Bruker specific parameters
$$ --------------------------
##$DU= <F:/spectra>
##$EXPNO= 1
##$NAME= <H-F>
##$PROCNO= 1
##$TYPE= <nmr>
##$USER= <she>
##$AMP= (0..31)
100 100 100 100 100 100 100 100 100 100 100 100 100 100 100 100 100 100 
100 100 100 100 100 100 100 100 100 100 100 100 100 100 
##$AQSEQ= 0
##$AQ_mod= 1
##$AUNM= <au_zg>
##$AUTOPOS= <>
##$BF1= 200.13
##$BF2= 200.13
##$BF3= 200.13
##$BF4= 200.13
##$BF5= 200.13
##$BF6= 200.13
##$BF7= 200.13
##$BF8= 200.13
##$BYTORDA= 1
##$CFDGTYP= 0
##$CFRGTYP= 5
##$CHEMSTR= <none>
##$CNST= (0..31)
1 1 145 1 1 1 1 1 1 1 1 1 1 1 1 1 1 1 1 1 1 1 1 1 1 1 1 1 1 1 1 1 
##$CPDPRG= <>
##$CPDPRG1= <>
##$CPDPRG2= <>
##$CPDPRG3= <>
##$CPDPRG4= <mlev>
##$CPDPRG5= <mlev>
##$CPDPRG6= <mlev>
##$CPDPRG7= <mlev>
##$CPDPRG8= <mlev>
##$CPDPRGB= <>
##$CPDPRGT= <>
##$D= (0..31)
0 1.2 0 0 0 0 0 0 0 0.06 0 0.03 0 0 0 0 0.0002 0 0 0 0 0 0 0 0 0 0 0 0 
0 0 0 
##$DATE= 1726134558
##$DBL= (0..7)
120 120 120 120 120 120 120 120 
##$DBP= (0..7)
150 150 150 150 150 150 150 150 
##$DBP07= 0
##$DBPNAM0= <>
##$DBPNAM1= <>
##$DBPNAM2= <>
##$DBPNAM3= <>
##$DBPNAM4= <>
$$ [...]
##$SUBNAM3= <"">
##$SUBNAM4= <"">
##$SUBNAM5= <"">
##$SUBNAM6= <"">
##$SUBNAM7= <"">
##$SUBNAM8= <"">
##$SUBNAM9= <"">
##$SW= 24.0689170037331
##$SWIBOX= (0..15)
0 0 2 0 0 0 0 0 0 0 0 0 0 0 0 0 
##$SW_h= 4816.95568400771
##$TD= 16384
##$TD0= 1
##$TE= 0
##$TE2= 300
##$TE3= 300
##$TEG= 300
##$TL= (0..7)
0 120 120 120 120 120 120 120 
##$TP= (0..7)
150 150 150 150 150 150 150 150 
##$TP07= 0
##$TPNAME0= <>
##$TPNAME1= <>
##$TPNAME2= <>
##$TPNAME3= <>
##$TPNAME4= <>
##$TPNAME5= <>
##$TPNAME6= <>
##$TPNAME7= <>
##$TPOAL= (0..7)
0.5 0.5 0.5 0.5 0.5 0.5 0.5 0.5 
##$TPOFFS= (0..7)
0 0 0 0 0 0 0 0 
##$TUNHIN= 0
##$TUNHOUT= 0
##$TUNXOUT= 0
##$USERA1= <user>
##$USERA2= <user>
##$USERA3= <user>
##$USERA4= <user>
##$USERA5= <user>
##$V9= 5
##$VALIST= <valist>
##$VCLIST= <CCCCCCCCCCCCCCC>
##$VD= 0
##$VDLIST= <DDDDDDDDDDDDDDD>
##$VPLIST= <PPPPPPPPPPPPPPP>
##$VTLIST= <TTTTTTTTTTTTTTT>
##$WBST= 1024
##$WBSW= 4
##$XGAIN= (0..3)
0 0 0 0 
##$XL= 0
##$YL= 0
##$YMAX_a= 284952
##$YMIN_a= -257223
##$ZGOPTNS= <>
##$ZL1= 120
##$ZL2= 120
##$ZL3= 120
##$ZL4= 120
##$ABSF1= 20.99438
##$ABSF2= -3.074751
##$ABSG= 5
##$ABSL= 3
##$ALPHA= 0
##$AQORDER= 0
##$ASSFAC= 0
##$ASSFACI= 0
##$ASSFACX= 0
##$ASSWID= 0
##$AUNMP= <proc_1d>
##$AZFE= 0.1
##$AZFW= 0.1
##$BCFW= 0
##$BC_mod= 2
##$BYTORDP= 0
##$COROFFS= 0
##$CY= -3
##$DATMOD= 1
##$DC= 0
##$DFILT= <>
##$DTYPP= 0
##$F1P= 0
##$F2P= 0
##$FCOR= 1
##$FTSIZE= 16384
##$FT_mod= 6
##$GAMMA= 0
##$GB= 0
##$INTBC= 1
##$INTSCL= 3.70164e-10
##$ISEN= 128
##$LB= 0.24
##$LEV0= 0
##$LPBIN= 0
##$MAXI= 10000
##$MC2= 0
##$MEAN= 0
##$ME_mod= 0
##$MI= 1.114404
##$NCOEF= 0
##$NC_proc= -7
##$NLEV= 6
##$NOISF1= 3.799351
##$NOISF2= 2.8
##$NSP= 0
##$NTH_PI= 0
##$NZP= 0
##$OFFSET= 21.00026
##$PC= 1
##$PHC0= -25995.24
##$PHC1= 5.587481
##$PH_mod= 1
##$PKNL= yes
##$PPARMOD= 0
##$PSCAL= 0
##$PSIGN= 0
##$REVERSE= no
##$SF= 200.130005696216
##$SI= 16384
##$SIGF1= 3
##$SIGF2= 2
##$SINO= 5.538805
##$SIOLD= 16384
##$SREGLST= <1H.CDCl3>
##$SSB= 0
##$STSI= 16384
##$STSR= 0
##$SW_p= 4816.95568400771
##$SYMM= 0
##$S_DEV= 0
##$TDeff= 16384
##$TDoff= 0
##$TI= <>
##$TILT= no
##$TM1= 0
##$TM2= 0
##$TOPLEV= 0
##$USERP1= <user>
##$USERP2= <user>
##$USERP3= <user>
##$USERP4= <user>
##$USERP5= <user>
##$WDW= 1
##$XDIM= 16384
##$YMAX_p= 285839606
##$YMIN_p= -721803
$$ End of Bruker specific parameters
$$ ---------------------------------
##NTUPLES= NMR SPECTRUM
##VAR_NAME=  FREQUENCY,     SPECTRUM/REAL,   SPECTRUM/IMAG
##SYMBOL=    X,             R,               I
##VAR_TYPE=  INDEPENDENT,   DEPENDENT,       DEPENDENT
##VAR_FORM=  AFFN,          ASDF,            ASDF
##VAR_DIM=   16384,         16384,           16384
##UNITS=     HZ,            ARBITRARY UNITS, ARBITRARY UNITS
##FACTOR=    0.29402158847633, 1,            1
##FIRST=     4202.78203322675, 0,            0
##LAST=      -614.173650780961, 0,           0
##MIN=       -614.173650780961, -721803,     0
##MAX=       4202.78203322675, 285839606,    0
$$ Real data points
##PAGE= N=1
##DATA TABLE= (X++(R..R)), XYDATA
$$ [...]
7721 974093 922632 1168122 1225437 1030311 1407835 1081066 807028 669664 595844 951805
7711 951805 1035459 826000 885445 775005 793515 1142432 854288 962749 892717 768355
7701 768355 919698 1279946 872899 738556 880654 949176 913707 1141591 776717 859022
7691 859022 733863 637988 575481 610245 732881 733532 714907 457738 603727 589383 559707
7680 559707 618506 822212 1036618 758979 989894 1111298 988813 771411 571654 810876
7670 810876 537010 482101 856768 1061230 1098524 725826 769183 832217 790572 816391 752051
7659 752051 739089 595542 575074 541763 674349 750369 676169 1007668 786619 645817 753375
7648 753375 676781 527977 650247 569203 909610 921523 902087 778354 703627 974358 924847
7637 924847 877066 568673 513211 830583 1103497 792346 897133 490818 754195 943175
7627 943175 1076108 880360 662122 680865 768623 699698 686744 836048 697088 1094685
7617 1094685 1212628 1085732 647860 753012 540564 354394 978291 925594 974977 1010052
7607 1010052 1224054 1312193 1347111 1310190 1186735 1284165 1277791 1467417 1582846 1145710 1203863
7596 1203863 1294961 1242552 1149352 1319549 1388319 1146306 1451127 1453652 1440227 1573375 1299206
7585 1299206 1579459 1777212 1880828 1641212 1604192 1874577 1868749 1824821 1625919 1532785
7575 1532785 1561151 1478282 1427946 1651604 1667547 1871721 2200750 2249374 2165137 2075195 2149336
7564 2149336 2453969 2558315 2764906 2855006 2998768 2977428 2670055 2451737 2537468 2555325
7554 2555325 2404306 2440360 2501343 2066726 2033430 1933626 1931871 2178377 1965584 2041066 2015719
7543 2015719 1788669 1966002 2121627 1934745 2122578 2363132 2537194 2721887 2741866 2992708
7533 2992708 3105154 3145318 2882676 2749188 2757861 2571172 2271165 2211741 2029587 1541491
7523 1541491 1593502 1561058 1651333 1358078 1210405 1101174 1111057 1153064 1296174 1056322 1161539
7512 1161539 1375153 1382785 1245457 1272732 1122167 1083694 1151579 1081232 1035970 1134957 1217590
7501 1217590 980740 887533 1053639 1027319 891691 830017 747763 486680 573246 934353
7491 934353 1016872 833404 884947 918184 550925 482010 735839 809336 755893 935667 583032
7480 583032 596035 565852 622199 758123 683028 481635 476306 504419 564526 675359 843169
7469 843169 545185 683630 1041965 946142 749611 1066267 1041691 978984 763387 646713
7459 646713 870562 903221 566129 714986 639845 864765 846625 952894 725146 516696
7449 516696 788030 814082 782492 836408 545473 502126 797164 778470 1033258 739835 630350
7438 630350 627320 950879 836936 673015 767289 828803 882105 926678 732400 933431 852664
7427 852664 513738 622257 884827 779230 806515 867473 945477 975857 1092707 1044352 1016671
7416 1016671 848277 767118 725650 932661 798672 947421 782811 1084169 1301328 828302
7406 828302 1069916 881565 1298954 1320729 1133768 832913 1241536 1167676 1198125 1394221
7396 1394221 1507018 1526429 1553684 1694618 1645399 1577769 1265157 863908 923685 941459 1077456
7385 1077456 1078718 1227290 1211662 1405321 1531455 1209698 1239920 1351499 1348240 1583147 1860553
7374 1860553 1732204 1726806 1832211 1853119 1861175 2150793 2071601 2071968 2187144 2335194 2439268
7363 2439268 2581270 2940524 3169564 3152628 3107477 2772150 2870524 2922682 2778581 2950180
7353 2950180 3201556 2834784 2754705 2479509 2403655 2353196 2109706 2213045 2458623 2310533
7343 2310533 2262540 2291836 2198585 2214591 2443689 2525022 2572911 2628251 2576627 2700659 3182010
7332 3182010 3449198 3394294 3297431 3235090 2958319 2825212 3102550 3030498 2795270 2882331
7322 2882331 2848955 2709924 2347680 2445028 2211673 2166784 2252387 2245210 2271166 1843854 2158069
7311 2158069 2231193 1869222 1924276 2134608 2021972 2338068 2143607 1840801 1843647 1761757
7301 1761757 1956568 1811128 1942053 2022044 2175369 2028137 1962606 1843919 1833582 2006674
7291 2006674 1994210 2070161 2265355 2183637 2239897 2300509 2255252 2232362 2075038 2393774 2001167
7280 2001167 1965554 2313776 2436310 2312079 2555212 2712004 2375437 2481762 2342774 2374243
7270 2374243 2587048 2437810 2700611 2617878 2796185 2829954 3051764 2824710 2914928 2843785
7260 2843785 2624985 2435315 2767866 2999871 2869980 2911616 2576769 2979072 3004124 2885964
7250 2885964 3078340 3189438 3147571 2907331 3084420 3391517 3390399 3396594 3207208 3252505 3282836
7239 3282836 3475143 3747259 3631205 3368925 3334874 3542403 3463802 3250425 3646401 3971918
7229 3971918 3888262 3931562 3882452 4322323 4415804 4143038 4083068 4124561 4107229 4408655 4529187
7218 4529187 4598112 4375560 4620816 5019473 4742756 4817764 4983059 5109530 5047496 5298610
7208 5298610 5299156 5145182 5485680 5717070 5697615 5585300 5714739 6271672 6439879 6576054
7198 6576054 6709276 6524314 6808136 7139514 7712117 7816481 8099446 8184084 8644906 8715300
7188 8715300 8348375 8414374 8261903 8265455 8426756 8224544 8214577 8264142 8262202 8145677 7716398
7177 7716398 7732727 7791963 7799714 7879771 7971762 8002539 7930286 7419233 7693782 7609674 7413841
7166 7413841 7514562 7129583 7118694 7153919 6962600 7007679 6699431 6785710 6626950 6649741
7156 6649741 6535237 6471438 6272176 6680874 6444062 6371164 6124798 6154851 6280075 6090971
7146 6090971 5939503 6129265 6247677 6030989 5780694 5929814 6123319 6045470 5935322 5746541
7136 5746541 5745510 6272159 6175145 6178414 6351858 6279211 6236489 6287733 6277366 6302052 6496080
7125 6496080 6305359 6342418 6148778 6476295 6729964 7007173 6730694 6641675 6831553 6909554
7115 6909554 7011354 7152412 6845206 7117335 7139185 7306328 7490725 7592171 7529355 8007149
7105 8007149 7990097 8155046 7623609 7782787 8178323 8285540 8410431 8468161 9054082 9221587
7095 9221587 9337357 9239124 9467700 9655647 9881703 9789816 9945716 10104953 10205254 10709358
7085 10709358 11305456 11348515 11557956 11856793 11981474 12339863 12839784 13007277 13439371 14134955
7075 14134955 14745000 15270629 15702287 16187955 16507377 16932231 17448458 17788486 18356651
7066 18356651 18981866 19805542 20400859 20750828 21491944 22307644 23086558 23827579 24835523
7057 24835523 25589723 26716055 27794378 29280545 30597296 32062162 34026602 36113106
7049 36113106 38240622 40627578 43532980 46752316 49736809 53628212 58948711 66514772
7041 66514772 75566172 83636293 83981216 78383743 69194986 58733842 51330739 45683353
7033 45683353 42290140 39177640 37218009 35334756 34142943 32947934 32090409 31138232
7025 31138232 30584972 29844632 29466272 29120558 28864803 29095245 29248544 29279749 29229144 29275424
7015 29275424 29384897 29187486 29140506 28465767 28255696 28047682 27347542 26877146 26522427 26138167
7005 26138167 25895840 25802436 25424847 25289980 24790573 24535007 24179610 23559280 22695045 22015060
6995 22015060 20984072 20300141 19812121 19024824 18527319 17778642 17231124 16952821 16838382
6986 16838382 16629962 16122033 15694021 15707206 15424135 14990142 14997202 14959444 14802147 14840995
6976 14840995 14865070 14622201 14254603 14150553 14059933 14253021 14460060 13969546 13923870 14239503
6966 14239503 14160232 13860284 14159459 14444090 14530422 14320369 14473574 14300667 14196061 14423838
6956 14423838 14449590 14601443 14919025 15017857 15122089 15317073 15675190 15957512 16097038 16305690
6946 16305690 16527935 17157195 17584487 17671057 18108562 18819149 19013232 19476972 20685088
6937 20685088 21289396 22030728 23398857 24821669 26266591 27648459 28967965 29922614 30127194
6928 30127194 29899618 29510079 29277650 29394004 29445699 29544425 29076575 27583075 25983115
6919 25983115 24357345 22561666 21217404 20120163 19437066 19033010 18281357 18250218 18146626
6910 18146626 18205261 18052739 18200499 18496213 19070261 19707638 20460345 21486217 22338753
6901 22338753 23307931 24862406 26514774 27146944 27430318 27060402 26442112 25968769 25734427
6892 25734427 25384523 25203266 24527415 23393367 21779628 19886406 17942592 16054363 14478910
6883 14478910 13074777 12205535 11367527 10619286 10243214 9637878 9363022 9033331 8804225
6874 8804225 8919135 8558808 8505377 8242079 7969596 8221779 7898612 7839040 8098583 7583381
6864 7583381 7395874 7268479 7229678 7121605 6903492 6729012 6718334 6761681 6357927 6108017
6854 6108017 5911678 6073347 6042365 6002350 5843064 5904831 5852627 5574352 5703225 5549992
6844 5549992 5859888 5846782 5579579 5963942 5739915 5967117 5876092 5603699 5927276 6126523
6834 6126523 5967291 5943267 6111000 6238545 6043842 5808418 5795048 5870936 5650225 5772769
6824 5772769 6033174 5976023 6089358 6057990 6359248 6490789 6257245 6289100 6214148 6746560
6814 6746560 6655425 6721345 7003625 7075263 7381785 7488101 7445842 7724916 7786526 7971652
6804 7971652 8238924 8307634 8344366 8514416 8941257 8820130 9013039 9650854 9580757 9741212
6794 9741212 10078152 10478006 10856942 10961851 11606093 12294702 12824642 13091166 13622238 14119440
6784 14119440 14604090 14973617 15987623 16521180 16847060 16756963 16823872 17100706 17484620 17423010
6774 17423010 17303169 17467396 17483914 17098982 17095411 16895570 16591661 16788687 16812792 16565590
6764 16565590 16387272 16355542 16618555 17111375 17252998 17447881 17940133 18291277 19002839 19541668
6754 19541668 20180364 20899630 21318918 21761749 22000025 22301495 21986976 22117590 22109654 22313456
6744 22313456 21646629 21211005 21012835 20308785 19725233 18762865 17555277 16872134 16219202
6735 16219202 15452152 14792931 14306322 13817276 13120266 12950128 12802931 12875248 12592392 12445730
6725 12445730 12525030 12571803 12881792 12867831 12944326 12844836 12407856 12267132 11800070 11564874
6715 11564874 11406576 11250361 10603824 10334711 9865700 9319572 8741893 8239852 7775702
6706 7775702 7105325 6588674 6137084 5594548 5314780 5077082 4922958 4612833 4508899 4347921
6696 4347921 4208887 3860564 3789436 3897945 3474056 3407712 3391453 3438642 3265990 3259477 3138151
6685 3138151 2988958 3043067 2879400 2902726 2986853 2827696 2473730 2328615 2585398 2459943
6675 2459943 2111097 2045717 1945552 1935033 1957776 1980202 2089846 1994135 1825867 1949077
6665 1949077 2115581 1828124 1882787 1557093 1413797 1446482 1678622 1721111 1852834 1897508
6655 1897508 1990913 1725312 1386911 1394354 1505074 1352346 1496509 1606283 1458900 1379772
6645 1379772 1409799 1105699 984813 1171926 1391192 1557348 1369497 1083529 1198626 1092070
6635 1092070 1217614 1188555 1554326 1459437 1285005 1320254 1036078 1139490 1121729 1203881
6625 1203881 1421398 1062577 1018859 684039 772966 951012 986420 1127294 1351044 1125038
6615 1125038 1135843 1191226 938350 894425 804585 826793 699464 572391 728229 674062 569174
6604 569174 1006977 715984 555390 824656 539292 485128 610001 763897 568179 430581
6594 430581 514420 468871 494131 113673 191458 175385 310344 370751 587914 663966 736542
6583 736542 603865 720868 719642 639951 346736 545445 601074 627923 606631 806711 659655
6572 659655 652417 732412 775803 615671 716274 546551 539778 774346 883413 571158 578846
6561 578846 561260 599549 483752 553498 474813 619313 542569 590641 780201 519044 860161
6550 860161 482115 392994 512793 324532 398707 460221 436745 200446 465103 498682 605488
6539 605488 503393 425660 691353 843367 661402 418624 546240 556292 763776 831636
6529 831636 652932 484134 517715 667713 572859 426329 243928 172434 456763 563065
6519 563065 495628 373503 531222 721345 468880 328939 391451 207431 281987 489138
6509 489138 494684 264671 225892 425339 741658 639056 372075 415528 391611 294729 532281
6498 532281 527748 386342 481892 467779 522186 616315 530609 492854 266029 450845 205733
6487 205733 434294 439850 185981 179289 294879 360554 511919 497904 426232 449935 327926
6476 327926 348171 373451 543336 268802 163346 529493 314034 669478 718354 500137
6466 500137 354511 330839 769696 604270 133300 187959 200359 309294 38130 338114
6456 338114 565861 306392 132958 246816 437834 123178 35712 125970 107301 477348
6446 477348 214985 412147 254598 349814 230092 322481 214498 352689 451760 28508
6436 28508 107115 305607 261717 228530 224664 110010 157898 233928 351286 393843 399779 114282
6424 114282 88715 269635 84201 156168 63906 200074 808131 287280 184249 -52799
6414 -52799 308419 327530 321313 378527 275982 307199 292140 344780 521810 408993 441301
6403 441301 205253 254585 64497 116492 100563 341060 347681 -182696 -139134 -1498 1235
6392 1235 186397 349735 431450 -41461 209683 429675 324941 127038 252936 157962
6382 157962 50921 13287 -96283 158319 242858 196317 166319 516474 365708 86514
6372 86514 -144490 238701 307246 -86463 224723 212746 60653 201112 39140 38889 -51087
6361 -51087 389677 331819 129103 91077 -99492 70882 185244 36590 -58 200831
6351 200831 156926 170259 140625 -24130 17828 292173 139455 175214 246626 -38427 302061
6340 302061 350278 221763 84893 303995 -50291 -380300 -128841 68289 280745 281183
6330 281183 369522 -54557 -147113 87673 99748 -237923 181611 332786 -86410 113479
6320 113479 184298 282922 -102447 -230869 -132583 66021 -69901 -201649 -40267 -77803
6310 -77803 202443 -25026 107986 -141546 -307508 -81419 -29066 -34093 -40386 -253569 35679
6299 35679 195500 -15132 3776 430954 154359 383502 362469 146162 -101844 -48143
6289 -48143 11859 -51048 379090 95135 -39086 30414 -23709 -30710 -16099 -179647 -226022
6278 -226022 -67188 4350 -33715 -15456 231045 -54792 64459 228136 -361288 -122690
6268 -122690 -197786 -479913 -152131 395913 341732 -10780 214351 406722 27500 -58291
6258 -58291 -186952 -648 -259960 18490 -188869 -61584 185133 18181 -140669 -113801
6248 -113801 -238152 30939 248215 367561 166870 205221 179520 121435 248699 91647
6238 91647 310776 418732 243195 -55487 175711 -110373 110408 217244 103030 135039
6228 135039 93345 120525 329309 289462 70978 50335 59045 28538 -56486 69360 17319
6217 17319 168237 -242121 -103078 -1729 -136581 16996 189643 12552 -62074 91429
6207 91429 326110 285629 202641 19498 214270 -30130 -146817 39488 -167592 -178743
6197 -178743 14953 79069 -130562 -39360 130329 43845 61550 -47476 -20696 171272 131639
6186 131639 265489 82037 -93898 -310061 -305942 47141 -28873 13515 63967 187754 207568
6175 207568 198373 294948 -115095 185178 -132459 -40040 158246 43185 -60495 -135698 20017
6164 20017 -17702 -157022 254621 197472 221722 102495 -47651 159509 151229 60436 192726
6153 192726 266202 -25285 34324 19585 -107053 138222 145123 -113209 15593 -4799 -90865
6142 -90865 -79443 26413 72548 -9449 269521 159868 -315294 -100158 -36856 -126290 -75548
6131 -75548 -292097 -446526 -396324 -129435 -158643 -55506 -35045 -228204 -76393 372570
6121 372570 -7459 -160133 -161708 -190835 -102114 203174 -6949 -29342 184095 259081 79786
6110 79786 -379790 -268245 -133917 17751 30828 -298873 60074 -198915 -287517 -54758
6100 -54758 -120038 -256812 9398 240056 282005 328160 -11560 -20331 497 -12710 126175
6089 126175 184341 -38356 -85681 131716 94348 25123 -106130 -197283 -28485 -114670 -54079
6078 -54079 -110570 -42736 13343 41527 -22272 -54609 -237902 1709 202229 -100897 23116
6067 23116 189844 -29903 -100210 -74789 2173 145038 41660 -4901 81490 -189370 -250625
6056 -250625 -32655 34814 -157953 -79382 56085 -43514 -272106 -104529 -150927 -106142 59884
6045 59884 74333 126900 280709 55125 126096 -42980 -187458 -396988 -267712 -19885
6035 -19885 -5892 -156875 -146230 228753 -197898 -102645 -62047 -61615 -362245 -320249 -86122
6024 -86122 -94266 72210 8090 149485 144158 -21927 -58087 168875 -5435 -9476 -354008
6013 -354008 1722 188169 -55363 -140703 -32783 -45594 59562 198224 -119808 -112098
6003 -112098 -9885 -26052 -32897 -37187 -57005 -92158 -154577 -27848 -2274 100510 137833
5992 137833 -132971 66628 -82285 -179251 -294007 -406944 -173499 8020 -46490 -296500
5982 -296500 66624 -65539 -41700 13354 -125483 -84973 -224439 -148230 15518 195869
5972 195869 48331 -113948 -44968 369574 205269 151647 234152 -231392 82735 55414
5962 55414 381062 247567 -102590 132536 343250 217716 136830 -158008 -263445 -448179
5952 -448179 40172 31136 -89866 265791 345397 98234 -17063 6108 67381 179831 -177092
5941 -177092 35427 66492 35265 256620 25296 -72639 12523 15937 -111453 45033 -24576
5930 -24576 -94126 -85930 -148090 -20124 -210198 -394669 -295633 -187334 30707 -87883 -298198
5919 -298198 103636 -26160 28160 120164 -45092 -222812 -184271 -98205 -33177 64078 -148
5908 -148 -300460 -25365 83147 97034 -87414 -75800 -194745 40851 15896 -119036 160185
5897 160185 79715 45964 -106019 -145812 -245605 -178895 -340639 -61902 -206829 -426423 -276586
5886 -276586 -139965 50120 -76536 225166 318346 -38787 112455 80836 -40929 -314266
5876 -314266 39438 107661 241087 248459 187576 -39375 46997 -282442 -202123 -72654 -132859
5865 -132859 1979 -86024 138006 200112 164704 -121737 -109924 62373 -36967 -15495 -22338
5854 -22338 -112122 -132037 -338994 32167 301162 5092 148168 -80804 -201936 -162066
5844 -162066 -217232 -75883 -110284 -141998 87737 184372 66838 -78278 29219 -29722 -252815
5833 -252815 -265998 -301989 -216268 -198649 -86738 -269637 52204 135651 84785 -255671 -53439
5822 -53439 59310 -121225 -251217 120158 -88270 59202 -49735 -158169 -130332 167174
5812 167174 -219079 130762 16872 102257 -13116 -86581 297327 69750 116306 296026
5802 296026 394926 -42707 17964 30165 133861 150717 344109 349140 102581 -50727 180201
5791 180201 322796 144957 -211498 -135502 40582 131798 -39155 18592 -82680 -110532
5781 -110532 162929 277421 276543 128037 45261 -159517 33639 194074 -72896 11015 -52663
5770 -52663 -274022 -333772 -158758 -173396 -103338 180417 188995 15248 242292 73607 -75176
5759 -75176 10297 -100252 -273258 -265708 -179703 -58866 -305088 -320198 -185181 -248834 -292769
5748 -292769 -156237 -204149 135124 100635 81809 -119077 37574 -98802 -124201 -53866 -133577
5737 -133577 -64301 -334100 -8331 267830 20835 -133478 -122184 -34142 -91763 7463 265594
5726 265594 8776 31973 -122467 -110720 -96564 -121765 -324229 -406533 -222981 23294 160536
5715 160536 111354 220008 129309 243840 85346 166242 -226429 -100006 -36484 -464764
5705 -464764 -281745 -201493 -4106 81350 75300 134940 26721 -212228 22556 3531 -89834
5694 -89834 -413928 -314326 110544 237234 20651 -96014 33130 -112353 -133276 35052
5684 35052 56948 21755 -119611 -72219 -145925 -133598 -63714 -12378 -71998 -3587 418332
5673 418332 394837 45175 -193323 -11379 290249 302530 101893 -292668 -369820 -170697
5663 -170697 -78419 -111355 -29455 -30485 -63403 -110274 -346988 -400572 -3567 118174 153022
5652 153022 53467 34373 27785 52691 13284 -1403 -228527 -247128 46160 51782 16771 -183348
5640 -183348 -103853 113583 4587 -30465 138659 144642 -141785 16503 291053 141207
5630 141207 171879 145002 193707 240537 24049 327616 374594 58538 7727 2960 19033
5619 19033 -26621 83018 195404 16628 188853 287075 140935 285222 530984 511402
5609 511402 398907 298535 447924 590644 535322 608415 494387 572206 277534 171585
5599 171585 490079 219207 217703 126276 393976 543826 -39775 32545 60760 187032 160140
5588 160140 120248 31775 265242 80392 96730 -52799 -118138 -61617 -290140 -63002 128846
5577 128846 -18349 -34761 52378 147627 75601 -167195 -41818 150645 -90110 -54547 112798
5566 112798 220855 373328 105889 132748 9603 40654 332765 592545 246724 14440
5556 14440 90949 -85152 -87472 11473 -4419 -81529 -273177 -56183 -20537 140958 109307
5545 109307 203122 240720 69145 34644 311862 326683 199087 212627 209920 429642 230680
5534 230680 264676 334996 255853 154208 371810 247650 286522 197027 46097 162573 174829
5523 174829 76519 79095 288668 70276 -58902 20801 -155049 302618 323297 232874 49896
5512 49896 -72146 66880 164954 238480 254059 181286 301642 399748 189846 209101 355294
5501 355294 464966 273956 217135 -108130 154727 359364 364387 439804 300839 117808
5491 117808 279354 214913 296656 347387 353638 461900 291450 477898 601638 653806 688113
5480 688113 611237 56138 291971 290660 239482 248909 166089 408289 310150 -55994 192519
5469 192519 413609 105951 64593 225674 334460 216608 392917 465930 300257 479977
5459 479977 538420 292925 326244 173064 360964 564107 372347 363147 120687 251614
5449 251614 172050 89810 334680 183840 300845 390519 401402 444548 423451 438698 513355
5438 513355 695003 629758 382297 311246 545064 574054 574170 737614 387889 402038 459618
5427 459618 646466 858594 685789 512289 728308 977665 886355 595784 703507 684983
5417 684983 573011 728225 560945 505251 455950 559231 804472 774094 716159 751670 673531
5406 673531 746830 744391 436271 840698 953916 828391 691042 485966 642566 535764
5396 535764 558831 878674 703713 807137 650826 694401 560085 606577 713284 662663
5386 662663 598712 552421 675964 692946 586847 582614 893347 1056299 850507 788344 526163
5375 526163 818826 654033 483416 974799 751693 876440 875769 865421 774397 1063021 780600
5364 780600 851845 925807 1018072 874687 1192828 1198303 1268823 1217588 949790 1192623 1466193
5353 1466193 1739485 1680267 1555333 1557530 1341251 1397592 1200171 1192981 1501367 1296709 1632276
5342 1632276 1818697 1698758 1752606 1757046 1296609 1303921 1549971 1902814 2015199 1578529
5332 1578529 1663494 1922505 1987864 2190590 2284139 2753749 2593368 2308613 2308342 2396281 2723946
5321 2723946 2716358 2482351 2603615 2599133 2197515 2599397 2501177 2808561 2995166 2871552
5311 2871552 2862883 2925104 3090936 3045640 3091123 2946074 3040218 2885397 3133207 3043684 2879557
5300 2879557 2962854 2915818 2850628 2916778 2986511 2927746 2528944 2677579 2587375 2313573 2277476
5289 2277476 2282102 2473733 2467989 2432789 2296326 2373408 2421604 2425516 2395545 2290070 1684411
5278 1684411 1822457 1927008 1775361 2130462 2260982 1939168 1667692 1658346 1817241 1946971
5268 1946971 1913548 2017843 1937118 2015498 2212626 1963242 1683175 1796938 1976250 1962583
5258 1962583 1955567 1963841 2187391 2016664 2133078 2233841 1724087 1850669 2249263 2247037 2298795
5247 2298795 2337738 2262777 2090436 2090950 2255134 2349262 2642261 2451678 2444011 2275956 2194995
5236 2194995 2423845 2482733 2460616 2217723 2323941 2609223 2410307 2478846 2779390 2571996
5226 2571996 2552178 2561156 2929414 2775960 2495057 2625633 2897373 3163956 3207031 2990305
5216 2990305 2834141 3024248 2930828 3194016 3170522 3190519 3309534 3221163 3354371 3488614
5206 3488614 3389810 3816330 3857381 3616888 3777488 3829776 3921624 3992605 4123112 4132439 4172791
5195 4172791 4633687 4311130 4022569 4260231 4328547 4600333 4880668 5043389 5094280 4829677
5185 4829677 5114372 5211832 5065172 5029024 4733480 4779003 5121970 5127429 5189929 5183271 4732016
5174 4732016 4643666 4963690 5187515 4825774 4900141 4899956 4951534 4757448 4744411 4537582 4430151
5163 4430151 4411398 4253567 4125846 4123397 4050952 4240844 4381366 4169216 4050869 3870177
5153 3870177 3851227 4039512 3708681 3623006 3801828 3615494 3325164 3869760 3903711 3621828
5143 3621828 3601017 3336917 3563962 3387305 3493125 3693913 3424121 3351070 3481259 3400008
5133 3400008 3175172 3179288 2985753 3268342 3592746 3478773 3358311 3158474 3363717 3330422
5123 3330422 3271107 3142551 3146053 2948312 3028171 2877453 3215473 3389481 3251081 3375784
5113 3375784 3466686 3132899 3241740 3344045 3126672 3301568 3381686 3315045 3259234 3035836
5103 3035836 3321348 3257512 3170039 3312449 3530259 3482795 3724812 3764673 3437874 3846222
5093 3846222 3917173 3985460 4101131 4161546 4090214 3913669 3738614 4020857 4066788 4237158
5083 4237158 4450601 4370137 4452426 4144250 4163157 4333525 4372973 4267692 4236024 4613078
5073 4613078 4816138 4719678 4628670 4872332 4585182 4515180 4560235 4723593 4964030 4972333 5429177
5062 5429177 5301525 5184054 5285916 5318082 5543575 5611831 5621041 5423706 5665520 5880404
5052 5880404 6183202 6068149 5752377 5917745 6328387 6531215 6518484 6475259 6329281 6566758
5042 6566758 6512604 6823814 6854760 6966840 7051370 6946947 7297694 7488523 7793052 7478346
5032 7478346 7674852 7676215 7877487 8072939 8150957 8010998 8298723 8610050 8570349 8549577
5022 8549577 8826835 9159715 9148306 8943087 9164500 9305393 9510107 9940086 9986395 10160857
5012 10160857 10213710 10474942 10836615 10842659 10938043 11406592 11760078 12059148 12250503 12689909
5002 12689909 12830050 13097106 13380659 13558753 13788921 14250454 14812531 15070547 15399151
4993 15399151 15585547 16002939 16540611 16685798 17362167 17605167 18287638 19124431 19646019
4984 19646019 20162585 20786995 21164117 21895994 22745820 23297032 23951226 24728442 25559435
4975 25559435 26098739 26980134 27688328 28783367 29826757 30575640 31695708 32583707 33666960
4966 33666960 34519692 35140570 36167913 36977005 37851828 38676714 39609615 40268218 40622761
4957 40622761 41375981 41646064 42108784 42527749 43003730 43464935 43426126 43780446 43880798 43458093
4947 43458093 43138687 42815511 42076366 41332266 40479261 39860262 38920562 37777767 37239315
4938 37239315 36106989 35011423 34188061 33219810 32220824 31223879 30360742 29487386 28326979
4929 28326979 27123663 26139727 25293952 24461571 23586880 22664466 21496966 20877203 20333184
4920 20333184 19684208 18795706 18606109 17766004 17123071 16695752 16190587 15818171 15454777
4911 15454777 14944976 14653845 14458566 13950338 13951289 13748123 13562342 13235015 12894591 12795053
4901 12795053 12731550 12495176 11989568 11939548 12052575 11817597 11962627 11641658 11273248 11340819
4891 11340819 11286308 11124225 10865444 10834159 10757022 10779076 10567315 10381349 10574841 10029420
4881 10029420 9782635 9765101 9850390 9867941 9919605 9490938 9129665 9291755 9443947 9129038
4871 9129038 9050065 8629934 8564476 8573356 8414031 8431466 8358763 8267134 8038877 8107198 7876078
4860 7876078 7776474 7887672 7887822 7741056 7926650 7736500 7750839 7971834 7861455 7584113
4850 7584113 7787657 7379698 7235089 7173031 7285779 7533660 7299206 7732862 7597733 7713274
4840 7713274 7876509 7607104 7557863 7759504 7734785 7694595 7539642 7711007 7569018 7479653
4830 7479653 7746294 7642182 7769342 7754780 7358145 7583292 7805283 8044298 7879034 8015174
4820 8015174 8376240 8502556 8216983 8250550 8491124 8427567 8325067 8315943 8907297 8917533
4810 8917533 8822042 8973081 9041537 8579605 8557834 8955298 9207041 9197831 9221403 9313016 9473181
4799 9473181 9602049 9532762 9833549 10074300 9738546 10043262 10512898 10442888 10355213 10574882
4789 10574882 10634760 10878795 11109405 11140494 11364757 11403757 11277745 11724552 11841124 11821983
4779 11821983 12039027 12044609 12263560 12551439 12671776 12869513 12911961 13146787 13229110 13523023
4769 13523023 14058440 14343489 14337531 14297540 14527799 14821311 15145029 15184621 15587460 15976028
4759 15976028 16378880 16467944 16789608 16835870 17352061 17779674 18256097 18678939 18826649 18906683
4749 18906683 19225136 19812743 20161763 20514976 20653349 21309181 21577140 21591936 21884037 22493634
4739 22493634 23117245 23661666 24376941 24666197 25015619 25594280 25984984 26157469 26657839
4730 26657839 27604735 28163557 28181293 28838523 29264263 29560410 30431941 30881039 31459681 32082908
4720 32082908 32814213 33227491 33893175 34528226 35348095 35952745 36935954 37576549 38317980
4711 38317980 38938206 39676503 40542547 41708972 42871533 43569461 44597430 45477239 46146807
4702 46146807 47109128 48236814 48975257 49493155 50302392 51601623 52469252 53307902 54323047
4693 54323047 54881127 55593484 56364878 57106641 57902188 58357575 59181517 59886539 60390275
4684 60390275 60569624 61255362 61637198 62039796 62722940 63105606 63091644 62911068 63050163 63297270
4674 63297270 63230199 63498230 63584772 63304672 63617000 63740814 63736353 63538735 63333840 63190567
4664 63190567 62866568 62897260 62720098 62508310 62380086 62129093 61832416 61192006 60792080 60331842
4654 60331842 59999561 59580753 58838962 58295946 57256259 56553614 55692609 54753415 53838163
4645 53838163 52860566 51889903 50435304 49215332 48043841 46912961 45931692 44389487 43168390
4636 43168390 41896674 40525779 39612791 38224880 37116695 35937869 34482684 33415906
4628 33415906 32395794 31002232 30240367 29069701 27863469 26679467 26047058 25422163 24472562
4619 24472562 23580821 22714622 21533671 20822726 20400984 19572289 19000061 18504367 18125627
4610 18125627 17465494 16870444 16546087 16295656 15908047 15619718 14890433 14529972 14604122 14174594
4600 14174594 13917898 13813285 12973565 12485509 12314327 12153520 11969064 12026464 11647057 11102750
4590 11102750 11213901 11134400 11202803 11057457 10361040 10390101 10400439 10224349 9867636 9802012
4580 9802012 9958767 10118052 9578688 9680526 9600300 9095438 9127125 8998497 9142735 9138408
4570 9138408 9047986 8736285 8748339 8687940 8765381 8787647 8782891 8728157 8470850 8230166 8236663
4559 8236663 8455979 8309558 8098002 7968212 8091900 8155420 8002166 7787120 8024653 7973764
4549 7973764 8035498 8120381 7817146 8008524 8145056 7724115 7917249 7809066 7674437 7498772
4539 7498772 7885789 7799475 7482601 7307520 7123814 7548099 7368828 7632219 7832178 7613543
4529 7613543 7236878 7315715 7451703 7609146 7613319 7349834 7465271 7682617 7584996 7175663
4519 7175663 7045373 7223752 7455080 7425997 7500843 7364661 7245247 7194455 7345576 6975198
4509 6975198 6839154 6988092 7222618 7456392 7144094 6952482 7047557 7009816 6563725 6654895
4499 6654895 6709876 6849274 6797168 6984048 6844823 6732479 6546064 6242141 6231430 6453043
4489 6453043 6495746 6545684 6040120 6287416 6379266 6088801 5971478 6111809 5982227 6349135
4479 6349135 6005533 5879556 5793258 5716335 5701774 5792194 6068285 5964155 5764146 5743054
4469 5743054 5732693 5415527 5376831 5435492 5288621 5376782 5321963 5457733 5638742 5355755
4459 5355755 5221096 4882972 5109891 4871651 5099727 5136463 5004052 4903209 4884306 5176392
4449 5176392 5009230 4852857 4822353 5130622 5345425 5424236 5167856 4872861 4933810 4792270
4439 4792270 4738775 4791646 4750238 4506324 4294380 4213164 4405541 4730992 4899076 4735616
4429 4735616 4764701 4463460 4463278 4344174 4265818 4450079 4573254 4482987 4219621 4235245 4055115
4418 4055115 3989718 4373143 4365323 4373915 4366091 3965289 4202920 4435046 4556543 4573177 4425200
4407 4425200 4275335 4403317 4368228 4225874 4042307 4248817 4093884 4092851 4104414 4040508
4397 4040508 4211424 3915489 3964638 3937832 3799866 3707161 3656136 3736694 3850819 3494815
4387 3494815 3680055 3533848 3500272 3586795 3624764 3568426 3266216 3457579 3423001 3512695 3603079
4376 3603079 3490855 3521264 3363359 3390509 3451467 3646037 3543408 3550347 3572995 3661246 3472385
4365 3472385 3599511 3563048 3244032 3502840 3531137 3128743 3222364 3273506 3347974 3522157
4355 3522157 3415230 3209744 3297964 3348429 3222109 3210420 3232334 3149141 3359100 3277699 3180027
4344 3180027 3205960 3130181 3287037 3434181 3174111 3283751 3334809 3559557 3485092 3330240
4334 3330240 3312663 3049795 3205196 3282703 3333952 3351294 3065750 3071629 3197743 2984310 2964286
4323 2964286 3217778 3625989 3456439 3345027 3504720 3378505 3192345 3318879 3308960 3456506
4313 3456506 3270571 3207624 3307578 3461173 3568782 3531422 3236643 3264058 3402614 3413940
4303 3413940 3484605 3419390 3389115 3477270 3516237 3393892 3204439 3705301 3619228 3685239 3562123
4292 3562123 3500991 3554301 3299579 3603528 3707169 3581179 3498314 3311453 3615759 3650135
4282 3650135 3593890 3655250 3537362 3321686 3470105 3674769 3699535 3957774 4067960 3958520
4272 3958520 3764597 3908235 3632114 3335314 3738478 3801207 3765354 3782708 3963198 3832275
4262 3832275 3795342 3950993 4051141 3791097 3749342 3697864 4017896 4073024 3895506 4081349
4252 4081349 4085444 4154094 4198419 4245901 4374930 4379940 4234816 4394546 4139175 4079121 4038493
4241 4038493 4327387 4430524 4502675 4412903 4351644 4716194 4732867 4657636 4894300 4683977
4231 4683977 4436453 4284103 4648154 4698368 4565550 4423016 4715158 4841453 4937504 5098198
4221 5098198 4925077 4830347 4836557 4987416 5050471 5041412 5110725 5167706 4886205 5230019 5371379
4210 5371379 5453017 5384736 5377718 5310499 5333322 5425996 5430325 5524723 5430603 5657727 5535182
4199 5535182 5375983 6075935 5788951 5765019 6236240 6146540 6116406 6072319 6317437 6238561
4189 6238561 6454049 6621804 6696706 6650979 6583314 6622433 6621612 6499559 6925857 6919072 6888031
4178 6888031 7156903 7400296 7480933 7317065 7026612 6824612 7081990 6856312 7072356 7421814
4168 7421814 7305525 7297057 7358840 7487567 7620351 7411466 7359663 7457193 7577582 7896286
4158 7896286 8267458 8035215 8118794 8354021 8516803 8310684 8423805 8713795 8807447 8962513
4148 8962513 8747636 8866523 9200631 9490995 9495314 9799031 10057401 9733927 9765275 9783480
4138 9783480 10311639 10305134 10303528 10481015 10515813 10871256 10843797 10897373 10952412 11147947 11233968
4127 11233968 11335645 11363598 11583734 11841216 12240872 12187385 12448192 12719106 12883866 13391528
4117 13391528 13372126 13239749 13078424 13186007 12910304 13236554 13315116 13204869 13529526 13567241
4107 13567241 13717610 13594998 13740763 13762678 14074099 14428892 14263672 14387427 14567975 14442712
4097 14442712 14160463 14523837 14800456 14869623 15045900 15026525 15141661 15177260 15150110 15455756
4087 15455756 15573427 15555141 15914661 16001916 16166854 16314012 16701712 16752526 16901875 17474525
4077 17474525 17521908 17564244 17849529 18130341 18442046 18587044 18866596 19007310 19251555 19398873
4067 19398873 19779009 20061793 20373593 21063594 21312331 21317659 21518175 22186248 22723921 23255276
4057 23255276 23481711 23529552 23989415 24444473 25198327 25420520 25873200 26261806 26895856 27158895
4047 27158895 27354279 27774259 28407199 29144458 29724980 30032271 30402190 30982046 31343261
4038 31343261 31758630 32504091 32647097 33463999 34317745 34611960 35286319 35773610 36426783
4029 36426783 36913139 37339063 37773167 38419078 39099705 39510908 39776468 40355126 40832768
4020 40832768 41360190 41537364 41912434 42446763 43042932 42957253 43570205 43936197 44242087 44193796
4010 44193796 44528027 45206109 45266411 45284037 45416493 45365448 45347014 45422634 45431627 45368884 45325133
3999 45325133 45329964 45585389 45563463 45457011 45410561 45327350 45331342 45139248 45139202 45035600 45268569
3988 45268569 45024918 44836598 44872188 45210900 45031313 44755684 44993369 44880108 44823990 44683468
3978 44683468 44785022 45046238 45395110 45454665 45606011 45994807 46524897 47102149 47567577 48005595
3968 48005595 48770400 49375390 49876578 50563305 50974588 51343403 52181290 53033496 53614148
3959 53614148 54122039 54745901 55159167 55762636 56342967 57055564 57480569 57898497 58531317
3950 58531317 59239555 59936164 60782073 60997683 61285530 62068634 62140135 62704859 62829220 62951209
3940 62951209 62725521 62549289 62471143 62057942 61419963 61555843 60908023 60609309 60224157 60199214
3930 60199214 60344612 60178233 60519336 60749158 60942956 61109118 61716027 62193694 62780939
3921 62780939 62868355 63261711 63484911 63774760 63680574 63133937 62987825 62474945 61880184 61387320
3911 61387320 60804537 60509773 60058711 59825171 60185460 60230138 60584423 61324337 61911466 62724400
3901 62724400 63715361 64766104 65024711 65412974 65219995 65124219 64044979 62811547 61347523
3892 61347523 59476864 57569629 55629010 54147988 52777079 51483673 50009021 48620612
3884 48620612 47468683 46620884 45574720 44747988 44110703 43259436 41959226 40560275 39234053
3875 39234053 37775129 35933462 33896754 32023260 30481445 28731151 27420682 26200069
3867 26200069 24751014 23655129 22871445 21912767 21335762 20532521 19784128 19306015 18445242
3858 18445242 18133821 17731883 17138122 16991741 16281980 15837121 15429702 15046535 14285209
3849 14285209 13890591 13818235 13564689 13068313 12791914 12499981 12347675 12063578 11897049 11601763
3839 11601763 11450667 11079454 10870898 10770385 10679473 10291304 9732757 9864883 9785683 9712046
3829 9712046 9435002 9409344 8993848 8943306 8786761 8506967 8829281 8700155 8453221 8150189
3819 8150189 8037986 7964359 7846279 7714449 7893513 7902500 7440778 7343364 7380453 7098893
3809 7098893 7169657 7336064 7328971 6978426 6904187 6739589 6568055 6734727 6515538 6788062
3799 6788062 6840309 6899692 6794330 6700143 6493084 6295246 6275746 6054966 6188045 5860319
3789 5860319 5849874 6449255 6441114 6121714 6159956 6247836 6185207 6115134 6061447 6177189 5937567
3778 5937567 5606817 5651365 5805358 5794737 5806778 5617689 5695688 5886195 5934910 5897313 5892017
3767 5892017 5792086 5484927 5422292 5715966 5553241 5713979 5851379 5713546 5580898 5706915
3757 5706915 5833037 5755815 5767644 5979585 5855863 5382500 5425612 5312402 5619621 5631853
3747 5631853 5436704 5720485 5713484 5904814 5964061 5670401 5761263 5640650 5811318 5826625
3737 5826625 5722884 5879928 5681473 5645579 5765893 5808820 5783704 5781486 5911397 6150398
3727 6150398 6010472 6076424 5980456 5834236 5874384 6063699 6107290 6190771 6571900 6458965
3717 6458965 6409647 6401381 6575314 6720333 6538342 6366064 6501104 6482272 6450633 6538782 6650472
3706 6650472 6855910 6767148 6540139 6607322 7159409 7244489 6754707 6772768 6907726 7011735
3696 7011735 6992636 6994675 7319732 7233162 7395749 7265680 7332578 7346766 7644899 7632475 7907225
3685 7907225 7790797 7965444 7885287 8319499 8419546 8354281 8546635 8516016 8384451 8369093
3675 8369093 8592609 8975602 9125109 8980836 9107717 8888447 8854092 9091764 9340504 9282865
3665 9282865 9449957 9849035 10037576 10174637 10107015 10187044 10183794 10345181 10220403 10407070
3655 10407070 11052413 10848871 10848563 11091408 11166294 11296960 11566326 11450700 11741193 11937269
3645 11937269 12327888 12475376 12563562 12704878 12928524 13155797 13497333 13787975 13768482 13914420
3635 13914420 14146362 14200521 14541796 14927591 15120843 15119799 15408223 15745543 16078196 16294108
3625 16294108 16251097 16453377 16942622 17092647 17204747 17081094 17364390 17758286 18196239 18329480
3615 18329480 18693060 19029997 19389862 19442167 19820996 20206452 20765329 20809913 21371604 21659414
3605 21659414 22063313 22471113 23021643 23371591 24011207 24408039 24761785 25557842 26143184
3596 26143184 26647394 27010770 27726344 28013023 28883139 29838140 30014590 30536303 31530883
3587 31530883 32497760 33010051 33349855 34385740 34768086 35575459 36199007 36672921 37165090
3578 37165090 37639489 38326015 38709667 38924918 39446254 39809363 40031412 40480193 40270764
3569 40270764 40351851 40240550 39783206 39576156 39051164 38893770 38482960 38113027 37588789 36968490
3559 36968490 36294478 36099180 35541063 34865410 34188447 33383131 32935633 32053148 31616710
3550 31616710 30741402 30031206 29566347 29170682 28723110 28049318 27708069 27613964 27205202 26394919
3540 26394919 26320010 25934662 25958147 25989565 26128346 25860557 25761503 25940658 26255267 25983538
3530 25983538 26136933 26052740 25937768 26137801 26166041 26452706 26630396 26638899 27016075 27374270
3520 27374270 27431866 27707218 27668589 28027693 28253748 28331996 28673210 28892760 29297599 29438122
3510 29438122 29855245 30186500 30395113 30495499 30785873 30976370 31022708 30994777 31023438 31212681
3500 31212681 31289100 31454757 31360637 31715078 31719725 31746466 31575227 31671376 31568446 31268764
3490 31268764 31393099 31099379 30954068 30747303 30675343 30456184 30306628 30094021 30123408 30072425
3480 30072425 29470507 29449225 29252923 29041385 29032139 28760508 28487693 28304418 28458188 28862369
3470 28862369 28589435 28728032 28580587 28449826 28602147 28463733 28540649 28535529 28741860 28926224
3460 28926224 29035801 29093740 29282326 29825460 30225690 30323057 30705751 30729227 30974186 31649878
3450 31649878 32307844 32744890 32900725 33357215 33732653 34036033 34542386 35295863 35965873
3441 35965873 36296890 36945981 37526594 38127547 38506563 39005736 40010574 40583582 41030217
3432 41030217 41267574 41947661 42810186 43506261 44256945 44769622 45299337 45899896 46803837
3423 46803837 47854472 48566848 49111963 49530659 50490235 51250970 51886819 52446001 53163183
3414 53163183 53707971 54561319 55170681 55615287 56487187 57057951 57422188 57931301 58714628
3405 58714628 59387130 60172610 61000438 61599535 62439539 63384512 64183258 64773432 65687771
3396 65687771 66371635 67010574 67846766 68222591 68841316 69097644 69644426 70068367 70031672 70434225
3386 70434225 70544489 70787644 70771921 70931546 70768263 70609274 70272079 69728207 69709807 69302770
3376 69302770 68492525 67946843 67582330 67147051 66886388 66144611 66059159 65571505 65084114 64429234
3366 64429234 63977321 63032138 62461061 61539667 60403446 59428133 58253144 57141718 55970996
3357 55970996 55084195 54022526 53170922 51840244 51617270 51087664 50179479 49477055 48752062
3348 48752062 48230775 47470732 47104400 46486048 45769972 44983134 44236418 43652110 43356362
3339 43356362 42796773 41762706 40685940 40150479 39418620 38787004 38089096 37043887 36478458
3330 36478458 35618834 34815830 34319135 34146460 33363476 32715867 32010284 31676647 31252669
3321 31252669 30953354 30597905 29820346 29532094 28932949 28519556 28134707 27673997 27249444
3312 27249444 27095474 27051499 26463517 26398667 26302801 25843551 25706624 25332552 24930492 24875210
3302 24875210 24664476 24534120 23997624 24021312 23971802 23932287 24034107 23661726 23283105 22995052
3292 22995052 23129871 22895376 22903713 22905887 22732707 22892656 23130156 22772513 22683939 22796498
3282 22796498 22696563 22831097 22897836 23134908 23528263 23710794 23609598 23798550 24344814 24514714
3272 24514714 24556978 24843716 25266955 25640080 25560618 25630037 25969837 26268675 26755462 27138738
3262 27138738 27225717 27526825 27887407 28360193 28610702 29026595 29540964 30149806 30631976 31337561
3252 31337561 31693467 32371818 32898920 33514066 34128577 35009453 35689746 36235608 36809365
3243 36809365 37147296 38215103 38674638 39551804 40538343 41476556 42395309 43201758 43866773
3234 43866773 44647498 45872838 46721021 47714584 48803282 50149193 51446839 52271099 53275971
3225 53275971 54571455 55349251 55979163 57041841 58053478 58800072 59259223 59438708 59565171
3216 59565171 59780730 59685277 59237051 58682038 58499039 57814060 56876795 55274400 54256016
3207 54256016 53131064 51953426 50470398 48782112 46984640 45665246 44316044 42873292
3199 42873292 41468049 40381574 39178639 38273234 37015783 35973882 35241615 34520010 33552547
3190 33552547 33007121 32372149 31894643 31313391 30687467 30064787 29215733 29047164 28775241
3181 28775241 28652147 28162005 27719114 27341107 27292437 27062216 26902089 26942949 26678211 26631518
3171 26631518 26644015 26595809 26695516 26976925 26881688 26784586 27066179 26950812 27067630 27100066
3161 27100066 26959303 27114055 27351164 27292480 27316088 27943066 28233999 28279876 28334721 28379976
3151 28379976 28715980 28768157 29167842 29422380 29432177 29677956 29666928 30166549 30578378 30521689
3141 30521689 30725510 30968127 31357859 31686801 32068300 32295216 32613326 32775435 33212443
3132 33212443 33621519 34149357 34289027 34702564 35073920 35320501 35758729 35980160 36407061
3123 36407061 37182442 37609430 37918271 38418603 38564822 39205831 39762685 40366936 40785743
3114 40785743 41410333 42236449 42777444 43899807 44567041 45345658 46095192 46808007 47637615
3105 47637615 48577854 49463418 50121479 50882224 51578580 52160321 52829716 52954847 53548940
3096 53548940 54601429 54943812 55166577 55587417 55793644 56557787 56885850 56961879 57177956
3087 57177956 58025814 58589839 59188950 59995114 60561032 61507305 62420503 63047067 64148145
3078 64148145 65160411 65681551 66620085 67837362 69161890 70396955 71731681 72889248
3070 72889248 73963350 75048306 76454789 77730363 78856696 79599236 80394254 81459862
3062 81459862 82212587 83010260 83852713 84378564 84466210 84548465 84500997 84456503 84495832 84327545
3052 84327545 84049870 83951808 83875470 84043244 84170799 84255595 84277864 84462236 84908583 85497204
3042 85497204 86012698 86443598 86905335 87471748 88186778 89310336 90337483 91063717 91650670
3033 91650670 92320604 92635347 93401276 93955455 94133437 94861922 94623133 94601664 94664793 94798228
3023 94798228 94486470 94296635 94364293 94478059 94367028 94393674 94543571 94672673 95168061 95741797
3013 95741797 96350200 97460753 98258303 99365971 100525188 102109727 103585941 105234807
3005 105234807 107076436 109063757 111404335 113107177 115545446 118428883 121206481 124168976
2997 124168976 127277273 131173002 135143814 138446819 142940093 147247638 151118184 155204110
2989 155204110 159166744 162858903 165760117 168130843 170177506 171593769 171803957 172223518
2981 172223518 171875435 170950794 169295241 167102965 164234073 161164007 157564728 153962573
2973 153962573 149742240 145859091 142150425 138159464 134225892 130514170 127248482 123601515
2965 123601515 120792207 118378084 116089243 114565393 113705149 113476027 113603957 114179851 115405697
2956 115405697 116392553 117118909 118530338 118493015 117831933 116592358 113762012 110311764 106405421
2947 106405421 102058253 97844474 93948680 90188611 86831311 83246850 79847190 76657593
2939 76657593 73633305 70239065 67027510 64472862 61595860 59179049 57016952 55080934
2931 55080934 53312196 51341054 49825623 47990071 46702788 45370925 44354994 43169357
2923 43169357 42244055 41380987 40596428 39611740 39111836 38385381 38030240 37608699 37069750
2914 37069750 36836934 36806184 36757438 36440488 36443445 36408622 36603144 36643859 36233287 36684084
2904 36684084 36843984 36849281 37115355 37825301 38120427 38299378 38636894 38903825 39431359 40124378
2894 40124378 40789379 41346391 42066114 42784209 43584392 44261090 45182086 46393013 47179538
2885 47179538 47756605 48951701 49992121 51172107 52214423 53437786 54699340 56081199
2877 56081199 57299457 58805429 60345124 62454229 64511012 66907406 69767373 72642835
2869 72642835 75232963 78017008 80868230 83514979 85522957 86999704 87805700 87191331
2861 87191331 85287842 82562409 79076714 74604301 70205954 65936206 61531765 57509226
2853 57509226 53712311 50110804 47206001 44208651 41823801 39537269 37359510 35313986
2845 35313986 33375239 32258039 31176626 30000147 29206594 28256920 27386573 26515559 25837072
2836 25837072 25489588 25023209 24305310 24005372 23483452 23054395 22862156 22200260 21517286
2827 21517286 21270301 21059149 21045162 21136290 20858197 20599494 20595192 20419184 20224905 20300073
2817 20300073 20178062 19915753 20041176 19627846 19746502 19838835 19630995 19794887 19633508 19490202
2807 19490202 19523473 19761504 19739812 19558374 19582726 19655311 19962425 20075317 20150148 20501274
2797 20501274 20719560 20820196 20879085 20728906 21091119 21367093 21475813 21518087 21736299 22173355
2787 22173355 22166955 22350440 22278451 22638148 23171714 23397103 23572152 23679072 23664668 24013593
2777 24013593 24348612 24770341 25125390 25336903 25512657 25796172 26092650 26504169 26625877
2768 26625877 27046511 27612866 27922772 28618965 28897904 29213772 29254658 29558863 29926562 30393599
2758 30393599 31171089 31416480 31846842 32551880 33128619 33263691 33919618 34278494 34850356
2749 34850356 35370464 35950115 36516356 37041905 37726499 38417427 39401070 40286762 40946093
2740 40946093 41465036 42264923 42925406 43554169 44695067 45967316 46893362 47859800 49335158
2731 49335158 50174754 51342574 52929330 54394852 55921585 57481253 59185765 61159105
2723 61159105 63257126 65582475 67647449 69904038 72004523 74367801 77365991 80389438
2715 80389438 83052223 85643504 88856908 91669981 94116514 96558576 98708993 100885792
2707 100885792 103324890 105788132 108244835 110712456 113401244 116158677 118982007 122129550
2699 122129550 125834535 129638047 133513963 138028897 143098113 149174678 156700598 164361507
2691 164361507 172034837 177551371 181002191 183089263 185016092 187833022 191967131 197576710
2683 197576710 203695973 211141077 219887525 229326710 239693440 251023931 262837043 274006473
2675 274006473 282258000 285839606 282773147 273862991 259953254 243197863 225047609 207429752
2667 207429752 190635000 174367761 159239462 145265635 132451814 120463973 109549687
2660 109549687 100141406 92105132 84678639 78413094 72597474 67826608 63391923 59357424
2652 59357424 56037746 52841953 50045145 47013622 44528963 42207649 40281912 38768918
2644 38768918 36801378 35341206 33802057 32221764 30919632 29801654 28502362 27271811
2636 27271811 26209399 25364934 24468546 23420331 23014547 22267508 21174294 20386097 19847264
2627 19847264 19143416 18582184 18025331 17373072 16726977 16105059 15771232 15204098 14890491
2618 14890491 14263825 13872901 13429399 13129003 12731091 12249321 11658047 11801919 11593927
2609 11593927 11188596 10695770 10588688 10418550 10175002 10007782 10003255 9897498 9407809 9468473
2599 9468473 9091081 8743472 8648697 8458935 8134463 8039997 7712256 7816231 8030438 7659245
2589 7659245 7158629 6839713 7278389 6773230 6789654 6868566 6872019 6785709 6681828 6523848
2579 6523848 6380839 6010655 5680132 5785630 5891475 6073493 5646770 5328867 5324394 5171459
2569 5171459 4822909 5374576 5364850 5130528 4787724 4946825 5016421 4961554 4660061 4866834
2559 4866834 4832860 4695927 4257272 4154104 4328103 4109384 4298416 4148638 3949139 3681861
2549 3681861 3998848 4026437 4011734 3986424 3966496 4231305 4040083 3888978 4051143 4085840
2539 4085840 3759465 3535069 3465113 3605097 3588078 3338667 3369597 3242552 3243780 3503205
2529 3503205 3369860 2990737 3042462 3543299 3234528 2986725 3312998 3000583 2629405 2562265
2519 2562265 2702393 3088965 2854233 2953009 2719115 2618526 2880336 2828795 2681897 2551435
2509 2551435 2953869 2893788 2577750 2414500 2682689 2894318 2680936 2572316 2507992 2384359
2499 2384359 2385278 2475178 2378833 2693456 2586949 2613202 2704754 2590086 2543287 2525022 2423536
2488 2423536 2588159 2650371 2697154 2466452 2242154 2283200 2432521 2291943 2054787 2405345
2478 2405345 2753878 2841453 2752159 2529348 2408887 2572844 2528336 2323756 2466516 2743275
2468 2743275 2599013 2324494 2509789 2662901 2839212 2531166 2574368 2860184 2659269 2470219
2458 2470219 2163090 2555590 2641472 2377421 2175319 2116332 1972844 2051964 1889328 1951573
2448 1951573 1881187 1742803 1780029 1709079 1849243 1809866 1855504 1617920 1507777 1711082
2438 1711082 1632156 1485181 1515009 1391356 1483810 1395778 1349499 1128120 1354382 1314778 1237671
2427 1237671 1152093 1173221 1369508 1246733 1262904 1344247 1121559 1075298 1285557 900129
2417 900129 1017069 1302677 1420974 1116539 1253778 1117909 1370185 1396877 1242668 1161532
2407 1161532 868976 915660 993226 1357219 1160007 1191401 1335155 1103408 922085 767747
2397 767747 1132280 904304 776847 1125996 1058696 1143035 1313537 1086193 1247657 1202030
2387 1202030 1021273 1027992 1128001 1153518 1248297 1328456 1370764 1059276 1215237 1183698 1142165
2376 1142165 1014600 956434 1420233 1367672 1063733 1094557 898284 1007891 935800 830919
2366 830919 1095358 1061117 1079035 1165665 1185500 912148 824458 1165351 826669 789662 986029
2355 986029 825400 1061443 1204608 1169761 946420 865796 826828 1151949 1366956 1217333
2345 1217333 799253 894773 1188604 1293850 1121521 932165 1015035 1034743 1061822 1026785
2335 1026785 937069 849945 879732 916443 1014559 846989 671356 840592 991448 739786
2325 739786 701653 894477 1065138 876758 664514 1121668 1246847 964237 953783 1057752
2315 1057752 722814 1015255 943398 854433 873139 876677 826027 696740 930895 567772 711258
2304 711258 753390 862326 775043 896733 1005546 1100703 1390007 1187383 1147197 1008944
2294 1008944 990876 859467 1205683 1303107 1119210 1144224 1249722 849586 984365 1289819
2284 1289819 1196041 911958 1172043 1104083 1102815 1064792 787482 1088855 1018606 917095 955892
2273 955892 953499 894869 1061877 1131863 950578 1125033 1185904 661374 567773 1090445 1260490
2262 1260490 997193 1077376 1246126 1255206 1071198 1090790 1035313 682051 828307 832319 659581
2251 659581 1000308 1300422 1168036 946359 1087061 1096420 825995 1155959 867656 936221
2241 936221 952812 651813 897245 1092921 963454 1071924 932984 1054839 1295326 1548803
2231 1548803 1152339 1153872 1420459 1376457 961212 944860 1021260 1031060 909229 1077265 1339306
2220 1339306 1358644 1322251 1385765 1425131 1236265 1917836 1799129 1546837 1591450 1521751 1496451
2209 1496451 1797914 1452012 1703242 1826311 1816974 1629205 1417317 1500683 1835762 2071367
2199 2071367 1724636 1623808 1582037 1670888 1839374 1658477 1793928 1999628 2006196 1893499
2189 1893499 2057706 2139901 2047129 2130954 2119243 2029945 1953887 2014394 2293645 2450949 2121440
2178 2121440 2380525 2405493 2351671 2670284 2465910 2360037 2459919 2776565 2560371 2747495
2168 2747495 2868983 2751267 2786934 2562342 2967705 3177666 3182270 3078023 2875475 3053450
2158 3053450 2988367 3084622 3028956 3210154 3227502 3135623 3238765 3310165 3479204 3600757 3481984
2147 3481984 3646717 3810038 4147001 4002822 3735891 3945598 4264480 4694403 4560033 4594328
2137 4594328 4697748 4887905 4994943 5246475 5135506 5402988 5911383 5750387 6070004 6303075
2127 6303075 6846048 6793840 7510261 7588105 7910607 8179414 8312233 8331644 8906157 9172861
2117 9172861 9511958 9979042 10118971 10296323 10672942 11061567 11341817 11499771 11818234 12408437
2107 12408437 13157726 13975044 14713874 15687192 16762255 17780181 18995690 20378674 21666089
2098 21666089 23600621 25950010 28169970 30160282 33900412 39294983 46672994 55362071
2090 55362071 62017052 60054446 53633210 43419696 33533569 26802940 21945809 18466413
2082 18466413 15544122 13169192 11770501 10957051 9540878 8663662 7601139 6637393 6112974
2073 6112974 5293056 4770575 4260414 3935709 3707581 3697898 3433315 3334089 3091085 2833008
2063 2833008 2776814 2688690 2707453 2405565 2149434 2234118 2222842 2217427 2072514 2087071 2262555
2052 2262555 2108977 1913572 1795592 1748780 1888351 1814279 1540595 1448924 1243343 1313468
2042 1313468 1155135 1165064 1150194 1176993 1303972 1320139 1152408 1100764 946746 751868 882443
2031 882443 915217 847443 857073 685747 524897 667068 789802 809891 639171 598463 712809
2020 712809 755040 711999 781678 748532 671279 398791 472706 732964 769055 808347 602145
2009 602145 613150 524421 393689 382638 366894 606688 752277 711377 366604 502394 490534
1998 490534 417575 548133 437430 641071 346531 349491 382661 380315 485911 531024 595745
1987 595745 727366 550390 584984 257610 292890 457784 515010 555632 631471 401845 325265
1976 325265 546122 454589 523383 211537 416880 420908 444033 571945 613678 349684 383608
1965 383608 379622 295454 347809 200630 320244 51064 348075 216698 -232826 -1886
1955 -1886 -33421 -148383 320571 207203 172948 178339 319674 450277 530729 465504 442862
1944 442862 248290 141329 290301 184181 263025 341349 129512 110549 212817 33440
1934 33440 -107986 24856 201989 166532 466261 516174 363451 213946 460759 338183
1924 338183 221129 311369 630230 776903 590022 431811 345511 239966 145834 105676
1914 105676 219099 163215 -33639 254690 230936 103494 -103094 345596 508130 335397
1904 335397 187095 228231 -28176 149914 250117 263301 195188 -266827 -55973 266434
1894 266434 272412 103677 369248 416188 333166 567915 376370 373497 556138 537433 272407
1883 272407 178194 116446 169305 -79571 -10857 -55148 109106 249459 243313 -83290 -274205
1872 -274205 -6582 7407 203459 256686 -110835 -156427 155103 108180 103139 77187 367490
1861 367490 183443 77283 157179 -127104 137716 194356 13086 -68271 -103228 -6123 -162546
1850 -162546 154404 109603 231032 235465 376016 -157709 108667 30853 25023 -154044 -206612
1839 -206612 -274113 36654 62162 126547 115986 -70165 13536 -247587 -136340 -33366 171969
1828 171969 216725 150610 167782 139273 311253 77638 -55567 238870 58778 -256874
1818 -256874 -190314 97189 39296 -71061 -241106 -18556 309639 307736 113430 69221 -162520
1807 -162520 19418 206990 25399 177677 266992 58892 267220 388511 323177 10054
1797 10054 -72070 183015 -14821 -188465 -251627 -167847 -180075 112744 443342 -22056 -291252
1786 -291252 -61482 -26967 -72909 47715 -293473 138095 456191 278090 181098 5296
1776 5296 17699 -83763 342256 492721 81796 111392 78156 238216 28831 77319 4299
1765 4299 -177127 -324102 -78065 78377 198278 291934 -94407 40382 -92910 328754
1755 328754 404478 56581 329912 4409 58262 -20549 78109 -30884 102705 146774 6821
1744 6821 6853 82337 314600 -121120 -8151 21529 1245 -3099 127382 58739 226912 224697
1732 224697 16805 -200976 -14115 74674 -86755 -271482 162076 191707 60861 131581
1722 131581 115004 230708 151819 42243 -7280 -40983 -137148 -221111 -363477 -126400 149770
1711 149770 -35427 -8799 -234044 92171 47379 -16465 -147196 -14662 -27340 -211778
1701 -211778 45339 134199 207069 -212665 -83016 -160376 184219 412601 102784 -39312
1691 -39312 74919 -423859 -317167 -161255 -36678 -59599 47312 -215200 -218885 -158142 -190025
1680 -190025 -326826 166776 294421 384087 366108 185604 130131 94648 27552 50364 11750
1669 11750 -44715 -112377 -75654 -165875 -79580 -56315 -235037 25924 52448 53256 1094 -16609
1657 -16609 39857 -87956 -225509 14429 94816 13032 25067 -14070 22290 -132620 -51620
1646 -51620 217109 -25945 25251 -194903 -14854 6820 73557 67705 117849 105965 87888
1635 87888 121370 282560 -25366 136939 250856 -134614 -136491 -110093 -241495 -12139 -259812
1624 -259812 -91466 97358 -32745 23680 6159 -79085 -239422 -50827 77927 -304966
1614 -304966 -194835 -125064 33291 251726 111863 -61886 121816 291424 -71077 19924
1604 19924 239436 -45328 -136289 -33809 33603 -160294 -50732 -100008 73254 148840 8109
1593 8109 -165753 -213296 -188357 -13068 -12766 -268645 172953 40577 -64913 61866 346096
1582 346096 -282080 -51924 248747 34749 81571 303686 274128 202881 246213 -44604
1572 -44604 133418 92945 -27651 -18675 -57242 13882 -108731 199016 -32155 -43492 265985
1561 265985 151212 93315 -226485 -322072 -173724 -189170 -122847 -280176 -157509 72000
1551 72000 -152232 165647 288664 236123 45323 -83308 -17246 -66721 106601 22577 -81249
1540 -81249 97871 134791 269718 363214 4903 -98779 -19932 59396 -280831 79020 219136
1529 219136 218412 116430 -132196 -113233 274068 -107025 -30087 70795 -302213 -253916 -421132
1518 -421132 -261582 -226698 -1075 11704 178551 -232337 -211134 -272981 -94740 302462
1508 302462 16131 -253267 -90400 24288 89451 27702 118217 211950 112985 273861 -118224
1497 -118224 -367117 -46387 -117079 -149009 -69028 -14406 -72572 228774 -13511 -89642 -185687
1486 -185687 -115777 -192442 -223988 -70077 -107771 -70730 -232191 -267825 -410796 -139944 252763
1475 252763 45413 176981 7733 -43782 -37567 -56046 255290 260814 84636 -224301 -116479
1464 -116479 158814 159548 -20390 -43661 -101046 -191531 -206 10129 55324 13612 -45944
1453 -45944 -17814 39883 362911 167865 164325 -107227 -177095 -180586 105254 -104127 -29365
1442 -29365 75929 26977 133878 140370 119708 233413 90135 28686 154626 168012 93346
1431 93346 353860 264105 192497 375287 219069 160947 83719 130236 -195529 -16252 95158
1420 95158 166389 -172056 -345701 -105946 -140022 -86073 182131 123238 -1907 49780 95818
1409 95818 -71896 46931 203400 99830 192010 11325 -162283 -323788 79376 -82629
1399 -82629 63331 -159914 236029 342960 245103 317547 27361 -208264 17908 315263
1389 315263 190911 -123253 -19155 -44163 90608 260225 76713 189465 287916 399467
1379 399467 205976 -140425 -396954 -25439 123533 40164 -67374 -231454 -271711 -67398
1369 -67398 211552 40064 -81546 -16564 -12338 -63535 -245552 -37656 -2714 203173 216309
1358 216309 80757 -148140 33378 -99669 -359777 -355596 3096 -15140 42447 162533
1348 162533 165306 -126228 60985 -92635 8232 -123921 -150981 -86897 -123480 164176 76423
1337 76423 -195779 128339 176539 66254 223956 138847 -12909 -159403 -203280 680
1327 680 21065 -189200 -158771 -131936 -443147 -413179 -2887 -49502 -88182 -246338 -192152
1316 -192152 -168491 -71403 -130069 110616 410186 493232 285367 159891 170626 -142760 20757
1305 20757 286225 201866 -31196 -286851 33704 -7494 46266 -88793 -164288 -40308 65480
1294 65480 -116065 -161219 42443 -14371 -16408 -47006 -419265 -240585 94358 173983 -280007
1283 -280007 -283104 -433053 -295755 198249 -96248 -29569 -119745 -402706 -209639 13937
1273 13937 -493187 -342012 151481 19583 173303 126957 -108696 -7050 448803 368081
1263 368081 177768 -12953 -49397 275384 199506 257360 125792 -77754 -142808 148161
1253 148161 -105241 -172477 108128 14551 -79790 -42357 -298306 -273966 11353 -15761 -1804
1242 -1804 266090 329886 -67259 8005 -146839 -57737 -50350 -388085 -32129 -59898 -256984
1231 -256984 -224328 -170904 -63763 -53703 -330455 -267516 -303929 160922 -68676 -247209 -34946
1220 -34946 44313 -107184 -22594 189756 185781 145198 159323 64600 -84450 -72941 -216839
1209 -216839 306721 60231 92034 335767 139986 -105922 165877 116171 -172048 -241273
1199 -241273 14852 -11153 -132117 111297 -66041 172993 -174239 -233243 -137153 39808
1189 39808 108044 -20898 -208509 -138476 -214343 -61761 349096 -167614 -46274 66352
1179 66352 -230613 152215 206908 -191660 -41509 53029 457672 391156 222338 -109372
1169 -109372 -30734 -112053 150535 309134 344216 329975 28024 147705 -78439 63917
1159 63917 311401 110140 267309 352574 289999 95940 -160736 -29695 6616 5562 335651
1148 335651 140140 302215 103398 219588 83508 69187 -10281 -139713 -240306 -28086
1138 -28086 297994 1173 124608 83046 -109974 -195948 156392 78733 48273 48144 27170
1127 27170 -70656 87347 -143975 171635 -61025 17244 50098 -77713 -176569 2317 335406
1116 335406 116063 164198 -159536 44593 237053 120598 73025 148043 -31504 -269696
1106 -269696 205405 216391 35350 -148476 -348483 -123254 19309 141901 235470 106696
1096 106696 385812 89557 45915 375149 352060 144683 57066 65118 5617 152341 42465
1085 42465 51062 104257 -188264 -280245 -149977 -222237 19406 111692 377396 412797 134652
1074 134652 -79974 10593 232579 139207 146466 -204511 57756 146705 -401412 -360304 5367
1063 5367 248536 239105 -7509 -179377 -232774 -449627 -366009 -81221 109421 -6578 -162981
1052 -162981 -347233 -104191 -118375 -85407 17058 -116595 -473757 -398704 -49259 68792
1042 68792 237367 -61322 -81392 -57632 -222320 -271445 92181 166275 87460 -3685 15857
1031 15857 55922 2454 -151429 -86627 -213720 -237244 -151506 -198613 -152841 -153609 -28685 42451
1019 42451 -28665 81617 146841 182146 13756 -139263 -173624 84654 236025 -145008 -107047
1008 -107047 -330162 -451855 -347176 -121316 -32618 -156939 -74906 -170366 -53591 -78598
998 -78598 43152 120787 135792 -24606 -94933 -3503 -117733 26857 -43097 23760 -18086
987 -18086 131261 220399 72576 60629 129099 305739 280560 379693 166233 -62208 42278
976 42278 35350 -41791 -234547 -355017 -132840 -280422 -336246 -330972 141743 413542 225692
965 225692 75966 18776 204443 -3052 108295 -129767 -52877 20114 109040 -22004 164716
954 164716 121682 128645 22321 -203570 -321200 -615725 -261771 -115343 -279860 196415
944 196415 -13513 -105789 129687 97129 143485 257472 -131459 -124274 -98442 -20422 286474
933 286474 -5987 -179961 -119920 -113378 28603 39350 -5732 -21271 -61124 -166292 81539
922 81539 -17426 177451 66864 -255570 -402213 -505354 -209789 -249872 -36343 78186
912 78186 93339 -85262 427113 -50288 -9514 -109710 -207554 41727 195953 137632 -136788
901 -136788 -98444 -83075 -171324 -37717 -63878 -151029 -362118 -256533 1425 143481 283262
890 283262 177079 84444 -39679 -131398 -68064 62617 128633 -236101 -177335 244150 139913
879 139913 -753 71113 19430 -46244 -182264 -200321 -354467 -75007 -151474 -271733 -60541
868 -60541 175610 -233777 -310471 -66870 -391578 -19093 -182756 -124676 35236 -31696 394672
857 394672 223953 -64792 63846 134299 25444 -178722 -248491 -256823 255395 27577 13479
846 13479 45457 -128432 -193586 -209837 -86269 74790 71574 -112304 -239859 -399776 -72757
835 -72757 118681 -53242 134035 67608 229972 50222 257108 17425 -10675 -204794
825 -204794 -154707 222668 -103544 -53810 -70432 -47253 103840 209642 17071 197655 104470
814 104470 276312 382841 205855 -13602 20088 232823 -206340 -483641 -69924 -99294
804 -99294 -186095 137032 -171735 214026 252185 128160 201586 -164993 -73320 64683 -32486
793 -32486 -119776 -104550 -71268 -43212 -173978 -141059 -456391 -103939 -72949 -39697 7670
782 7670 271158 263790 -22801 -38381 -83621 368607 155103 -16803 98864 -122632 -175060
771 -175060 124352 347133 172917 120381 301091 228179 81112 27271 319429 -25074
761 -25074 70017 167310 250992 278096 -16729 -229226 355825 367409 -1945 118619 51608
750 51608 -148006 -251090 -191723 -30431 -64197 30271 -58124 -270617 31903 -79293 -350829
739 -350829 -134425 -301036 -555941 -47655 -204842 -77239 200275 184866 217117 101447
729 101447 52219 -128796 -262125 181184 3396 -235038 -96103 203142 -31573 55442
719 55442 101482 -76660 138546 153697 -5808 131448 76161 39873 58485 -266025 -180913
708 -180913 202200 -167771 -152154 -29453 49104 55973 61342 178218 134274 126334 55841 -261200
696 -261200 -138699 -111005 -568479 -351086 -373037 -469965 -285551 -223616 -192303 -188801 -99934
685 -99934 67870 -43569 80858 196275 171063 145959 97520 329344 285537 64238 -26596
674 -26596 78331 181402 83512 56378 -75218 45195 -179318 -128943 235436 -64415 65073
663 65073 279534 567075 373285 107325 -153451 -319624 -107790 -61235 -74918 184140
653 184140 247536 -64351 -35411 140914 -349941 -408302 -130934 -116792 -5054 77299 -29531
642 -29531 -168368 38307 -225920 96185 23692 402270 408716 218827 23937 -159548 -34330
631 -34330 196925 77832 -54573 193731 74432 -209876 -351616 -355652 -286188 8379 98769
620 98769 -78330 8143 -126643 33103 -84034 311848 418319 358947 244716 71427
610 71427 -44603 151653 115300 -165781 -443327 -526126 -218672 31703 175677 167464 -209703
599 -209703 -22715 229191 -14621 -129723 -223811 -260763 -431258 -516986 -259965 -119780
589 -119780 -130275 14096 -91975 -167261 -90758 100018 30395 375448 -12596 51605 -11343
578 -11343 -204326 43269 200077 92343 139313 238543 94625 -229496 -4045 -9614 -274358
567 -274358 -188955 -263998 -242393 101682 -220185 -127116 278743 388020 32568 81024 213835
556 213835 310168 176406 51677 -208373 -212808 28074 59450 -167759 -202174 -295550 -158442
545 -158442 -148122 -201146 -56197 -31765 -122206 -86692 178314 97724 10233 189212 151148
534 151148 -241435 -96301 -41018 96393 -114494 -16301 -98187 93005 41419 26859 -64509
523 -64509 141974 -139906 -298431 -85708 -122929 80206 -47953 -102288 155261 65672 -16353
512 -16353 150471 316573 45353 -76157 -52227 66992 222485 221669 45875 -130365 -122354
501 -122354 -88017 79252 58979 -13644 -63970 -105908 -115803 -110438 -211033 -122059 13410 33221
489 33221 -69918 215734 107961 -234007 -76173 263088 204268 -31227 14321 94994 52509
478 52509 88529 156046 221553 104114 177673 154465 -67499 -74018 89043 -62002 -402941
467 -402941 -196143 -94125 -127385 133042 493208 158062 78269 -201716 148555 122249
457 122249 -91051 169963 186693 208834 174789 -222247 -339487 -159939 -297421 133138
447 133138 -64128 98295 112850 54647 -129371 -1868 118255 -191761 -75935 152473
437 152473 31986 318858 215870 -23928 -250727 20736 108681 103058 148085 -50863 -120427
426 -120427 275815 335442 94230 57395 139113 164001 255622 110613 -287741 -61099 99907
415 99907 80641 181566 -2596 -232785 44802 145426 -39459 -10790 -37954 33676 274671
404 274671 49706 -21377 -157037 -69129 -175012 -180131 -22784 -123666 -106661 -51782 -212247
393 -212247 -249242 -77271 15532 -68167 -80164 -121526 -17715 -79030 -239905 -262544 -83992
382 -83992 90529 288971 167567 136457 235695 -49534 -32206 -70806 158995 80031 -122681
371 -122681 -317119 -541406 -370760 -238934 -12119 17331 -169289 -44826 -32870 -134016
361 -134016 6765 27805 10323 17405 -92849 -125994 -109729 -220494 -158723 -55954 -71514
350 -71514 -418934 -122447 -13512 219373 157234 -42208 379018 -47884 86613 358435
340 358435 -215903 116837 -118100 -68781 -27812 -154612 -446624 20437 212771 -170611
330 -170611 -159839 -32722 -51370 -399128 -185843 -82952 -95454 242978 -150578 -197119 76913
319 76913 -8404 -88628 3802 63513 4018 -88075 145160 94427 64055 116182 29169 80027
307 80027 -108420 60723 82621 22643 -2275 -71773 148826 169214 121225 125955 219339 132026
295 132026 84378 170834 -24881 -45482 131697 56710 -240061 -165181 -195468 -316846 -259508
284 -259508 -87025 53252 14879 -31099 -71104 -187548 124587 -11338 64311 -2002 36750
273 36750 -8126 26464 -100166 -123416 -344442 -297545 -99384 53284 143542 171226 -183280
262 -183280 -152521 -443088 -421943 -157708 -170587 -73860 -102462 -412267 -475580 -210149 -200962
251 -200962 -2558 41423 39024 151775 -133088 -296009 -131679 -400169 -417429 -383394 -223095
240 -223095 -127555 -55391 128004 42413 -348296 -214275 113397 110459 173746 65987 33892
229 33892 24662 135680 -39836 -55739 -173554 -140357 -242275 30705 243639 -52037 -183846
218 -183846 84435 74827 43135 93938 252499 133614 198167 -44719 137820 6642 99447
207 99447 -129940 -247740 -27058 -112001 -229292 -274538 -137060 -50160 -239159 -51215 52907
196 52907 -94114 -41460 -46609 -258461 -374826 -25023 -355500 -1857 -108316 -97020 -274328
185 -274328 -146043 159868 30789 201001 206380 -20152 50347 -178212 -108950 -214397 144051
174 144051 26942 236295 -22476 -11247 7949 141645 239322 61516 18945 192170 145815
163 145815 162480 66073 -121468 -79508 -157883 59160 76457 -14948 165347 288503 251962
152 251962 104585 4168 -365428 -229262 32128 -37849 141756 162784 52248 -337903
142 -337903 -148605 -247751 -93688 39536 -25978 -191372 -311663 184323 223419 -93077
132 -93077 -289828 -168668 -141318 62158 17850 66167 -46932 86713 202508 321255 436931
121 436931 184613 -159508 -103280 -52317 -212898 -297850 35031 -15411 -56338 134016 -270776
110 -270776 -184224 -49379 -126006 -213162 -45959 -113343 -271671 -80608 -2737 -222203 -410584
99 -410584 -128084 -58536 -69793 -66830 -5366 137495 204682 39751 55061 122917 69102 -37243
87 -37243 -57529 97158 106581 -34595 -104446 123783 -103015 -57572 -82306 -5295 7881 -154355
75 -154355 -49256 -91044 -121149 -195782 -22256 -40344 -142408 19045 -258350 -133398 -77368
64 -77368 144362 17424 16078 -107847 -28887 -199323 -165237 -98939 -63529 -269577 -263767 -140647
52 -140647 -219351 -66212 -45104 -106659 4144 -39765 -165986 -188161 -258035 -267517 -93538
41 -93538 113548 75724 193083 147754 51348 145903 85512 33289 -48117 -13062 -28973 -28248
29 -28248 58851 297826 343736 162155 171249 114194 -24985 23449 80429 123194 130248 32511
17 32511 -201302 -131057 56056 -38522 -239881 -282907 -60984 -126353 -87450 -10549 -65390
6 -65390 -41699 4360 14283 -90181 -101669 -109925
0 -109925
$$ Imaginary data points
##PAGE= N=2
##DATA TABLE= (X++(I..I)), XYDATA
16383 -2873657 -2869125 -2791923 -2854982 -2992584 -2812513 -2970857 -2958707 -2797335 -2811921 -2662395
16373 -2662395 -2563132 -2541561 -2650201 -2530824 -2582230 -2512337 -2490145 -2354177 -2517071 -2258991
16363 -2258991 -2271002 -2412443 -2179349 -2257407 -2124543 -1955888 -2196975 -2072424 -2160741 -2173049
16353 -2173049 -2085846 -2022909 -1739076 -1932594 -1858674 -1848773 -1836162 -1686479 -1740964 -1797756 -1732325
16342 -1732325 -1583058 -1572729 -1399624 -1445538 -1661289 -1676909 -1593514 -1500512 -1126666 -1260284
16332 -1260284 -1277775 -1113946 -1018685 -1180462 -1181995 -1061799 -1047799 -1088115 -1273544 -965154
16322 -965154 -925713 -1010213 -1189784 -807857 -732447 -739143 -710078 -666820 -555856 -850625 -774066
16311 -774066 -576469 -834736 -442262 -511803 -654079 -665644 -869114 -709102 -511937 -470734
16301 -470734 -208016 -312916 -263920 -358697 -442298 -310314 186813 93261 202716 244836
16291 244836 -236866 -88102 -68770 63864 362484 253703 264180 115370 202241 308839
16281 308839 70954 170513 204467 233831 115551 254752 251427 378374 331623 225769 332921
16270 332921 646593 641418 841330 579347 555431 487921 624257 613192 333780 634716
16260 634716 538436 850679 772324 903252 860392 562836 665113 788010 930836 982437
16250 982437 1028369 854894 1037133 772677 844746 1022294 1162351 1310445 1251819 1003132
16240 1003132 1055662 1221411 1121846 1019455 1141163 1240310 1278210 1391066 1288823 1370229
16230 1370229 1260590 1322735 1399325 1324378 1404173 1278239 1383834 1611098 1488826 1248377
16220 1248377 1173588 1232168 1371937 1393257 1332022 1384385 1374432 1581938 1732935 1658639 1698410
16209 1698410 1627987 1706890 2025456 1535329 1593025 1764264 1661763 1793109 1791207 1787335 1932734
16198 1932734 1946879 1728682 1709406 1690668 1983866 1971693 1930650 2116748 1801828 1802303 1920271
16187 1920271 2103504 2231320 1998288 1391957 1807608 1951246 2108960 2255229 2116527
16178 2116527 2085228 2150279 2304546 2149137 2078220 1934051 2156070 2125474 2146831 2473360
16168 2473360 2341676 2015304 2265302 2429974 2300072 2350298 2418439 2462453 2235989 2207249
16158 2207249 2041666 2462008 2413709 2366695 2352708 2354122 2451157 2067655 2252762 2305422 2144950
16147 2144950 2084125 2365796 2442148 2341123 2275149 2017810 1955605 2039653 2238673 2476613
16137 2476613 2425961 2427733 2322850 2289518 2572974 2537313 2435766 2578850 2313639 2540960
16127 2540960 2553135 2440995 2537045 2856515 2875233 2502062 2608814 2592531 2488661 2447792
16117 2447792 2296684 2474763 2337027 2281469 2354423 2553376 2476434 2514358 2659788 2384003
16107 2384003 2243495 2320188 2581174 2621509 2941505 2555996 2537321 2768262 2617145 2807977
16097 2807977 2572572 2616692 2434910 2238928 2253073 2227832 2352598 2626443 2805704 2664275
16087 2664275 2665072 2770645 2744458 2676557 2740843 2543318 2589761 2703873 2639721 2483853 2518881
16076 2518881 2687937 2598574 2644917 2762119 2705413 2594024 2566632 2717585 2733736 2837673
16066 2837673 2952464 2669260 2723850 2889528 2640883 2726061 2956349 2737817 3025004 2901567
16056 2901567 3004562 2720545 2638679 2861530 2941472 2857852 2612377 2633528 2611880 2539885
16046 2539885 2977610 2964690 2615179 2525151 2817529 3209270 2804153 2838506 2708450 2706925
16036 2706925 2765295 2644272 2743987 2882799 2774954 2815149 2894023 2608476 2619461 2621715 2638675
16025 2638675 2883296 2688939 2971830 2931158 2735610 2687011 2403904 2486615 2717995 2765073
16015 2765073 2468577 2343103 2480434 2503270 2703114 2954649 2867803 3088240 2877775 2613394
16005 2613394 2797471 2892766 2824347 2424610 2487398 2664780 2745182 2880829 2825049 2518909
15995 2518909 2901936 2883908 2722213 2682976 2859540 3259628 3187631 2840777 2807556 2792552
15985 2792552 2827394 3050012 3200223 2830981 2967299 2947526 3112003 2865302 2945280 2930084
15975 2930084 3121471 3162631 2705026 2696470 2503796 2878670 2879462 2999841 2860553 2687491
15965 2687491 2574604 2906741 2757190 2858054 2938361 2991329 2744779 2797492 2888110 2960245
15955 2960245 2712405 2522860 2602189 2927987 2886081 2948430 3035754 3038310 2570231 2561498 2617127
15944 2617127 2551018 2720882 2349218 2268987 2394326 2598992 2766996 2666654 2547273 2639924
15934 2639924 2677524 2731293 2860051 2701456 2481159 2672647 2636161 2771377 2891795 2781175
15924 2781175 2701909 2806974 2794922 2713785 2853717 2963521 2720601 3014095 2994765 2753410
15914 2753410 2929096 3045188 3040804 3100695 2888191 2731259 2704200 2500857 2538764 2847668
15904 2847668 2954075 3141724 2977411 2611892 3057264 3014818 2649619 2847874 2919720 2941962
15894 2941962 2794438 2735453 2891864 2940404 2718581 2778003 2589383 2622073 2950105 2855373
15884 2855373 2787453 2901454 2576481 2818114 2832509 2439779 2440404 2454805 2461107 2442503 2923604
15873 2923604 3099919 2647391 2808738 2966128 2738669 2781875 2814038 2714601 2666597 2405407
15863 2405407 2388860 2638497 2751071 2757524 2636734 2394945 3109857 2985728 2961761 2736765
15853 2736765 2705632 2694677 2518126 2637986 2707908 2604946 2533546 2461841 2659415 2808333
15843 2808333 2728272 2561059 2900487 2916664 2592974 2578743 2716776 2744183 2461340 2903827
15833 2903827 2792530 3252716 2829002 2873836 2841897 2904902 2775036 2848955 2967287 2662077
15823 2662077 2879461 2839294 2737437 2799658 3029460 2941069 2711703 2701644 3027174 3030136
15813 3030136 3084040 2796214 2890843 3290885 2874733 2775377 2567895 3036286 2892441 2966575
15803 2966575 2820241 2642637 2740763 2683906 2896293 2793897 2699614 2870549 2729474 2638422
15793 2638422 2724572 2785010 2855385 2640006 2751729 3023153 2855622 2730792 2828586 2985744
15783 2985744 2732410 2991498 2957011 3011524 2948597 3079605 2928375 3084155 2913941 2754301
15773 2754301 3312065 2854649 2703574 2716221 2910423 2777201 2828490 2732218 2799821 2511736
15763 2511736 2849398 3239081 2850731 2735897 2412100 2754720 2759449 2655556 2616810 2851067
15753 2851067 2779545 2833252 2980551 2663226 2800736 3052281 3139649 2712356 2512723 2811419
15743 2811419 2942466 3038960 3014269 2925784 2995336 2895750 2719207 2641439 2510029 2769471
15733 2769471 2839338 3049617 3012824 2802554 2814687 2493273 2769691 2938706 2871376 2821134
15723 2821134 3003075 2932039 2892652 2942978 3042002 2876813 2932770 2674925 2625817 2771897
15713 2771897 2974312 2938480 2826395 2965700 2885080 3066517 3171541 3158800 3194411 2980492
15703 2980492 2897903 3003513 3016650 2986428 3044075 3039467 2872327 3019498 3136014 3093025 2910232
15692 2910232 2847797 2809786 2656925 2782689 2672990 2961839 2659296 2886141 2818021 2869564
15682 2869564 2743847 2790358 2661677 2785833 3073741 3002885 2967640 3029783 2873309 2522708
15672 2522708 2634067 2575455 2543307 2768261 2899657 2906610 2844034 2913011 3381192 3135051
15662 3135051 2722903 2741130 2769624 3001380 2937147 2963490 2954352 3035811 3054265 2982967 2742363
15651 2742363 2641716 2765246 2752801 2707125 2595013 3070925 3003917 3115261 2890225 2706230
15641 2706230 2876623 2924809 2948571 3157648 2852668 2737544 2829878 3045209 3207144 2880446
15631 2880446 2490843 2785576 2703722 2653253 2932391 3093971 2992066 3118340 3008685 2842416
15621 2842416 3143148 3077613 2998382 3037811 2949221 3089935 2891223 2682295 2454594 2766389
15611 2766389 3131138 2929064 2968049 2921544 3005741 3141107 3052475 3022408 2955814 2865888 2927933
15600 2927933 2870201 2827399 2693377 2609735 2729340 2817338 3019327 3079502 3084226 2965082 2954486
15589 2954486 3047643 2885177 3007691 3180737 2943481 2989567 2909037 3291392 3244544 2688236
15579 2688236 2802944 2861671 3025517 2891747 2774535 2690293 2760270 2905982 2965664 3143997
15569 3143997 3213049 3116079 3131824 2710079 2912960 3009918 3005502 2958458 3029042 3076141 3157053
15558 3157053 3052104 2988416 3028663 2934081 3098132 2825409 2945561 2785065 2832338 2704720
15548 2704720 2787377 2992910 2894020 2861284 3030935 3020198 2874166 2861822 2901364 2655581
15538 2655581 2814847 2738701 2662937 2793680 2893488 2972247 2505290 2725247 2667666 2827689
15528 2827689 2857702 2649799 2704365 3079624 3060075 2738377 2932741 2883626 3086318 2792337
15518 2792337 3089778 3117618 2960190 3150194 2805948 2482598 2701348 2626451 2740187 2735397
15508 2735397 2565419 2673952 2567183 2964610 2868925 2788872 2723190 2655156 2764692 2767055
15498 2767055 2615930 2737274 2999296 3165694 2761415 3120400 3007405 2902590 2908467 2959912
15488 2959912 2905891 2909704 2976793 3198805 3082310 3108155 2905707 2671649 2914854 2882711
15478 2882711 2770687 2883714 3048508 2959785 2943303 2568404 2534206 2870477 2917395 2803426
15468 2803426 2920145 3111251 3173598 2870805 3112145 3051294 2686779 2971835 3021129 2681343
15458 2681343 2685116 2640661 2815765 2930822 3185767 3114127 3147740 2930232 2895282 3071867
15448 3071867 3113751 3219428 2978223 3008010 2825396 2761433 2436424 2789969 2764105 2566369
15438 2566369 2755744 2629024 2733065 2680635 2724826 2801679 3286682 3419530 3130295 3097340
15428 3097340 2762065 2788686 3034816 2728830 2817964 3138894 2969782 2733013 2878493 2949055
15418 2949055 3332860 2941303 2898086 2873089 3134930 2975583 2856590 2879096 3173713 3264327
15408 3264327 3105218 3034958 2974807 3185737 2869954 2883982 3001739 3009097 3211771 3049778
15398 3049778 2744793 2794914 2705740 2861313 3089181 3179518 2896483 2893194 3101540 2780861
15388 2780861 2658994 2852916 2708961 2760868 2706388 2932998 2975923 2881215 3004577 3132260
15378 3132260 2857093 2858302 2598710 2856282 3031139 3058861 2960429 2539052 2553295 2802851
15368 2802851 2696333 2890529 2934534 3134996 3250000 2831035 3058252 3013387 3083329 2929757
15358 2929757 2880729 2818564 2955966 3040399 2938346 2976874 2767411 2871765 3160231 2991484
15348 2991484 2874815 2858855 2924130 3159338 3089782 3039986 2896124 2847309 2841977 2935947 3102503
15337 3102503 2983520 2784114 2876930 3004138 2852022 2834760 2930036 3028475 3323690 2965774
15327 2965774 2839478 2969907 3055463 2829495 2851632 3151051 3038436 3049892 3141651 3026018
15317 3026018 3054306 3016308 2841576 2814404 3010993 3057451 3037943 2783106 2601348 2930153
15307 2930153 2862709 3021998 3115248 3072091 2784781 3001048 3044912 3122128 3131277 2954953 2965787
15296 2965787 2949835 2810881 2924021 2974705 3075598 2736716 2674550 2868866 2967868 2718890
15286 2718890 2728027 2838954 2642832 2894915 2772563 2972522 2747553 2980868 3146063 2786892
15276 2786892 2770124 2937910 3048066 3022621 2912306 2643927 2711144 2909116 3147294 2945320
15266 2945320 2959087 3277934 2997622 2842273 2817508 2981622 2868728 3074226 3136635 2902294
15256 2902294 2780650 2790181 2879104 2839119 2991698 3050275 2778608 2721643 2698815 2821625 2948257
15245 2948257 3059168 3213673 3041416 3106765 3058548 2831866 2900394 2950243 2818956 2772775
15235 2772775 2771287 2597008 3135957 2949720 2689577 2851815 2978498 3433240 3257518 3191045
15225 3191045 3015228 2979067 2822157 2897201 2658353 2996154 2861622 2759077 3105562 3088540
15215 3088540 3054826 3023454 2823945 2659836 2864836 3043421 2795830 2957623 3096603 2861092
15205 2861092 2776538 2677806 2458838 3201247 3050329 3047000 3198444 3021058 2948410 2752638
15195 2752638 2898368 2888916 3065465 3133773 3233140 2912619 2827988 2980091 3146982 2993797
15185 2993797 3122748 2949896 3130139 2795060 2819030 3222573 3147650 3078448 3030210 2845649
15175 2845649 3015598 3037825 2788481 2906661 2939709 2739984 2889332 3008848 2934597 2784758
15165 2784758 2606442 2719186 3028200 2964210 3094709 3094473 2932469 3010118 3096368 3152978 2907528
15154 2907528 2880111 3091144 3061928 2884951 3041044 2937534 3118441 3071376 2886671 2531381
15144 2531381 2678437 2912711 3014880 2654382 2904366 2799602 2751441 2925042 2682810 2786043
15134 2786043 3013139 3130371 2805848 2962704 2815703 2751568 2786261 3015084 2760986 2716601
15124 2716601 3114728 3203561 3059657 2947472 3133743 3069627 3123540 3080989 3014374 3182796
15114 3182796 3096305 2779179 2583719 2627661 2724889 2934319 3072800 2937929 2736296 2731093
15104 2731093 2986660 3148347 3373035 3269827 3298735 3362320 3030497 2732530 2904268 3169524
15094 3169524 3117075 2780398 2797538 2868519 2811104 3099437 3117429 2979766 2786293 2977159
15084 2977159 2840859 2977784 2687861 3073951 2930585 2640417 2896197 3070594 3102088 3270903
15074 3270903 3368299 3270562 3112393 3036629 2931865 3065277 3055180 3240305 3174909 2869120
15064 2869120 2724604 2825507 2722258 2992099 3015021 3080234 2833820 2518416 3028359 3040298
15054 3040298 3083147 3057540 3095940 3283902 3270801 3114600 2889891 2623775 3059331 3158966
15044 3158966 3008271 3008528 3125696 3235687 3224603 3075980 3107376 2969088 3167629 3221474
15034 3221474 3243210 3129426 3148568 3077424 2962856 2997071 2868164 3068700 3109997 3160683
15024 3160683 3054691 2839303 3068022 2704921 2529172 2751584 3206342 3225599 3153671 3068322
15014 3068322 3425868 3250239 3146735 2846053 2662169 2531951 2727560 2690489 3007248 3228776
15004 3228776 2847762 2781477 2893891 3139389 2828230 2913205 2891331 2835195 2808278 2780182
14994 2780182 3006708 3089459 3283289 3221848 3087214 3157307 2812865 2843297 3155453 3166210
14984 3166210 3080359 3069633 2859256 3428924 3201950 3121381 2869319 3024239 3305507 2874896
14974 2874896 2847076 3148244 2855421 2834822 2977170 2956824 3059903 2921645 3019046 2912770
14964 2912770 3108193 2673534 2920485 3139413 3098741 2986983 2729419 2889470 3285194 2986756
14954 2986756 3155770 2837262 3022819 2983446 2895510 2863986 2955093 2926340 2891656 3113640
14944 3113640 3100003 3421157 3467012 3394336 3257777 3052157 3086524 3320811 3216818 3302762
14934 3302762 3102119 3059656 3153826 3212281 3092568 3182072 3045718 3200309 3079049 2860215
14924 2860215 2983330 3330747 2887614 2915601 3069813 2916099 2748777 2824030 3172825 3066030
14914 3066030 3294252 2871899 2937943 3016955 3086939 2937460 2827968 2893262 2488541 2918761
14904 2918761 3380445 3272654 2828297 2801668 3277631 3211338 3405721 3361315 2884932 3187025
14894 3187025 2955321 2938341 3272492 3150975 3093627 2998544 3052674 3046816 2682991 3079867
14884 3079867 3189395 3529085 3314115 3296538 3372570 3254694 2991534 2809637 3055443 3020483
14874 3020483 3107027 3479385 2984574 2971087 2949887 3085847 2807508 3116885 3405116 3137514
14864 3137514 3124850 3203406 3078509 2804135 2871686 3150266 3234101 3161133 3155542 2960874 2818432
14853 2818432 2820035 2902344 3046055 3267742 3263805 3271890 3211548 3194158 2764697 2919544 2930324
14842 2930324 3023701 3050363 3073130 3027678 3501659 3506638 3451840 3126490 3230277 3135766 3205642
14831 3205642 3036410 2964464 3021211 3112919 3531331 3192531 3216427 3239996 3047750 3168288
14821 3168288 3500624 2954897 3287994 3214403 3043925 3145205 2915377 3119159 3463035 3077645
14811 3077645 3116888 3066577 3171485 3061431 2966981 3051430 2907374 3143807 2674951 3030894
14801 3030894 3281500 3057808 2745477 2940395 3054046 3093412 3226293 2939676 2895434 3089171
14791 3089171 3118476 3272420 3251460 3177719 3110386 3129489 3039504 2894759 2745259 2870524
14781 2870524 3068244 3096059 3004893 2951735 2966990 3281475 3419673 3427809 3235578 3186700 3138352
14770 3138352 3169016 3144645 2800082 3098893 3184045 3065027 3204586 3278245 3061727 2869010
14760 2869010 2924025 2919779 2949710 3211191 3327442 2911593 3163682 2926132 3202589 3395750
14750 3395750 3286880 3487925 3130852 3072328 3167736 2906312 2844018 2810940 2671550 2926939
14740 2926939 3022249 3022072 2962742 3363747 3155419 2998712 3367998 3299553 3247229 3247813 2888447
14729 2888447 2922693 2985363 3025414 3289354 3142567 2956248 3113013 3091504 3172134 3291966
14719 3291966 3068443 3222280 3067755 2993965 2949393 3148896 3006032 2776570 3076856 3191779
14709 3191779 3260899 3065395 3021497 2938652 2857345 3064586 2992357 2907463 3277082 3272593 2922490
14698 2922490 2879562 3013326 2940024 3003813 2968717 3023176 2921953 2923737 2995738 3130582 2766672
14687 2766672 2919338 3013167 2797941 2972037 2987995 2949992 3137065 3199086 3247958 3275988
14677 3275988 3029169 3185694 3325283 3155051 2973709 3019002 3382027 3410196 3158200 3164953
14667 3164953 2858660 3005524 3231663 3054334 3111235 3113224 3087184 2852459 3213578 3102586
14657 3102586 3025978 3189791 3142510 3148116 3161338 3212279 3158952 3178580 3047267 3473803 3314118
14646 3314118 2990052 2941782 3074773 3117402 3217718 3082501 2952809 3182122 2988200 2935797
14636 2935797 3131592 2941427 2854786 3017806 3213798 3201303 3328611 3453942 3041674 3062958
14626 3062958 2971896 3150305 3244229 2816450 2935252 3197674 3253635 3234234 3248751 3085506
14616 3085506 2961072 3131953 3212362 3288630 3313123 3245632 3101366 3372318 3299221 3268400
14606 3268400 3213886 3071431 2988492 3114392 3125915 3032164 3179411 3323025 3034734 2968145
14596 2968145 3085735 3131821 3171228 3078414 2971919 3017647 2961422 2760277 2938568 2794836
14586 2794836 2623925 2776730 2934028 3002874 2868007 2985030 3337552 3011359 2819489 3148633
14576 3148633 3062861 3006960 3137035 3050850 3045920 2966480 2896137 3050921 3029823 3192338 3037925
14565 3037925 2867574 3012349 2731737 3059734 3093203 3305126 3143525 3397379 3347632 3216061
14555 3216061 3447047 3330372 3274136 3103525 3068383 3009887 3151001 3175292 3050708 2986456
14545 2986456 3145593 3392042 3095957 3057070 2891959 2860140 3018186 3260936 3212972 3321442
14535 3321442 3410445 3333338 3316945 3360152 3573132 3403138 3329547 3183755 3261697 3243058 3199547
14524 3199547 3206384 3120873 3013340 3117886 3428784 3686182 3617738 3649809 3319454 3152043
14514 3152043 3210163 3288455 3181124 3247883 3275933 3633536 3712872 3084523 2893450 2927693
14504 2927693 3042232 3287180 3249833 3105459 3280183 3094474 3278366 3110482 3029493 3262224
14494 3262224 3324562 3573326 3290574 3083059 3098554 3492118 3321450 3264933 3200692 3196328
14484 3196328 3284171 3376601 3087594 3096541 3401437 3259691 3151685 3055953 3059440 3147351 3111037
14473 3111037 3004687 3194159 3195295 2928321 3200802 3252248 2949671 3193178 3325494 3295948
14463 3295948 3133428 3311111 3234510 3426379 3332548 3215664 3340929 3431791 2888668 2989754
14453 2989754 3011891 3329786 3063563 3059663 3364190 3231755 3259638 3103476 3244268 3145934
14443 3145934 2913662 3215129 3244385 3439730 3631154 3533461 3409738 3314063 3229548 2923645
14433 2923645 3129933 3274783 3324026 3314120 3404695 3499336 3407345 3085389 3061801 3210836 3180388
14422 3180388 3052276 3293457 3293644 3341280 3268331 3427439 3587562 3367030 3363760 3431245 3144713
14411 3144713 3459677 3429041 3276768 3089445 3057952 3284784 3008281 3146320 3266360 3260117
14401 3260117 3170899 3041975 3173522 3028037 3084076 3439835 3380032 3348199 3447946 3216353
14391 3216353 3227360 3277700 3093000 2934020 3174299 3178070 3085277 3328464 3389809 3465183 3509797
14380 3509797 3267000 3294011 3254719 3325374 3608698 3244705 3200525 3238679 3323048 3229989 3177846
14369 3177846 3033960 2908682 3236332 2996635 2987012 3078467 3250125 3271427 2944578 3159586
14359 3159586 3174582 3236832 3218303 2970046 2947268 3153358 3451766 3228900 3149806 3379809
14349 3379809 3183772 3189445 3139380 3002595 3314864 3146015 3116972 3456621 3323424 3009688
14339 3009688 3055894 3016927 3088435 3196343 2861258 3036670 3344074 3239470 3261385 3184345
14329 3184345 3017645 3208406 3021473 3024775 3440477 3440471 3550433 3341150 3354608 3111530 2998284
14318 2998284 3113384 3222357 3011731 3071519 3076670 3006430 3160388 3138391 2953693 2990304
14308 2990304 2803539 2999134 3089443 3063934 3415241 3323339 3347134 3092922 3207779 3369110
14298 3369110 3028756 3048255 3116307 3300009 3571150 3226678 3057396 3137151 3363150 3378897
14288 3378897 3267495 3085990 3099562 3077856 3299306 3293133 3131874 3039252 3254523 3241858
14278 3241858 3208372 3340722 3121448 2993627 2922230 3061331 3095173 3045547 3421428 3309842
14268 3309842 3405220 3527778 3379319 3266500 3265276 3135611 3272361 3171446 3213098 3126743
14258 3126743 3260871 3312011 3241325 3540994 3417053 3337555 3018412 2771325 2947515 2984042
14248 2984042 3134830 3342480 3183158 3410463 3440023 3214912 3087599 3326930 3403756 3201456
14238 3201456 3154711 3156443 3255716 3371461 3507636 3214850 2999419 3071801 2989614 3101672
14228 3101672 3519298 3097719 3137245 3427886 3280185 3214467 3106720 2983257 2965086 3153581
14218 3153581 3277356 3347423 3206734 3249455 3316923 3487452 3406497 3403885 3307931 3314742 3468663
14207 3468663 3582067 3502455 3378479 3397766 3324857 3261765 3255328 3398008 3513569 3448795 3468578
14196 3468578 3091661 3174437 3341128 3107651 3223232 3365702 3185330 3230814 3139593 2940093
14186 2940093 3185921 3331424 3356533 3249510 3432521 3438702 3206928 3372052 3332229 3124520
14176 3124520 3024062 3282988 3093860 3039273 3281690 3382254 3202365 2978750 3198760 3258231
14166 3258231 3349107 3405238 3467190 3530617 3475931 3164588 2864506 3150154 3210105 3305266 3014920
14155 3014920 3063739 3331298 3130041 3354769 3695174 3487956 3240187 3367369 3364216 3295379
14145 3295379 3502430 3178005 2939291 3135118 3145637 3059245 2835744 3302006 3180486 2981413
14135 2981413 3115623 3327334 3310096 3599252 3414985 3249962 3024875 2960194 2944199 3329532
14125 3329532 3524056 3601277 3452434 3129313 3182342 3143437 3113749 3034857 3408265 3770324
14115 3770324 3566111 3316383 3395067 3517854 3383943 3252226 3447474 3364486 3351575 3271887
14105 3271887 3492391 3395290 3123023 3012813 3322137 3498541 3086172 3195353 3429194 3475463
14095 3475463 3281670 3131645 3252671 3200993 3394200 3305499 3099596 3174555 3197458 3169566
14085 3169566 3192839 3242871 3429484 3318044 3292105 3438103 3315548 3147694 3566092 3534366
14075 3534366 3293044 3297856 3541564 3634893 3299945 3187612 3179207 2994857 3166461 3258169
14065 3258169 3517013 3431159 3520858 3694753 3700774 3655082 3547420 3326422 3132218 3288428
14055 3288428 3401375 3414292 3537784 3656583 3325741 3222265 3359210 3423062 3480078 3576643
14045 3576643 3255662 3449383 3692461 3288625 3524245 3388660 3207800 3091091 3038496 3511157
14035 3511157 3607801 3571575 3436834 3415736 3356329 3188877 3375628 3524152 3419209 3413322
14025 3413322 2883011 2969794 3045079 3394870 3478044 3336208 3597417 3517067 3335362 3219820
14015 3219820 3332020 3306095 3463178 3362330 3223857 3307897 3245676 3310184 3363464 3477053
14005 3477053 3573227 3431386 3086477 3175818 3121874 3177687 3350848 3296847 3003547 3025685
13995 3025685 3340978 3331906 3515446 3595069 3572240 3529560 3346525 3496146 3540885 3051892
13985 3051892 3252540 3099602 3131668 3077310 2900186 3175348 3610004 3669257 2959587 3232327
13975 3232327 3161284 3242960 3073786 3238000 3342584 3022186 2908828 3274121 3125323 3106277
13965 3106277 3337678 3230635 3279726 3308609 3421201 3335076 3410268 3529177 3619247 3551157
13955 3551157 3278526 3189198 3117209 3405586 3349920 3273390 3440633 3257053 3368711 3233907
13945 3233907 3354842 3376536 3394964 3470521 3233431 3027845 3313990 3443530 3522719 3073274
13935 3073274 3156690 3428625 3396226 3368927 3194682 3276901 3262776 3295300 3416266 3688187
13925 3688187 3682165 3431139 3535858 3630377 3709794 3459837 3230074 3220089 3141710 3437089 3339860
13914 3339860 3274314 3566355 3465521 3218502 2867576 3007736 3123724 3089656 3193288 3226586
13904 3226586 3393177 3592001 3263260 3348566 3602448 3247210 3214275 3334189 3608958 3412494
13894 3412494 3505531 3579715 3361541 3403695 3078894 3357405 3184428 3302597 3360326 3531068
13884 3531068 3250665 2934656 3181012 3129732 3161180 3419560 3387093 3317488 3205757 3244780
13874 3244780 3521491 3759641 3678645 3593452 3463305 3426454 3311838 3502588 3550046 3221698
13864 3221698 3588393 3295734 3124361 2971094 3296813 3527544 3316969 3468608 2990657
13855 2990657 3212458 3402813 3260011 3710972 3225350 3745491 3855840 3579767 3495501 3232481
$$ [...]
##END NTUPLES=NMR SPECTRUM
##END=
