##TITLE=1H_CG-1208-X43
 CDCl3
 8 sc, 
 10.9.2024
##JCAMPDX= 6.0         $$ Bruker NMR JCAMP-DX V2.0
##DATA TYPE= NMR SPECTRUM
##DATA CLASS= NTUPLES
##ORIGIN= UXNMR, Bruker Analytische Messtechnik GmbH
##OWNER= root
$$ XWIN-NMR		Version 3.5
$$ Tue Sep 10 14:34:32 2024 Russian Standard Time (UT+4h)  she@DPX200
##.OBSERVE FREQUENCY= 200.1318
##.OBSERVE NUCLEUS= ^1H
##.ACQUISITION MODE= SIMULTANEOUS
##.ACQUISITION SCHEME= undefined
##.AVERAGES= 8
##.DIGITISER RES= 18
##SPECTROMETER/DATA SYSTEM= spect
##.PULSE SEQUENCE= zg30
##.SOLVENT NAME= CDCl3
##.SHIFT REFERENCE= (INTERNAL, CDCl3, 0, 20.9929)
##AUDIT TRAIL= $$ (NUMBER, WHEN, WHO, WHERE, WHAT)
$$ ##TITLE= Audit trail, XWIN-NMR		Version 3.5
$$ ##JCAMPDX= 5.01
$$ ##ORIGIN= Bruker BioSpin GmbH
$$ ##OWNER= she
$$ F:/spectra/data/she/nmr/H-F/1/pdata/1/auditp.txt
$$ ##AUDIT TRAIL=  $$ (NUMBER, WHEN, WHO, WHERE, WHAT)
(   1,<2024-09-10 14:33:07.21 +0400>,<she>,<DPX200>,
      <created by zg, POWCHK disabled, PULCHK disabled
       configuration hash MD5:
       00 E9 B6 7A A2 85 ED C7 34 08 36 98 17 FE 4E 26
       data hash MD5: 16K
       B6 A0 5D B7 58 32 DC CA 26 C2 0F B8 6C 15 7B 50>)
(   2,<2024-09-10 14:33:09.28 +0400>,<she>,<DPX200>,
      <Start of raw data processing
       efp BC_mod = 2 LB = 0.24 FT_mod = 6 PKNL = 1 PHC0 = -25999.38 PHC1 = 19.38748 SI = 16K 
       data hash MD5: 16K
       7D 2B 10 24 F6 98 26 A8 F3 31 34 2B 62 18 A7 B4>)
(   3,<2024-09-10 14:33:46.46 +0400>,<she>,<DPX200>,
      <pk PHC0 = 22.61959 PHC1 = -27.6 
       data hash MD5: 16K
       AF 2B 70 D0 F0 6B 93 5C A4 74 27 3F 2A 64 25 DF>)
(   4,<2024-09-10 14:33:49.98 +0400>,<she>,<DPX200>,
      <abs ABSG = 5 
       data hash MD5: 16K
       3F 2D 9B 5D 33 05 FB 9A 22 D4 DF 3A 6D A9 65 A7>)
$$ ##END=
$$ 
$$ hash MD5
$$ A4 70 98 DD 1E 04 02 C8 0B 22 D0 79 32 5F CC 52
##$RELAX= 
##$RELAX= 
##$RELAX= 
##$RELAX= 
##$RELAX= 
##$RELAX= 
$$ Bruker specific parameters
$$ --------------------------
##$DU= <F:/spectra>
##$EXPNO= 1
##$NAME= <H-F>
##$PROCNO= 1
##$TYPE= <nmr>
##$USER= <she>
##$AMP= (0..31)
100 100 100 100 100 100 100 100 100 100 100 100 100 100 100 100 100 100 
100 100 100 100 100 100 100 100 100 100 100 100 100 100 
##$AQSEQ= 0
##$AQ_mod= 1
##$AUNM= <au_zg>
##$AUTOPOS= <>
##$BF1= 200.13
##$BF2= 200.13
##$BF3= 200.13
##$BF4= 200.13
##$BF5= 200.13
##$BF6= 200.13
##$BF7= 200.13
##$BF8= 200.13
##$BYTORDA= 1
##$CFDGTYP= 0
##$CFRGTYP= 5
##$CHEMSTR= <none>
##$CNST= (0..31)
1 1 145 1 1 1 1 1 1 1 1 1 1 1 1 1 1 1 1 1 1 1 1 1 1 1 1 1 1 1 1 1 
##$CPDPRG= <>
##$CPDPRG1= <>
##$CPDPRG2= <>
##$CPDPRG3= <>
##$CPDPRG4= <mlev>
##$CPDPRG5= <mlev>
##$CPDPRG6= <mlev>
##$CPDPRG7= <mlev>
##$CPDPRG8= <mlev>
##$CPDPRGB= <>
##$CPDPRGT= <>
##$D= (0..31)
0 1.2 0 0 0 0 0 0 0 0.06 0 0.03 0 0 0 0 0.0002 0 0 0 0 0 0 0 0 0 0 0 0 
0 0 0 
##$DATE= 1725964386
##$DBL= (0..7)
120 120 120 120 120 120 120 120 
##$DBP= (0..7)
150 150 150 150 150 150 150 150 
##$DBP07= 0
##$DBPNAM0= <>
##$DBPNAM1= <>
##$DBPNAM2= <>
##$DBPNAM3= <>
##$DBPNAM4= <>
$$ [...]
##$SUBNAM3= <"">
##$SUBNAM4= <"">
##$SUBNAM5= <"">
##$SUBNAM6= <"">
##$SUBNAM7= <"">
##$SUBNAM8= <"">
##$SUBNAM9= <"">
##$SW= 24.0689170037331
##$SWIBOX= (0..15)
0 0 2 0 0 0 0 0 0 0 0 0 0 0 0 0 
##$SW_h= 4816.95568400771
##$TD= 16384
##$TD0= 1
##$TE= 0
##$TE2= 300
##$TE3= 300
##$TEG= 300
##$TL= (0..7)
0 120 120 120 120 120 120 120 
##$TP= (0..7)
150 150 150 150 150 150 150 150 
##$TP07= 0
##$TPNAME0= <>
##$TPNAME1= <>
##$TPNAME2= <>
##$TPNAME3= <>
##$TPNAME4= <>
##$TPNAME5= <>
##$TPNAME6= <>
##$TPNAME7= <>
##$TPOAL= (0..7)
0.5 0.5 0.5 0.5 0.5 0.5 0.5 0.5 
##$TPOFFS= (0..7)
0 0 0 0 0 0 0 0 
##$TUNHIN= 0
##$TUNHOUT= 0
##$TUNXOUT= 0
##$USERA1= <user>
##$USERA2= <user>
##$USERA3= <user>
##$USERA4= <user>
##$USERA5= <user>
##$V9= 5
##$VALIST= <valist>
##$VCLIST= <CCCCCCCCCCCCCCC>
##$VD= 0
##$VDLIST= <DDDDDDDDDDDDDDD>
##$VPLIST= <PPPPPPPPPPPPPPP>
##$VTLIST= <TTTTTTTTTTTTTTT>
##$WBST= 1024
##$WBSW= 4
##$XGAIN= (0..3)
0 0 0 0 
##$XL= 0
##$YL= 0
##$YMAX_a= 65595
##$YMIN_a= -57607
##$ZGOPTNS= <>
##$ZL1= 120
##$ZL2= 120
##$ZL3= 120
##$ZL4= 120
##$ABSF1= 21.00172
##$ABSF2= -3.067413
##$ABSG= 5
##$ABSL= 3
##$ALPHA= 0
##$AQORDER= 0
##$ASSFAC= 0
##$ASSFACI= 0
##$ASSFACX= 0
##$ASSWID= 0
##$AUNMP= <proc_1d>
##$AZFE= 0.1
##$AZFW= 0.1
##$BCFW= 0
##$BC_mod= 2
##$BYTORDP= 0
##$COROFFS= 0
##$CY= -3
##$DATMOD= 1
##$DC= 0
##$DFILT= <>
##$DTYPP= 0
##$F1P= 0
##$F2P= 0
##$FCOR= 1
##$FTSIZE= 16384
##$FT_mod= 6
##$GAMMA= 0
##$GB= 0
##$INTBC= 1
##$INTSCL= 3.70164e-10
##$ISEN= 128
##$LB= 0.24
##$LEV0= 0
##$LPBIN= 0
##$MAXI= 10000
##$MC2= 0
##$MEAN= 0
##$ME_mod= 0
##$MI= 1.114404
##$NCOEF= 0
##$NC_proc= -9
##$NLEV= 6
##$NOISF1= 3.799351
##$NOISF2= 2.8
##$NSP= 0
##$NTH_PI= 0
##$NZP= 0
##$OFFSET= 20.99291
##$PC= 1
##$PHC0= -25976.76
##$PHC1= -8.212521
##$PH_mod= 1
##$PKNL= yes
##$PPARMOD= 0
##$PSCAL= 0
##$PSIGN= 0
##$REVERSE= no
##$SF= 200.130007165026
##$SI= 16384
##$SIGF1= 3
##$SIGF2= 2
##$SINO= 5.538805
##$SIOLD= 16384
##$SREGLST= <1H.CDCl3>
##$SSB= 0
##$STSI= 16384
##$STSR= 0
##$SW_p= 4816.95568400771
##$SYMM= 0
##$S_DEV= 0
##$TDeff= 16384
##$TDoff= 0
##$TI= <>
##$TILT= no
##$TM1= 0
##$TM2= 0
##$TOPLEV= 0
##$USERP1= <user>
##$USERP2= <user>
##$USERP3= <user>
##$USERP4= <user>
##$USERP5= <user>
##$WDW= 1
##$XDIM= 16384
##$YMAX_p= 313849946
##$YMIN_p= -6724047
$$ End of Bruker specific parameters
$$ ---------------------------------
##NTUPLES= NMR SPECTRUM
##VAR_NAME=  FREQUENCY,     SPECTRUM/REAL,   SPECTRUM/IMAG
##SYMBOL=    X,             R,               I
##VAR_TYPE=  INDEPENDENT,   DEPENDENT,       DEPENDENT
##VAR_FORM=  AFFN,          ASDF,            ASDF
##VAR_DIM=   16384,         16384,           16384
##UNITS=     HZ,            ARBITRARY UNITS, ARBITRARY UNITS
##FACTOR=    0.29402158847633, 1,            1
##FIRST=     4201.31130579118, 0,            0
##LAST=      -615.644378216527, 0,           0
##MIN=       -615.644378216527, -6724047,    0
##MAX=       4201.31130579118, 313849946,    0
$$ Real data points
##PAGE= N=1
##DATA TABLE= (X++(R..R)), XYDATA
$$ [...]
4814I645402j057272O84183J411898N18787J65974n17010J77110r9049O65198
$$ 9645402 8588130 9272313 10684211 11202998 11368972 10851962 11029072 10930023 11595221
4805A1595221J553286m62628O90150n48227P73162k05214K54540K42429K80996
$$ 11595221 13148507 12685879 13376029 12827802 13600964 13395750 13650290 13892719 14173715
4796A4173715k75127l91997O02795p68903Q40750O49209J000840M33290n47023
$$ 14173715 13898588 13506591 14109386 13340483 14181233 14830442 15831282 16264572 15717549
4787A5717549j70266J117087J220807n51856O85449J88144k57149M96665J592432
$$ 15717549 15547283 16664370 17885177 17333321 18018770 18206914 17949765 18446430 20038862
4778B0038862K89565P91742J20593n787J433897N84180J510712P53268N37668
$$ 20038862 20328427 21120169 21240762 21234975 22668872 23253052 24763764 25517032 26054700
4769B6054700R55122P01933j41963R82004M31770k11738r53964k00383J20871
$$ 26054700 27009822 27711755 27569792 28551796 28983566 28771828 27817864 27617481 27738352
4760B7738352m04718J640551J106749j09603O07387N19219J974063J657100Q4759
$$ 27738352 27333634 28974185 30080934 29971331 30578718 31097937 33072000 34729100 34813859
4751C4813859J769995K325374Q64927l88981j999961q85057R83329j189058k076973
$$ 34813859 36583854 38909228 39774155 39385174 37385213 36500156 37483485 36294427 34217454
4742C4217454n21366K62666j107432N04358J352033N75126P87748L19463L02636
$$ 34217454 33696088 33958754 32851322 33355680 34707713 35282839 36070587 36390050 36692686
4733C6692686K094811J007256J198367K89483r61405J563564p13689k14556M6225
$$ 36692686 38787497 39794753 40993120 41282603 40321198 41884762 41171073 40956517 41002742
4724D1002742J192850M58211p30156k65371J426697M27232q65552o0541M57311
$$ 41002742 42195592 42653803 41923647 41658276 43084973 43512205 42646653 42586112 43043423
4715D3043423J162756Q90706J573322O26656P40025J765343J344978K204982J055411
$$ 43043423 44206179 45096885 46670207 47296863 48036888 49802231 51147209 53352191 54407602
4706E4407602J327102q9770O34187J47248p16457O5142m11373n69433J311387
$$ 54407602 55734704 55644934 56279121 56426369 55709912 55775054 55363681 54794248 56105635
4697E6105635P92758J033956O42876P07832K043952J904511K326542N92151r39646
$$ 56105635 56898393 57932349 58575225 59283057 61327009 63231520 65558062 66150213 65210567
4688F5210567K00430J416715K88185m77770j196997j95239j342282K43286l97284
$$ 65210567 65410997 66827712 67115897 66638127 65441130 65245891 63903609 64146895 63749611
4679F3749611k77034Q90361R05271J648538Q89148l70744J128737O90850j339392
$$ 63749611 63472577 64362938 65268209 66916747 67805895 67435151 68563888 69254738 67915346
4670F7915346n46992k627343j642349J99297k41747k107790p33868o23254k434896
$$ 67915346 67368354 64741011 63098662 63297959 63056212 60948422 60214554 59591300 57156404
4661E7156404j378047j930248r15935q67567j587554P9818l12321j712511k875163
$$ 57156404 55778357 53848109 52932174 52064607 50477053 50556871 50244550 48532039 45656876
4652D5656876n92099j073417j131390k303970j49933j307758j157926j564575
$$ 45656876 45064777 43991360 42859970 40556000 40406067 39098309 37940383 36375808
4644C6375808j808249j097928k278821P40651r63305k526203j37558p03146Q13733
$$ 36375808 34567559 33469631 31190810 31931461 30968156 28441953 28304395 27601249 28414982
4635B8414982j851164k751623j35257r50130l6265j005103L40243L02941k29166
$$ 28414982 26563818 23812195 23676938 22726808 22690543 21685440 22025683 22328624 22099458
4626B2099458j651017q40592r16387l4068j45341P6199P38594m88305L55438M2931
$$ 22099458 20448441 19607849 18691462 18657394 18512053 18588252 19326846 18838541 19193979 19236910
4616A9236910j633942O43173l10740j168148j31156m58073m22223n63034j53734
$$ 19236910 17602968 18246141 17935401 16767253 16636097 16178024 15755801 15192767 15039033
4607A5039033n91718Q38145J30863j040894k35854K50884p54065r3978J35594
$$ 15039033 14447315 15285460 15416323 14375429 14139575 14390459 13636394 13542416 13678010
4598A3678010j011358r21676L02011j74990P65762L89606L84313q32679o90674
$$ 13678010 12666652 11744976 12046987 11871997 12637759 13027365 13411678 12578999 11888325
4589A1888325J23904P76342o30393j421631J617289p57965M66925J13768j169868
$$ 11888325 12012229 12788571 12158178 10736547 12353836 11595871 12062796 12176564 11006696
4580A1006696r9337N2557K34685n04516P8330k34519j14653N08841o50944q68372
$$ 11006696 10907359 10959916 11194601 10690085 10768415 10533896 10419243 10928084 10277140 9408768
4570I408768k56709O54979M18797P19246j180306q68527l40349J241006N43059
$$ 9408768 9152059 9807038 10225835 10945081 9764775 8896248 8555899 9796905 10339964
4561A0339964j090346o88543J014467M92347L08676m68850k09301q4789J472793
$$ 10339964 9249618 8561075 9575542 10067889 10376565 9907715 9698414 9613625 11086418
4552A1086418r57103N15421k0022m57241J32035j97448j12823R85249k82946n80869
$$ 11086418 10129315 10644736 10624714 10167473 10299508 10102060 9989237 10974486 10691540 10110671
4542A0110671l14240L21644k11246p91017k06262N34509j19680j196609O60993
$$ 10110671 9796431 10118075 9906829 9115812 8909550 9444059 9324379 8127770 8788763
4533H788763Q44937l42026O10094k83052l5172n90045k64754O42693l26930j16731
$$ 8788763 9633700 9291674 9901768 9618716 9583544 8993499 8728745 9371438 9044508 8927777
4523H927777K05181J346616j513516J0300L34551q09254J32672N27808n55312
$$ 8927777 9132958 10479574 8966058 8976358 9310909 8501655 8634327 9162135 8606823
4514H606823J93839J76531N46187j782416k10778L21904J46275M14580J388501
$$ 8606823 8800662 8977193 9523380 7740964 7530186 7852090 7998365 8412945 9801446
4505I801446q81652k56357l13395K42376j327649K96806J032076r7114M37566
$$ 9801446 8919794 8663437 8350042 8592418 7264769 7561575 8593651 8496537 8934103
4496H934103j55277R20964j184085Q27582j908727p7680J246175j164881P16025
$$ 8934103 8778826 9699790 8515705 9343287 7434560 7356880 8603055 7438174 8154199
4487H154199K8849O9738j045647j369275J923383J28749m75953J400506q38399
$$ 8154199 8183048 8252786 7207139 5837864 7761247 7889996 7414043 8814549 7976150
4478G976150j65466l56321O6216j005464j003031J95322Q5602J9104Q7845L49069
$$ 7976150 7810684 7454363 7520579 6515115 5512084 5707406 5793008 5812112 5899957 6249026
4468F249026n68L68737J52502M80745M01526r86128l63042Q52049n86455p86366
$$ 6249026 6248458 6617195 6769697 7250442 7651968 6665840 6302798 7154847 6568392 5782026
4458E782026Q73519m90553N84190k46694m69515p5320j106467M08854L5472N45327
$$ 5782026 6655545 6164992 6749182 6502488 6032973 5957653 4851186 5260040 5295512 5840839
4448E840839L78750r26981J010822j118358J29303J260478r41388j102426M92202
$$ 5840839 6219589 5292608 6303430 5185072 5314375 6574853 5633465 4531039 5023241
4439E023241J132518n18635l76088P37421m94585R6047J54084q8211j258997N50487
$$ 5023241 6155759 5637124 5261036 5998457 5503872 5599919 5754003 5665792 4406795 4957282
4429D957282N68537p42764l63191o60547K04142K11554N60600N67006p70218L37257
$$ 4957282 5525819 4783055 4419864 3759317 3963459 4175013 4735613 5302619 4532401 4869658
4419D869658J033755j104748L05033j353411M64128P76446l49404k7450q0750
$$ 4869658 5903413 4798665 5103698 3750287 4214415 4990861 4641457 4614007 4533257
4410D533257P53989q78634K88719m26299n1587n19812K49114J129355r69757N08157
$$ 4533257 5287246 4408612 4697331 4271032 4219445 3699633 3948747 5078102 4108345 4616502
4400D616502M0726O38124j250569K89232M88809K89550k82950l37486Q99824n87318
$$ 4616502 4657228 5295352 4044783 4334015 4822824 5112374 4829424 4491938 5391762 4804444
4390D804444j049893P3597o96315K35784K36278J534483m86629l34893J111422
$$ 4804444 3754551 3828148 3131833 3367617 3603895 5138378 4651749 4316856 5428278
4381E428278r56510J34669j15638K8487m4241L33143k60979J96182p20312J17251
$$ 5428278 4471768 4606437 4490799 4519286 4475045 4808188 4547209 4743391 4023079 4140330
4371D140330m27014k37494N46258j720157J97065r7902P90867Q79156n6676J38106
$$ 4140330 3713316 3475822 4022080 2301923 2498988 2401086 3191953 4071109 4014433 4152539
4361D152539j61194o46496J23716O27663n10411J171192r15198q46493Q09020
$$ 4152539 3991345 3344849 3468565 4096228 3585817 4757009 3841811 2995318 3804338
4352C804338o70560M85687M55143l97020R83728k30114j614395Q88332l14725
$$ 3804338 3133778 3619465 4074608 3677588 4661316 4431202 2816807 3705139 3390414
4343C390414L15733J035467l3654j41037M44685p56632o28535k13839o39187m71461
$$ 3390414 3706147 4741614 4707960 4566923 5011608 4254976 3626441 3412602 2773415 2301954
4333B301954K30583J298165o62487J50083N7286r99196l76007Q53774J042332
$$ 2301954 2532537 3830702 3168215 3318298 3375584 2376388 2000381 2854155 3896487
4324C896487R06353j236701o62204m3795J663714O3491p07514M88330L22r68855
$$ 3896487 4802840 3566139 2903935 2860140 4523854 4587345 3879831 4368161 4368483 3399628
4314C399628O80558r99074o5912J37423m14699O91440J02026k46968o87057J822028
$$ 3399628 4080186 3081112 3015200 3152623 2737924 3429364 3531390 3284422 2597365 4419393
4304D419393k49337P16526n6888m21805j427595O74376m08358k1009L51526P22624
$$ 4419393 4170056 4886582 4829694 4407889 2980294 3654670 3246312 3225303 3576829 4299453
4294D299453j189536o0073J35529q19567J122671L62769j10227N48969L12527
$$ 4299453 3109917 3049844 3185373 2365806 3488477 3851246 3741019 4289988 4602515
4285D602515n75452k08572J682177j19733k80444J83253m53130l32692k08108
$$ 4602515 4027063 3818491 5500668 5380935 5100491 5283744 4830614 4497922 4289814
4276D289814N18340k65684j046609O49615L49225K46916n87787m12338J101252
$$ 4289814 4808154 4542470 3495861 4145476 4494701 4741617 4153830 3741492 4842744
4267D842744q30166o08816K71135M74458J4263J159178j566141K71163L16406
$$ 4842744 4012578 3403762 3674897 4149355 4163618 5322796 3756655 4027818 4344224
4258D344224n70378l76237O3417r27896r8347J356126N76396p02499k1710k53881
$$ 4344224 3773846 3397609 3461026 2533130 2434783 3790909 4367305 3664806 3643096 3389215
4248C389215R75786M66468n24236M25568r6195n61542M55014j15858Q25638r97998
$$ 3389215 4365001 4831469 4307233 4732801 4636606 4075064 4530078 4414220 5239858 4241860
4238D241860K39899R16281l91234p87103M57722J76869r93178J65819M50981n28934
$$ 4241860 4481759 5398040 5006806 4219703 4677425 4854294 3861116 4026935 4477916 3948982
4228C948982m25135M94523O25423J094330r81768j87430j37051n72615K63366
$$ 3948982 3523847 4018370 4643793 5738123 4756355 4568925 4431874 3859259 4122625
4219D122625M74410N19529P38819L15264J90325M12508p80640j417146J028318
$$ 4122625 4597035 5116564 5855383 6170647 6360972 6773480 5992840 4575694 5604012
4210E604012r36126O84444o40160l1143J421701j547800p40165O92256R64294
$$ 5604012 4667886 5352330 4712170 4681027 6102728 4554928 3814763 4507019 5471313
4201E471313j270237J665187M26305l6365m42518M34575L60804j26903o6484J22714
$$ 5471313 4201076 5866263 6292568 6256203 5813685 6248260 6609064 6482161 6415677 6538391
4191F538391m11144n5966k46078N6365m30628L80012J387825j363362R84274J113216
$$ 6538391 6127247 6071281 5825203 5881568 5450940 5830952 7218777 5855415 6839689 7952905
4181G952905j66913p68280K70342k65534M95327J124635J49564J09238l44679
$$ 7952905 7785992 7017712 7288054 7022520 7517847 8642482 8792046 8901284 8556605
4172H556605m88412R86103q54720J030804m28237O93107k37082R0970N03834Q03555
$$ 8556605 8068193 9054296 8199576 9230380 8802143 9495250 9258168 9349138 9852972 10656527
4162A0656527k40079q24865M83967R13504M89240j11007p7514O75100J006054
$$ 10656527 10416448 9591583 10075550 10989054 11478294 11367287 11289773 11964873 12970927
4153A2970927L34348J23864L31344n79399K25737L5175j76178J892720j069337
$$ 12970927 13305275 13429139 13760483 13181084 13406821 13441996 13265818 15158538 14089201
4144A4089201K81943R56152j153188K83156J215984n76093K56027p09369J032042
$$ 14089201 14371144 15327296 14174108 14457264 15673248 15097155 15353182 14643813 15675855
4135A5675855n73286P28901m35769Q3921l23362p80193L077J539562q66011N6216
$$ 15675855 15102569 15831470 15395701 15479622 15156260 14376067 14379144 15918706 15052695 15108911
4125A5108911J275076K99227j80565q06877Q3216r55316m83466M03316M50837
$$ 15108911 16383987 16683214 16502649 15695772 15778988 14823672 14340206 14743522 15194359
4116A5194359l3054k8626r59697N585J670327m85235k90934q91692K56985O10072
$$ 15194359 15161305 15132679 14172982 14178567 15848894 15363659 15072725 14181033 14438018 15048090
4106A5048090K66264M96639q30507N41806M78475L48728r14526R3426K4825J171242
$$ 15048090 15314354 15810993 14980486 15522292 16000767 16349495 15434969 15528395 15553220 16724462
4096A6724462J015362q42161n94016J232994j562268q82481J293523l16484m93403
$$ 16724462 17739824 16897663 16303647 17536641 15974373 15091892 16385415 16068931 15575528
4087A5575528L849136n05819j817958m64578N74869j18005R5733P79100p8154
$$ 15575528 19424664 18918845 17100887 16636309 17211178 17093173 17188906 17968006 17889852
4078A7889852O37638L89443n25424P66116R2173O26158k39399p19555P58225k34991
$$ 17889852 18527490 18916933 18391509 19157625 19249798 19875956 19636557 18917002 19675227 19440236
4068A9440236K101521K2642j12894o5291K21868Q79830O94826N46126l95232Q54198
$$ 19440236 21541757 21564399 21451505 21386214 21608082 22487912 23182738 23728864 23333632 24187830
4058B4187830r80163J252502R63210n371J477696j130Q31470R14220m10187L82854
$$ 24187830 23207667 24460169 25423379 25418008 26895704 26894574 27726044 28640264 28230077 28612931
4048B8612931O707J429773J952135O42240K01148J881379K168014K57162J860871
$$ 28612931 28619638 30049411 32001546 32643786 32844934 34726313 36894327 37151489 39012360
4039C9012360L21517L33275J025246O65233j172744J53172P09697j32358N42314
$$ 39012360 39333877 39667152 40692398 41357631 40184887 40338059 41047756 40915398 41457712
4030D1457712l13541Q71175q1388J114162J918654N94871K377587J040709J801484
$$ 41457712 41144171 42015346 41933958 43048120 44966774 45561645 47939232 48979941 50781425
4021E0781425M88456K286373L25540k022425j38140q44111k166131j433377o76234
$$ 50781425 51269881 53556254 53881794 51859369 51721229 50877118 48710987 47277610 46601376
4012D6601376j176836j794442q85522j627199r31609o80682k76010O16220o34802
$$ 46601376 45424540 43630098 42744576 41117377 40185768 39505086 39229076 39845296 39210494
4003C9210494J234023n76391o66023j212854N6882m55844j711815p12002j976274
$$ 39210494 40444517 39868126 39202103 37989249 38046131 37590287 35878472 35166470 33190196
3994C3190196j580121n23815p74286m44689j417266j051185O23668j512460j618751
$$ 33190196 31610075 31086260 30311974 29867285 28450019 27398834 28022502 26510042 24891291
3985B4891291J430231M80749m49554j34760r02560j59106J484753O0304m46888
$$ 24891291 26321522 26802271 26352717 26217957 25315397 25156291 26641044 26701348 26254460
3976B6254460Q51079Q98126M93989l88600Q61863R74971K54240Q94138n57976
$$ 26254460 27105539 28003665 28497654 28109054 28970917 29945888 30200128 31094266 30536290
3967C0536290p43219O10149J382782j1267K80458O75750p51921J481163O15388
$$ 30536290 29793071 30403220 31786002 31774735 32055193 32730943 31979022 33460185 34075573
3958C4075573J035955j8305J400946k57296J612147J564322k41683J140730j395097
$$ 34075573 35111528 35093223 36494169 36236873 37849020 39413342 39171659 40312389 38917292
3949C8917292j870066J122052r16389j067812p84778o90582p65725k75355N62
$$ 38917292 37047226 38169278 37252889 36185077 35400299 34709717 33943992 33668637 33669199
3940C3669199o27376L32847Q98117J99401m139l11600K82215J415127o17226J26673
$$ 33669199 33041823 33374670 34272787 34472188 34468049 34156449 34438664 35853791 35236565 35363238
3930C5363238J050618R94882j003106R1652o87325l2082k29895l02401m98966
$$ 35363238 36413856 37408738 36405632 36497284 35809959 35777877 35547982 35245581 34746615
3921C4746615j07622j420052j575743K65633J065757m64305j164666M39680R84033
$$ 34746615 34638993 33218941 31643198 31908831 32974588 32510283 31345617 31785297 32769330
3912C2769330O10171K292230N34029L36151J517682K23184J094384r1756o73730
$$ 32769330 33379501 35671731 36205760 36541911 38059593 38282777 39377161 39285405 38611675
3903C8611675J128082N69322j246729j171862r38947r01701o46585j890974p753
$$ 38611675 39739757 40309079 39062350 37890488 36951541 36049840 35403255 33512281 33504528
3894C3504528Q7415n87796J055888k082519K2181j53756l50698o60595L48053
$$ 33504528 33591943 33004147 34060035 31977516 31999697 31845941 31495243 30834648 31182701
3885C1182701J159871j494559j127955j444755j31106j3374J46271j136739j433012
$$ 31182701 32342572 30848013 29720058 28275303 28144197 28130823 28277094 27140355 25707343
3876B5707343q88272j587958r49853j323390j07245k40295K51082N07977j819673
$$ 25707343 24819071 23231113 22281260 20957870 20850625 20610330 20861412 21369389 19549716
3867A9549716j477763N98829j709418k86242O43585r54269j27441L43669l59007
$$ 19549716 18071953 18670782 16961364 16675122 17318707 16364438 16236997 16580666 16221659
3858A6221659n08313K79284l47073M69666k122306J479202r62693O68410N15416
$$ 16221659 15713346 15992630 15645557 16115223 13992917 15472119 14509426 15177836 15693252
3849A5693252r33761k090481J68262J763393L83898l9026n40932q96959n54244
$$ 15693252 14759491 12669010 12837272 14600665 14984563 14945537 14404605 13507646 12953402
3840A2953402N16707j783648Q34810N89043l45199q07861j07457L43884J74718
$$ 12953402 13470109 11686461 12521271 13110314 12765115 11957254 11849797 12193681 12368399
3831A2368399j051864K02990q20358M76930l31918K54639J17113j4618j234831
$$ 12368399 11316535 11519525 10699167 11176097 10844179 11098818 11215931 11201313 9966482
3822I966482p9713K68209J114915n9808j172383o39771R79565q09346j066536
$$ 9966482 9886769 10154978 11269893 11210085 10037702 9397931 10377496 9568150 8501614
3813H501614M84803n96860N91487l45420Q10352j87575L31410m57214O39436j063594
$$ 8501614 8986417 8389557 8981044 8635624 9445976 9258401 9589811 9132597 9772033 8708439
3803H708439r8008K56064q5550j93072R64853m70213n98454K91199p04356k93124
$$ 8708439 8610431 8866495 8780945 8587873 9552726 9082513 8484059 8775258 8070902 7777778
3793G777778M98617m07980R0436m350r76859J049700k59005j79941K55172L17603
$$ 7777778 8276395 7868415 7958851 7954501 6977642 8027342 7768337 7588396 7843568 8161171
3783H161171j149841Q90545O4742j308152l978O02702L56633l22833m33058l24953
$$ 8161171 7011330 7901875 7966617 6658465 6654487 7257189 7613822 7290989 6857931 6532978
3773F532978R96954r6228j827657M81981M19778j88767Q27368J127235J19085
$$ 6532978 7529932 7433704 5606047 6088028 6507806 6319039 7146407 8273642 8392727
3764H392727j693486n79722O13071M35276N31630k19907q76121Q20815p55996
$$ 8392727 6699241 6119519 6732590 7167866 7699496 7479589 6603468 7424283 6668287
3755F668287j003915Q53448p26642m42100M46788j4127N12492N71054M11985q8733
$$ 6668287 5664372 6517820 5791178 5349078 5795866 5781739 6294231 6865285 7277270 7188537
3745G188537j438194K38926J020411l68955p29499j36753l9023N08140J21604
$$ 7188537 5750343 5989269 7009680 6640725 5911226 5774473 5735450 6243590 6365194
3736F365194j213708N93522P7898N51049l90776K17010P40857Q8250q83314n4370
$$ 6365194 5151486 5745008 5822906 6373955 5983179 6200189 6941046 7029296 6145982 6091612
3726F091612M754N96840o7099j334445K4221R10659K89810l5572m85731k0420
$$ 6091612 6096366 6693206 6626107 5291662 5315883 6226542 6516352 6480780 5995049 5974629
3716E974629N30932l73879l60570n850M29483m90821K040774q21801N05330j047796
$$ 5974629 6505561 6131682 5771112 5765262 6194745 5703924 7744698 6922897 7428227 6380431
3706F380431o51358M45087J620752K85935p69033m15119j44347N83325m5729O13681
$$ 6380431 5729073 6174160 7794912 8080847 7311814 6896695 6752348 7335673 7289944 7903625
3696G903625J36605k96015j34342n0193l10512J699648q470m57353q28168J543976
$$ 7903625 8040230 7744215 7609873 7559680 7249168 8948816 8940346 8482993 7654825 9198801
3686I198801n78502O15007l20867J57671K2887n1144J78682n89700J63486j179515
$$ 9198801 8620299 9235306 8914439 9072110 9094997 9043853 9222535 8632835 8796321 7616806
3676G616806J424798P4745O34852o4686m16138k57232N89702J91948Q5717O26773
$$ 7616806 9041604 9116349 9751201 9686515 9270377 9013145 9602847 9794795 9880512 10507285
3666A0507285Q71194O01796r36829M1015N20873J096124l43851o40935P64754
$$ 10507285 11378479 11980275 11043446 11084461 11605334 12701458 12357607 11716672 12481426
3657A2481426L1878j87969k75702N77714P53238N88873k60478O26133p45156J355342
$$ 12481426 12513304 12325335 12049633 12627347 13380585 13969458 13708980 14335113 13589957 14945299
3647A4945299K7111o37550P24113J664808Q37486O06772R07125o2870K33320j195613
$$ 14945299 14972410 14334860 15058973 16723781 17561267 18168039 19075164 19012294 19245614 18050001
3637A8050001l51913O60744r2751O1423N94181J037341M65537k83175M89675L62926
$$ 18050001 17698088 18358832 18266081 18327504 18921685 19959026 20424563 20141388 20631063 20993989
3627B0993989Q52550j041618J80858J723931L3000J57076M61404M8358J322971
$$ 20993989 21846539 20804921 20985779 22709710 22742710 22899786 23361190 23409548 24732519
3618B4732519P00597k25296m27710n59514M82743j62130j81370J296182O60578
$$ 24732519 25433116 25207820 24780110 24220596 24703339 24541209 24359839 25656021 26316599
3609B6316599q07541j12022J563212l4326o09102L67462O49179J097354M08011
$$ 26316599 25509058 25397036 26960248 26925922 26316820 26684282 27333461 28430815 28838826
3600B8838826J49716O24372j425787J31278J022741Q92766J674258o94361m20067
$$ 28838826 28988542 29612914 28187127 28318405 29341146 30233912 31908170 31213809 30793742
3591C0793742Q39642k36059N89528J508421R0195m32974J41559M82811J886581
$$ 30793742 31633384 31397325 31986853 33495274 33585469 33152495 33294054 33776865 35663446
3582C5663446R81088J174629J507156J414234J100609K302929j24722N25690N94093
$$ 35663446 36644534 37819163 39326319 40740553 41841162 44144091 44019369 44545059 45139152
3573D5139152m85810k150552n30460r55190j8536J230044j042936o16177j23409
$$ 45139152 44653342 42502790 41972330 41017140 40998604 42228648 41185712 40569535 40446126
3564D0446126M59118l99016J96531p69860o21429J240400J076770p37784j026852
$$ 40446126 40905244 40506228 40702759 39932899 39311470 40551870 41628640 40890856 39864004
3555C9864004o1988r41367N01014j884930l80841J50479j451458l86232r54770
$$ 39864004 39802016 38860649 39361663 37476733 37095892 37246371 35794913 35408681 34453911
3546C4453911j287603j90902n87035r05407n53055p61192l83557k32391r19322
$$ 34453911 33166308 32975406 32388371 31482964 30929909 30168717 29785160 29552769 28633447
3537B8633447j189803J304945m5060j481231k259767o94779j252379M5930Q52555
$$ 28633447 27443644 28748589 28703529 27222298 24962531 24267752 23015373 23061303 23913858
3528B3913858k99661j616415p63719m95818n88493k58274K26833p72389j453399
$$ 23913858 23614197 21997782 21234063 20738245 20149752 19891478 20118311 19345922 17892523
3519A7892523J222828O94820n13787q30397l41998n0789j70908j069678k53788
$$ 17892523 19115351 19810171 19296384 18465987 18123989 18073200 17902292 16832614 16578826
3510A6578826R05333r73643m72083O17434J226403q82930q37848O51961o57800
$$ 16578826 17484159 16510516 16038433 16655867 17882270 16999340 16161492 16813453 16155653
3501A6155653o85460J709727M84838j161232j30165j23282J74190O9378N578J78470
$$ 16155653 15470193 17179920 17664758 16503526 16373361 16250079 16424269 16493647 16499225 16677695
3491A6677695j179252L70378j863248J511617M48644o05673J100759n60307m64033
$$ 16677695 15498443 15868821 14005573 15517190 15965834 15360161 16460920 15900613 15436580
3482A5436580J232462J87676L04331J21507m06751M32172P8390P71522J65660
$$ 15436580 16669042 16856718 17161049 17282556 16875805 17307977 17386367 18157889 18323549
3473A8323549M31422k78970N61258j146410L00095J17132N42759K87173J46814
$$ 18323549 18754971 18476001 19037259 17890849 18190944 18308076 18850835 19138008 19284822
3464A9284822J27655o24029J763081p14849k42458m79870L81282J03485N92784
$$ 19284822 19412477 18788448 20551529 19836680 19594222 19114352 19495634 19599119 20191903
3455B0191903J402785J281933R0298Q95577p77764q68470l44335Q51861q9668
$$ 20191903 21594688 22876621 22966919 23862496 23084732 22216262 21871927 22723788 22634120
3446B2634120R57320Q60001j561256J339450O46692Q12785J001554k26R83659
$$ 22634120 23591440 24451441 22890185 24229635 24876327 25689112 26690666 26690440 27674099
3437B7674099J830575q14392n3613K108094Q45460k71304J368712J99660J536975
$$ 27674099 29504674 28690282 28636669 30744763 31590223 31318919 32687631 32887291 34424266
3428C4424266Q53005p39413N11683J58185o80046Q14369J495677N36718P50314
$$ 34424266 35277271 34537858 35049541 35207726 34527680 35342049 36837726 37374444 38124758
3419C8124758q659k21034j13805J049811J354180l60805J020811N88677J825824
$$ 38124758 38116099 37895065 37781260 38831071 40185251 39824446 40845257 41433934 43259758
3410D3259758o79255K0951R28011J069072N43149p99146N45881K124019Q52846
$$ 43259758 42580503 42601454 43529465 44598537 45141686 44342540 44888421 47012440 47865286
3401D7865286J048027o73545j271319n09257J963578N42541p27088N16847j30908
$$ 47865286 48913313 48239768 46968449 46459192 48422770 48965311 48238223 48755070 48624162
3392D8624162m89936m42873L03434K72130J57839q16653O45295l33421L69589
$$ 48624162 48134226 47691353 47994787 48266917 48424756 47608103 48253398 47919977 48289566
3383D8289566L40724k92859l04501j02023r71599m75790N43701j688611l43355
$$ 48289566 48630290 48337431 48032930 47930907 46959308 46483518 47027219 45338608 44995253
3374D4995253J2770p68580j467171p15991P42740r42402o19046j32639q53354
$$ 44995253 45008023 44239443 42772272 42056281 42799021 41856619 41237573 41104934 40251580
3365D0251580k74793J27973j337104j374138J012073J90256q62144K17788o49498
$$ 40251580 39976787 40104760 38767656 37393518 38405591 38595847 37733703 37951491 37301993
3356C7301993J04129P73506j359266k050260L18536j40037j735536P31155m46902
$$ 37301993 37406122 38179628 36820362 34770102 35088638 34948601 33213065 33944220 33497318
3347C3497318M1368O86308k624460j020129J85364j37341N42308j287859r22819
$$ 33497318 33538686 34224994 31600534 30580405 30765769 30628428 31170736 29882877 28960058
3338B8960058J42309l4329k00070j375048L82126k2067q38274N81312o78502m18491
$$ 28960058 29102367 29068038 28867968 27492920 27875046 27852979 27014705 27596017 26917515 26499024
3328B6499024j074922J229882R7854p37787q95493j674728J499111n08382R7754
$$ 26499024 25424102 26653984 26751838 26014051 25118558 23443830 24942941 24434559 24532313
3319B4532313Q47820j186011k44620K1329j045924M14648j27169n08811o78624
$$ 24532313 25380133 24194122 23949502 23970831 22924907 23339555 23212386 22703575 22024951
3310B2024951j13401q08755J381757K28011m97346N49717P75072L4724m72469
$$ 22024951 21911550 21102795 22484552 22712563 22215217 22764934 23540006 23574730 23102261
3301B3102261o15534m92713N38365p37389M22533J614002l26856j33493l63943
$$ 23102261 22486727 21994014 22532379 21794990 22217523 23831525 23504669 23371176 23007233
3292B3007233J504117R44424M27358o87540R0242J220590l80205P21008L0040
$$ 23007233 24511350 25455774 25883132 25195592 25285834 26506424 26126219 26847227 26877267
3283B6877267N36900M31825m88731P15474P90412j132045p13471J187977O92490
$$ 26877267 27414167 27845992 27357261 28072735 28863147 27731102 27017631 28205608 28898098
3274B8898098j453233r56526j419502J224524K77444k45752j027324M83213O72688
$$ 28898098 27444865 26488339 25068837 26293361 26570805 26325053 25297729 25780942 26453630
3265B6453630L97939o01357M896L89789j02092J173264J61513j264526J093J119511
$$ 26453630 26851569 26250212 26255108 26644897 26542805 27716069 27877582 26613056 26614149 27733660
3255B7733660q12914o12378N18517N81215K6617M72287p17026O45998M73369q61549
$$ 27733660 26920746 26308368 26826885 27408100 27434717 27907004 27189978 27835976 28309345 27447796
3245B7447796k00807l9211J512357M04896m13716L45283o28403j795010p20975
$$ 27447796 27246989 27207778 28720135 29125031 28711315 29056598 28428195 26633185 25912210
3236B5912210J591723J143275q580j501313O38569n53380m51959J22244j69890
$$ 25912210 27503933 28647208 28638628 27137315 27775884 27222504 26770545 26892789 26722899
3227B6722899K023451m09342k90091q2839j084753J49592N06769k91538P58320
$$ 26722899 28746350 28337008 28046917 27964078 26879325 27028917 27535686 27244148 28002468
3218B8002468Q05410j43828Q28061N35923J68835O88571R73317j741036R30657
$$ 28002468 28807878 28664050 29492111 30028034 30196869 30885440 31858757 30117721 31048378
3209C1048378L94070O77812J054597J349776J248893R1089J365854R98150J409521
$$ 31048378 31442448 32120260 33174857 34524633 35773526 35864615 37230469 38228619 39638140
3200C9638140J479832K000827L58073J258530J780871J409854N82056M1813R44255
$$ 39638140 41117972 43118799 43476872 44735402 46516273 47926127 48508183 48549996 49494251
3191D9494251O26293J65748J78837K77290K70818L86458O80597J206109p14289
$$ 49494251 50120544 50286292 50465129 50742419 51013237 51399695 52080292 53286401 52572112
3182E2572112o88605K73967M18619q7125K06403j82197K43189P19707R03546J436001
$$ 52572112 51883507 52157474 52576093 52488968 52695371 52513174 52756363 53476070 54379616 55815617
3172E5815617o65506o24993k00397K28555j126737K5611k57355q48776J00683
$$ 55815617 55150111 54525118 54324721 54553276 53426539 53452150 53194795 52346019 52446702
3163E2446702j160369l6458j783623j443327k68426q05209j772088k371912j597818
$$ 52446702 51286333 51249875 49466252 48022925 47754499 46949290 45177202 42805290 41207472
3154D1207472j378588j762249P2212L48850j321378l241967P13824n15426k416561
$$ 41207472 39828884 38066635 38138847 38487697 37166319 33924352 34638176 34122750 31706189
3145C1706189J121257k67384m80540J61406l18983L42455j58490k23840n08402
$$ 31706189 32827446 32560062 32079522 32240928 31921945 32264400 32105910 31882070 31373668
3136C1373668M59016L3641L74844n8890k58557P8814M15902J278126j137872J561491
$$ 31373668 31832684 31866325 32241169 32182279 31923722 32002536 32418438 33696564 32558692 34120183
3126C4120183N51095j10667R54432j448863L5520p20588p72261L54985q7044Q2618
$$ 34120183 34671278 34560611 35515043 34066180 34101700 33381112 32608851 32963836 32876792 32959410
3116C2959410O0495J331131j070128p99228R71446Q77134o54120J33316P27139
$$ 32959410 33019905 34351036 33280908 32481680 33453126 34330260 33676140 33809456 34536595
3107C4536595j401310O57441J176939n8072r4010j32812N50667r48856L55488
$$ 34536595 33135285 33792726 34969665 34911593 34817583 34684771 35235438 34286582 34642070
3098C4642070M0302J99084j69800J625905R93443j052676j052266K43724P77347
$$ 34642070 34682372 34881456 34711656 36337561 37331004 36278328 35226062 35469786 36247133
3089C6247133J045381j679274L68161j61746N48910J040261Q67943N71345M74373
$$ 36247133 37292514 35613240 35981401 35819655 36368565 37408826 38276769 38848114 39322487
3080C9322487K10004O35842J752399J104693l08654j82586M68594J155944q99604
$$ 39322487 39532491 40168333 41920732 43025425 42716771 42534185 43002779 44158723 43259119
3071D3259119L89295m13510L16258p48684R23344K4518P2514J53142j8007Q10148
$$ 43259119 43648414 43234904 43551162 42802478 43725822 43750340 43822854 43975996 43957989 44768137
3061D4768137Q97106n91823n69102K480547o34813J595622J915463J128315N26910
$$ 44768137 45665243 45073420 44504318 46984865 46350052 47945674 49861137 50989452 51516362
3052E1516362K261527J103616J652365J073259J516003K255315P28929J123419
$$ 51516362 53777889 54881505 56533870 57607129 59123132 61378447 62107376 63230795
3044F3230795J626006P37499J192991M25952J356018Q30834J039941J26722R94808
$$ 63230795 64856801 65594300 66787291 67213243 68569261 69400095 70440036 70566758 71561566
3035G1561566k74031R33373Q46540Q5591j34916K86728k4966Q1151R0326M69071
$$ 71561566 71287535 72220908 73067448 73153039 73018123 73304851 73279885 73361036 73451362 73920433
3025G3920433j95907j50731J839401J077060R88735K859791K686209J354147K875790
$$ 73920433 73724526 73573795 75413196 76490256 77478991 80338782 83024991 84379138 87254928
3016H7254928K607292K903783K534243J418783L498636L555464L083770K043392
$$ 87254928 89862220 92766003 95300246 96719029 100217665 103773129 106856899 108900291
3008A08900291Q70748K620384J965488m20002J381080o08261l52578R34655J035958
$$ 108900291 109771039 112391423 114356911 113936909 115317989 114709728 114357150 115291805 116327763
2999A16327763l33897P04439J758751J16474K19290p57890O82087J448462P15700
$$ 116327763 115993866 116698305 118457056 118573530 118792820 118034930 118717017 120165479 120881179
2990A20881179J987039K766847L364233L217455L995609L561369N755631K854089
$$ 120881179 122868218 125635065 128999298 132216753 136212362 139773731 145529362 148383451
2982A48383451K577520L781817M091325K164413Q31669K125598K163595J06566
$$ 148383451 150960971 154742788 158834113 160998526 161830195 163955793 166119388 166225954
2974A66225954Q35753O60544m73048l90906k934411l313034l013214m733841n189696
$$ 166225954 167061707 167722251 167249203 166858297 163923886 160610852 157597638 152863797 147674101
2965A47674101n371725n184630n290112m904407n462991m752336m178670l909597
$$ 147674101 142302376 137117746 131827634 126923227 121460236 116707900 112529230 108619633
2957A08619633l559398k038553l021209k627200n22097k217182j661480j675476
$$ 108619633 105060235 103021682 100000473 97373273 96851176 94633994 92972514 91297038
2949I1297038j325520j706203j030909j933872k044179j844952l10932p79293
$$ 91297038 89971518 88265315 87234406 85300534 83256355 81411403 81100471 80321178
2941H0321178q79471j856061k566574k107384j718348j857866q70329k715512
$$ 80321178 79441707 77585646 75019072 72911688 71193340 69335474 68465145 65749633
2933F5749633j254782j702931k215353j529338o35923j150303j235181j624328
$$ 65749633 64494851 62791920 60576567 59047229 58411306 57261003 56025822 54401494
2925E4401494j198372l57386p92553j572215j155448n78550m77353m50010j275160
$$ 54401494 53203122 52845736 52053183 50480968 49325520 48746970 48269617 47819607 46544447
2916D6544447j058615O90919Q92222j68564q88688L89476k25850j6964K49779
$$ 46544447 45485832 46176751 47068973 46900409 46011721 46401197 46175347 46158383 46408162
2907D6408162N19941J053554M12458K554577R11161o7002K66580J04243J923849
$$ 46408162 46928103 47981657 48394115 50948692 51859853 51792851 52059431 52163674 54087523
2898E4087523K0814P84591k67031o27870R19662o7734j8593K14966o49153l67276
$$ 54087523 54108337 54892928 54625897 53998027 54917689 54849955 54831362 55046328 54397175 54029899
2888E4029899r0398J54678j05102N48598L51408j156284m08311r48291M66539
$$ 54029899 53939501 54094179 53989077 54537675 54889083 53732799 53324488 52376197 52842736
2879E2842736J925305k020772l2057j470396K11522M65679Q84491J657168L25115
$$ 52842736 54768041 52747269 52715212 51244816 51456338 51922017 52806508 54463676 54788791
2870E4788791P22638J262251J612011J860532L545451L170650K440760J912963
$$ 54788791 55511429 56773680 58385691 60246223 63791674 66962324 69403084 71316047
2862G1316047K028276K711524K693115K273602k82228m31242n00148r37393l009080
$$ 71316047 73344323 76055847 78748962 81022564 80740336 80309094 79808946 78871553 75862473
2853G5862473k680654l292567k128453k968418l441847j721016m570406k000396
$$ 75862473 73181819 69889252 67760799 64792381 61350534 59629518 55059112 53058716
2845E3058716l047234k293784k095303j115246j558260r88727O8613j369318j502151
$$ 53058716 50011482 47717698 45622395 44507149 42948889 41960162 42028775 40659457 39157306
2836C9157306K12945j575480j327438J356228j654394j689504K52190L46696p50278
$$ 39157306 39370251 37794771 36467333 37823561 36169167 34479663 34731853 35078549 34328271
2827C4328271j712395k63593m7553j721515n89632J171189k199497j101268L05977
$$ 34328271 32615876 32352283 32304730 30583215 29993583 31164772 28965275 27864007 28169984
2818B8169984L34901j219544k87918j138956r54026l57411n37260m15929J81772
$$ 28169984 28504885 27285341 26997423 25858467 24904441 24547030 24009770 23593841 23775613
2809B3775613o59104k31237j260090K60813l47696l7888j889862q41166O05266
$$ 23775613 23116509 22885272 21625182 21885995 21538299 21500411 19610549 18769383 19374649
2800A9374649p17805j327459m67323p4506P86262r32219J76034L72935K11696
$$ 19374649 18656844 17329385 16862062 16787556 17573818 16641599 16817633 17190568 17402264
2791A7402264m42399p20943l90665j72550N73873l48429N9012J99900k19146n90560
$$ 17402264 16959865 16238922 15848257 15675707 16249580 15901151 15960163 16160063 15940917 15350357
2781A5350357M51237N16065j96857k76665R81320o15523O65837l3041j139847
$$ 15350357 15801594 16317659 16120802 15844137 16825457 16209934 16875771 16842730 15702883
2772A5702883n10513J472636p54000q12125n78402Q87428Q15069n80057k42904
$$ 15702883 15192370 16665006 15911006 15098881 14520479 15407907 16222976 15642919 15400015
2763A5400015L38786R49559l93830j268742J231882O63490l32148o24196K41295
$$ 15400015 15738801 16688360 16294530 15025788 16257670 16921160 16589012 15964816 16206111
2754A6206111K90515K55931P43663k9607M06131P21649P12933j42023P75179J868319
$$ 16206111 16496626 16752557 17496220 17466613 17872744 18594393 19307326 19165303 19940482 21808801
2744B1808801K99723j499605J269015O63257N06393Q55126K19882j290518J084435
$$ 21808801 22108524 20608919 21877934 22541191 23047584 23902710 24122592 22832074 23916509
2735B3916509K633390j10604J102012p07947J914670J601278J073920M83895J315087
$$ 23916509 26549899 26439295 27541307 26833360 28748030 30349308 31423228 31907123 33222210
2726C3222210J733275J831358Q56567R22477J985248J145689J700023J233465
$$ 33222210 34955485 36786843 37643410 38565887 40551135 41696824 43396847 44630312
2718D4630312K345093K641658J324028K499515K929399L667720M335402K951444
$$ 44630312 46975405 49617063 50941091 53440606 56370005 60037725 64373127 67324571
2710F7324571M606745L789086K292821K915084J366260K305761J493243J220345
$$ 67324571 71931316 75720402 78013223 80928307 82294567 84600328 86093571 87313916
2702H7313916K628035K778371L353229K676721K857362L083865L338516M093529
$$ 87313916 89941951 92720322 96073551 98750272 101607634 104691499 108030015 112123544
2694A12123544M694217L595988L762908K210689K433586K154706K407239L180526
$$ 112123544 116817761 120413749 124176657 126387346 128820932 130975638 133382877 136563403
2686A36563403M601918M036591O822479M972438O224984Q075438P122922R257150
$$ 136563403 141165321 145201912 152024391 156996829 163221813 171297251 178420173 187677323
2678A87677323J1051907J1136242Q482166L570875j871785o198176q713609p465300
$$ 187677323 198729230 209865472 218347638 221918513 220046728 213848552 205134943 197669643
2670A97669643o952018m074464l449550n50416K043539K944100N450118N296435
$$ 197669643 190717625 186643161 183193611 182643195 184686734 187630834 193080952 198377387
2662A98377387J856587n36516n173514p766750r398710j0754116j0673763r302123
$$ 198377387 200233974 199697458 194523944 186757194 177358484 166604368 155930605 146628482
2654A46628482p600249p465104o202493p124875o585211p071044p664706o725832
$$ 146628482 139028233 131563129 125360636 118235761 111650550 104579506 96914800 90188968
2646I0188968n744099m948519o750568l828248m404122l324425l264688l445252
$$ 90188968 84444869 79496350 72745782 68917534 64513412 61188987 57924299 54479047
2638E4479047k830528l119999k507128l041164l470802l34699m53618l305152
$$ 54479047 51648519 48528520 46021392 42980228 39509426 39174727 38721109 35415957
2630C5415957j556740j471357p43163r56374j67120p59662j471749j158161j725861
$$ 35415957 33859217 32387860 31644697 30688323 30521203 29761541 28289792 27131631 25405770
2621B5405770J41780j534080J647622j083825j490977p23338j328182P84560j550318
$$ 25405770 25547550 24013470 25661092 24577267 23086290 22362952 21034770 21819330 20269012
2612B0269012j772970o42724R456j183496M44098p62539q73022j23816m27652
$$ 20269012 18496042 17853318 17862774 16679278 17123376 16360837 15487815 15363999 14936347
2603A4936347m03665J224099j356662j605572J43359n21663q92043l82894O2779
$$ 14936347 14532682 15756781 14400119 12794547 12937906 12416243 11524200 11141306 11204085
2594A1204085j084892O48614J95187p41809m90116J045939r47488j503140M33902
$$ 11204085 10119193 10767807 10962994 10221185 9731069 10777008 9829520 8326380 8760282
2585H760282J01300j606834k2555L99977R67896J569066j844626Q87431j926833
$$ 8760282 8861582 7254748 7232193 7632170 8600066 10169132 8324506 9211937 7285104
2576G285104N07693Q23991L45556r13536j655762l44488J09268J34845m3524N4480
$$ 7285104 7792797 8616788 8962344 8048808 6393046 6048558 6157826 6292671 6249147 6303627
2566F303627O0152o26101j319561J885492J40326l93355m52542o80042P2202M7338
$$ 6303627 6363779 5737678 4418117 6303609 6443935 6050580 5598038 4917996 4990198 5037536
2556E037536J7170J34878K99775n14953j27544Q78603q64981j499396l89382J117195
$$ 5037536 5054706 5189584 5489359 4974406 4846862 5725465 4860484 3361088 2971706 4088901
2546D088901J403061k223783k20605J212058r85003J195186l27512Q46714r89350
$$ 4088901 5491962 3268179 3047574 4259632 3274629 4469815 4142303 4989017 3999667
2537C999667o64767J164803L65604j719260k04298J329960o86864n89450p33905
$$ 3999667 3334900 4499703 4865307 3146047 2941749 4271709 3584845 2995395 2261490
2528B261490L44993k2333N11527l035r44472R12345o65816n13737R11989P97751
$$ 2261490 2606483 2584150 3095677 3092642 2148170 3060515 2394699 1880962 2792951 3590702
2518C590702L77873j522314P41264j41625L3730M3067k10897M91061r16198O06116
$$ 3590702 3968575 2446261 3187525 3045900 3079630 3122697 2911800 3402861 2486663 3092779
2508C092779P00547j446567k66447N08809L01234q33291K31330P66351k62608
$$ 3092779 3793326 2346759 2080312 2589121 2890355 2057064 2288394 3054745 2792137
2499B792137J08376j144760j63430J406790r52794j96720J409527n95951q47043
$$ 2792137 2900513 1755753 1592323 2999113 2046319 1849599 3259126 2663175 1816132
2490A816132L39442K02169k88583L33802N83320n72890J078966j352475p38478
$$ 1816132 2155574 2357743 2069160 2402962 2986282 2413392 3492358 2139883 1401405
2481A401405O40474o68706N86228K37383L95234p43496q02019J589370j23874
$$ 1401405 2041879 1373173 1959401 2196784 2592018 1848522 1046503 2635873 2511999
2472B511999O47113N49830r67703P83521p12853m18591P28733k41182l35437m07613
$$ 2511999 3159112 3708942 2741239 3524760 2811907 2393316 3122049 2880867 2545430 2137817
2462B137817J286284j71711p27884o61394J41287M30957R5652n43153o94973N64170
$$ 2137817 3424101 3252390 2524506 1863112 2004399 2435356 2531008 1987855 1292882 1857052
2452A857052N52300J82833Q4285j2621o65238K71674o77711m69086J89124j209166
$$ 1857052 2409352 2592185 2676470 2663849 1998611 2270285 1592574 1123488 1312612 103446
2442A03446K30946M00049J044135K84871j672149R6869p4314J129837j114453
$$ 103446 334392 734441 1778576 2063447 391298 488167 413853 1543690 429237
2433D29237O32105j161654L46782O74217m9909Q01746q25018J04548o368L6196
$$ 429237 1061342 -100312 246470 920687 870778 1672524 847506 952054 945686 981882
2423I81882n24756M29058q76179L78593M98920j18038J239006r95004L05132k71245
$$ 981882 457126 886184 10005 388598 887518 769480 2008486 1013482 1318614 1047369
2413A047369P81937l15090K53900k70608J43500o32688m52567l69022j82984J114781
$$ 1047369 1829306 1514216 1768116 1497508 1641008 1008320 555753 186731 3747 1118528
2403A118528j198054P67716m48493M64279j11980l85976L89192J218133q2897
$$ 1118528 -79526 688190 239697 703976 591996 206020 595212 1813345 1730448
2394A730448p29980r55899M1038k22172M39545P28876k23203Q2865K47698q01599
$$ 1730448 1000468 44569 85607 -136565 302980 1031856 808653 891518 1139216 337617
2384C37617J72115P37903m89870N49306R08369j280632J91264O33479p15723J34579
$$ 337617 509732 1247635 757765 1307071 2215440 934808 1126072 1759551 1043828 1178407
2374A178407p44347M3152O46335P33141n362p08863q14635J199699n13508j107384
$$ 1178407 434060 477212 1123547 1856688 1851326 1142463 327828 1527527 1014019 -93365
2364i3365m39257K100614j567933k88221M63825L34262n5478j06696N55404k21521
$$ -93365 -532622 1567992 59 -288162 175663 509925 454447 347751 903155 681634
2354F81634m68387Q3454J54375O14069k12403k94626Q95639l55823q29689n2163
$$ 681634 213247 296701 451076 1065145 852742 558116 1453755 1097932 268243 216080
2344B16080L42319j15965j33369L62932J383331q99323Q82088l16128j48114l22978
$$ 216080 558399 442434 309065 671997 2055328 1156005 2038093 1721965 1573851 1250873
2334A250873L06331q216L55159O51678j505333l92727J088337n49931j261245
$$ 1250873 1557204 1548988 1904147 2555825 1050492 657765 1746102 1196171 -65074
2325f5074M88865N14576q55796Q32490n35650J93169o03486J48631N5773j7562
$$ -65074 423791 938367 82571 915061 379411 572580 -30906 117725 173498 155936
2315A55936J49618j09641M40293K6140L9190O9184o10579Q99861j03466q72898
$$ 155936 305554 195913 636206 662346 701536 770720 160141 1060002 956536 83638
2305H3638R05308O46864n70854j370314P22738j51205Q12185K33850J163789L19077
$$ 83638 988946 1635810 1064956 -305358 417380 266175 1078360 1312210 2475999 2795076
2295B795076o14505P35512n37178M05965l03878n75324r74531M94699j06553m63818
$$ 2795076 2180571 2916083 2378905 2784870 2480992 1905668 931137 1425836 1319283 855465
2285H55465k26019n32527m17876K00203M08623k86167J099415o34847N48916k60145
$$ 855465 629446 96919 -320957 -120754 287869 1702 1101117 466270 1015186 755041
2275G55041O30742J151477q92031k92780n57098P79995k71409j141513K5234L392
$$ 755041 1385783 2537260 1645229 1352449 795351 1575346 1303937 162424 187658 191050
2265A91050J750218p64442j271465N43600j57897l31897Q62069R8030l47328Q1438
$$ 191050 1941268 1176826 -94639 448961 291064 -40833 821236 919266 571938 653376
2255F53376Q52516m4238N4981l8894m45182M48196l11332p34541P65487N08852
$$ 653376 1505892 1461654 1516635 1477741 1032559 1480755 1169423 434882 1200369 1709221
2245A709221N13589j357723J93969O62827n62227N29756r09155j33820M61377
$$ 1709221 2222810 865087 1059056 1721883 1159656 1689412 780257 646437 1107814
2236A107814l69449J515626o33321o59511l18161R15727j5443n91149J820104
$$ 1107814 738365 2253991 1620670 961159 642998 1558725 1543282 952133 2772237
2227B772237m91236r36372j184820J638588n50758o58593J294703j8248j404163
$$ 2772237 2281001 1344629 159809 1798397 1247639 589046 1883749 1865501 461338
2218D61338J218863j46227L35723N75981N7728q47683P52624m16400o72191n22462
$$ 461338 1680201 1533974 1869697 2445678 2503406 1655723 2408347 1991947 1319756 797294
2208G97294k66957k22260J239825J47474o16056J149692L50738J015392o59475
$$ 797294 530337 308077 1547902 1695376 1079320 2229012 2579750 3595142 2935667
2199B935667m69366O25135p86228K77916p98881J22113n03530m47019J845229
$$ 2935667 2466301 3091436 2305208 2583124 1784243 1906356 1402826 955807 2801036
2190B801036m63289N47276o67798k43396Q6098O28640j40771l647O68940n37605
$$ 2801036 2337747 2885023 2217225 1973829 2059927 2688567 2547796 2544149 3213089 2675484
2180B675484j42532k43809J010587N22117n33923l71443j243719J235124P21945
$$ 2675484 2532952 2289143 3299730 3821847 3287924 2916481 1672762 2907886 3629831
2171C629831l34326N75589M50919n92601m74371J409104m92719J254663j50843
$$ 3629831 3295505 3871094 4322013 3729412 3255041 4664145 4171426 5426089 5275246
2162E275246j321510J590160J11915O61255l57374j323006N76996N61309k08097
$$ 5275246 3953736 5543896 5655811 6317066 5959692 4636686 5213682 5774991 5566894
2153E566894O39911n00199J19252L51170J116680p8893N98207J220335J075114
$$ 5566894 6206805 5706606 5825858 6177028 7293708 7214815 7813022 9033357 10108471
2144A0108471J89559L19489j066654l5434L163323j365976J206112M89502l64374
$$ 10108471 10298030 10617519 9550865 9515431 12678754 11312778 12518890 13008392 12644018
2135A2644018P92223R30486J403574q47060P03507K193491Q1323K472239O73444
$$ 12644018 13436241 14366727 15770301 14923241 15626748 17820239 17901562 20373801 21047245
2126B1047245j83919k72406J135937J917989p67855J668855N36047J825449Q09269
$$ 21047245 20863326 20590920 21726857 23644846 22876991 24545846 25081893 26907342 27716611
2117B7716611L83338K112020L608211K636576K046220R36994J929730N213202
$$ 27716611 28099949 30211969 33820180 36456756 38502976 39439970 41369700 46582902
2109D6582902L505891L293360M441173M558531O171168N069910Q921527O517277
$$ 46582902 50088793 53382153 57823326 62381857 68553025 73622935 82544462 89061739
2101H9061739J1590595J3464891K0337172K3294745L3234783L9206824N6644541
$$ 89061739 100652334 114117225 134454397 157749142 190983925 230190749 286835290
2094B86835290K7014656j4163657l3503372m4163507l9522941l7363625k1541830
$$ 286835290 313849946 299686289 266182917 222019410 182496469 145132844 123591014
2087A23591014j8957262j2091219j1165412q508511p912919m882381o932808o744511
$$ 123591014 104633752 92542533 81377121 72868610 64955691 60073310 53140502 46395991
2079D6395991n085109m289106l514615k258023j989541k110229k048353p16852
$$ 46395991 41310882 37021776 33507161 31249138 29259597 27149368 25101015 24384163
2071B4384163j193978j394788k216991o42950k36122m77678k127048j061088q42248
$$ 24384163 23190185 21795397 19578406 18935456 18699334 18221656 16094608 15033520 14191272
2062A4191272n54743m37456j155389o13080N377k77232j115517O26987j75448
$$ 14191272 13636529 13199073 12043684 11430604 11435981 11158749 10043232 10670219 10494771
2053A0494771j768965K54179p66196n33400L97541O4885q10342m89502q53469
$$ 10494771 8725806 8979985 8213789 7680389 8077930 8142815 7332473 6842971 5989502
2044E989502L70027m40435m0531p49847J211090j318694R9034n1938j96615k54752
$$ 5989502 6359529 5919094 5878563 5128716 6339806 5021112 5120146 5068208 4871593 4616841
2034D616841q17002Q3280K82912K90447n74831O01850r80532k12903L53768m87288
$$ 4616841 3799839 3883119 4166031 4456478 3881647 4483497 3502965 3290062 3643830 3156542
2024C156542n43143N34009m37539R005O58151n91824l97148J492408p53985r50608
$$ 3156542 2613399 3147408 2709869 2718874 3377025 2785201 2388053 3880461 3126476 2175868
2014B175868n8588l20312j30644K05476J77248p45912M85216L71904N44040r38896
$$ 2175868 2117280 1796968 1666324 1871800 2049048 1303136 1788352 2160256 2704296 1765400
2004A765400o21855N9701P8679m5157k68132o41967l33765L29189N42649l43096
$$ 1765400 1143545 1203246 1281925 1236768 968636 326669 -7096 322093 864742 521646
1994E21646J078835R0318n27685l15218o31417P95883k48971N17660m96303p46299
$$ 521646 1600481 1690799 1163114 847896 216479 1012362 763391 1281051 784748 38449
1984C8449K14199K10984l87491Q2162J66893k79973N9932j52513j88194O71210
$$ 38449 252648 463632 76141 158303 325196 45223 105155 -47358 -235552 435658
1974D35658J14769Q86489J246570j057135j136352l12357j92928K89049l28452
$$ 435658 550427 1436916 2683486 1626351 489999 177642 -15286 273763 -54689
1965e4689N50208K50396l49139M93057N45245j805827O73952l75477M82891m74680
$$ -54689 495519 745915 396776 889833 1435078 -370749 303203 -72274 410617 -64063
1955f4063K92566k39481M05302l27754M30608J55758q10232k61105p5692L68412
$$ -64063 228503 -10978 394324 66570 497178 652936 -157296 -418401 -494093 -125681
1945a25681Q7917l4575L38949m49881Q63546m64439l78675N1481M91411j237217
$$ -125681 -37764 -72339 266610 -183271 680275 215836 -162839 -111358 380053 -857164
1935h57164P15616N03251q68040J62793M57943p61844O77864J093085j569080
$$ -857164 -141548 361703 -506337 -343544 114399 -647445 30419 1123504 -445576
1926d45576R78151r90923j77943N32088P44486J2541k81911p1693p97402k3359
$$ -445576 532575 -458348 -636291 -104203 640283 652824 370913 299220 -498182 -521541
1916e21541M97340M82623M63420J91743K41292l20361K91690o91799N01799M42559
$$ -521541 -24201 458422 921842 1113585 1354877 1034516 1326206 634407 1136206 1578765
1906A578765m60133p52559N00227N9714q80079J244895K89182m18008m79673p98530
$$ 1578765 1118632 366073 866300 926014 45935 1290830 1580012 1162004 682331 -116199
1896a16199m18769P56944J355215N54084m82369L3098l07843o55004Q04837j225060
$$ -116199 -534968 221976 1577191 2131275 1648906 1682004 1374161 719157 1523994 298934
1886B98934K15205p19685P38033r73933K86583M86521n37196J08617Q88727Q20035
$$ 298934 514139 -205546 532487 -441446 -154863 331658 -205538 -96921 791806 1611841
1876A611841p32724l85178n10808n07824j88762J433951Q45348r17486j30212
$$ 1611841 879117 493939 -16869 -524693 -713455 720496 1565844 648358 518146
1867E18146p35525M2907K46599l68318m75936J11622J086531J57411l03452k3451
$$ 518146 -217379 -174472 72127 -296191 -772127 -660505 426026 583437 279985 256534
1857B56534p17746j08193N27235l62705M95712p46516M27991M23703J002906k00210
$$ 256534 -461212 -569405 -42170 -404875 90837 -655679 -227688 196015 1198921 998711
1847I98711j09696n12757J43649m08821j667843N31072K95819j7560P72855K60749
$$ 998711 889015 376258 519907 111086 -1556757 -1025685 -729866 -747426 25429 286178
1837B86178J39598k79075m09011M81150p29450m30924J002925M10279m1941O17213
$$ 286178 425776 146701 -262310 218840 -510610 -941534 61391 471670 429729 1046942
1827A046942j09758M86357j003680O6237j125598r0925J051880l86406m05212
$$ 1046942 937184 1423541 419861 486098 -639500 -730425 321455 -64951 -470163
1818d70163K75293N27406j388506Q80787n8868j17183p279Q85307P37731k45886
$$ -470163 -194870 332536 -1055970 -175183 -234051 -351234 -358513 526794 1264525 1018639
1808A018639p65899J18627m89106J00743o36001n5813K12627R14641m91719M2459
$$ 1018639 252740 371367 -117739 -16996 -652997 -708810 -496183 418458 -73261 -30802
1798c0802o54645l33293J91074K35480j59439m75817j47597m78656Q54294J212844
$$ -30802 -685447 -1018740 -827666 -592186 -751625 -1227442 -1375039 -1853695 -999401 213443
1788B13443j293744L59199J0114L1824N71457P78001M51897q46158Q517k017638
$$ 213443 -1080301 -721102 -710988 -679164 -107707 670294 1122191 276033 284550 -1733088
1778a733088J320675P74933R73348k455419J289744k06672r81558K61019l95573
$$ -1733088 -412413 362520 1335868 -1119551 170193 -36479 -1018037 -757018 -1152591
1769a152591O95998J559208M28413j376096n20762J299726O0493j134006Q0925
$$ -1152591 -456593 1102615 1531028 154932 -365830 933896 994389 -139617 -58692
1760e8692N71481q42261p9490l35871R42489m34194Q52647R51191o11137r52064
$$ -58692 512789 -329472 -408962 -744833 197656 -236538 616109 1567300 956163 4099
1750D099p21571M75072O7339m94431k0819J136036L33273l59625L83055l31721
$$ 4099 -717472 -242400 -175061 -669492 -690311 445725 778998 419373 802428 470707
1740D70707n9n39035k43811p68165n86790N63499J477857j96781l30829J07544
$$ 470707 470648 -68387 -312198 -1080363 -1667153 -1103654 374203 177422 -153407 -45863
1730d5863n03194n09713Q31111M41933k92316n52146J27373J350279r08181J05522
$$ -45863 -549057 -1058770 -227659 214274 -78042 -630188 -502815 847464 -60717 44805
1720D4805J148719k12349j321872K16397Q02577J38081j589367J281177P1367
$$ 44805 1193524 981175 -340697 -124300 678277 816358 -773009 508168 579535
1711E79535l25589j450397q63391J708749j434151o50496J124409m39089O87409
$$ 579535 253946 -1196451 -2059842 -351093 -1785244 -2435740 -1311331 -1750420 -1063011
1702a063011L53129J179137K44546N57469k198670N5914M79619m96331k88868
$$ -1063011 -709882 469255 713801 1271270 -927400 -871486 -391867 -888198 -1177066
1693a177066N04040O34649L76948p20j36106L31743m82123m66458M55621N98198
$$ -1177066 -673026 -38377 338571 337851 201745 533488 51365 -415093 40528 638726
1683F38726o60325m1596p16098O50087o93699K91026P3879o8716L78288O14714
$$ 638726 -21599 -63195 -779293 -129206 -822905 -531879 -458000 -526716 -148428 466286
1673D66286P96919j308840J40096j026358m66O04395R29317m12438n29494Q08317
$$ 466286 1263205 -45635 94461 -931897 -932363 -327968 601349 188911 -340583 467734
1663D67734L19876j461932L8320O02398O20725r69783O47157j535255P26644R03846
$$ 467734 787610 -674322 -636002 -33604 587121 -382662 264495 -1270760 -544116 359730
1653C59730j80997n44569j1443j021239K05148L35387P6281R0388L08490l1448
$$ 359730 178733 -365836 -377279 -1398518 -1193370 -857983 -781702 -691314 -382824 -414272
1643d14272j16331J04417Q24260N21650j134269K11955n73787n87941l23387R84255
$$ -414272 -530603 -426186 398074 919724 -214545 -2590 -576377 -1164318 -1487705 -503450
1633e03450R2062J073472n29512k64943r53869O78706p55643R14204p71744q03206
$$ -503450 -411388 662084 132572 -132371 -1086240 -407534 -1163177 -248973 -1020717 -1823923
1623a823923r43421J325581J045420N16406l26319j261024J361723o5544J990005
$$ -1823923 -2767344 -1441763 -396343 120063 -206256 -1467280 -105557 -171101 1818904
1614A818904j489661j006685K06532j195540J015288J073825j965579P20757J077115
$$ 1818904 329243 -677442 -470910 -1666450 -651162 422663 -1542916 -822159 254956
1605B54956j012859Q17663L75718k08933K45012M19066l38136m79000M79519l06291
$$ 254956 -757903 59760 435478 226545 471557 890623 552487 73487 553006 246715
1595B46715q73045P38960j76407l59644J17845J419581j4187j218080q60397O19253
$$ 246715 -626330 112630 -63777 -423421 -305576 1114005 1099818 -118262 -978659 -359406
1585c59406p97953J683075n4387m65098M17416l64406n51131J170806l37714M95150
$$ -359406 -1157359 525716 471329 6231 423647 59241 -491890 678916 341202 836352
1575H36352p12271k67493P13401p68760J15397K05697K92190p31006r20946j178463
$$ 836352 124081 -143412 569989 -198771 -83374 122323 414513 -316493 -1237439 -2415902
1565b415902Q76965J180301j81721q1760l78360O26977m79150Q59879r53133M28231
$$ -2415902 -1538937 -358636 -540357 -622117 -1000477 -373500 -852650 7229 -945904 -517673
1555e17673Q96884q30360K53552j07191m8086L91812n39787M63186j83978q71279
$$ -517673 379211 -451149 -197597 -304788 -352874 38938 -500849 -37663 -221641 -1092920
1545a092920O0446K16429M0768J51338J093301q14216n98379L71183J61680l67945
$$ -1092920 -1032474 -816045 -775277 -623939 469362 -344854 -943233 -572050 -410370 -778315
1535g78315M24557k77118k21381J219226o60544l97304j60528N97860k1475L29325
$$ -778315 -353758 -630876 -852257 366969 -293575 -690879 -851407 -253547 -275022 54303
1525E4303p3490n92856K65840l80641J37675R01449p02020N47551P65430n40268
$$ 54303 -19187 -612043 -346203 -726844 -589169 312280 -389740 157811 923241 382973
1515C82973J83814j382468J68720L8587M30385p17986J552600J98513m25948q47900
$$ 382973 566787 -815681 -646961 -608374 -177989 -895975 656625 855138 429190 -418710
1505d18710J003793l74152L94058o66834J88360m40344P77624j105239l6735m18592
$$ -418710 585083 210931 604989 -61845 126515 -313829 463795 -641444 -678179 -1096771
1495a096771N3261J691192N97311p63356Q1784m77167m87093l90019n98737Q05337
$$ -1096771 -1043510 647682 1244993 481637 563421 86254 -400839 -790858 -1389595 -584258
1485e84258L51254L50339n47563J53689N03120Q92r89601p81576K85206J145353
$$ -584258 -233004 117335 -430228 -276539 226581 227473 -762128 -1543704 -1258498 -113145
1475a13145k71409J296713j019225p95000K47294o10059L51618M02442j47979
$$ -113145 -384554 912159 -107066 -902066 -654772 -1264831 -913213 -510771 -658750
1466f58750N06574Q20109k64035n77109j481364q227J860498L31563p76524K00314
$$ -658750 -152176 667933 403898 -173211 -1654575 -1662802 197696 529259 -247265 -46951
1456d6951P0538N92111j264127O77715n73307j933026J500143R02738K80570r38288
$$ -46951 23587 615698 -648429 29286 -544021 -2477047 -976904 -74166 206404 -731884
1446g31884P97620K45801l98647L81215l87527K80107l82958j53738O49540j015137
$$ -731884 65736 311537 -87110 294105 -93422 186685 -196273 -350011 299529 -715608
1436g15608M15913j010430j80651J0965P46271J45567O47653J395019r10522k69005
$$ -715608 -299695 -1310125 -1490776 -1479811 -733540 -587973 59680 1454699 544177 275172
1426B75172n49636j043630J303903q54396k49454Q81678J487800n0588n07429
$$ 275172 -274464 -1318094 -14191 -868587 -1118041 -236363 1251437 1200849 693420
1417F93420J45649j098716n20881M66480L36091J261446q30785q23534Q9051j14548
$$ 693420 839069 -259647 -780528 -314048 22043 1283489 452704 -370830 -281779 -396327
1407c96327R80663l94421q06272l39765j00906l21895N83115J021668L99635j056572
$$ -396327 584336 189915 -616357 -956122 -1057028 -1378923 -795808 225860 625495 -431077
1397d31077K42382J033182j027239J075335o90674p39422o316j464011J006006
$$ -431077 -188695 844487 -182752 892583 201909 -537513 -543829 -2007840 -1001834
1388a001834n9692L65302L81712K09047o25930O7870J183740L84172o90021k06146
$$ -1001834 -1061526 -696224 -314512 -105465 -731395 -663525 520215 904387 214366 8220
1378H220Q28766m63551r01553L74972O28154K23017m51870M3452m36652j89493
$$ 8220 836986 373435 -528118 -153146 475008 698025 246155 289607 -147045 -336538
1368c36538L78466j54406r07806J473840q23838L35842j222019M24773M34940
$$ -336538 41928 -112478 -1020284 453556 -370282 -34440 -1256459 -831686 -396746
1359c96746N70979Q54755o48410O79252o33140J9391j07155j786771j80284J154626
$$ -396746 174233 1028988 380578 1059830 426690 446081 338926 -1447845 -1628129 -473503
1349d73503r0083L93999p84856J10682K25350J025763n15479R753Q17065p09318
$$ -473503 -563586 -169587 -954443 -843761 -618411 407352 -108127 -98374 718691 9373
1339I373k81562l54536m84940P81227L16496l25717Q12k62036L81075O3314k32949
$$ 9373 -272189 -626725 -1111665 -330438 -13942 -339659 -338847 -600883 -219808 -156494 -389443
1328c89443O13448r54385M32704P01223R62113k82552p7288l3654j089636j03974
$$ -389443 224005 -730380 -297676 403547 1365660 1083108 1005820 972166 -117470 -221444
1318b21444j218894J102411j70680n22043M25314L58043J98886o45262K82599
$$ -221444 -1440338 -337927 -508607 -1030650 -605336 -247293 -48407 -693669 -411070
1309d11070r05779l78199P87973L06702O16465j084239j835437K288122P22449
$$ -411070 -1316849 -1695048 -907075 -600373 16092 -1068147 -2903584 -615462 106987
1300A06987n94832m3834m23251M61062M87216r06130o19675M26169O82132j186969
$$ 106987 -487845 -531679 -954930 -493868 -6652 -912782 -1532457 -1106288 -424156 -1611125
1290a611125J624370p59494L30996n81595J60041L03217l87311j236035P83467
$$ -1611125 13245 -746249 -415253 -996848 -836807 -533590 -920901 -2156936 -1373469
1281a373469R70493O1830j70734m3832K84515j094868J031212J42013r9726o98516
$$ -1373469 -402976 -341146 -511880 -555712 -271197 -1366065 -334853 -192840 -292566 -991082
1271i91082Q35017M38234N37525n33765l47619j593806M01356R46462K07175o68321
$$ -991082 -156065 282169 819694 285929 -61690 -1655496 -1254140 -307678 -100503 -768824
1261g68824o85983J316382R40890j326361O46973p1061j228253J989775l24632
$$ -768824 -1454807 -138425 802465 -523896 123077 52016 -1176237 813538 488906
1252D88906k27639J066547j46351J26773p29358l12074j07950J02774l54056j22787
$$ 488906 261267 1327814 1181463 1308236 578878 266804 158854 261628 -92428 -215215
1242b15215j75055j190719J332270N68916R71540k19517j456355O82560j82709
$$ -215215 -390270 -1580989 -248719 320197 1291737 1072220 -384135 298425 115716
1233A15716j75417m15139J045928j39118m59021j41995J234731j75637j362702
$$ 115716 -59701 -474840 571088 431970 -27051 -169046 1065685 890048 -472654
1224d72654O9666L5721Q11123j077425L38628m28745q7244J486751j144135R54253
$$ -472654 -402988 -367267 443856 -633569 -294941 -723686 -810930 675821 -468314 485939
1214D85939j024274n11747J396348J72323q43220j022435K07839O60853j71786
$$ 485939 -538335 -1050082 346266 518589 -324631 -1347066 -1139227 -478374 -650160
1205f50160K68724q95708J217451L22j021886P80449l06017p54290P33753J174936
$$ -650160 -381436 -1277144 -59693 -59371 -1081257 -300808 -606825 -1361115 -627362 547574
1195E47574m13577j063663r47680J369362J071579r13786L95458p22191l1910
$$ 547574 133997 -929666 -1877346 -507984 563595 -350191 45267 -676924 -708834
1186g08834M80643r6110P92680K9774p09126M99973j554765J077573K90202j204948
$$ -708834 -228191 -324301 468379 498153 -210973 289000 -1265765 -188192 102010 -1102938
1176a102938J312040Q33644k16777l26437p97038j046716O83835j66729J27750
$$ -1102938 209102 1042746 825969 499532 -297506 -1344222 -660387 -827116 -699366
1167f99366M02628M5196M73492m80331m99481J289665m22839j358500M73449j003081
$$ -699366 -296738 -251542 221950 -258381 -757862 531803 108964 -1249536 -776087 -1779168
1157a779168L33866K474579m52917j23315j098399J06830L93422K81931J61017
$$ -1779168 -1445302 1029277 576360 453045 -645354 -538524 -145102 136829 297846
1148B97846m5830j88885n01806N10866L12172Q8377J77828n11087L2042k42604
$$ 297846 252016 63131 -438675 72191 384363 472740 650568 139481 171523 -71081
1138g1081j98480J262803l64865p12119K9825Q8391J00181j102898o95429m37692
$$ -71081 -269561 993242 628377 -83742 -53917 34474 134655 -968243 -1663672 -2101364
1128b101364K501707J61909j26183J48963q31834J761194j42538j903050q7740
$$ -2101364 400343 562252 436069 585032 -246802 1514392 1371854 -531196 -618936
1119f18936k060J285888L28766r70157j54842Q87443L25810j9960j97642r28224
$$ -618936 -620996 664892 993658 23501 -131341 756102 1081912 1061952 864310 -63914
1109f3914p07375m22311M36588J22179J30972N63029l08051J0297R21529j069401
$$ -63914 -771289 -1193600 -757012 -634833 -503861 59168 -248883 -238586 682943 -386458
1099c86458j57102J110585n78296N11301L96467q5882q579j301796J6460J443936
$$ -386458 -543560 567025 -11271 500030 896497 810615 802036 -499760 -483300 960636
1089I60636M27240l3680j107162k17953j054918o16631O66082L22652M25414J239454
$$ 960636 1387876 1354196 247034 29081 -1025837 -1642468 -976386 -653734 -228320 1011134
1079A011134J44395n34907K2396M28995o91408q97192L40127K39449j316428J123311
$$ 1011134 1155529 620622 643018 1072013 380605 -516587 -176460 62989 -1253439 -130128
1069a30128o22828k7333J324540l29932K43328m41528J80609r41449O31027P74589
$$ -130128 -752956 -780289 544251 214319 457647 16119 196728 -744721 -113694 660895
1059F60895m32839K87978M19156j90076k48765n85301l15881j566977K54434J571285
$$ 660895 228056 516034 935190 745114 496349 -88952 -404833 -1971810 -1717376 -146091
1049a46091o9986R16875r14609M7416j737875l18603O05457J963714P48096q40422
$$ -146091 -216077 700798 -213811 -166395 -1904270 -2222873 -1617416 346298 1094394 253972
1039B53972k58678j270317K92888J36936J462076o67175l01100M91122l34178
$$ 253972 -4706 -1275023 -982135 -845199 616877 -50298 -351398 139724 -194454
1030a94454l48495P84670r44237N04873K08292K41986o90139N29629n07601M57894
$$ -194454 -542949 241721 -702516 -197643 10649 252635 -437504 92125 -415476 42418
1020D2418K11364r56924M10549m67631p5712J506088j193978P36342j09053O16473
$$ 42418 253782 -703142 -292593 -760224 -835936 670152 -523826 212516 103463 719936
1010G19936m78827j553596O94453J155384Q3341l93447K67977m51635j66090N85339
$$ 719936 241109 -1312487 -618034 537350 620691 227244 495221 43586 -122504 462835
1000D62835k081577N07929k50979j09069J769819N96125p2623j329758J328067
$$ 462835 -1618742 -1110813 -1361792 -1470861 298958 895083 822460 -507298 820769
991H20769j51077k86076O13541L53633j170943M22829R51178l86275j187996N36883
$$ 820769 669692 383616 997157 1350790 179847 602676 1553854 1167579 -20417 516466
981E16466l38686p49M61548r15461K63728Q60707j008462J044663k0708j263680
$$ 516466 177780 177031 638579 -276882 -13154 847553 -160909 883754 863046 -400634
971d00634N77304J084203r85095p77604L37296R68804q07906L53521K95121n58519
$$ -400634 176670 1260873 275778 -501826 -164530 804274 -3632 349889 645010 86491
961H6491k0219l43933k02504N05239n84175k35465J376239J96330J91829j128023
$$ 86491 66272 -277661 -480165 25074 -559101 -794566 581673 778003 969832 -158191
951a58191q43440R96858k24372N52118J045575r73547l90639J03333L05364J65899
$$ -158191 -1001631 -4773 -229145 322973 1368548 395001 4362 107695 413059 578958
941E78958p02020R2170o40769q64011J383017j70301M06821J265477j194920j313359
$$ 578958 -123062 -30892 -671661 -1535672 -152655 -322956 83865 1349342 154422 -1158937
931a158937J66912J342498J34339m36144J142991o72160j395234Q89780Q53866
$$ -1158937 -992025 350473 484812 48668 1191659 519499 -875735 14045 867911
922H67911m53783N17159j192437n25943l24469J064047p20679l69798K111347
$$ 867911 414128 931287 -261150 -787093 -1111562 -47515 -768194 -1137992 973355
913I73355K86068m20325j703489N98533O04970Q27576j193510p70107J237892
$$ 973355 1259423 839098 -864391 -265858 339112 1166688 -26822 -796929 440963
904D40963O899n69887P60080L6947j425349P75041J058920o70615n33485j38726
$$ 440963 447862 -122025 638055 675002 -750347 24694 1083614 412999 -120486 -259212
894b59212r0824N39533J61364m15811N31165L38992n7211j92757l00611K63209
$$ -259212 -350036 189497 350861 -64950 466215 805207 747996 555239 254628 517837
884E17837j70212K13691j038942M88409r80014K83985k77751J98254M70290l66337
$$ 517837 347625 561316 -477626 10783 -969231 -685246 -962997 -764743 -294453 -660790
874f60790N95926m72230m91901Q04354L85105r32886M4258Q19900R09661M45910
$$ -660790 -64864 -537094 -1028995 -224641 160464 -772422 -728164 91736 1001397 1447307
864A447307m7796q19585J230591j077294j801704O34344J284491j085321N48087
$$ 1447307 1399511 579926 1810517 733223 -1068481 -434137 850354 -234967 313120
855C13120m86267J001050j38154j002119p22247k86750J050925M76480O05194
$$ 313120 -173147 827903 689749 -312370 -1034617 -1321367 -270442 206038 811232
846H11232j661710O32107o25642k06602L87097k93481R38457J354413r61362O75239
$$ 811232 -850478 -218371 -844013 -1050615 -663518 -956999 -18542 1335871 374509 1049748
836A049748j667628q97144N63089k21239J299623o73232L78039L64173J165184
$$ 1049748 -617880 -1515024 -951935 -1173174 126449 -546783 -168744 195429 1360613
827A360613j124468q40920J203564k11798l03730O58008j239794L85178P66095
$$ 1360613 236145 -604775 598789 386991 83261 741269 -498525 -113347 652748
818F52748L23862j549464o86464J051210L29489L46879q68556J76573m49408J301913
$$ 652748 976610 -572854 -1259318 -208108 121381 468260 -400296 -223723 -673131 628782
808F28782J90581j99189o68778M83058N22730j069400n49480O29514m07151K85565
$$ 628782 819363 620174 -48604 434454 957184 -112216 -661696 -32182 -439333 -153768
798a53768M90229n20220J34001o35095P66702o44829k15466K02366J471064r60834
$$ -153768 336461 -183759 -49758 -684853 81849 -562980 -778446 -576080 894984 -65850
788f5850J084718p17675j15296k32778j071329J02091m66142J377677P75012J11183
$$ -65850 1018868 301193 185897 -46881 -1118210 -1016119 -1482261 -104584 670428 781611
778G81611k52993j375578O91152O91684o11699Q80848M6522l46312J78023k19431
$$ 781611 528618 -846960 -155808 535876 -75823 805025 851547 505235 683258 463827
768D63827o51308R89162J46609j460782L71275M21275j138521J16948K07915L21538
$$ 463827 -187481 801681 948290 -512492 -141217 280058 -858463 -741515 -533600 -212062
758b12062N60631q63163K77458J613359k69986j036924q84447J071952J58420
$$ -212062 348569 -514594 -237136 1376223 1106237 69313 -815134 256818 415238
749D15238L71096l32099p00927j46113J298743n64828m81099M34991m21363l61897
$$ 415238 786334 454235 -246692 -392805 905938 341110 -139989 295002 -126361 -488258
739d88258J23907J139116m65008L1610J343165o87499j145609l35249J188548
$$ -488258 -364351 774765 309757 341367 1684532 997033 -148576 -483825 704723
730G04723o94329N49721M90013m53412M92806Q13652p08662k87326j225979J017269
$$ 704723 10394 560115 1050128 596716 1089522 1903174 1194512 907186 -318793 698476
720F98476N23314p78733o76302j75053l95468K63303N3392M70328K92771q87450
$$ 698476 1221790 443057 -233245 -408298 -803766 -540463 -487071 -16743 276028 -611422
710f11422K62796j01942K77093k16899N41436L12396P72849k342106O10985L84808
$$ -611422 -348626 -450568 -173475 -390374 151062 463458 1236307 -1105799 -494814 -110006
700a10006k80345N43329o0925o24347J080780L74181j822883O24464k46182J069598
$$ -110006 -390351 152978 92053 -532294 548486 922667 -900216 -275752 -521934 547664
690E47664J47831r90968N34216j07901J619876j199272o82486Q30989j074498
$$ 547664 695495 -295473 238743 130842 1750718 551446 -131040 699949 -374549
681c74549o02126P55787n41224R08400M33157p34096j04688p88059P56436n71427
$$ -374549 -976675 -220888 -762112 146288 579445 -154651 -259339 -1047398 -290962 -862389
671h62389q629N97492M55317Q01465P10482Q9973j313486r99542J194257L33000
$$ -862389 -871018 -273526 181791 983256 1693738 1783711 470225 -529317 664940 997940
661I97940j16952p28751j081745J36397P92549k77796L93197M65390m55136R82603
$$ 997940 880988 152237 -929508 -793111 -562 -278358 114839 580229 125093 1107696
651A107696o32381m93753N13727L35176j057249R22400j20977k34851q29900k23154
$$ 1107696 475315 -18438 495289 830465 -226784 695616 574639 339788 -490112 -713266
641g13266Q16796j290545L38852N80397L38484q8411K40719n54988m94886J79411
$$ -713266 103530 -1187015 -848163 -267766 70718 -17693 223026 -331962 -826848 -647437
631f47437K28928M71804K96073o22684P71802M1537q21124k92554l38148J160325
$$ -647437 -418509 53295 349368 -273316 498486 540023 -281101 -573655 -911803 248522
621B48522J023547P84339p37264j07686j211000J55309p9103o61772j87622R37264
$$ 248522 1272069 2056408 1319144 1211458 458 155767 76664 -585108 -772730 164534
611A64534N39657J7012P40755m12094q17133L38301o59069j39994N58438j345
$$ 164534 704191 721203 1461958 1049864 232731 571032 -88037 -228031 330407 329062
601C29062N92213r57083J102744p40698m62847J085777K63079j209102j002703
$$ 329062 921275 -35808 1066936 326238 -136609 949168 1212247 3145 -999558
592i99558L416M10143L97213R05258l16301j033453M29206J8448K11108m37848
$$ -999558 -996142 -585999 -188786 716472 400171 -633282 -204076 -185628 25480 -412368
582d12368o23686J230797k24064q30370o2376O53376J09114J20077J358678m54648
$$ -412368 -1036054 194743 -29321 -859691 -922067 -268691 -159577 -39500 1319178 864530
572H64530r13999M52622n78865Q6339J183957j6199j481366n66215J577421p16491
$$ 864530 -49469 403153 -175712 -89373 1094584 1078385 -402981 -969196 608225 -108266
562a08266j02783J262556j06665N86937q80258l10838O1414q99045J102771m47662
$$ -108266 -211049 1051507 944842 1531779 651521 340683 402097 -496948 605823 158161
552A58161l23204N34297j98623n10456m76863O61043J080212q54533O28016o36791
$$ 158161 -165043 369254 170631 -339825 -816688 -155645 924567 70034 698050 61259
542F1259P05384n46337q54549R77474n27450J349391J084404r3974j185725j044668
$$ 61259 766643 220306 -634243 343231 -184219 1165172 2249576 2155602 969877 -74791
532g4791k93426L20727j68171j052080Q86517k23071N07098j82669N33260Q61334
$$ -74791 -368217 -47490 -215661 -1267741 -381224 -604295 -97197 -279866 253394 1114728
522A114728q57394p4578K00213O31152n31023p80270K86333J064296m75647m59568
$$ 1114728 257334 182756 382969 1014121 483098 -297172 -10839 1053457 577810 118242
512A18242N9919k04609J750365N25441l62196k049725j305690J133167M60224
$$ 118242 178161 -26448 1723917 2249358 1887162 -162563 -1468253 -335086 125138
503A25138L75172r01777o59060M40074J470358J58463k14835r89450O71758M27018
$$ 125138 500310 -401467 -1060527 -620453 849905 1008368 793533 -195917 475841 902859
493I02859q39796q71663P48447k34874P71281j97156O52458j734431m35114Q27704
$$ 902859 63063 -808600 -60153 -295027 476254 279098 931556 -802875 -1237989 -410285
483d10285M32902Q23393o13098P32668l34925L55667q188p91147M75140n69562
$$ -410285 22617 846010 232912 965580 630655 986322 978134 186987 662127 92565
473I2565l16287N42950j922334L19491O26890p73649K41699J24198P29999J76596
$$ 92565 -223722 319228 -1603106 -1283615 -656725 -1430374 -1188675 -1064477 -334478 -157882
463a57882m31337Q49602P61867p08225k86825N55991R33204j29596j278447k03098
$$ -157882 -589219 260383 1022250 314025 27200 583191 1516395 1386799 108352 -94746
453i4746j91063n77341k72134J216296R55498j429921n985J706328l30594L41913
$$ -94746 -285809 -863150 -1135284 81012 1036510 -393411 -399396 1306932 976338 1318251
443A318251j388250j20803J52602m94438J693739l71562n89988J07548l23366
$$ 1318251 -69999 -190802 -38200 -532638 1161101 789539 199551 307099 -16267
434a6267l04720J595034r76764K67314j62136K18199O6452l46086l88667o19612
$$ -16267 -320987 1274047 297283 564597 402461 620660 687112 341026 -47641 -667253
424f67253J432385l31803N03523J89283j399721p35303J705949m28546m53271
$$ -667253 765132 433329 936852 1126135 -273586 -1008889 697060 268514 -184757
415a84757j187535M24682m91250J465006K38875l94498j63791L66079J415865
$$ -184757 -1372292 -947610 -1438860 26146 265021 -129477 -293268 72811 1488676
406A488676j866301K22023l64752p9574j18232L33561J710437j69225j479738
$$ 1488676 -377625 -155602 -520354 -599928 -718160 -384599 1325838 1156613 -323125
397c23125n00117l28092J440161m21097Q17546P14249n80441p36774j389053J712452
$$ -323125 -823242 -1151334 288827 -132270 685276 1399525 819084 82310 -1306743 405709
387D05709J599027k011451J06786q00486j127568J989953j61252J011800m86071
$$ 405709 2004736 -6715 100071 -700415 -1827983 161970 718 1012518 526447
378E26447k34841Q7413r14109j035982O30017J332144N94487j781578n07953R26596
$$ 526447 291606 379019 -535090 -1571072 -941055 391089 985576 -796002 -1303955 -377359
368c77359Q31292m71363K16617r8650o76672K57079J36924m06935j2244r85135
$$ -377359 453933 -17430 199187 100537 -576135 -319056 -182132 -589067 -601311 -1586446
358a586446N67825O29094K60251K13449L59709Q1679k62801q33384o0581M526
$$ -1586446 -1018621 -389527 -129276 84173 443882 525561 262760 -570624 -631205 -626679
348f26679K06385k90979N99843p45859M95791P63863m64839K13754q60004l77000
$$ -626679 -420294 -711273 -111430 -857289 -361498 402365 -62474 151280 -708724 -1085724
338a085724J163358L81894L4597j04860j318393P95770P31840l1327J16907L62824
$$ -1085724 77634 459528 494125 389265 -929128 -133358 598482 567155 684062 1046886
328A046886o27495L10052p81215O6640r67307Q01236k83475l00666n40227O97385
$$ 1046886 419391 729443 -51772 14868 -952439 -151203 -434678 -735344 -1275571 -578186
318e78186j16449r1823J083798J634116j578536l12118q49544N21931J016079
$$ -578186 -694635 -786458 297340 1931456 352920 40802 -808742 -286811 729268
309G29268K05945m67362n27145L9244R20429p66599q5438j15025M00667J67242
$$ 729268 935213 467851 -59294 -20050 900379 133780 48342 -66683 333984 501226
299E01226l44299J98278o1526o22561o62211M91338M01299J24550p16519J186018
$$ 501226 156927 355205 293679 -328882 -991093 -499755 -98456 26094 -690425 495593
289D95593r0366K94435M65725j63133p79936j189134r6609L15660N55139Q45761
$$ 495593 405227 699662 1165387 1002254 222318 -966816 -1063425 -747765 -192626 653135
279F53135o64945N40140l80426O08805q89394p98014N05567k74948r75925J122984
$$ 653135 -11810 528330 147904 756709 -132685 -930699 -425132 -700080 -1676005 -553021
269e53021p65761N08910J12357J36606O78012N75673L99408j368946R42252j136594
$$ -553021 -1318782 -809872 -697515 -560909 117103 692776 1092184 -276762 665490 -471104
259d71104n74824J230803M62154n80462l0374o75142J33843Q58280P2676k98757
$$ -471104 -1045928 184875 647029 66567 36193 -638949 -505106 353174 425850 127093
249A27093n92166J204347K32357p12418o84721L77590Q0072o95908N71729p07420
$$ 127093 -465073 739274 971631 259213 -425508 -47918 32154 -663754 -92025 -799445
239g99445J479091P2802l80171Q34265p14277O90422N122j010136N61692j124309
$$ -799445 679646 752448 372277 1206542 492265 1182687 1187809 177673 739365 -384944
229c84944n16499K74381Q0965J014754L56097J150j024775k100p09554N28718
$$ -384944 -901443 -627062 -546097 468657 824754 825904 -198871 -200971 -910525 -381807
219c81807K6585j0723p14298L22433M72485Q42553l51833j76474j483095J180327
$$ -381807 -355222 -365945 -1080243 -757810 -285325 557228 205395 28921 -1454174 -273847
209b73847k03293L61736M41855p09269O14379O07853j80510j03717l89948j906638
$$ -273847 -477140 -115404 326451 -382818 231561 839414 658904 555187 165239 -1741399
199a741399N90989j13991j38077J422775j71662M08658r821q35707Q85461n87575
$$ -1741399 -1150410 -1264401 -1402478 20297 -151365 257293 247472 -588235 297226 -290349
189b90349j04883R54473j30041j154959k47148K66547J242013q98065p26319Q56091
$$ -290349 -395232 559241 429200 -725759 -972907 -706360 535653 -362412 -1088731 -232640
179b32640J359247l65762j409923q81458J621321j17010m72687P32545Q96719
$$ -232640 1126607 760845 -649078 -1530536 90785 -26225 -498912 233633 1130352
170A130352j256807p11012l93522M5133O09527L95271j77352j79674J022257l97887
$$ 1130352 -126455 -837467 -1230989 -1185856 -576329 -181058 -358410 -538084 484173 86286
160H6286J39291K43169l06510R21377M8572j153553j83139P38K27989n16895M458
$$ 86286 225577 468746 162236 1083613 1132185 -21368 -204507 -203769 24220 -492675 -488217
149d88217O60772m84297j31169M0560J275637j99143j879677K25895J575256R79609
$$ -488217 172555 -311742 -442911 -402351 873286 674143 -1205534 -979639 595617 1575226
139A575226j507854R2828J39803j65930M86202q15427n01509L16152J230375p00361
$$ 1575226 67372 160200 300003 134073 620275 -195152 -696661 -380509 849866 149505
129A49505O9055o63453j24114P66613m11861p46982M4511J042110k03682M54596
$$ 149505 218560 -444893 -569007 197606 -214255 -961237 -916726 125384 -78298 376298
119C76298R6494o13666k80440J41651q2296O96147K18602j267737P34301K9610
$$ 376298 472792 -140874 -421314 -279663 -361959 334188 552790 -714947 19354 48964
109D8964J275797j391098j15465R70837p35940l70529p08915R30724J43863J48671
$$ 48964 1324761 -66337 -181802 789035 53095 -317434 -1026349 -95625 48238 196909
99A96909r6019n07813m70307J69612k03069M408P55966N61958r9151n21417O10679
$$ 196909 100890 -406923 -877230 -707618 -910687 -906279 -150313 411645 312494 -208923 401756
88D01756k35611K77728j38044K25079N32463j412863m93759J076506L05932n09277
$$ 401756 166145 443873 305829 530908 1063371 -349492 -843251 233255 539187 29910
78B9910N40272j131140j70962K03640J005194n64324r2568N11406L67137n70519
$$ 29910 570182 -560958 -731920 -528280 476914 -87410 -179978 331428 698565 128046
68A28046l59744l94561J97899K12316r4090P65847j63327m81282j216683M93129
$$ 128046 -231698 -626259 -428360 -216044 -310134 455713 292386 -188896 -1405579 -912450
58i12450J139825k3344o21252N35461k66191k47615L89103n12550N08142k23462
$$ -912450 227375 204031 -417221 118240 -147951 -395566 -6463 -519013 -10871 -234333
48b34333J68670R7106o62233Q47490J61847m13774j91069L77803l68669J51311
$$ -234333 -65663 31443 -630790 216700 378547 -35227 -226296 151507 -217162 -65851
38f5851M04676M12027j36280q62214q1661K08195K04851N5700k90227k84398l2700
$$ -65851 338825 750852 614572 -247642 -329303 -121108 83743 139443 -150784 -435182 -467882
27d67882R43154P72280o25685q98172k37778l58894Q13673Q30916r44223p97012
$$ -467882 475272 1247552 621867 -276305 -514083 -872977 -59304 771612 -172611 -969623
17i69623K78798P98545J73253N87156o3681k78108o93911n44518l4238k67047
$$ -969623 -690825 107720 280973 868129 804448 526340 -167571 -712089 -746327 -1013374
7a013374M35902R79473j03223p3273j087376M71684N55190
$$ -1013374 -577472 402001 298778 225505 -861871 -390187 165003
0A65003
$$ 165003
$$ Imaginary data points
##PAGE= N=2
##DATA TABLE= (X++(I..I)), XYDATA
16383c049166L68844J62894j31088k53051k71596Q44122q54160O2530j82811K05612
$$ -3049166 -2680322 -2517428 -2648516 -2901567 -3173163 -2329041 -3183201 -3120671 -3303482 -3097870
16373c097870o62201P86358R28587r3393p84857l39477k37668M77339K37579m52521
$$ -3097870 -3760071 -2973713 -2045126 -2138519 -2923376 -3262853 -3500521 -3023182 -2785603 -3238124
16363c238124m820L82962K44007J16330N41486o48787K26260o22119N86290J44242
$$ -3238124 -3242944 -2859982 -2615975 -2499645 -1958159 -2606946 -2380686 -3002805 -2416515 -2272273
16353b272273l4924J62257m0752k89372p27130J84045L69783m1924J54991P81567
$$ -2272273 -2307197 -2144940 -2185692 -2475064 -3202194 -3018149 -2648366 -2690290 -2535299 -1753732
16343a753732m75982K78754q6220N15764J44591o85409L02671J481540p36157
$$ -1753732 -2229714 -1950960 -2037180 -1521416 -1376825 -2062234 -1759563 -278023 -1014180
16334a014180j06566j4069m02617p2035K7903K57143L77881l06536n12740N61374
$$ -1014180 -1120746 -1134815 -1537432 -1609467 -1581564 -1324421 -946540 -1253076 -1765816 -1204442
16324a204442J09416Q6194q44288j54599N75540l8940M95112J65728M83697p54109
$$ -1204442 -1095026 -1008832 -1853120 -2007719 -1432179 -1471119 -976007 -810279 -326582 -1080691
16314a080691R8562k09565P59587N22524r59891n26029N697N44091R1448N86456
$$ -1080691 -982129 -1191694 -432107 90417 -869474 -1395503 -1389806 -845715 -754267 -167811
16304a67811L50464n99682k05759j10696j26772l91191L03048J100367l22965
$$ -167811 182653 -417029 -622788 -733484 -860256 -1251447 -948399 151968 -170997
16295a70997M25311L98194q94661k33876O37424l08934J66028N6152N47053P42095
$$ -170997 254314 652508 -242153 -476029 161395 -147539 18489 74641 621694 1363789
16285A363789r57805o73389J65577o64047J619661O57056o35258j94854p4769
$$ 1363789 405984 -267405 -101828 -765875 853786 1510842 875584 680730 605961
16276F05961m75391J297843k16103j006387M0886J77566n18201K27328K60002
$$ 605961 130570 1428413 1212310 205923 246809 424375 -93826 133502 393504
16267C93504M76446L67218j23802O64026j38289L05238m80439k41438j047451
$$ 393504 869950 1237168 1113366 1777392 1639103 1944341 1463902 1222464 175013
16258A75013J230684L30397m53177n9963k00586m55952O8213j55257P38543L4825
$$ 175013 1405697 1736094 1282917 1222954 1022368 566416 634629 479372 1217915 1252740
16248A252740L77774m92416m7054j19020j35997K36218L58104k8425l80953O27475
$$ 1252740 1630514 1138098 1091044 972024 836027 1072245 1430349 1401924 1020971 1648446
16238A648446l54258P94171n58508O47700K35884M51829p81070j248241P90355
$$ 1648446 1294188 2088359 1529851 2177551 2413435 2865264 2084194 835953 1626308
16229A626308J65727P10966K3477j304884P99944Q51065n84810k36582N89009
$$ 1626308 1792035 2503001 2526478 1221594 2021538 2872603 2287793 2051211 2640220
16220B640220j292331l52630L96302N87105p15358O75676k94432J82986J17776
$$ 2640220 1347889 995259 1391561 1978666 1263308 1938984 1644552 1827538 1945314
16211A945314M17185M19221j43982L10692m35031r63901N09692p52979M101J414487
$$ 1945314 2362499 2781720 2637738 2948430 2513399 1549498 2059190 1306211 1310312 2724799
16201B724799k49669K32758L10547q35210j67425J5595Q9368j142205N47124j04097
$$ 2724799 2475130 2707888 3018435 2183225 2015800 2031395 2120763 978558 1525682 1421585
16191A421585O63796J74070k67360J5516l44852o54556P36053k94281J94106L82729
$$ 1421585 2085381 2259451 1992091 2007607 1662755 1008199 1744252 1449971 1644077 2026806
16181B026806M68934l94614N92126P48219p60823p34986P4267L57406k02206O9573
$$ 2026806 2495740 2101126 2693252 3441471 2680648 1945662 2019929 2377335 2175129 2244702
16171B244702N74403N43532j201049R24679J22158r65274j66319P66892l33796
$$ 2244702 2819105 3362637 2161588 3086267 3208425 2243151 2076832 2843724 2509928
16162B509928O66173j90470r38893n59977Q99613K55799k90129L93921R90344
$$ 2509928 3176101 2985631 2046738 1486761 2386374 2642173 2352044 2745965 3736309
16153C736309k42467o90712n22206R75767K51796J561378r45455k944n54581o26868
$$ 3736309 3493842 2803130 2280924 3256691 3508487 5069865 4124410 4121466 3566885 2940017
16143B940017m74213M30532m97776K77000n58473P62047K95068o94272l08763
$$ 2940017 2465804 2896336 2398560 2675560 2117087 2879134 3174202 2479930 2171167
16134B171167O43279m54530L2276l5911m98923J399718J702377j345947J02237
$$ 2171167 2814446 2359916 2392192 2356281 1857358 3257076 4959453 3613506 3715743
16125C715743j520513o29687K57606M66445L64076J55602P79337m31194K53558
$$ 3715743 2195230 1565543 1823149 2289594 2653670 2809272 3588609 3157415 3410973
16116C410973J50952J43871j829675M88362j099908K025348l21892r15726K63762
$$ 3410973 3561925 3705796 1876121 2364483 1264575 3289923 2968031 2052305 2316067
16107B316067J182100j2419p62491K21811m16963M81698o93476L47460q95118
$$ 2316067 3498167 3485748 2723257 2945068 2528105 3009803 2316327 2663787 1768669
16098A768669O56078L70847N39667k34758k39844K38040k96545m71682j10659
$$ 1768669 2424747 2795594 3335261 3100503 2860659 3098699 2802154 2330472 2219813
16089B219813J439770m27814p45010J30800J24806j95905N61827o59833k4953
$$ 2219813 3659583 3231769 2486759 2617559 2742365 2546460 3108287 2448454 2423501
16080B423501R95223K51202J01190m45997k82800O99179M10990O17548r64117
$$ 2423501 3418724 3669926 3771116 3325119 3042319 3741498 4152488 4770036 3805919
16071C805919p13437j089475k81584J510210m51805J19746o19983J70447O35059
$$ 3805919 3092482 2003007 1721423 3231633 2779828 2899574 2279591 2450038 3085097
16062C085097n94739Q84100r20n21120n26698M42249m3662R56101j58513o39196
$$ 3085097 2490358 3374458 3373538 2852418 2325720 2767969 2724307 3680408 3521895 2882699
16052B882699P36556k04761l95993p38542N27979K26426j88802M62026m35864
$$ 2882699 3619255 3414494 3018501 2279959 2807938 3034364 2845562 3307588 2871724
16043B871724J53980m69915J70065j37108Q5464J258219N004o59089J346386k52784
$$ 2871724 3025704 2555789 2725854 2588746 2674210 3932429 3937433 3278344 4624730 4371946
16033D371946o83743K61531m752j845899N21022L64256n92334R9772O01090J99764
$$ 4371946 3688203 3949734 3944982 2099083 2620105 2984361 2392027 2491799 3092889 3292653
16023C292653j66456O72945j81009r11472o98516l5822K03086m93349l20965R32331
$$ 3292653 3126197 3799142 3618133 2706661 2008145 1972323 2175409 1682060 1361095 2293426
16013B293426J17860j57072M61161r20923Q16905R53498O2678o33711Q74919q26444
$$ 2293426 2411286 2254214 2715375 1794452 2611357 3564855 3627533 2993822 3868741 3042297
16003C042297n88557J204350J58192j080893J12691m622J28418N09784q4529l72881
$$ 3042297 2453740 3658090 3816282 2735389 2848080 2843458 2971876 3481660 3397131 3024250
15993C024250p97148P03857J79358J25397o39488J154110k43082r77785n54871
$$ 3024250 2227102 2930959 3110317 3235714 2596226 3750336 3507254 2529469 1974598
15984A974598k8183q64125O38684J648791p19303j42734k03244J05033J26107
$$ 1974598 1946415 1082290 1720974 3369765 2650462 2507728 2304484 2409517 2535624
15975B535624K51696N59599j095451P65931j301998P24115J05750Q47396k06426
$$ 2535624 2787320 3346919 2251468 3017399 1715401 2439516 2545266 3392662 3186236
15966C186236K11093l2250n92138M9718o73810Q44147L81577K39076J193160r47623
$$ 3186236 3397329 3365079 2772941 2822659 2148849 2992996 3374573 3613649 4806809 3859186
15956C859186M64125L09267j520145j283687J494665j2273m57220M76847j574165
$$ 3859186 4323311 4632578 3112433 1828746 3323411 3311138 2853918 3330765 1756600
15947A756600M61512L60723K89423N47193n8940j430473K11315P91583r73440
$$ 1756600 2218112 2578835 2868258 3415451 3356511 1926038 2137353 2928936 1955496
15938A955496j788821J675887J122196l83505j93610o97127J13401J185119M89583
$$ 1955496 166675 1842562 2964758 2581253 2387643 1690516 1803917 2989036 3478619
15929C478619p9535j011478J783567l00470o12235m0749n753k02489m20784k28427
$$ 3478619 3399084 2387606 4171173 3870703 3258468 3217719 3211966 3009477 2588693 2360266
15919B360266N82445m09771n23832O65355j054753P43239J188884k04578L0100
$$ 2360266 2942711 2532940 2009108 2674463 1619710 2362949 3551833 3347255 3377355
15910C377355j55007J87408L07966m98039j82475J57546p91941M63667p28351
$$ 3377355 3222348 3409756 3717722 3219683 3037208 3194754 2402813 2866480 2138129
15901B138129O38163R79426l84426J134153j186434p02033N61034M84383r95648
$$ 2138129 2776292 3755718 3371292 4505445 3319011 2616978 3178012 3662395 2666747
15892B666747J09091O34518o77144K43340o46525l64742L05263K63852j53907
$$ 2666747 2775838 3410356 2733212 2976552 2330027 1965285 2270548 2534400 2380493
15883B380493l707Q37683N70342n71137P05959j42074o48755J52121o61219J31842
$$ 2380493 2376786 3214469 3784811 3213674 3919633 3777559 3128804 3280925 2619706 2751548
15873B751548K74166J20199K14669K56153j1594j36803L49455k01212L7985O55083
$$ 2751548 3025714 3145913 3360582 3616735 3605141 3468338 3817793 3616581 3654566 4309649
15863D309649l24686j011577n60811R93915o16846P53898k75894j062909O01760
$$ 4309649 3984963 2973386 2412575 3406490 2789644 3543542 3267648 2204739 2806499
15854B806499j64025j406061L34283J368549J078332j092190M79182m57213L33228
$$ 2806499 2642474 1236413 1570696 2939245 4017577 2925387 3404569 2947356 3280584
15845C280584l9947P28396l82545q43665J037743O09294p95433n21335J78139
$$ 3280584 3240637 3969033 3586488 2742823 3780566 4389860 3594427 3073092 3251231
15836C251231L64799K37590k69861K97878r26540n15066N43827j70044p17306
$$ 3251231 3616030 3853620 3583759 3881637 2955097 2440031 2983858 2813814 2096508
15827B096508N18286J349323J5984n57999j10222Q4058j218199J42885J425149
$$ 2096508 2614794 3964117 3980101 3422102 3311880 3395938 2177739 2320624 3745773
15818C745773J230642m67289j773584M33551J291716k21146n56260o22782n12419
$$ 3745773 4976415 4509126 2735542 3169093 4460809 4239663 3683403 3060621 2548202
15809B548202K01132p19666j8233L97830P39804m009L87784n2362n64632j51575
$$ 2548202 2749334 2029668 2011435 2409265 3149069 3145060 3532844 3480482 2915850 2764275
15799B764275j08052J225629J165539l65105p2293n50349l40728J33931K3011
$$ 2764275 2656223 3881852 5047391 4682286 4609993 4059644 3718916 3852847 3875858
15790C875858K01467p46150n50568j49625j180904N85759n96167J115358n17936
$$ 3875858 4077325 3331175 2780607 2630982 1450078 2035837 1439670 2555028 2037092
15781B037092k36509L14581O23796L65393p75427J97872R27109l83155L8109O48669
$$ 2037092 1800583 2115164 2738960 3104353 2328926 2526798 3453907 3070752 3108861 3757530
15771C757530o50239M1211o75526P36333P9204J23418M18781j297053M95146k82933
$$ 3757530 3107291 3148502 2472976 3209309 3288513 3411931 3830712 2533659 3028805 2745872
15761B745872K36806J90832J37277r8829M43149l02368J46985J332555j005822
$$ 2745872 2982678 3173510 3310787 3211958 3655107 3352739 3499724 4832279 3826457
15752C826457J51242L75398r80817J74358n98161j11409P76095o10893n9862M01202
$$ 3826457 3977699 4353097 3372280 3546638 2948477 2837068 3613163 3002270 2942408 3343610
15742C343610K1366o10931N68899J77059n79812K48717O00486o01550j82977o09976
$$ 3343610 3364976 2754045 3322944 3500003 2920191 3168908 3769394 3167844 2984867 2374891
15732B374891J28289J542754p04068J18654p05977R7662j76544m91873J118890
$$ 2374891 2503180 4045934 3341866 3460520 2754543 2852205 2675661 2183788 3302678
15723C302678k18651L28946k06825J96348J90265j87981l46735l54093J187365
$$ 3302678 3084027 3412973 3206148 3402496 3592761 3404780 3058045 2703952 3891317
15714C891317Q28224j118540r61229L2024L46443K00952L40880n62923j0070K09875
$$ 3891317 4719541 3601001 2639772 2671796 3018239 3219191 3560071 2997148 2987078 3196953
15704C196953m52409M2892P67040l98271P96061p43322k48111J06766j020520
$$ 3196953 2744544 2787436 3554476 3156205 3952266 3208944 2960833 3067599 2047079
15695B047079J385075r24456J162798K09068P86991l24768m41638o0978n6238
$$ 2047079 3432154 2507698 3670496 3879564 4666555 4341787 3900149 3839171 3782933
15686C782933j694708o2164K557374l47388R2726j487106J05842K96467L40536
$$ 3782933 2088225 2026061 4583435 4236047 4328773 2841667 2947509 3243976 3584512
15677C584512P56355j224410l08637K69499k75500O77630j01071K75877M58031
$$ 3584512 4340867 3116457 2807820 3077319 2801819 3479449 3378378 3654255 4112286
15668D112286m6138j588934O93407O41145k70309l35435K93470Q80607k78229
$$ 4112286 4066148 2477214 3170621 3811766 3541457 3206022 3499492 4380099 4101870
15659D101870n35207m34339J22793l6208L55383O12938p86514j55773j60263j27631
$$ 4101870 3566663 3132324 3255117 3218909 3574292 4187230 3400716 3244943 3084680 2957049
$$ [...]
##END NTUPLES=NMR SPECTRUM
##END=
