##TITLE=1H_CG-1208-X42
 CDCl3
 8 sc, 
 10.9.2024
##JCAMPDX= 6.0         $$ Bruker NMR JCAMP-DX V2.0
##DATA TYPE= NMR SPECTRUM
##DATA CLASS= NTUPLES
##ORIGIN= UXNMR, Bruker Analytische Messtechnik GmbH
##OWNER= root
$$ XWIN-NMR		Version 3.5
$$ Tue Sep 10 14:28:15 2024 Russian Standard Time (UT+4h)  she@DPX200
##.OBSERVE FREQUENCY= 200.1318
##.OBSERVE NUCLEUS= ^1H
##.ACQUISITION MODE= SIMULTANEOUS
##.ACQUISITION SCHEME= undefined
##.AVERAGES= 8
##.DIGITISER RES= 18
##SPECTROMETER/DATA SYSTEM= spect
##.PULSE SEQUENCE= zg30
##.SOLVENT NAME= CDCl3
##.SHIFT REFERENCE= (INTERNAL, CDCl3, 0, 21.0017)
##AUDIT TRAIL= $$ (NUMBER, WHEN, WHO, WHERE, WHAT)
$$ ##TITLE= Audit trail, XWIN-NMR		Version 3.5
$$ ##JCAMPDX= 5.01
$$ ##ORIGIN= Bruker BioSpin GmbH
$$ ##OWNER= she
$$ F:/spectra/data/she/nmr/H-F/1/pdata/1/auditp.txt
$$ ##AUDIT TRAIL=  $$ (NUMBER, WHEN, WHO, WHERE, WHAT)
(   1,<2024-09-10 14:27:06.29 +0400>,<she>,<DPX200>,
      <created by zg, POWCHK disabled, PULCHK disabled
       configuration hash MD5:
       00 E9 B6 7A A2 85 ED C7 34 08 36 98 17 FE 4E 26
       data hash MD5: 16K
       0A DF 38 EB B4 79 1A BE 21 B4 AF 86 CD 55 8A D1>)
(   2,<2024-09-10 14:27:08.84 +0400>,<she>,<DPX200>,
      <Start of raw data processing
       efp BC_mod = 2 LB = 0.24 FT_mod = 6 PKNL = 1 PHC0 = -25994.73 PHC1 = 13.38748 SI = 16K 
       data hash MD5: 16K
       38 21 B8 75 21 AA 0D 32 A0 CD 71 97 27 9D 92 CE>)
(   3,<2024-09-10 14:27:31.20 +0400>,<she>,<DPX200>,
      <pk PHC0 = -4.649176 PHC1 = 6 
       data hash MD5: 16K
       7A EB 2E 15 95 A3 71 29 A6 5F CD 6D BF 3B AD DF>)
(   4,<2024-09-10 14:27:34.65 +0400>,<she>,<DPX200>,
      <abs ABSG = 5 
       data hash MD5: 16K
       AF FB 22 E4 04 E9 72 2D 97 B9 99 99 4C C1 FD 21>)
$$ ##END=
$$ 
$$ hash MD5
$$ DF 2E 3E 33 A8 D9 DD 96 9E 3B 53 DC 9E DE CC F7
##$RELAX= 
##$RELAX= 
##$RELAX= 
##$RELAX= 
##$RELAX= 
##$RELAX= 
$$ Bruker specific parameters
$$ --------------------------
##$DU= <F:/spectra>
##$EXPNO= 1
##$NAME= <H-F>
##$PROCNO= 1
##$TYPE= <nmr>
##$USER= <she>
##$AMP= (0..31)
100 100 100 100 100 100 100 100 100 100 100 100 100 100 100 100 100 100 
100 100 100 100 100 100 100 100 100 100 100 100 100 100 
##$AQSEQ= 0
##$AQ_mod= 1
##$AUNM= <au_zg>
##$AUTOPOS= <>
##$BF1= 200.13
##$BF2= 200.13
##$BF3= 200.13
##$BF4= 200.13
##$BF5= 200.13
##$BF6= 200.13
##$BF7= 200.13
##$BF8= 200.13
##$BYTORDA= 1
##$CFDGTYP= 0
##$CFRGTYP= 5
##$CHEMSTR= <none>
##$CNST= (0..31)
1 1 145 1 1 1 1 1 1 1 1 1 1 1 1 1 1 1 1 1 1 1 1 1 1 1 1 1 1 1 1 1 
##$CPDPRG= <>
##$CPDPRG1= <>
##$CPDPRG2= <>
##$CPDPRG3= <>
##$CPDPRG4= <mlev>
##$CPDPRG5= <mlev>
##$CPDPRG6= <mlev>
##$CPDPRG7= <mlev>
##$CPDPRG8= <mlev>
##$CPDPRGB= <>
##$CPDPRGT= <>
##$D= (0..31)
0 1.2 0 0 0 0 0 0 0 0.06 0 0.03 0 0 0 0 0.0002 0 0 0 0 0 0 0 0 0 0 0 0 
0 0 0 
##$DATE= 1725964025
##$DBL= (0..7)
120 120 120 120 120 120 120 120 
##$DBP= (0..7)
150 150 150 150 150 150 150 150 
##$DBP07= 0
##$DBPNAM0= <>
##$DBPNAM1= <>
##$DBPNAM2= <>
##$DBPNAM3= <>
##$DBPNAM4= <>
$$ [...]
##$SUBNAM3= <"">
##$SUBNAM4= <"">
##$SUBNAM5= <"">
##$SUBNAM6= <"">
##$SUBNAM7= <"">
##$SUBNAM8= <"">
##$SUBNAM9= <"">
##$SW= 24.0689170037331
##$SWIBOX= (0..15)
0 0 2 0 0 0 0 0 0 0 0 0 0 0 0 0 
##$SW_h= 4816.95568400771
##$TD= 16384
##$TD0= 1
##$TE= 0
##$TE2= 300
##$TE3= 300
##$TEG= 300
##$TL= (0..7)
0 120 120 120 120 120 120 120 
##$TP= (0..7)
150 150 150 150 150 150 150 150 
##$TP07= 0
##$TPNAME0= <>
##$TPNAME1= <>
##$TPNAME2= <>
##$TPNAME3= <>
##$TPNAME4= <>
##$TPNAME5= <>
##$TPNAME6= <>
##$TPNAME7= <>
##$TPOAL= (0..7)
0.5 0.5 0.5 0.5 0.5 0.5 0.5 0.5 
##$TPOFFS= (0..7)
0 0 0 0 0 0 0 0 
##$TUNHIN= 0
##$TUNHOUT= 0
##$TUNXOUT= 0
##$USERA1= <user>
##$USERA2= <user>
##$USERA3= <user>
##$USERA4= <user>
##$USERA5= <user>
##$V9= 5
##$VALIST= <valist>
##$VCLIST= <CCCCCCCCCCCCCCC>
##$VD= 0
##$VDLIST= <DDDDDDDDDDDDDDD>
##$VPLIST= <PPPPPPPPPPPPPPP>
##$VTLIST= <TTTTTTTTTTTTTTT>
##$WBST= 1024
##$WBSW= 4
##$XGAIN= (0..3)
0 0 0 0 
##$XL= 0
##$YL= 0
##$YMAX_a= 587468
##$YMIN_a= -539154
##$ZGOPTNS= <>
##$ZL1= 120
##$ZL2= 120
##$ZL3= 120
##$ZL4= 120
##$ABSF1= 20.93856
##$ABSF2= -3.130571
##$ABSG= 5
##$ABSL= 3
##$ALPHA= 0
##$AQORDER= 0
##$ASSFAC= 0
##$ASSFACI= 0
##$ASSFACX= 0
##$ASSWID= 0
##$AUNMP= <proc_1d>
##$AZFE= 0.1
##$AZFW= 0.1
##$BCFW= 0
##$BC_mod= 2
##$BYTORDP= 0
##$COROFFS= 0
##$CY= -3
##$DATMOD= 1
##$DC= 0
##$DFILT= <>
##$DTYPP= 0
##$F1P= 0
##$F2P= 0
##$FCOR= 1
##$FTSIZE= 16384
##$FT_mod= 6
##$GAMMA= 0
##$GB= 0
##$INTBC= 1
##$INTSCL= 3.70164e-10
##$ISEN= 128
##$LB= 0.24
##$LEV0= 0
##$LPBIN= 0
##$MAXI= 10000
##$MC2= 0
##$MEAN= 0
##$ME_mod= 0
##$MI= 1.114404
##$NCOEF= 0
##$NC_proc= -6
##$NLEV= 6
##$NOISF1= 3.799351
##$NOISF2= 2.8
##$NSP= 0
##$NTH_PI= 0
##$NZP= 0
##$OFFSET= 21.00173
##$PC= 1
##$PHC0= -25999.38
##$PHC1= 19.38748
##$PH_mod= 1
##$PKNL= yes
##$PPARMOD= 0
##$PSCAL= 0
##$PSIGN= 0
##$REVERSE= no
##$SF= 200.130005402659
##$SI= 16384
##$SIGF1= 3
##$SIGF2= 2
##$SINO= 5.538805
##$SIOLD= 16384
##$SREGLST= <1H.CDCl3>
##$SSB= 0
##$STSI= 16384
##$STSR= 0
##$SW_p= 4816.95568400771
##$SYMM= 0
##$S_DEV= 0
##$TDeff= 16384
##$TDoff= 0
##$TI= <>
##$TILT= no
##$TM1= 0
##$TM2= 0
##$TOPLEV= 0
##$USERP1= <user>
##$USERP2= <user>
##$USERP3= <user>
##$USERP4= <user>
##$USERP5= <user>
##$WDW= 1
##$XDIM= 16384
##$YMAX_p= 470419852
##$YMIN_p= -1488630
$$ End of Bruker specific parameters
$$ ---------------------------------
##NTUPLES= NMR SPECTRUM
##VAR_NAME=  FREQUENCY,     SPECTRUM/REAL,   SPECTRUM/IMAG
##SYMBOL=    X,             R,               I
##VAR_TYPE=  INDEPENDENT,   DEPENDENT,       DEPENDENT
##VAR_FORM=  AFFN,          ASDF,            ASDF
##VAR_DIM=   16384,         16384,           16384
##UNITS=     HZ,            ARBITRARY UNITS, ARBITRARY UNITS
##FACTOR=    0.29402158847633, 1,            1
##FIRST=     4203.07633140266, 0,            0
##LAST=      -613.879352605055, 0,           0
##MIN=       -613.879352605055, -1488630,    0
##MAX=       4203.07633140266, 470419852,    0
$$ Real data points
##PAGE= N=1
##DATA TABLE= (X++(R..R)), XYDATA
$$ [...]
5442B53626P5407j17002O9042k6715P3316j25288m7129m04L6754n1732Q9812M6244
5430B75931L3383j20605J17594N6596M2603r1383p4551J08181q7026Q7847K6430
5419C75000r4958m7398K04694j40996j70534J24765O0595n0858j305l8095L2373
5408B53283J20214j0881k8381j7459J713M7175p8567k4440Q4086o5378J12018
5397C93383j60296L1423K10205j30250j21795k241K32971k73877n7923K6330J23680
5386B71610Q1949j91936J7740m194R1033N2187r0353J34499j3364m7409l5069
5375B66693o3540O0932p4269J21657N363R0208L2766n2840j50402J07478L4339
5364C78385l8361J30965m5707p6320N2400K1231M5411J15561j04271K1069P1742
$$ y = [253626, 329033, 212031, 281073, 254358, 327674, 202386, 155257, 154853, 191607, 139875, 229687, 275931, 309314, 188709, 306303, 362899, 405502, 314119, 239568, 347749, 260723, 348570, 375000, 280042, 232644, 437338, 296342, 125808, 250573, 311168, 260310, 259005, 220910, 253283, 373497, 362616, 334235, 316776, 318489, 365664, 287097, 262657, 346743, 281365, 393383, 233087, 264510, 474715, 344465, 222670, 220429, 453400, 179523, 121600, 147930, 271610, 353559, 161623, 179363, 175169, 266202, 318389, 228036, 362535, 349171, 301762, 266693, 203153, 264085, 189816, 311473, 316836, 407044, 439810, 386970, 236568, 344046, 378385, 340024, 470989, 425282, 348962, 401362, 422593, 468004, 583565, 479294, 500363, 572105]
5353E72105p8303J64135N8505m3196n1085O849k2383k7621R4604n502K7257q6866
5341F08499K7288N6473J32468q4894j0702K08533J8575q463o1099n6247J06004
5330I36435N5219L3899J348q1662J74155O6867J67990J27124J430N7071J42479
5319A682355J81317J15456P1728N3929K5773P3097L58508J89043J42391n2522
5309B841075J77127n5118j57395q645P3440J59156J16845l8655J03472R621J94845
5298C415768J90903K35220Q5571K20469K14304J25570N6390l1787l26986k21736
5288C963686j90506j38008k34084k03859j6061n8273q4083n8790M47P4451J1469
5277C066389J59003n2077j55198J4007p0895k71171k44073j70233k65646n7037
$$ y = [572105, 493802, 657937, 716442, 673246, 622161, 629010, 606627, 579006, 673610, 668108, 695365, 608499, 635787, 692260, 824728, 739834, 729132, 937665, 956240, 947777, 886678, 830431, 936435, 991654, 1025553, 1026901, 945239, 1119394, 1186261, 1354251, 1481375, 1482805, 1539876, 1682355, 1863672, 1979128, 2050856, 2104785, 2130558, 2203655, 2562163, 2751206, 2893597, 2841075, 3018202, 2963084, 2805689, 2797044, 2870484, 3029640, 3146485, 3107830, 3211302, 3220923, 3415768, 3606671, 3841891, 3927462, 4147931, 4362235, 4487805, 4544195, 4512408, 4185422, 3963686, 3773180, 3635172, 3401088, 3197229, 3181168, 3122895, 3038812, 2980022, 2980469, 3054920, 3066389, 3225392, 3173315, 3018117, 3032124, 2961229, 2690058, 2445985, 2275752, 2010106, 1953069]
5267A953069k24428l8668j06424n4730N5671j43439q7242J6370k9278K13703j62696
5256A391908r1433m7500J23091M6374o9776k5452P1344j54747J16643r279K0296
5245A371469K4985K1823k3892n8195L2412n9947K1135J06173k20652J28229N1564
5234A395104J23684j37740J37134M1645j42046M2691r5978m6492R9076K7292r1802
5223A352568K6614R5620L690r1981p374j24987J24835J93601k0019j8908j42393
5212A391266J46589O1694k440J4212l6463p08P4856P7123l5822k3578J19197j13397
5200A672529l5637J17310R0650J78009O0668L8335k4127J50944J45112Q6975l2017
5189B448751J67011j09569J56199J32924J7014J52031K55523J44833J28598J99235
$$ y = [1953069, 1728641, 1689973, 1583549, 1528819, 1584490, 1441051, 1353809, 1370179, 1340901, 1554604, 1391908, 1300475, 1252975, 1376066, 1422440, 1352664, 1327212, 1398556, 1243809, 1360452, 1351173, 1371469, 1396454, 1418277, 1394385, 1336190, 1368602, 1308655, 1329790, 1435963, 1215311, 1343540, 1395104, 1518788, 1381048, 1518182, 1559827, 1417781, 1460472, 1364494, 1318002, 1417078, 1444370, 1352568, 1379182, 1474802, 1478492, 1386511, 1379137, 1254150, 1378985, 1572586, 1552567, 1533659, 1391266, 1537855, 1599549, 1597109, 1611321, 1574858, 1574150, 1649006, 1726129, 1690307, 1666729, 1785926, 1672529, 1636892, 1754202, 1844852, 2022861, 2083529, 2121864, 2097737, 2248681, 2393793, 2480768, 2448751, 2615762, 2506193, 2662392, 2795316, 2812330, 2964361, 3219884, 3364717, 3493315, 3692550]
5179C692550K00256J18710J96761J97677K79726Q9350J17765M3987q9288j6564
5169D830930k895J24632K09893M2441L172K44507J81761K62843J69064J78302
5159F244650L95247K71162L48961O3979l5758l18725l26139m45710k54386k54972
5149E688309k29220k81988m0726R0901k45582p9641o5046J51976K2738n1167j26410
5138D834144L3416q6483j45924j68408k16743k48856k75767o1300j51770o2174
5128C450135k73465j66306j03578r3781j41338l516p3785L1105j03504q7427j1652
5117B422888n2585j15993Q5751o5007j38456m1192K10523p3222r2328O8486K7597
5106B236462N9572k1389k0583o525j1958j7445p052k0837q2504J4920P8234L9535
$$ y = [3692550, 3892806, 4011516, 4208277, 4405954, 4685680, 4775030, 4892795, 4936782, 4847494, 4830930, 4828035, 4952667, 5162560, 5205001, 5208173, 5452680, 5634441, 5897284, 6066348, 6244650, 6639897, 6911059, 7260020, 7323999, 7288241, 6969516, 6643377, 6197667, 5943281, 5688309, 5459089, 5177101, 5136375, 5227276, 4981694, 4902053, 4837007, 4988983, 5011721, 4960554, 4834144, 4867560, 4781077, 4635153, 4466745, 4250002, 4001146, 3725379, 3664079, 3512309, 3450135, 3176670, 3010364, 2906786, 2813005, 2671667, 2668151, 2594366, 2625471, 2521967, 2434540, 2422888, 2370303, 2254310, 2340061, 2275054, 2136598, 2095406, 2305929, 2232707, 2140379, 2208865, 2236462, 2296034, 2274645, 2254062, 2247537, 2235579, 2218134, 2211082, 2190245, 2107741, 2122661, 2200895, 2240430]
5094B240430p1840o0695L8524Q1112p585p6218J82801p94N8674N8229n5851P5648
5082B462435K7833n21K659p0862o8420Q861J56263P1170L5169J47205j17417q0791
5070B573584K01745j38551J39865J2240J38552J41277j5028M777J10257k4784
5060C143934m4051r3838K2182r2611j0717J9851O7254n3236m2403n1634K4688
5049B889419M5679M3055J5403J55355o0732J82513M9553o2670p9828J02596O0903
5038C341246p6358n1890L0474J4844J14943K6860p1365J42499Q7852J14420L1253
5027C704778n7159Q6803Q9183J67221j13665K73415J6400M7300J81523L8930J82293
5016D617022L3024L9441K37012J35145L9757J82239J30K69897J42766M4964J04379
$$ y = [2240430, 2168590, 2107895, 2146419, 2227531, 2219946, 2143728, 2326529, 2325735, 2384409, 2442638, 2386787, 2462435, 2490268, 2489747, 2492406, 2421544, 2353124, 2361985, 2518248, 2589418, 2624587, 2771792, 2654375, 2573584, 2775329, 2636778, 2776643, 2788883, 2927435, 3068712, 3053684, 3058461, 3168718, 3143934, 3099883, 3006045, 3028227, 2935616, 2924899, 2944750, 3012004, 2958768, 2916365, 2864731, 2889419, 2935098, 2978153, 2993556, 3148911, 3088179, 3270692, 3320245, 3257575, 3177747, 3280343, 3341246, 3264888, 3212998, 3243472, 3258316, 3373259, 3400119, 3328754, 3471253, 3559105, 3673525, 3704778, 3647619, 3734422, 3823605, 3990826, 3877161, 4150576, 4166976, 4214276, 4395799, 4434729, 4617022, 4650046, 4689487, 4926499, 5061644, 5101401, 5283640, 5283770, 5553667, 5696433, 5741397, 5845776]
5005E845776J29049P2890J47684K02909K84061J36331K05348K14219L77050K25036
4995G840353K4101L72266M03438K13779K91194L13969K88010K47847J72076K94744
4985A0461777K73852K53535L20460M60205N16415N87968L83720M33513N80023
4976A4271468N50656O10280N48549O73039P74515P93592P77566Q88294Q94479
4967B0782438J057192J208691J372509J357895J784083J867276K272705K229637
4959C3932426K504814K752503L116491K899197K928360K162879J351002N82429
4951E2230101o6522j79024l63789n4603L42800P83055J149354J651072K341929
4942E7834373K838022L583003M199385M526088M722092M633665L334321J179599
$$ y = [5845776, 5974825, 6047715, 6195399, 6398308, 6682369, 6818700, 7024048, 7238267, 7615317, 7840353, 7864454, 8236720, 8640158, 8853937, 9145131, 9459100, 9747110, 9994957, 10167033, 10461777, 10735629, 10989164, 11309624, 11769829, 12286244, 12874212, 13257932, 13691445, 14271468, 14822124, 15432404, 15980953, 16653992, 17428507, 18222099, 18999665, 19887959, 20782438, 21839630, 23048321, 24420830, 25778725, 27562808, 29430084, 31702789, 33932426, 36437240, 39189743, 42306234, 45205431, 48133791, 50296670, 51647672, 52230101, 52163579, 51984555, 51620766, 51566163, 51908963, 52692018, 53841372, 55492444, 57834373, 60672395, 64255398, 68454783, 72980871, 77702963, 82336628, 85670949, 86850548]
4934H6850548j129657l337279m712106n184737m809313l855513l383503k592317
4926E7846123k040608j286224n82820l94607K53677O33616R99950P86669K63178
4917E6478954o03959j754790k887731l490324l689014l595578l396688k922268
4909C4138602k589598k582579k132865j605209j647273j422844j153739j183867
4901A9820628j024399o98004p81500p24490n67290n93443n60589n03346k92996
4892A4074571l43146l54405j40514p5981j45558k0499K5497m4729l06482k44635
4882A2424119q2954m07251l09672l52942l49508q3837P610o9860o9128K0595J72133
4871A0899305J08856K25470K74357K56995M21513L13027P6927J08535m15312n76079
$$ y = [86850548, 85720891, 82383612, 77671506, 72486769, 67677456, 63821943, 60438440, 57846123, 55805515, 54519291, 53936471, 53541864, 53795541, 54429157, 55429107, 56215776, 56478954, 55874995, 54120205, 51232474, 47742150, 44053136, 40457558, 37060870, 34138602, 31549004, 28966425, 26833560, 25228351, 23581078, 22158234, 21004495, 19820628, 18796229, 18098225, 17316725, 16592235, 16024945, 15431502, 14870913, 14367567, 14074571, 13731425, 13377020, 13236506, 13160525, 13014967, 12994468, 13019965, 12975236, 12668754, 12424119, 12341165, 11933914, 11624242, 11271300, 10921792, 10837955, 10845565, 10775705, 10706577, 10727172, 10899305, 11008161, 11233631, 11507988, 11764983, 12186496, 12499523, 12576450, 12684985, 12269673, 11693594]
4861A1693594m94410o67466l58611m68782k79739k7282o08820o4196j11686q2466
4851H530136L162m0959K51471j11598Q5877r712P449k84715l00651j87292m69135
4840G474033k62907l34608j91684l04428r1640j33271j19323j43550k16844j10217
4830E565561j58788j79503k52945P22j40343O5895j03061q7203J35288j09035
4820D736588j14062n7674J867j60198j22810K6370N7808m2250m4054j88088k33262
4809C860235J45563K1588j31407J44475j30465l3712L6901J2297M1384N4014P9383
4798D100256n1892o4893p2021m1917J01618K3273r820q3231J24756k206j02699
4787C921224k1084J23535k9081J0974O3155p1601J24129M8214j6170K2258m9175
$$ y = [11693594, 11199184, 10531718, 10173107, 9704325, 9424586, 9397304, 8788484, 8724288, 8612602, 8530136, 8533298, 8492339, 8743810, 8632212, 8718089, 8708377, 8715826, 8431111, 8130460, 7943168, 7474033, 7211126, 6876518, 6684834, 6380406, 6288766, 6155495, 6036172, 5892622, 5675778, 5565561, 5406773, 5227270, 4974325, 4975047, 4834704, 4900599, 4797538, 4710335, 4845623, 4736588, 4622526, 4564852, 4566719, 4406521, 4283711, 4310081, 4367889, 4325639, 4281585, 4093497, 3860235, 4005798, 4027386, 3895979, 4040454, 3909989, 3876277, 3913178, 3925475, 3966859, 4020873, 4100256, 4048364, 3983471, 3911450, 3869533, 3971151, 3994424, 3984604, 3901373, 4026129, 4023923, 3921224, 3900140, 4023675, 3994594, 4005568, 4068723, 3997122, 4121251, 4169465, 4153295, 4175553, 4126378]
4776D126378P7962J65490J01454P278k3501j72693l4897Q8535L6591P3882j32655
4765D313824J93944J22424j0172P6483Q364K2171p8175N2063J03065L26913N2823
4754E183727R2120O3668J4362L5485l9315K59478R8152K12413N4686J26591J12043
4743F213410J58757J83770J10590J8493P3476J21946J81663J68610M60688J37670
4733G829073K01642M14884Q9218L07895M27794L20249L81487L42892L99168K15853
4723A0930155J31371K18079J95632o7524J83834J07389K31012K40575K70208M91567
4713A2932298L53572M21615M85660O31513P32677R48686O21898K91997M17897
4704A7837813L09652K08116K9014O7797O0901p0044J9907J66646L34338K97334
$$ y = [4126378, 4204340, 4369830, 4471284, 4478562, 4455061, 4282368, 4247471, 4336006, 4372597, 4446479, 4313824, 4507768, 4630192, 4620020, 4696503, 4704867, 4727038, 4648863, 4700926, 4803991, 5130904, 5183727, 5275847, 5339515, 5353877, 5389362, 5350047, 5609525, 5707677, 5920090, 5974776, 6101367, 6213410, 6372167, 6555937, 6666527, 6685020, 6758496, 6880442, 7062105, 7230715, 7691403, 7829073, 8030715, 8445599, 8534817, 8842712, 9270506, 9590755, 9972242, 10315134, 10714302, 10930155, 11061526, 11279605, 11475237, 11407713, 11591547, 11698936, 11929948, 12170523, 12440731, 12932298, 13285870, 13707485, 14193145, 14824658, 15557335, 16506021, 17127919, 17419916, 17837813, 18147465, 18355581, 18384595, 18452392, 18513293, 18443249, 18463156, 18629802, 18964140, 19261474]
4694A9261474J57262L32721L71318M56419N54841O07801M31511O82547N74519
4685B3430413N56219L96573M28960O32491K64564K24226L31428K65303K97198
4676B6827375M41262N99890M85369O57020P96079P25119R72405R02647J191101
4667C3598267J299591J247486J380131J480823J603005J746796J861505K068930
4659D6286534K193449K550873K832146K937442L221468L405855L268604L207384
4651F9903755K821029K412693K028271J703045J580491J792921K319803K806655
4643H7368663L254912M030042M595309N116220N843079O113962N877367N193871
4635A27393425M566010L671912K558357J701672L23351j100776k071963k678881
$$ y = [19261474, 19418736, 19751457, 20122775, 20579194, 21134035, 21741836, 22173347, 22855894, 23430413, 23986632, 24383205, 24812165, 25444656, 25709220, 25933446, 26264874, 26530177, 26827375, 27268637, 27868527, 28353896, 29010916, 29806995, 30532114, 31504519, 32407166, 33598267, 34897858, 36145344, 37525475, 39006298, 40609303, 42356099, 44217604, 46286534, 48479983, 51030856, 53863002, 56800444, 60021912, 63427767, 66696371, 69903755, 72724784, 75137477, 77165748, 78868793, 80449284, 82242205, 84562008, 87368663, 90623575, 94653617, 99248926, 104365146, 110208225, 116322187, 122199554, 127393425, 131959435, 135631347, 138189704, 139891376, 140214727, 139113951, 137041988, 134363107]
4627A34363107k743408j854981j014686J93299J232727K493841L583009L644739
4619A39897647K929755J047927j230437l244534m770670n031485n276414n132115
4611A19189674n071640n044349m946136m563865l943193l537298l072535k375320
4603H6635338k061257j748538j693039k120673k783527l622867m211841m448987
4595F3944609m516136m119321l772948l635705l101074k751653k390340k051341
4587C7606091j798822j658603j658120j322495j281426j382899j327102j290678
4579B5885946j291563j110996r50818j020661j020313r00632o62201o80696p87416
4570A7460650m14002o27311o86900l95624m04599m10669o04931l86872l61594
$$ y = [134363107, 131619699, 129764718, 128750032, 128943331, 130176058, 132669899, 136252908, 139897647, 142827402, 143875329, 142644892, 139400358, 134629688, 129598203, 124321789, 119189674, 114118034, 109073685, 104127549, 99563684, 95620491, 92083193, 89010658, 86635338, 84574081, 82825543, 81132504, 79011831, 76228304, 72605437, 68393596, 63944609, 59428473, 55309152, 51536204, 47900499, 44799425, 42047772, 39657432, 37606091, 35807269, 34148666, 32490546, 31168051, 29886625, 28503726, 27176624, 25885946, 24594383, 23483387, 22532569, 21511908, 20491595, 19590963, 18928762, 18248066, 17460650, 17046648, 16419337, 15732437, 15336813, 14932214, 14521545, 13916614, 13529742, 13168148]
4561A3168148k73145l62141j78187l57384k72169j88668m70083j89400j47101
4552A0729870l20329r5051k62621j92183j87172O1096l09600m2188k06206j38080
4542I037536j45129o4790k0145N9211j65009n4414o989r4671J07668K7821R0383
4531H771472P5405K12075J12753J63859K46531L18951K12268O507l0483j99293
4521I890045k38185j25832l87186n3879n8853j38146j13294J40776J38880K3912
4511I078238k4584K83406M59251M82378M31568L45407M14336J84180k63623n90811
4501A0799746o76375n15985n42163k22713m58495l12608j96425k14634n2437j47245
4491G460666R9657j38094n4966M6543J09548L25037j27376p7439k04294k56109
$$ y = [13168148, 12895003, 12532862, 12354675, 11997291, 11725122, 11536454, 11066371, 10876971, 10729870, 10409541, 10314490, 10051869, 9859686, 9672514, 9733610, 9424010, 9381822, 9175616, 9037536, 8892407, 8827617, 8807472, 8866683, 8701674, 8647260, 8640271, 8545600, 8653268, 8681089, 8771472, 8846877, 9058952, 9171705, 9335564, 9582095, 9901046, 10113314, 10119821, 10089338, 9890045, 9651860, 9526028, 9138842, 9084963, 9026110, 8887964, 8774670, 8915446, 9054326, 9078238, 9053654, 9337060, 9796311, 10278689, 10710257, 11055664, 11470000, 11654180, 11390557, 10799746, 10123371, 9607386, 9065223, 8842510, 8384015, 8071407, 7874982, 7660348, 7607911, 7460666, 7560323, 7422229, 7367263, 7413806, 7523354, 7848391, 7721015, 7643576, 7439282, 7183173]
4481G183173l49979k58652l50202k49959o2043q3491r6368j43723j10523k42382
4471E235851J0063j61217j34615j44322j40598l9774k09690j8766o9076q7184
4461D240672k5886q4763O7284k7610M3199m44n0691j72795J6108M6836k2255j42274
4449C887381o8582j06176j06962r3668j16303M6500o1603n1108j40777j07578
4439C081124Q9407n8001j06481O2404r3513j52019K5580j1471j22416K1219l8447
4428B697386O2207j5225n8879l2459q8422N3805j29418j3725Q2575j30898L8635
4417B465582p789j17314r205j2566K33176j15747j1982q2485j25539K6593N6765
4406B299489O1640N0097n3353j12514O8171J37645p8220j93732L1284j4349O6933
$$ y = [7183173, 6833194, 6574542, 6224340, 5974381, 5912338, 5828847, 5732479, 5588756, 5478233, 5235851, 5245914, 5084697, 4950082, 4805760, 4665162, 4625388, 4415698, 4396932, 4327856, 4240672, 4214786, 4130023, 4197307, 4169697, 4212896, 4212452, 4161761, 3988966, 4005074, 4051910, 4029655, 3887381, 3818799, 3712623, 3605661, 3511993, 3395690, 3442190, 3380587, 3329479, 3188702, 3081124, 3170531, 3112530, 3006049, 3068453, 2974940, 2822921, 2848501, 2837030, 2714614, 2735833, 2697386, 2759593, 2744368, 2685489, 2653030, 2564608, 2618413, 2488995, 2475270, 2557845, 2426947, 2465582, 2457793, 2340479, 2331274, 2318708, 2551884, 2436137, 2424155, 2341670, 2216131, 2242724, 2299489, 2361129, 2411226, 2357873, 2245359, 2313530, 2451175, 2372955, 2179223, 2210507, 2196158, 2263091]
4395B263091P5018q8711j20797K05604J07107n3842j3509n0932q0357O0423J04947
4384B408042j04296J32440Q7462n6899l8069j39765r0506P2910O4652j15968m9930
4373B170073R760P2356k4668o0199l3384j26395J31536P1809j53714j02573J30088
4362B084689K2840q1871R3193j57842k00718J05691O3981q5910o4288n0196J03914
4351A833483k07468l8509p023n9294Q520P7073j43645N7104O1652N5636k9648
4340A607881p1581J21013j37356l2807J01978k27827j6444R2712j0812J03985
4330A530742m1896N9233j8762n9053l5928J38438p3161j31843j4393l2129J6533
4319A337781M6647l5439K3799K3155n6834j04887N6113J18195O7819l1714j9532
$$ y = [2263091, 2338109, 2249398, 2128601, 2334205, 2441312, 2387470, 2373961, 2323029, 2242672, 2303095, 2408042, 2303746, 2436186, 2523648, 2466749, 2428680, 2288915, 2198409, 2271319, 2335971, 2220003, 2170073, 2179833, 2252189, 2227521, 2167322, 2133938, 2007543, 2139079, 2210888, 2057174, 1954601, 2084689, 2107529, 2025658, 2118851, 1961009, 1760291, 1865982, 1929963, 1844053, 1779765, 1729569, 1833483, 1626015, 1587506, 1580483, 1521189, 1529709, 1606782, 1463137, 1520241, 1581893, 1637529, 1607881, 1536300, 1657313, 1519957, 1487150, 1589128, 1361301, 1344857, 1437569, 1426757, 1530742, 1488846, 1548079, 1529317, 1470264, 1434336, 1572774, 1499613, 1367770, 1353377, 1321248, 1337781, 1384428, 1348989, 1372788, 1395943, 1339109, 1234222, 1290335, 1408530, 1476349, 1444635, 1425103]
4308A425103k8138j02336J57619J25231p3025O42l2236J29713O8724j43773Q0434
4297A607958Q7903j169j16987K1371J58846M301O4921O3673m410J23916j4059
4286A996264L995K3006l3339J34822J46818p2489j0642J09073J26279J20137L1538
4275B575462J6307J55454J46395Q9575J14054K6192J56906J86598K39954N3891
4265C760788M3038J00052K66493l741Q7251Q1779O4321O137J62313n5746l03686
4254D208999J20115J50198K09288J0430R2384o7604J79224J35647Q6060K40771
4244E365512J89502J54226L15050K95081P4269K9207J48361Q8801o3232j18609
4234F478168p1759j29565k93223p8970j44642j85880P1111k70630j30662j70843
$$ y = [1425103, 1396965, 1294629, 1452248, 1577479, 1504454, 1505096, 1472860, 1602573, 1671297, 1527524, 1607958, 1695861, 1694692, 1577705, 1599076, 1757922, 1762223, 1827144, 1890817, 1886407, 2010323, 1996264, 2000259, 2023265, 1989926, 2124748, 2271566, 2199077, 2188435, 2297508, 2423787, 2543924, 2575462, 2591769, 2747223, 2893618, 2983193, 3097247, 3123439, 3280345, 3466943, 3706897, 3760788, 3803826, 3903878, 4170371, 4166630, 4253881, 4335660, 4399981, 4406118, 4568431, 4512685, 4208999, 4329114, 4479312, 4688600, 4699030, 4791414, 4723810, 4903034, 5038681, 5124741, 5365512, 5555014, 5709240, 6024290, 6319371, 6393640, 6422847, 6571208, 6660009, 6596777, 6478168, 6406409, 6276844, 5983621, 5904651, 5760009, 5574129, 5645240, 5374610, 5243948, 5073105]
4224E073105r4786Q2926k16020Q3945J18019l6342M2367J60461j9470L4486l1220
4213E197471j7221j25638j93620j92792l5250j66697r6368p8790j38603k16574
4203C935918r5943l3301o4579j36716j17417o0399N0696L2454m1642k90054J6486
4192C195503J44959o5097j31849j6643l5927l3053Q0351R6678j7828j23740O5991
4181C159345q5693N3381r9415N7721o5361M2152j1291j7192J63197j3146K48210
4170C431908J0688R1002O971j92387J85600l27230L3706q3890M0687l5212J14897
4159C276740r5250l4936L9453j7224q816J1703J35756N2950P5415l6936N9413
4148C458268M1749k7254R0297J03497m6198J55546l1355L5149M5193l6177J3466
$$ y = [5073105, 4978319, 5061245, 4845225, 4929170, 5047189, 5010847, 5053214, 5213675, 5194205, 5228691, 5197471, 5180250, 5054612, 4860992, 4668200, 4632950, 4466253, 4369885, 4291095, 4152492, 3935918, 3839975, 3806674, 3742095, 3605379, 3487962, 3427563, 3478259, 3510713, 3469071, 3179017, 3195503, 3340462, 3275365, 3143516, 3126873, 3090946, 3057893, 3138244, 3234922, 3217094, 3093354, 3159345, 3073652, 3127033, 3027618, 3085339, 3019978, 3062130, 3050839, 3033647, 3196844, 3183698, 3431908, 3442596, 3533598, 3540569, 3348182, 3533782, 3206552, 3240258, 3156368, 3197055, 3161843, 3276740, 3181490, 3146554, 3186007, 3168783, 3159967, 3171670, 3307426, 3360376, 3435791, 3398855, 3458268, 3500017, 3472763, 3563060, 3666557, 3620359, 3775905, 3744550, 3779699, 3824892, 3788715, 3802181]
4137C802181K10716o882K6947K09397J38150K56547L4275K67619J84645K05254
4127E328849O4533j03746O6540J81497K65569n7639j35557J40348J9716j97303
4117E572807J62497R3171M553J83993J69696K3533K61955K58612J11343K90945
4107G133105L98716J53898N1585R7734J7342K392k65727j26901j5570p7653j55305
4096G213616j78824j2270L1717J80124K3769M8909o8825l1350K03998J44680j06826
4085G448718K3082O1094j94916r9057N154O082k05869l31269M3540L8907j22082
4074F673384j20427M578K5461N6354N2772P8073k5566o8112j3312Q1098j55238
4063F589065L6150o5379J46192M9003M1110K64240J6642O3901J5108K49572J14851
$$ y = [3802181, 4012897, 4006015, 4032962, 4242359, 4380509, 4637056, 4671331, 4938950, 5123595, 5328849, 5393382, 5289636, 5356176, 5537673, 5803242, 5745603, 5610046, 5750394, 5770110, 5572807, 5735304, 5828475, 5833028, 6017021, 6186717, 6210250, 6472205, 6730817, 6842160, 7133105, 7531821, 7685719, 7737304, 7835038, 7852380, 7854772, 7589045, 7462144, 7446574, 7368921, 7213616, 7034792, 7022522, 7054239, 7234363, 7258132, 7307041, 7238216, 7206866, 7410864, 7555544, 7448718, 7471800, 7532894, 7337978, 7238921, 7244075, 7250157, 7044288, 6713019, 6756559, 6795466, 6673384, 6552957, 6557535, 6582996, 6639350, 6692122, 6770195, 6744629, 6676517, 6663205, 6744303, 6589065, 6625215, 6559836, 6706028, 6755031, 6796141, 7060381, 7077023, 7140924, 7156032, 7405604, 7520455]
4052G520455l3690J62039J46129P7141J18593K09250J34898J13017L10681K37939
4042H996452L56785L8920J24375J79427O1395J98642K24654K71940J59639K41517
4032A0853746K27395K96725L94311L43464L43601M95452L66474K90977M70493
4023A4082638L90188M83215M43579M29120M69889L03204L33564M24771N94708
4014A7954876O12688M95386N63407O33439M58380N88057Q91822Q63938O64870
4005B3726863R21530P38436R62374P96984O90424P43841P52132Q28322Q13527
3996C0974433R14339R60822J236743J335212J523400J647004J685074J905884
3988D2182911K127559K425508K699448K861781K950484L174475L113931L076181
$$ y = [7520455, 7486765, 7648804, 7794933, 7872074, 7990667, 8199917, 8334815, 8447832, 8758513, 8996452, 9353237, 9392157, 9516532, 9695959, 9757354, 9955996, 10180650, 10452590, 10612229, 10853746, 11081141, 11377866, 11772177, 12115641, 12459242, 12954694, 13321168, 13612145, 14082638, 14472826, 14956041, 15399620, 15828740, 16298629, 16601833, 16935397, 17360168, 17954876, 18567564, 19062950, 19626357, 20259796, 20718176, 21306233, 22198055, 23061993, 23726863, 24648393, 25386829, 26349203, 27146187, 27836611, 28580452, 29332584, 30160906, 30974433, 31888772, 32849594, 34086337, 35421549, 36944949, 38591953, 40277027, 42182911, 44310470, 46735978, 49435426, 52297207, 55247691, 58422166, 61536097, 64612278]
3980F4612278K888613K176010J721685J046476N16997J84521M09451M60812R35332
3971G4952175J222783J554397J949809K454825K812435L567334M188545M745830
3963I7448133N143038N064363M746233M049589K856626J200200k59614j124333
3955A19124235j264951j313727j419267j057280j148677o55106m96057l73288
3947A11395882m2445L46088P61221J248506J453699J594681J683952J624804J536964
3938A21603352R97766P24674K32640J32939n3860n57701p53392j509639j964385
3929A18852394k416639k916505k801923k633124k628440k303504j772605j287373
3921A00092281o97244j96865M03105P97959J371933J415994J507601J280389J168481
$$ y = [64612278, 67500891, 69676901, 71398586, 72445062, 72962059, 73146580, 73556031, 74016843, 74952175, 76174958, 77729355, 79679164, 82133989, 84946424, 88513758, 92702303, 97448133, 102591171, 107655534, 112401767, 116451356, 119307982, 120508182, 120248568, 119124235, 117859284, 116545557, 115126290, 114069010, 112920333, 112265227, 111769170, 111395882, 111353437, 111699525, 112460746, 113709252, 115162951, 116757632, 118441584, 120066388, 121603352, 122601118, 123325792, 123558432, 123691371, 123637511, 123079810, 122326418, 120816779, 118852394, 116435755, 113519250, 110717327, 108084203, 105455763, 103152259, 101379654, 100092281, 99395037, 99198172, 99601277, 100399236, 101771169, 103187163, 104694764, 105975153, 107143634]
3912A07143634N44322o5368p25083j504256j898234k109770k235667j973262j554949
3903I5621367j315254p63435l74539J68243P16643J243110J486024J501611J664804
3894I9948574J598633J043083N59963L393q66002j596169k373758k995748l037481
3885I2284488l068152k669769k614658k475296k057280j528899j293736j529467
3877G5047231p72119j043844j061710j281581j694226j591473k208721k354150
3869F3039407k724944k709601k869045l070853k722581k552444k552629k339933
3861D1497377k144872j977189j846971j475835j399954j569596j157679j066300
3853B8858981j180287r21730r32368q10126o66120r19802q76850n43955o00583
$$ y = [107143634, 107687956, 107622588, 106897505, 105393249, 103495015, 101385245, 99149578, 97176316, 95621367, 94306113, 93542678, 93168139, 93336382, 94053025, 95296135, 96782159, 98283770, 99948574, 101547207, 102590290, 103150253, 103153646, 102287644, 100691475, 98317717, 95321969, 92284488, 89216336, 86546567, 83931909, 81456613, 79399333, 77870434, 76576698, 75047231, 74275112, 73231268, 72169558, 70887977, 69193751, 67602278, 65393557, 63039407, 60314463, 57604862, 54735817, 51664964, 48942383, 46389939, 43837310, 41497377, 39352505, 37375316, 35528345, 34052510, 32652556, 31082960, 29925281, 28858981, 27678694, 26756964, 25824596, 25014470, 24348350, 23428548, 22551698, 22007743, 21407160]
3844B1407160o75124n28365q29926l67663m43358n80234m21472n32160l14925
3835A6713933l03392m42071k53887k71428k49664r0577m2269j72262n9871j76906
3825A4651606n0917j61009M918j24198j91509k38603l77700m46307k67785m10587
3815A2387909l34204k91735k37963l50037l71611j33389k37758q1637p0055j96776
3805A0082744j53601m6728j8049j89436J17j50739k26581M3259k06755k61700
3795H872531q9811k10108r1179k12097k94924j32836j79051k53494p1470K8415
3785G365976j22921j82225j70079J8448j84481r0880j93475k38150q2054j63541
3775E956618n0447j0851j40041k87882k26330M3649k8960L1722n1812k71614O3951
$$ y = [21407160, 20732036, 20203671, 19373745, 19006082, 18562724, 17982490, 17561018, 17028858, 16713933, 16410541, 15968470, 15714583, 15443155, 15193491, 15102914, 15060645, 14888383, 14828512, 14651606, 14600689, 14439680, 14444598, 14320400, 14128891, 13890288, 13512588, 13066281, 12798496, 12387909, 12053705, 11761970, 11524007, 11173970, 10802359, 10668970, 10431212, 10349575, 10279520, 10082744, 9929143, 9882415, 9864366, 9674930, 9675047, 9524308, 9297727, 9340986, 9134231, 8872531, 8782720, 8572612, 8481433, 8269336, 7974412, 7841576, 7662525, 7409031, 7337561, 7365976, 7243055, 7060830, 6890751, 6909199, 6724718, 6633838, 6440363, 6202213, 6120159, 5956618, 5906171, 5895320, 5755279, 5467397, 5241067, 5284716, 5255756, 5287478, 5235666, 4964052, 5028003]
3764E028003k435k43501m0778k563L8721k33711l6370J9627j29263p3599q0493
3753D243638r8605j03650L2522K9933j28997N9208j92670R8066j72680J5099r1991
3742C689873J1249N9244k63099K6942J37496R9620p2682k00015j7483n813J12796
3731C578128r9238J1727j10706M6180m5298J05193o7448o7020Q3062r8791k9455
3720C306334o884J86085k2386P4883L029o497r2924j66861J0868J71708p1158
3709C386197k66967k9652j57668m6597K82136O888k8492O0259q4034j56091J07228
3698C073207M8833Q208L1614m0620j61158j9801P4001M176N4805p1899J76268
3687C177634r1081l1926J10163n5670p08N8186K06220j37995o4382J75886l6635
$$ y = [5028003, 5025568, 4782067, 4741289, 4738726, 4777447, 4543736, 4507366, 4526993, 4397730, 4324131, 4243638, 4145033, 4041383, 4073905, 4103838, 3974841, 4034049, 3841379, 3939445, 3766765, 3781864, 3689873, 3701122, 3760366, 3497267, 3524209, 3661705, 3761325, 3688643, 3488628, 3471145, 3465332, 3578128, 3478890, 3490617, 3379911, 3426091, 3380793, 3485986, 3418538, 3351518, 3434580, 3335789, 3306334, 3299450, 3485535, 3463149, 3538032, 3541061, 3534564, 3441640, 3274779, 3285647, 3457355, 3386197, 3119230, 3089578, 2931910, 2885313, 3167449, 3174337, 3145845, 3206104, 3122070, 2965979, 3073207, 3122040, 3130248, 3161862, 3121242, 2960084, 2940283, 3014284, 3018460, 3073265, 3001366, 3177634, 3086553, 3054627, 3164790, 3109120, 3108412, 3166598, 3372818, 3234823, 3170441, 3346327, 3309692]
3676C309692j40564P0929J1813M067r3957J60503J18321j29301J01743J53056
3666C566302o6665n988J7450m7961P4383J57813N8938O0863J90396j15295j96251
3655C693985J13453J42743J53329M3289J04078k1427O3373K36425m6408J14702
3645D597542K08238P4097J28566J7153J38273Q2870J16852J53766J09112J39337
3635E765806J20683J59480K21025n1974K51234L69363M01100L94965M64573M20468
3625H516723M33465L02527J53609j38418k67157k23979p8666K03622M4218j95183
3615H750761P9145J19623k7468J96667K31994J08820K76895K22894P8451L85711
3605A0423493K22299K12429L58446L63543K86538K58710L23794K30425K66124
$$ y = [3309692, 3169128, 3240057, 3251870, 3255937, 3161980, 3322483, 3440804, 3311503, 3413246, 3566302, 3499637, 3493649, 3511099, 3463138, 3537521, 3695334, 3754272, 3815135, 4005531, 3890236, 3693985, 3807438, 3950181, 4103510, 4146799, 4250877, 4229450, 4292823, 4529248, 4482840, 4597542, 4805780, 4879877, 5008443, 5025596, 5163869, 5246739, 5363591, 5517357, 5626469, 5765806, 5886489, 6045969, 6266994, 6215020, 6466254, 6835617, 7236717, 7631682, 8096255, 8516723, 8950188, 9252715, 9406324, 9267906, 9000749, 8776770, 8698104, 8901726, 8945944, 8750761, 8829906, 8949529, 8922061, 9118728, 9350722, 9459542, 9736437, 9959331, 10037782, 10423493, 10645792, 10858221, 11216667, 11580210, 11866748, 12125458, 12449252, 12679677, 12945801]
3596A2945801K14488Q0549K98394L00407K72065K47746M57344N26767M16073O11713
3586A6371347N15592O23490O86275O58419P81000Q20587J030284R52202R85723
3577B3424919R76795R58476R78878P14235R57066J036938J110479J064429J111719
3568C2333934J251243J262546J359484J416335J390264J364775J264034Q13521
3560D2456136N71153M80541M82928L81910N00494M46526O50693L82868J44459
3551D6497708j47126l16015m78292o20453m81565p27533q44200p43372p59311
3542D1379841q27778j018288j329631j321939j255442j409760j555358j273946
3534C1387699j319998j244702j213379j315609j179554j153376j081060j046317
$$ y = [12945801, 13160289, 13240838, 13539232, 13839639, 14111704, 14359450, 14816794, 15343561, 15759634, 16371347, 16886939, 17510429, 18196704, 18855123, 19636123, 20456710, 21486994, 22439196, 23424919, 24401714, 25360190, 26339068, 27053303, 28010369, 29047307, 30157786, 31222215, 32333934, 33585177, 34847723, 36207207, 37623542, 39013806, 40378581, 41642615, 42456136, 43027289, 43507830, 43990758, 44372668, 44873162, 45319688, 45970381, 46353249, 46497708, 46350582, 46034567, 45556275, 44935822, 44454257, 43726724, 42882524, 42139152, 41379841, 40552063, 39533775, 38204144, 36882205, 35626763, 34217003, 32661645, 31387699, 30067701, 28822999, 27609620, 26294011, 25114457, 23961081, 22880021, 21833704]
3526B1833704j137103r82687q43094p78501q64689r26566p22388n44394p50083
3517A4284199n67318m44036m46710l03425l19449k99543l29170k98679l32617
3508A0943252j03653k66528j43055O416j82865k31501j17181Q7011j50299r5197
3498I746400o9994j9842m6282N8036K4878j04238n7726j51341K3547r5043j8856
3487I289539j60039j1435O1206j1145M3299J13553M898k1452O4514J3711r292
3476I377357J50100J3252J8982J45999J2929q9941K02616k1560J29285K71625
3466A0210644J10302N2319J85475J82611K69961L3163L23479M38445k275J62332
3456A1966456M34459K95153K78818L83447M49815M65862M61207O29545N90852
$$ y = [21833704, 20696601, 19713914, 18870820, 18092319, 17227630, 16301064, 15578676, 15034282, 14284199, 13716881, 13272845, 12826135, 12522710, 12203261, 11903718, 11574548, 11275869, 10943252, 10839599, 10573071, 10430016, 10436432, 10253567, 10022066, 9904885, 9991896, 9841597, 9746400, 9676406, 9656564, 9610282, 9668318, 9693196, 9588958, 9531232, 9379891, 9403438, 9308395, 9289539, 9129500, 9118065, 9179271, 9168126, 9211425, 9324978, 9329876, 9308424, 9372938, 9386649, 9377357, 9527457, 9540709, 9559691, 9705690, 9718619, 9628678, 9831294, 9809734, 9939019, 10210644, 10320946, 10373265, 10558740, 10741351, 11011312, 11044475, 11367954, 11806399, 11804124, 11966456, 12400915, 12696068, 12974886, 13358333, 13808148, 14274010, 14735217, 15364762, 15955614]
3447A5955614N24241O40355P47301P87222O59308P71447Q80681O56512P36057
3438B2358738O86328R00523Q52897P37456R99075R63608R92310J070759R53419
3429C0515113J197505J237257R14738R45296J034715J033562J114856J083140
3421C9076182R30269J094279J226547J061367J203473J334899J277125J393850
3413D8597991J584658J519872J845892J710223J591015J309108J236367Q51384
3405F0246510Q42012O18100Q52260R06155Q90537J058794J013476Q69505J064689
3396F8362038J129756J218412J077993J415823J734875J780969K192145K224961
3388H1136972K275133K268537K143073J577566J585065J292935J095791P54153
$$ y = [15955614, 16479855, 17120210, 17867511, 18654733, 19314041, 20085488, 20966169, 21622681, 22358738, 23045066, 23945589, 24798486, 25535942, 26535017, 27498625, 28490935, 29561694, 30515113, 31712618, 32949875, 33864613, 34809909, 35844624, 36878186, 37993042, 39076182, 40006451, 41100730, 42327277, 43388644, 44592117, 45927016, 47204141, 48597991, 50182649, 51702521, 53548413, 55258636, 56849651, 58158759, 59395126, 60246510, 61088522, 61706622, 62558882, 63465037, 64355574, 65414368, 66427844, 67297349, 68362038, 69491794, 70710206, 71788199, 73204022, 74938897, 76719866, 78912011, 81136972, 83412105, 85680642, 87823715, 89401281, 90986346, 92279281, 93375072, 94129225]
3380I4129225Q17116P23909K74631J51754J43658J94780J2072L33300J64022J57058
3370I7101525O9148k22160j15908L1592r1217J1445k0922k35038l31383j94616
3360I6002466m48685p91737q35075q90809j268376j541151j784207j852760k280557
3351H4309109k353285k208436k258684j961925j784639j388349j282839j026212
3343G0044740j041804j092954j093762j091432q79107j080450j033798q57177
3335F1874256j066086j044428r43471j004888j228532j670539j639786j735706
3327E1540820j649379j447435j424089j153176j175445j132513j237593j136521
3319D1184669j202766p79419j013603j083546p84137p15106j056764r05293j051479
$$ y = [94129225, 94946341, 95670250, 95944881, 96096635, 96240293, 96435073, 96447145, 96780445, 96944467, 97101525, 97170673, 96948513, 96832605, 96864197, 96772980, 96784425, 96763503, 96528465, 96197082, 96002466, 95553781, 94762044, 93926969, 93036160, 91767784, 90226633, 88442426, 86589666, 84309109, 81955824, 79747388, 77488704, 75526779, 73742140, 72353791, 71070952, 70044740, 69002936, 67909982, 66816220, 65724788, 64845681, 63765231, 62731433, 61874256, 60808170, 59763742, 58820271, 57815383, 56586851, 54916312, 53276526, 51540820, 49891441, 48444006, 47019917, 45866741, 44691296, 43558783, 42321190, 41184669, 39981903, 39202484, 38188881, 37105335, 36321198, 35606092, 34549328, 33644035, 32592556]
3310C2592556j014668r85289j152725r93307q83194p49798r67659p06195o92998
3301B4446723o94322p45215o69099n61164q49526n84761p83812n97519m82463
3292A8478842m33423n06320n06180n54369n01332k57400l85771k93525l03227
3283A4737295k93451j93394k09020j90797l9079j68771l22383k35407J4485j7733
3273A3081745k10004j12777K3872r2597J88471J38429r2395Q8874n8475N9378
3263A3014521K37871J29706Q0834R0725Q7545L10087K62886J69940K02559M44581
3253A5031255L67116K84256L72158K94041M25749L30203L82565K27831L18097
3244A8033271K82705M21470K81644J86531L70906J91139L76902K78829K22212
$$ y = [32592556, 31577888, 30592599, 29439874, 28446567, 27563373, 26813575, 25845916, 25139721, 24446723, 23752401, 23007186, 22338087, 21776923, 20927397, 20342636, 19558824, 18961305, 18478842, 18045419, 17539099, 17032919, 16478550, 15977218, 15719818, 15334047, 15040522, 14737295, 14443844, 14250450, 14041430, 13850633, 13811554, 13642783, 13320400, 13084993, 13099478, 13081745, 12871741, 12758964, 12782836, 12690239, 12878710, 13017139, 12924744, 13013618, 12955143, 13014521, 13252392, 13382098, 13462932, 13553657, 13641202, 13951289, 14214175, 14384115, 14586674, 15031255, 15398371, 15682627, 16054785, 16348826, 16774575, 17104778, 17487343, 17715174, 18033271, 18315976, 18737446, 19019090, 19205621, 19576527, 19767666, 20144568, 20423397, 20645609]
3235B0645609L53467K41586L59439J69377J54632K70106L38135K43980M36959
3226B3213290K39093K13686L91972M88560N88242M64263O70093N98053O61176
3217B7528428P81447Q33592Q66425R45295R85938J037249J202433J549318J567698
3208C7297823J590026J918654K140345K350718K545542K936505L174470L373059
3200E7327142L696362L979198M260055M562914M610329M461061M205650L814293
3192I0917004L303904K619330J779558J231751Q20401K15966k10526n85334o75794
3183I9416260j101905j595896j874622k614001l274075l599940m114520m502524
3175G6738777m578421m432867m354087m079443l827436l560364l073843k986786
$$ y = [20645609, 20999076, 21240662, 21600101, 21769478, 21924110, 22194216, 22532351, 22776331, 23213290, 23452383, 23666069, 24058041, 24546601, 25134843, 25599106, 26269199, 26867252, 27528428, 28309875, 29143467, 30009892, 30955187, 31941125, 32978374, 34180807, 35730125, 37297823, 38887849, 40806503, 42946848, 45297566, 47843108, 50779613, 53954083, 57327142, 61023504, 65002702, 69262757, 73825671, 78436000, 82897061, 87102711, 90917004, 94220908, 96840238, 98619796, 99851547, 100671948, 100887914, 100677388, 100092054, 99416260, 98314355, 96718459, 94843837, 92229836, 88955761, 85355821, 81241301, 76738777, 72160356, 67727489, 63373402, 59293959, 55466523, 51906159, 48832316, 45845530]
3167D5845530k625862k204990k156183k178641j699494j545513j401243j228202
3159C0805402j183553j055279q88700j077525o69489p37801p50448n88749n98987
3150B3254871n37482m57907m05848l66973m75463k71929l12213k71173k86500
3141A9869383k32504j60192k84512k11960j36784O1865L4834n2962k28214r0607
3131A8568347o5699r757j5742j53457j35432K4565j55314J08817n5130R7306j9047
3120A8189457p033n8804l2910K76865J53097K32329J58581J9613L48076J96845
3110A9476116J99482L65667L41265L58883M44052M49728K96164M28352P79785
3101B3139494M56664P22478P86846P23361R24657Q08809Q68497R88783J007672
$$ y = [45845530, 43219668, 41014678, 38858495, 36679854, 34980360, 33434847, 32033604, 30805402, 29621849, 28566570, 27677870, 26600345, 25930856, 25193055, 24442607, 23853858, 23254871, 22717389, 22259482, 21853634, 21486661, 21011198, 20739269, 20427056, 20155883, 19869383, 19636879, 19476687, 19192175, 18980215, 18843431, 18905296, 18940130, 18887168, 18658954, 18568347, 18502648, 18492891, 18477149, 18323692, 18188260, 18212825, 18057511, 18166328, 18111198, 18208504, 18189457, 18182424, 18123620, 18090710, 18367575, 18520672, 18753001, 18911582, 18931195, 19279271, 19476116, 19675598, 20041265, 20382530, 20741413, 21185465, 21635193, 21931357, 22359709, 23139494, 23596158, 24318636, 25105482, 25828843, 26753500, 27562309, 28430806, 29419589, 30427261]
3092C0427261R71428Q65317J195998J084262J292803J180877J237031J376829
3084C9631806J578359J657417J630083K004485J783968J845450J834426J499514
3076E3465508J199998Q53706O13414J95169m06886n48235o80365q44032q70281
3067E2977996l91880k15452l20249l52814K4618O9977K62429N12296P56562O72933
3057E3996416Q85576J294681J450391J759181J958284K224771K753578K902211
3049F9225089L248564L467083L947259M340751M526298M633682N174640N220261
3041A03783627N147622M814514M520870L718225K777259J744613N47825m12834
3033A26641721j554211k124155k605235k781745k690902k338201k244836j753041
$$ y = [30427261, 31398689, 32264006, 33460004, 34544266, 35837069, 37017946, 38254977, 39631806, 41210165, 42867582, 44497665, 46502150, 48286118, 50131568, 51965994, 53465508, 54665506, 55519212, 56132626, 56327795, 55920909, 55372674, 54692309, 53848277, 52977996, 52586116, 52370664, 52050415, 51697601, 51722219, 51792196, 52054625, 52566921, 53323483, 53996416, 54881992, 56176673, 57627064, 59386245, 61344529, 63569300, 66322878, 69225089, 72473653, 75940736, 79887995, 84228746, 88755044, 93388726, 98563366, 103783627, 108931249, 113745763, 118266633, 121984858, 124762117, 126506730, 127054555, 126641721, 125087510, 122963355, 120358120, 117576375, 114885473, 112547272, 110302436, 108549395]
3025A08549395j138363n98761k19064K50744P28491R50729J470386K143082K544237
3016A14680876K780083L200874L364651L403724L432432L245894K967228K403468
3008A39479230J960840J271279P10878l809q15371j359960j722944k231270k262360
2999A35026513k342670k375773j941111j659573j119845q14689n4025P16755J168345
2990A26603927J938846K524337L180396L849704M608903N456205O336815O915434
2982A61414567P319498P866789Q118391Q000130P292965P150170O696725N998527
2974B19857762N275894M695489L730129K907752J674638J53495j251130k789690
2966B34254339m357317n856930p193854q153254r120983r756248j0051154j0033134
$$ y = [108549395, 107411032, 106812271, 106593207, 106843951, 107572442, 108523171, 109993557, 112136639, 114680876, 117460959, 120661833, 124026484, 127430208, 130862640, 134108534, 137075762, 139479230, 141440070, 142711349, 143422227, 143418418, 142603047, 141243087, 139520143, 137288873, 135026513, 132683843, 130308070, 128366959, 126707386, 125587541, 124772852, 124718827, 125435582, 126603927, 128542773, 131067110, 134247506, 138097210, 142706113, 148162318, 154499133, 161414567, 168734065, 176600854, 184719245, 192719375, 200012340, 207162510, 213859235, 219857762, 225133656, 229829145, 233559274, 236467026, 238141664, 238295159, 237044029, 234254339, 229897022, 224040092, 216846238, 208692984, 199572001, 189815753, 179764599, 169731465]
2958A69731465j0338376j0065355r423247r107568q491359p807859p065799o571895
2950A00860007n777447n262832m508110m080281l498138l040711k731919k426145
2942F9534424k401206k380995k084746k195138k065645k018983j709778j386288
2934E3291645j269877j172217p76248p92786o85545n35623o75164l98024n63472
2925D6422689n58442l45781k81431l03624j90033Q0162l6507p5567m72371m42816
2915D3796279o03675o73290m33748o08647n82925m83298n07987l96572l40859
2906C9165278k89566l57404k59010l35876k29637k68474l68857k33272k50840
2897C6572342k55381J04033N883k01186k3030j09109j32972K7791N4742J9782
$$ y = [169731465, 159393089, 149327734, 139904487, 130796919, 122305560, 114497701, 107431902, 100860007, 95082560, 89819728, 85311618, 81231337, 77733199, 74692488, 71960569, 69534424, 67133218, 64752223, 62667477, 60472339, 58406694, 56387711, 54677933, 53291645, 52021768, 50849551, 50073303, 49280517, 48594972, 48059349, 47384185, 46986161, 46422689, 45864247, 45518466, 45237035, 44933411, 44743378, 44823540, 44787033, 44711466, 44239095, 43796279, 43192604, 42519314, 42085566, 41476919, 40893994, 40410696, 39902709, 39506137, 39165278, 38875712, 38518308, 38259298, 37923422, 37693785, 37425311, 37056454, 36823182, 36572342, 36316961, 36420994, 36426877, 36225691, 36202661, 36093552, 35960580, 35988371, 36043113, 36062895]
2887C6062895L05746K86292M91728N41134L44536O72256Q18959Q88816O86900
2878D1099262J075071J137081J117287J345281J314969J613192J497659J783972
2870E1983774J979180K189610K415161K923713L143065L465481L689381M126105
2862G5915470M452734M779508N223258N756079O097208O356624O603417O507157
2854A21691455O014460N284021L938242K258602M64230j787007l743832n318858
2846A28801313o693353p435516p661451p837980p486855o833954o453937n972849
2838G2425418n346943m705397m361703m005376l195909k772979k576229k471830
2830D2989052k245514j882912j722185j660321j572305j313786j157014j068804
$$ y = [36062895, 36368641, 36654933, 37146661, 37687795, 38032331, 38704587, 39523546, 40412362, 41099262, 42174333, 43311414, 44428701, 45773982, 47088951, 48702143, 50199802, 51983774, 53962954, 56152564, 58567725, 61491438, 64634503, 68099984, 71789365, 75915470, 80368204, 85147712, 90370970, 96127049, 102224257, 108580881, 115184298, 121691455, 127705915, 132989936, 136928178, 139186780, 139651010, 137864003, 134120171, 128801313, 122107960, 114672444, 107010993, 99173013, 91686158, 84852204, 78398267, 72425418, 67078475, 62373078, 58011375, 54005999, 50810090, 48037111, 45460882, 42989052, 40743538, 38860626, 37138441, 35478120, 33905815, 32592029, 31435015, 30366211]
2822C0366211j187781q15023j009609r47806o62531o49240n79154r15221n68408
2813B3031438m92534m63630l01528l74094l63347k95945k46057l91004k77633
2804A9825666j15552k26027j54714j22576j79795k46681j22642l86973l09657
2795A7961049j98756l27081j66894k86857k50137j51893l92087k88994j12118
2786A5786232k86272j10085j51973l7243k75989j90216Q1144n7025j1764L2022
2776A4778831n8277j70781l3799j297j18188K9153j37268j01473p5626k60131
2766A3851144l844o1218j36772M1855K5228j13351M0719K2935P1281m3773J64963
2755A3859167K54412N3368J73131J41969J10410P6294Q7301J82800K68720N9699
$$ y = [30366211, 29178430, 28363407, 27353798, 26405992, 25743461, 25094221, 24515067, 23599846, 23031438, 22538904, 22075274, 21773746, 21399652, 21036305, 20740360, 20494303, 20103299, 19825666, 19710114, 19484087, 19329373, 19206797, 19027002, 18780321, 18657679, 18270706, 17961049, 17762293, 17435212, 17268318, 16981461, 16731324, 16579431, 16187344, 15898350, 15786232, 15499960, 15389875, 15237902, 15200659, 14924670, 14734454, 14815598, 14758573, 14746809, 14778831, 14720554, 14549773, 14515974, 14514677, 14396489, 14425642, 14288374, 14186901, 14111275, 13851144, 13847300, 13786082, 13649310, 13691165, 13716393, 13603042, 13643761, 13666696, 13737977, 13694204, 13859167, 14113579, 14166947, 14340078, 14482047, 14592457, 14668751, 14756052, 14938852, 15207572, 15267271]
2745A5267271J20203J59761K89335J56830L05619K78889K76703L57910L41239
2736A7553760L87045L51592L67827N86390N16052M42928M56032P20362O17455
2727B1999443O69927O49499O69569R61349R15957Q43750P06491R72905P22213
2718B9111103M87067P80242Q89243Q00191Q46477J033570J219206R55369J242047
2709C7364515J277640J399609J240782J420416J461622J578839J554839J840868
2701D9139130J729472K090567K118199J998938K317333K293806K468258K675093
2693F6830796K657953K794205L100731L324258L581195L840562M079564M317524
2685I4526788M955147N350704N746266O792850P651858Q654944R970821J1286988
$$ y = [15267271, 15387474, 15547235, 15836570, 15993400, 16299019, 16577908, 16854611, 17212521, 17553760, 17940805, 18292397, 18660224, 19246614, 19762666, 20205594, 20661626, 21381988, 21999443, 22669370, 23318869, 23988438, 24949787, 25865744, 26709494, 27415985, 28388890, 29111103, 29598170, 30378412, 31267655, 32067846, 32914323, 33947893, 35167099, 36122468, 37364515, 38642155, 40041764, 41282546, 42702962, 44164584, 45743423, 47298262, 49139130, 50868602, 52959169, 55077368, 57076306, 59393639, 61687445, 64155703, 66830796, 69488749, 72282954, 75383685, 78707943, 82289138, 86129700, 90209264, 94526788, 99481935, 104832639, 110578905, 117371755, 125023613, 133678557, 143649378, 154936366]
2677A54936366J2890363J4436991J6346904J8033968J9750842K1156813K2813816
2670B80366063K5352280K8663053L2249909L5209757L3767269K5534901R276620
2663D70419852j0838632k7041033l5178431l5818222l3231599k9156563k5554638
2656B73600734k2982886k0964649j9437821j7907074j6151282j4504601j2570056
2649A49082365j0691401r494011q385783p262983o625002o000279n186108m810550
2641I0626248m022784l615941l071301k372507k005381j350673j175392j307646
2633G1704623j784530k418970l159650l420659l144788l190882k762438k557190
2625D9265516k388440j806575j770092j861188j714068j777575j788786j547762
$$ y = [154936366, 167826729, 182263720, 198610624, 216644592, 236395434, 257552247, 280366063, 305718343, 334381396, 366631305, 401841062, 435608331, 461143232, 470419852, 459581220, 432540187, 397361756, 361543534, 328311935, 299155372, 273600734, 250617848, 229653199, 210215378, 192308304, 176157022, 161652421, 149082365, 138390964, 128896953, 120511170, 113248187, 106623185, 100622906, 95436798, 90626248, 86603464, 82987523, 79916222, 77543715, 75538334, 74187661, 73012269, 71704623, 69920093, 67501123, 64341473, 60920814, 57776026, 54585144, 51822706, 49265516, 46877076, 45070501, 43300409, 41439221, 39725153, 37947578, 36158792, 34611030]
2617C4611030j512700j447909j386898j279669j121370r55785j109188r36988
2609B4860523r05914j040842p09324p65625p26456o80011n83537n40617p53200
2600A8154997m51468m78478n56207m70535k67656l64081m52972m29320n45308
2591A4138972l84199k63717k77184m01822j33200k71566k19326l64481k45120
2582A1578357k50855l34312j00776k65949j19560k67147j94052j72671j44085
2573I728950j54133j03922k03123k86458k01798j73274l9782j92860k97264j45123
2563G931213j12323j96623k34028k05157j17137k39029J24272k04183k07444n7821
2553F481740j24191j47735R107l41131P348n761k61648n2214k63972n3126j17202
$$ y = [34611030, 33098330, 31650421, 30263523, 28983854, 27862484, 26906699, 25797511, 24860523, 23954609, 22913767, 22204443, 21438818, 20712362, 20032351, 19448814, 18908197, 18154997, 17703529, 17225051, 16668844, 16198309, 15930653, 15566572, 15113600, 14684280, 14138972, 13754773, 13491056, 13213872, 12812050, 12678850, 12407284, 12187958, 11823477, 11578357, 11327502, 10993190, 10892414, 10626465, 10506905, 10239758, 10045706, 9873035, 9728950, 9574817, 9470895, 9267772, 8981314, 8779516, 8606242, 8566460, 8373600, 8076336, 7931213, 7818890, 7622267, 7388239, 7183082, 7065945, 6826916, 6951188, 6747005, 6539561, 6481740, 6357549, 6209814, 6218921, 5877790, 5885138, 5879377, 5617729, 5565515, 5301543, 5248417, 5131215]
2542E131215n2858o1053j16179r8507r8142j5350j73425p9314J58183j19337j34532
2531D340701l9903R6896m5429Q3033k3706k05994j66716j8669J59005n8542j81241
2520C939435J1262R1632j17936m1884P7084k11575j15738j9088N3387p8494j6298
2509C571787j10376j02457k0120j02696J01800j70686r2716J5839j04254J87285
2499C173406j08745P942J7226n0481M9811n8870j18986j67238K43756j04353j59225
2488B724243j4235R7078q5419r9794L5130O1089l6080r7635j33393K20043q5484
2477B585543Q9491N8909K6752p6042l8920j34292J05988P8212m0929R9336l729
2466B750319J90034k75195Q0106L6048J0796J68215M1657K2647J38378J69449
$$ y = [5131215, 5078357, 5017304, 4901125, 4802618, 4704476, 4689126, 4515701, 4436387, 4594570, 4475233, 4340701, 4300798, 4397694, 4352265, 4435298, 4411592, 4205598, 4038882, 4020213, 4179218, 4120676, 3939435, 3950697, 4042329, 3924393, 3882509, 3959593, 3748018, 3632280, 3613192, 3666579, 3588085, 3571787, 3461411, 3358954, 3338834, 3236138, 3337938, 3167252, 3074536, 3090375, 2986121, 3173406, 3064661, 3072603, 3089829, 3039348, 3089159, 3030289, 2911303, 2744065, 2987821, 2883468, 2724243, 2710008, 2807086, 2721667, 2621873, 2657003, 2718092, 2682012, 2584377, 2450984, 2671027, 2585543, 2675034, 2733943, 2760695, 2684653, 2645733, 2511441, 2617429, 2695641, 2654712, 2754048, 2750319, 2940353, 2665158, 2745264, 2781312, 2792108, 2960323, 3001980, 3024627, 3163005, 3332454]
2456C332454J48625R9306J1607P225J93314J04394m1618j7989m2405l57426q2785
2445C354702j16845j18135j94103j0467p0797j24016m6021j92884j51667m9681
2435B280086r2103L0937M5800k52439j80558k7524R4757n6524o6767q141q5974
2424A681550r5856Q5320K7105l0951J1033M1218n671j92474n9876j5458M4357
2413A490297n6044N6491k7102k9570M6380j13195M9963p6295l3730o0944n899
2402A240352m5414o48j58734J44419M043p5301L6355k3453n7772j2610M8239o1207
2390A038269K3379k765n1113l8300P0680l1836p1064J0444M2730K1696o1561o9510
2378H81049m3767M9765k8292k4473R4481Q504J41490k79943J19093N1264K2995
$$ y = [3332454, 3481079, 3580385, 3591992, 3599217, 3792531, 3896925, 3855307, 3837318, 3794913, 3437487, 3354702, 3237857, 3119722, 2925619, 2915152, 2844355, 2720339, 2674318, 2481434, 2329767, 2280086, 2187983, 2218920, 2264720, 2012281, 1831723, 1804199, 1898956, 1842432, 1775665, 1767524, 1681550, 1585694, 1671014, 1698119, 1667168, 1678201, 1719419, 1713748, 1521274, 1461398, 1445940, 1490297, 1434253, 1490744, 1463642, 1434072, 1480452, 1367257, 1417220, 1340925, 1307195, 1246251, 1240352, 1194938, 1194290, 1035556, 1179975, 1184018, 1108717, 1145072, 1121619, 1063847, 1051237, 1099476, 1038269, 1061648, 1058883, 1007770, 969470, 1040150, 1008314, 937250, 947694, 990424, 1012120, 950559, 881049, 837282, 887047, 858755, 834282, 928763, 937267, 1078757, 798814, 917907, 969171, 992166]
2367I92166j7351j76914n6291M5330L9587q7030P3008Q2111n8189N7424M5571
2356I39422j6063J7684P8413r4176p2964o0512P5938J5933q7932k9719J1982n3810
2344G24196k5764k8577l3843P729K525j17522m7087J08080O9857p7355l6088J04234
2332F50385J4415P1094M8161O2739j41116K0925P4398j82749O9943K7783P0818
2321G86796n9909n6564J442j2669q4448l8220J52845P9884l6853j7192K6006M3933
2309G85051j46361J1818J30562j13350r2313M3633K9150K050p4929K2153R5534
2298F92998L9974k656k2385J56406k86952M5375R0096K30415j70373o4510J11050
2287H19438k8092j35262j70047J4424K48N7557N0444L4643M5354m4350O0429K0027
$$ y = [992166, 974815, 797901, 741610, 786940, 826527, 739497, 812505, 894616, 836427, 893851, 939422, 923359, 941043, 1019456, 925280, 852316, 791804, 867742, 883675, 795743, 766024, 778006, 724196, 698432, 669855, 636012, 643741, 646266, 528744, 481657, 589737, 659594, 582239, 546151, 650385, 664800, 735894, 784055, 846794, 705678, 726603, 801001, 618252, 688195, 715978, 786796, 726887, 670323, 671765, 659096, 574648, 536428, 689273, 769157, 732304, 715112, 741118, 785051, 638690, 650508, 781070, 667720, 575407, 619040, 648190, 650240, 575311, 597464, 692998, 732972, 730316, 707931, 864337, 577385, 622760, 712856, 943271, 772898, 708388, 819438, 791346, 656084, 486037, 500461, 500709, 558266, 608710, 643353, 688707, 644357, 704786, 724813]
2275G24813j20741Q687R1734j51276M3207r6088l3549m0377N6068m6354N2449
2264D88573p6198J60101k3040q9561k3148l2074N0762K25659j7353J3920j36322
2253E41319j35008j7533o5996K59298M3736j41419o5124P2476J42007P2558j03299
2242F03015r6109m1114n0377o6833J42694J42204j06240J88636j76869j56153
2232C82854o3391R8388Q2875o801j0463j32341j2705j04426N9318Q3454J32071
2221E08833K4043J4302j23946r2804M4705J22847j63614N4026l077Q5739j23957
2210C47097O8921R7117j26177J02574q6384R1291Q9541j33871Q2712n8625r985
2199D64211j47530J35576N7172p3961l3542L4742j05209P3200n564J65617k4952
$$ y = [724813, 604072, 612759, 704493, 553217, 596424, 500336, 466787, 426410, 482478, 436124, 488573, 412375, 572476, 549436, 459875, 436727, 404653, 455415, 681074, 663721, 677641, 541319, 406311, 388778, 322782, 582080, 625816, 484397, 419273, 491749, 633756, 706314, 603015, 506906, 465792, 415415, 348582, 491276, 633480, 527240, 715876, 539007, 382854, 319463, 417851, 500726, 493925, 483462, 351121, 338416, 233990, 293308, 376762, 508833, 532876, 547178, 423232, 330428, 375133, 497980, 334366, 388392, 385315, 471054, 347097, 416018, 513135, 386958, 489532, 403148, 494439, 583980, 450109, 532821, 474196, 464211, 316681, 452257, 509429, 435468, 401926, 436668, 331459, 404659, 399095, 564712, 539760]
2188E39760o5991J23711j00689j02207R5043l41k3374N5303N4152p942J6056j00859
2176D82622J10697J18281j69741r2791K089O8183K4690j14240M9028Q8618O540
2165E73976N32L0355L4247q007Q4009J2238P5696L7518Q0782J3833R628k5439
2153I19368p7231m8941l3247M1195K8142N8045P3701J22211r59p1648J97017M8225
2141A255878j89461L1342P0082O7672n5419J18453j2823J18282J00237J04358
2131A608601L8198p202K9767J29717R8977J20K2697k2121J37619J58706n2554
2120B142525Q0103P6289R2665K10279J62459O8105J25882N0636K13151J73819
2110C395913L5495L01907N5682J06319K78321K39461M21836L22809N54618N26264
$$ y = [539760, 473769, 597480, 496791, 394584, 489627, 489286, 465912, 521215, 575367, 567425, 583481, 482622, 593319, 711600, 541859, 449068, 451157, 519340, 544030, 429790, 478818, 567436, 573976, 574508, 604863, 639110, 631103, 715112, 727350, 803046, 840564, 921346, 935179, 944807, 919368, 842137, 793196, 759949, 801144, 829286, 887331, 961032, 1083243, 1082284, 1010636, 1207653, 1255878, 1066417, 1097759, 1167841, 1235513, 1180094, 1298547, 1285724, 1404006, 1504243, 1608601, 1646799, 1639597, 1669364, 1799081, 1898058, 1898178, 1920875, 1898754, 2036373, 2195079, 2142525, 2222628, 2298917, 2391582, 2601861, 2764320, 2832425, 2958307, 3008943, 3222094, 3395913, 3431408, 3733315, 3788997, 3895316, 4173637, 4413098, 4834934, 5157743, 5712361, 6238625]
2100F238625P22261P81156P49474O34094J055642J162017J905268K188265L186734
2091A8623536L979714N710020N480609j285723n155126o327374l736661k484328
2083A4804667k324738j794126j347652j040283o03647o26054n22575o73151o82396
2074E190045o22472m58760k36458l01620k35230K872m8933l30141k53012n9731
2064B646560j62252j55275n8588j54624j31239j118j38967j44215j27686j53251
2054A419345J09996j05259o5679m0216p1628l8297J74668J4874j28234j21031
2044A148539p27j01781k03542n3418J55518o0038k50388K38917J57017k04573
2034H25524l8515o2177l039M8626o0829l3289r8702K3928j32570R5752P8387n6713
$$ y = [6238625, 6960886, 7742042, 8491516, 9125610, 10181252, 11343269, 13248537, 15436802, 18623536, 22603250, 28313270, 33793879, 32508156, 27353030, 21025656, 17288995, 14804667, 12479929, 10685803, 9338151, 8297868, 7694221, 7068167, 6545592, 5872441, 5190045, 4567573, 4108813, 3872355, 3570735, 3335505, 3338377, 3289444, 2959303, 2706291, 2646560, 2484308, 2329033, 2270445, 2115821, 1984582, 1983464, 1844497, 1700282, 1572596, 1419345, 1529341, 1424082, 1358403, 1318187, 1246559, 1208262, 1382930, 1397804, 1269570, 1148539, 1147812, 1046031, 842489, 789071, 944589, 884551, 634163, 873080, 1030097, 825524, 787009, 724832, 721793, 770419, 709590, 676301, 577599, 601527, 468957, 564709, 643096, 586383]
2022E86383o779K1979K6975j39244M6721P1700j04192j42173l4637M779N0295
2011C81807J51649n4727K0263O6200R3465o7819j88521L5798L0451j27405L8098
2000C79259L0298j47781j3953J72424n443k525N79P1695j01967L9640m3085j07796
1988B71345N3694J04226J23701r7521j17963k1571J83085r3943j25856k4860q3160
1977A71177J57022O5927m7761n3109M9787j80528p3228J97709O5866R1776j46383
1966B98255P4697j64529N0118L4679m6085J1060R7144j50672k4731Q312K1533
1955B09781l1065J18647L7794Q0677j59910J24307J60921k02161j4827q1165j05562
1944A37437k7310L7101O829n5751R5402j4332R5776J38443k6525j02711K2700
$$ y = [586383, 579604, 601583, 628558, 489314, 536035, 607735, 503543, 361370, 326733, 331512, 381807, 533456, 478729, 498992, 565192, 658657, 590838, 402317, 438115, 468566, 341161, 379259, 409557, 261776, 247823, 420247, 414804, 412279, 412858, 484553, 382586, 422226, 379141, 271345, 325039, 429265, 552966, 455445, 337482, 315911, 498996, 405053, 279197, 254337, 171177, 328199, 394126, 346365, 293256, 343043, 162515, 89287, 286996, 352862, 444638, 298255, 372952, 208423, 258541, 293220, 247135, 258195, 355339, 204667, 179936, 188248, 209781, 178716, 297363, 335157, 415834, 255924, 380231, 541152, 338991, 324164, 242999, 137437, 110127, 147228, 154057, 98306, 193708, 179376, 275152, 413595, 387070, 284359, 307059]
1933C07059q1593o4872k542l7212k0573J67525j28580N4227R6856l8688J7604
1922B69211L3117q0694j20009r2788J91953o5107m1008K5207J26118j5647m6008
1911A84345K5127j01585J08512L5867j07081j0846J42079q1498j2682n4842P7038
1900B04434p3951Q7671M3296o0233P5647R9472j91118N8442P4893J2491J05010
1889D36054R3423p4015k9395j53357q8037O7553l3075m3562L7806L7021r3222
1878A57194J04513j09167L9885m6854n4722J11637J18242n9840k49872J83805
1868A94821Q1673r6054J6956L87j19241m0740j1805J51005r0421k289J9994o505
1856I7781N8560m6234J39881P755j75926p7465J30674P9685q5809j404j7476L7797
$$ y = [307059, 225466, 160594, 158052, 120840, 100267, 267792, 139212, 193439, 290295, 251607, 269211, 302328, 221634, 101625, 8837, 200790, 135683, 94675, 119882, 246000, 230353, 184345, 209472, 107887, 216399, 252266, 145185, 134339, 276418, 194920, 182238, 127396, 204434, 130483, 218154, 261450, 201217, 276864, 376336, 185218, 243660, 318553, 331044, 436054, 529477, 455462, 426067, 272710, 184673, 252226, 219151, 175589, 213395, 250416, 157194, 261707, 152540, 192425, 145571, 90849, 202486, 320728, 260888, 11016, 194821, 276494, 180440, 197396, 197783, 78542, 37802, 25997, 177002, 86581, 84292, 104286, 97781, 156341, 110107, 249988, 257743, 81817, 4352, 135026, 214711, 128902, 127498, 110022, 147819]
1844A47819j27046Q504M3566Q7835j28653K5968K5288q42J40819J9232j13124
1833A29366p1122m5842p8117R8673J60336k4043r2342P4325n5970j03444k3812
1822c1992J53645J70254m1096j26877p8604O966N1460L582j40826l704J45738
1811A08546P7189l2920M1810m3006J5525k9238J05618r1079k6509m1034n4498
1800C0404J37055J12490J60n8282j33123q1891k797Q1980J2281j7977J15554j2795
1788A83059k43850R7889O0881L9429o508M2160m5448o8066M3248j10486o264M6824
1776C2868k23o3450O9989j13177P8497N3633q1460N8337N05j04805O9879J7088
1764A7681j7990J01450o108j347l3960j81423J28759N5058l4059K3385j4773r378
$$ y = [147819, 20773, 29277, 72843, 160678, 32025, 57993, 83281, 82439, 223258, 242490, 129366, 58244, 12402, -65715, 32958, 193294, 169251, 76909, 151234, 95264, -8180, -31992, 121653, 291907, 250811, 123934, 45330, 52296, 103756, 107338, -33488, -37192, 108546, 185735, 152815, 194625, 151619, 167144, 137906, 243524, 152445, 125936, 84902, 30404, 167459, 279949, 280109, 221827, 88704, 6813, 4016, 85996, 98277, 80300, 195854, 183059, -60791, 37098, 97979, 137408, 130900, 173060, 127612, 59546, 102794, -7692, -13956, 32868, 32645, -30805, 39184, -73993, 4504, 58137, -23323, 35014, 35519, -69286, 593, 17681, -309, 101141, 95033, 93686, 59726, -121697, 7062, 62120, 28061, 51446, 36673, 27295]
1752B7295L3382P9800m9930j62490J28021M7661j48323J10901j1966J6562q207
1741F2706l3626J8834j51484J08079R9553P6163j44921n5977N165R9331l307k4557
1729E5959Q2334O7646L7603k3936q0564R0002o0514M0826m1606j5066n1992j57800
1717e7108J08114m0789n3007N9524M9964N2756P8304j16100q3499J05976j8341
1706H5794O9343n4379J34961M7483j99651j89317J6339J1735J5367P9401Q7932
1695A05008Q1308k9835M8700M0892j61367o2120m5847R2699j76197L9183J94296
1684A26720J1517m7735j1547j08851R3219J31687q8800J27013j65549l6420m2670
1673a1416m7330O6798J38426n9687M012J2751J8290l5553m8521m7728Q1220m952
$$ y = [27295, 60677, 140477, 90547, -71943, 56078, 103739, -44584, 66317, 54351, 70913, 62706, 29080, 47914, -103570, 4509, 104062, 180225, 35304, -20673, -15508, 83823, 80516, 55959, 138293, 205939, 243542, 219606, 139042, 229044, 168530, 209356, 167750, 152684, 100692, -57108, 51006, 10217, -42790, 16734, 66698, 119454, 197758, 81658, -1841, 104135, 85794, 155137, 100758, 235719, 283202, 83551, -105766, -89427, -77692, -62325, 17076, 105008, 186316, 156481, 205181, 246073, 84706, 22586, -23261, 69438, -106759, -67576, 126720, 138237, 90502, 78955, -29896, 63323, 195010, 106210, 233223, 67674, 31254, -11416, -58746, 8052, 146478, 86791, 90803, 103554, 121844, 86291, 37770, -9958, 71262, 66310]
1661F6310j26142Q9761J9456j55722J00225R9683J36088j20075j48517L2673O6758
1650F0498K6849j7927j5935r0774n9503j7451L736J19171O0822m1379k7526J1851
1638A2432j57094N9019J0460o4664J77156l3260n8458q193m2957J55321Q1059
1627A30821q3233j33746O283J78992l0187n1293j13155L2468J06702O2866n8052
1616D8466l0318m3608J68297j76188K535J65942j80255L5359p4642J021J68236
1605H4845q3951L5674J25494j82356j8879k590r184l4129P0836j4400M5843N5764
1593G2967m8230Q707J15J02077q83J0494o6587j4144j49030N2872J55928l6302
1581H7984N6781o814l7394n1269L6336P5464j2587o6183P2626j26251j29105J1901
$$ y = [66310, -59832, 29929, 49385, -106337, -6112, 93571, 229659, 109584, -38933, -6260, 60498, 87347, 69420, 53485, -37289, -96792, -114243, -110507, 8664, 69486, 28107, 581, 12432, -144662, -85643, -75183, -139847, 37309, 4049, -54409, -62602, -105559, 49762, 130821, 47588, -86158, -79875, 99117, 68930, 17637, -95518, -63050, 43652, 106518, 48466, 18148, -25460, 142837, -33351, -30816, 135126, -45129, -9770, -84412, -83391, 84845, 894, 36568, 162062, -20294, -39173, -41763, -50947, -85076, -14240, -28640, 17203, 72967, 24737, 33444, 33559, 135636, 134753, 145247, 78660, 64516, -84514, -31642, 124286, 87984, 144765, 137951, 100557, 49288, 85624, 161088, 148501, 82318, 154944, 28693, -100412, -88511]
1569h8511K69359O4593m9477k01129O1232J27980j19162j31258K9846R3184l7620
1558A9037L5426J11126j8694p3075j37822P7250m8860j30226J33140J23448j4132
1547G6618j62958N5253J49847j32502j8953J51344N3683k49147J6019J059P820
1536e1917N1470L2150J02042j58075N3129N6243l1872M9199l3220J71681q0630
1525A60200j73172o9777O5882P3865k42980J61222k5612J6987O7806O80j13952
1514g8851J60596p6350j72051J34062J73616r6528j0721O1682P6361j64179n7865
1503e0228j9211m1141M1501J13728j75947J55259R9887k55877P7816j24535M5485
1492a33263K85315N920j16404n3728K0267n3473N1569J098N8079n456l0811n8517
$$ y = [-88511, 180848, 245441, 195964, -5165, 56067, 184047, 64885, -66373, -36527, 56657, 19037, 54463, 165589, 146895, 73820, -64002, 13248, -35612, -165838, -32698, 90750, 76618, -86340, -31087, 118760, -13742, -32695, 118649, 172332, -76815, -60796, -59737, -51917, -447, 31703, 133745, -24330, 28799, 85042, 53170, 102369, 69149, 240830, 160200, -12972, -82749, -16867, 56998, -185982, -24760, -50372, -33385, 34421, 35101, -78851, 81745, 5395, -166656, -32594, 141022, 44494, 33773, 95455, 171816, 7637, -50228, -69439, -110580, -69079, 44649, -131298, 23961, 123848, -132029, -54213, -178748, -133263, 152052, 157972, 41568, -12160, 8107, -45366, 6203, 7301, 65380, 59924, 29113, -29404]
1480b9404k14224K38676J18036j27562N6138L5631N904K2092j65146l1901N586
1469h6174J21291J22520j46494j31440o7652Q3966J8964J31770N3551j62277R5388
1458C3413J04125j01993o2412p989J0003J10812q370n2961P6286N9093j37681
1447B2326M204k7746n5068Q530K52036j07141j34557n3808N3961O2452P7535r1037
1435A1687L1064j07447K3593J6985L7365r1064j35671J71052J0731J41468p0280
1424C9483j30860K824J74505q8656j33017O450K8331L0545n1540J24272L3124
1413C5461o373L6781m2155J33731j11146L581l7175j23133K23274j26693l7949
1402e1796J40807q8206J9847n4225M6907J29081j27646p2646m0492J53471N0602
$$ y = [-29404, -243628, -4952, 113084, -14478, 41660, 77291, 83195, 105287, -59859, -91760, -86174, 35117, 157637, 11143, -120297, -187949, -103983, -85019, 46751, 100302, -61975, 33413, 137538, 35545, -26867, -34856, -24853, 85959, 77589, 24628, 100914, 160007, 22326, 26530, -1216, -56284, -47754, 204282, 97141, -37416, -91224, -37263, 25189, 102724, 11687, 42751, -64696, -41103, -24118, 13247, -77817, -213488, -42436, -31705, 109763, 39483, -91377, -88553, 85952, -2704, -135721, -129271, -100940, -70395, -121935, 2337, 35461, 29088, 65869, 23714, 157445, 46299, 49880, 12705, -110428, 112846, -13847, -51796, 89011, 805, 20652, -33573, 13334, 142415, 14769, -57877, -98369, 55102, 105704]
1391A05704N9582l8496j14953P5061j17467Q0262J0073J08792j04661l11676J69555
1380g8224q700J7589L7191M5243K9806J52103j44329j09497J40956K1256j7281
1369H6113q1983O051l452m0610j16372J93648L992n9853k718P1371k1344O870
1357D1713o0244m1922O3656o959l9322L6149N6789J49065J1115L5682j97300J656
1345E0078o6942N066m1772N93J05210M9786n3848K6216K1882m3790j08333R7539
1333D1685k41656L1740J55470m0055M9579K7326n5927o2336J64865J51368r7426
1322A24633r1394p8108p3K968m5863R4761J47282p3555r9310K1068P9364o388
1310G5385q6793J53388j15140J4380j4785M5825k90300K22644L2300n2754O942
$$ y = [105704, 165286, 126790, 11837, 86898, -30569, 49693, 59766, 168558, 63897, -247779, -78224, -86924, -69335, -32144, 13099, 42905, 195008, 50679, -58818, 82138, 103394, 86113, 4130, 10181, 6729, -33881, -150253, 43395, 47387, -12466, -15184, 56187, 34843, 41713, -18531, -60453, 3203, -3756, -43078, -6929, 49860, 198925, 210040, 245722, 48422, 50078, -16864, -11798, -53570, -52977, 52233, 102019, 48171, 74387, 96269, 52479, -55854, 41685, -199971, -168231, -12761, -52816, -3237, 24089, -31838, -94174, 70691, 222059, 124633, 33239, -44869, -44942, -41974, -87837, 6924, 154206, 80651, -18659, 2409, 81773, 75385, -11408, 141980, 26840, 41220, 26435, 72260, -218040, 4604, 36904, -15850, -8908]
1299h908m0534Q6483J10189q6273k2376m2760m8039o958N2963K7625k9537m5940
1287e4065N4748j05004J51435k9402j38891N2512J30594p5466J93213j3078j07656
1276E8940P5754l2259j42068j0510J27906j23896m7895L2158q4254k9243J27911
1265d7456O1825p4883N587l320m6764R6674M1812K8504Q116p4870o7921K5476
1253d7220M7986N7322j38859M1153J4153l060O0241L6908k7969q206k8080M8591
1241E2960N0518m6738L5326q1663n6378r7372M4664J7167l5324O635J53937Q0335
1229A24067k67261J90595P4816o7112k0651N5129m3197p1321n0020N1531R06Q9262
1217F6744r2630r534m8347n8222L3579J00262O8154k2273J23158j56670q078O6231
$$ y = [-8908, -49442, 37041, 147230, 60957, 38581, -4179, -52218, -59176, -6213, 21412, -8125, -54065, 683, -104321, 47114, 17712, -121179, -68667, 61927, -13539, 179674, 166596, 58940, 134694, 102435, -39633, -50143, 77763, -46133, -94028, -61870, -146124, -175367, -47456, 14369, -60514, -54927, -58247, -105011, -8337, 33475, 61979, 70095, -4775, -72696, -47220, 766, 58088, -80771, -39618, -25465, -28525, 31716, 68624, 40655, 32449, 4369, 52960, 103478, 56740, 92066, 10403, -45975, -143347, -98683, -81516, -116840, -110205, 43732, 124067, -143194, 47401, 122217, 55105, 34454, 89583, 46386, -24935, -74955, -23424, -22518, 66744, -25886, -35420, -83767, -141989, -108410, -8148, 60006, 37733, 160891, 4221, -3857, 62374]
1205F2374J00731j45734j57938J89475N5099n8307o1104m1284P8434J1025o4215
1194c1444N5718j49125j37729K63000P9889r4163J0016l9395J8858q6923N3991
1183e7307J45995K5643j41881J3993j6457q3271L5755J4222Q8031J16241j15257
1172B5707Q689r921p5932J9663j8931P7288l2839Q5320k8511K874n000k5447j7630
1159E330j5703R8804j2514p5481r7701O5374J70894J2429j44669p4930R7586L1273
1147F0692j76116K2972J93966n9798q2118O2435J14755r7248o9585n7350j2177
1136i9572J73816L1239K2276o0225Q3439K7860j15227J03901n9900j22482M7640
1125C2765j48433J67743m5853K0795M0536j64385J38484N1079j62407j42012J00525
$$ y = [62374, 163105, 17371, -140567, 48908, 104007, 45700, -15404, -56688, 21746, 32771, -31444, 24274, -124851, -262580, 420, 80309, -13854, -3838, -43233, -24375, -111298, -57307, 88688, 114331, -27550, -13557, -30014, -113285, -77530, -63308, 24723, 140964, 25707, 34396, 24475, -51457, -31794, -50725, 26563, -6276, 79044, 50533, 53407, 48407, 22960, 5330, -10373, 88431, 75917, 436, -97265, -31891, 139003, 151432, 6763, -68167, 29419, 60692, -115424, -92452, 101514, 41716, -40402, 22033, 136788, 39540, -30045, -87395, -99572, 74244, 105483, 127759, 67534, 150973, 178833, 63606, 167507, 107607, -14875, 32765, -115668, 52075, 6222, 27017, 67553, -96832, 41652, 92731, -69676, -211688, -111163]
1114a11163n3137J22164k2083K1136J19823j7606R46o90J8693k0973r9271Q416
1102c3745J03557J0304J7793q7233J7257j647p1949o8121Q3939J58594j51626
1091b2877N2041j03668j04717M3218R4315k0728J2056m3616r941K23936L097l595
1079A19521n9163K8927k08285R7230L1901P3804j2550j09663N6061m0537M5259
1068B2505K1795k1248j80146p5131J73516O3922O0113k35630J19316m6130p8716
1057a75834J62140M2011j40776J02040r9507j4648P1030o0830O7908K5555O948
1046a3963P416K3485j36423J75952p3583O5035j05416N0346j04056J53047m3479
1035a639R4077q2868m5804J49518j01798n6586K9106L3995J96800j59523j58385
$$ y = [-111163, -164300, -42136, -64219, -43083, 76740, 59134, 60080, 59390, 78083, 57110, -42161, -33745, 69812, 80116, 97909, 10676, 27933, 26286, -45663, -113784, -29845, 128749, -22877, 29164, -74504, -179221, -136003, -41688, -62416, -50360, -93976, -103917, 120019, 123116, 119521, 60358, 89285, -119000, -21770, 10131, 83935, 71385, -38278, 17783, -22754, 22505, 44300, 23052, -157094, -232225, -58709, 5213, 65326, -170304, -50988, -97118, -175834, -13694, 28317, -112459, -10419, -109926, -124574, -53544, -114374, -46466, -20911, -13963, -6547, 16938, -119485, 56467, -17116, 47919, -57497, -7151, -111207, 41840, -1639, 92438, 9570, -36234, 113284, 11486, -45100, -15994, 18001, 214801, 55278, -103107]
1024a03107J05751l5329j7836m4774l0425J17962M974P7541q0963p5731K3634
1013e8303m1859Q4318J17519m9190J1849j3318r0805O160m785K85858r6212n6271
1001I4961q2749Q5324K1176J10002l5728j24327p7108j04591l4528M9972K9646
990f7950K08609J7329p424l8006r5641J1573k9857O4836j44657r978J10421Q6813
978A06068j2237j87481l8692J60435M6100k5312k07083P2203P3863n5648l3377
967a01161J19591K8622n5800N4994j04245P649O6807m3642P3012J8709k5243l8602
955F91K9176N1038n5203m0890k6441O7979j21638m3547Q2641R7825J03795l1394
943A14032o7216j06583O7923J7250M1114k40784K01662K9099l0307J33349j57556
$$ y = [-103107, 2644, -32685, -50521, -95295, -125720, -7758, -2784, 74757, -6206, -81937, -58303, -100162, -15844, 101675, 52485, 64334, 51016, -39789, -33629, -38414, 247444, 151232, 94961, 12212, 97536, 118712, 228714, 192986, 68659, -8449, -113040, -147568, -97596, -67950, 140659, 157988, 150564, 112558, 16917, 28490, -1367, 63469, -81188, -91166, 19255, 106068, 93831, -93650, -132342, 28093, 74193, 48881, -158202, -85999, -12136, -67784, -101161, 18430, 47052, -8748, 46246, -57999, -50350, 16457, -27185, 45827, 64536, 39293, 691, 29867, 80905, 25702, -15188, -41629, 26350, -95288, -138835, -56194, 41631, 145426, 114032, 46816, -59767, 8156, 25406, 66520, -174264, 27398, 56497, 26190, 159539, 1983]
932A983j7370M1612J179m1123n2202P2896O3956n0532m0535j29561J00801K1842
920b7054J8052r2866j8827J17342m3029L9880J00606M1717k00955p3819K89157
909A50204j78555R4617L7799m198j51943K7103N6314j28451Q9495R1686o1168
898B2903N7633R5045k02927k5866J11457O8378o0338L0368j67160K353K8618o9703
886a09239J01530o4181K9619J3221l3952J75388r5368j42503J80977J4724k02146
875a31930M4945L7727m2418k7124J5017j1681J3968J07246L5289J44704k47824
864f2081l8960r3901J13367N3346K7276J14847M4473J9777l1415j28449j3825
853D455N2867J03398j20380j48735N926J4075J03148J5743k01377J11596k0476
$$ y = [1983, -15387, 26225, 27404, -13719, -65921, 6975, 70931, 20399, -20136, -149697, -48896, -27054, -9002, -101868, -120695, -3353, -46382, -6502, 94104, 135821, -65134, -138953, 150204, -28351, 66266, 104065, 99867, -52076, -24973, 31341, -97110, -7615, 84071, 22903, 80536, 175581, -27346, -53212, 58245, 126623, 66285, 96653, -70507, -68154, -39536, -109239, -7709, -71890, -42271, -29050, -63002, 112386, 17018, -125485, 55492, 70216, -131930, -86985, -49258, -91676, -118800, -103783, -115464, -101496, 5750, 41039, 185743, -62081, -101041, -194942, -81575, -28229, -953, 113894, 158367, 178144, 146729, 18280, 4455, 57322, 160720, 40340, -108395, -102469, -88394, 14754, 30497, -170880, -59284, -79760]
842g9760q5498K34296p0265L4010J63170j36096j27742N8089k460P926M2567n7680
830a9443o7636L97j6227j2847J2559J50407j13598M3707M4856j84923J31016J21929
818I0197J131o6545j3919r7952n3235K01944P0766j61102m4117J54983k2944R1843
806A51050n0636j48153j17368P9359Q0844N4342l7537J1588P817n28l5695J06748
794A01831j04186m3506Q5024j04296j4535J73844r163j02402N1847N233Q5118
783A24809j01731m6026k9355L2751Q1194q7048N1431M7204K1964k2902J677Q9861
771A63829k8501p3957Q5824k7049M1496q7934j2905j25355m5824J25538J7647
760C2809R156J6015n9845N1048k6998M8893j01560N6318j89814Q7807K1956Q4192
$$ y = [-79760, -165258, 69038, -1227, 32783, 195953, 59857, -67885, -9796, -12256, -4330, 38237, -19443, -87079, -86682, -102909, -115756, -103197, 47210, -66388, -22681, 22175, -162748, -31732, 90197, 91328, 24783, 10864, -87088, -140323, 61621, 132387, -28715, -72832, 82151, 59207, 151050, 100414, -47739, -165107, -85748, -4904, 49438, 11901, 23489, 31306, 30778, -4917, 101831, -2355, -45861, 39163, -65133, -79668, 94176, 85013, -17389, 34458, 39691, 124809, 23078, -22948, -52303, -19552, 61642, -25406, 26025, 73229, 95193, 72291, 73968, 163829, 135328, 61371, 147195, 120146, 161642, 73708, 60803, -64552, -110376, 15162, 32809, 41965, 57980, -1865, 49183, 22185, 71078, -30482, 25836, -163978, -76171, -54215, 29977]
748B9977o6575n1491L3917n5779J16468J11056o7839j18188O7093Q7534j9062
737F7111k3654M8150k47860R8024o4079J10554J0485r438K4672J5161J6343L8596
725H4065m2415p1367O6838J5394j37816R0155p2617Q2250K0782j28057J5360O2839
713a4589l9192j19700J74772R7388p4801o1423L1605J15384n5692n1096R9794
702A02450m1430j40039J3974j14365J74728m6753j47417J47589J7751J69613j37249
691a148P759O1956J8515l5171J15827j9267j91754j6975r9823l5352J4618J60061
679b0754l0616Q9408K1707m0646Q3240o1079l1520L2202k904j33483J84765J2141
667A02461k7220L2779j81884j02699J2192J73802j01464R0113Q8802j08703P7423
$$ y = [29977, -36598, -88089, -54172, -109951, 6517, 117573, 49734, -68454, -1361, 86173, 67111, 43457, 91607, -156253, -58229, -122308, -11754, -1269, -10707, 13965, 29126, 45469, 84065, 41650, -29717, 37121, 52515, -85301, 4854, -67763, 14487, 35269, -92788, -77428, -14589, -53781, -173481, 1291, 98679, 23878, -37545, -5940, 109444, 53752, 2656, 102450, 61020, -79019, -65045, -179410, -4682, -51435, -198852, -51263, -33512, 136101, -1148, 6611, 68567, 87082, 51911, 167738, 148471, -43283, -60258, -160081, -195433, -180815, -20754, -51370, 38038, 59745, 19099, 102339, 41260, 9740, 41942, 39038, -94445, 90320, 102461, 75241, 108020, -73864, -176563, -164371, 9431, -92033, -1920, 86882, -21821, 55602]
656E5602K3045j53857L5799K530p3651L2126L4936P8886l6297m7114O3743o1743
644d5995l338O9600M2373l1207R279L4434J12807j89525q8181j48921K23865J07178
632I2369j60159l9898n15j4904M2614q761j9357j929J19503p0889K9393k2063
620e4596j19435J67611o3337M8831r7879j002J17734M4985l7787P3256o8562r2868
608h3049R5167N3988m5422j40751J68914n8770M8165j43101k5736K28006j4795
597H2616J5941k20261J56080J42489j97074o1921Q6429J2790j08951o6895Q9992
586f8765M7492q5364J28757q4935J1177K6429q1257P3044m4193N1349J930L4673
574A0337j11631J08217M1226n6260K0633q9151o3842l2149P8924P0686J49347
$$ y = [55602, 78647, -75210, -39411, -36881, -110532, -78406, -43470, 35416, -881, -47995, 15748, -45995, -49333, 20267, 62640, 31433, 40712, 75146, 187953, -1572, -89753, -238674, -14809, 92369, -67790, -107688, -108203, -123107, -80493, -89254, -108611, -110540, 8963, -61926, -32533, -54596, -174031, -6420, -69757, -20926, -118805, -119807, -2073, 42912, 5125, 78381, 9819, -83049, 12118, 66106, 20684, -120067, 48847, -9923, 38242, -104859, -130595, 97411, 82616, 98557, -121704, 34376, 176865, -20209, -82130, 4299, 17089, -91862, -158757, -68765, -21273, -106637, 22120, -62815, -51638, -25209, -106466, -33422, -77615, -26266, -24336, 10337, -101294, 6923, 48149, -8111, 12522, -76629, -140471, -172620, -93696, -23010, 126337]
563A26337r8971K3008N1520r8107j93958L2510J32054k00794J50955J18840Q7907
552A31301j41401m2031k0031O2293j15940O6379J12676k21418j0141M4326L364
541a30623O3930j15076J97363n5513p6401J6883N4090J7109J09865j20514n7835
530i6722p3476J82770o110j29039J99808L1396p2045J4625k3980j41808J62105
519D7524j11390n6442p1473J34674J58173j86543P1606L7474K9629j94114j8783
508a59665L5876J18126j48315R5110Q6471m1479Q786L2121L5627l7526J0617n5644
496a9895K2507j15708K76m2564L4453L161N94m1474Q1962J33993k5766o108L7431
483F2862n2690r0184K5384J518k8917m9461K8968J88064j01281j64087R2981K692
$$ y = [126337, 27366, 50374, 101894, 3787, -190171, -157661, -25607, -226401, -75446, 43394, 131301, -10100, -52131, -72162, -9869, -125809, -59430, 53246, -168172, -178313, -133987, -130623, -66693, -181769, 15594, -39919, -116320, -99437, -45347, -28238, 81627, -38887, -96722, -170198, 12572, 6462, -122577, 77231, 108627, 36582, 51207, 27227, -114581, 47524, -63866, -120308, -191781, -57107, 101066, -85477, -13871, 23603, 53232, -140882, -159665, -123789, -5663, -153978, -58868, 27603, -13876, -5090, 27031, 62658, 25132, 35749, -19895, 2612, -113096, -112820, -155384, -120931, -117770, -117176, -158650, -76688, 57305, 31539, 25431, 62862, 10172, -80012, -54628, -53110, -82027, -131488, -102520, 85544, -15737, -179824, -86843, -84151]
471h4151M865K07093j35448q5402O8482J26040l2342O9429o7758K1704j27818
460c5306J45806k4123j0864o5569p3036j00704J02929J26679k8221J27170k3249
449A41512j73151l3264J42427k1289p7454J09276k6454j3943j2733J2000m4933
438A994N7875l760o2520n0345M840N0758j7297r0533N2815O515N2273P9652j09922
425b7655j40058Q8118J0141r2668P5832K02353q2174l9297M8112j32366J24347
414C4685L330L033j74715M5908R0167o3535L2191J23058o4237q0976N3329n6323
402e4085j16323K21656M1687j23932j91438J08402j4810O126J17562k0444N4360
391B8761L1981R1747k10328p0371q01K3432J50385o7212p1259J7273K54405p2412
$$ y = [-84151, -79286, 127807, -7641, -93043, -24561, 101479, 69137, 138566, 70808, 92512, -35306, 110500, 86377, 75513, 9944, -63092, -163796, -60867, 65812, 37591, 164761, 141512, -31639, -64903, 77524, 56235, -21219, 88057, 61603, 47660, 34927, 46927, 1994, 59869, 56109, -6411, -56756, -51916, -1158, -18455, -108988, -56173, -49658, 2615, 82267, -27655, -167713, -79595, -69454, -162122, -86290, 116063, 33889, -5408, 42704, -89662, 34685, 38015, 41048, -133667, -87759, 2408, -61127, -28936, 94122, 29885, -51091, 2238, -54085, -170408, 51248, 92935, -30997, -222435, -114033, -128843, -122717, -5155, -25599, 28761, 60742, 152489, -57839, -128210, -129011, -105579, 44806, -22406, -93665, -76392, 178013, 105601]
379A05601k41141O6993J22063j00885O5084r3823n3238J78911J13867k25061M5837
368a5792J00645p7280p6709L5642J09238q7060l3846m6255L3302k5395R8990j29883
356a14403L4638j25492O9623p002p0095J53443n684m2986l1282L2715P3185K35161
344B01821o1346j26235L2977j6725n2741L8176n5845n2755J31558J14199l6936
333A16148j54760j4444P8032j08663m7986J30674N3689j02674J39133q2617j41582
322a35050J08984j150o4542o3658R2029K6251n7712K0494j07469O8540J29372
311A6089r3568J61338k1550o3657r924q1036M5216L7108p7031P2585J6231q4126
299h2325J41120o8948j01379J25997L4858j85699R6290k4743M1145M7267r0373
$$ y = [105601, -135540, -68547, 53516, -47369, 17715, -76108, -129346, 49565, 163432, -61629, -15792, 84853, 7573, -69136, -33494, 75744, -11316, -45162, -91417, -58115, -83510, 15480, -114403, -79765, -205257, -135634, -142636, -212731, -59288, -64972, -107958, -139240, -106525, -33340, 201821, 140475, 14240, 47217, 30492, -22249, 15927, -39918, -92673, 38885, 153084, 116148, -38612, -53056, 24976, -83687, -131673, -999, 52690, -49984, 89149, 6532, -135050, -26066, -27216, -91758, -155416, -63387, -37136, -94848, -74354, -181823, -113283, 16089, -77479, 83859, 62309, -1348, -11272, -92308, -47092, -9984, -87015, -14430, 1801, -82325, 58795, -10153, -111532, 14465, 49323, -136376, -40086, -64829, -23684, 23583, -66790]
288f6790n413o0086O829P1403j8605Q3635M738j17109J20304j9524m0440L42M197
275c6519N4972m0666k3003J06687o1102p1076j889q4322O3269R0805j2629m9080
263f4553K2272N7056o9894o0322p7636J24773k6067n582M4321k0458M4613L2115
251F38n0454j14913j878N6277m7199l085J52707l8088J24208m9306J5026j21318
239g7385P0642L7078o3941j36164k3426k5419M8175J01849k4452M970O6661P4619
227E3207j4723l6239J55583k3084o9499M2896o9609K7808j59933J06811K517J5204
215C0939M7377o177o1027j47738j0997J43707j09116l7448p0703K1282K07953
204H052P925j51476R9272j08504J60115Q6404o5938l868k1131R7003j2712j37676
$$ y = [-66790, -72203, -132289, -125460, -54057, -72662, 10973, 15711, -101398, 18906, -618, -41058, -40716, -36519, 18453, -22213, -45216, 61471, 369, -70707, -72596, -156918, -93649, -2844, -15473, -64553, -42281, 14775, -55119, -115441, -193077, -68304, -94371, -99953, -55632, -76090, -31477, 638, -49816, -164729, -166607, -110330, -157529, -160614, -7907, -45995, 78213, 28907, 43933, -77385, -6743, 30335, -33606, -169770, -193196, -218615, -170440, -68591, -93043, -88073, -21412, 53207, 38484, 2245, 157828, 134744, 65245, 108141, 38532, 66340, -93593, 13218, 15735, 30939, 78316, 72139, 11112, -136626, -147623, -3916, -113032, -150480, -221183, -199901, 8052, 15977, -135499, -36227, -144731, 15384, 101788, 35850, 31982, 10851, 107854, 95142, -42534]
192d2534p2699O9122k3717r2357J9331R5013J10237J2388j64522L3139L2552j10880
180a34927K2412l1849Q6602j0316q5813L8411m0812M1040K4431L2606L3726R3108
168F8619J7407o6370r2521m4276J19578q8067K2470K5617o0848P6531J01575l451
156G6264j53680L8910k0034L994j5929j40603P1552l5751l8179Q1223k4031O6879
144h9385r527l8773L5195M9701L1358j8856K1721m0223M7988P8141j66609L9696
132e9573n4971N135O3949k0525J9910J8433m0551j36883p8914J90136m672q648
120a07174O0019N3015l5817J5518K581q3360J17518j28504M4069R9082o5047O850
108b1250j3645j4946p6969J5299k4753M8510M6663q3781M5955P1762J8151K4288
$$ y = [-42534, -115233, -46111, -69828, -162185, -142854, -47841, 62396, 74784, -89738, -56599, -24047, -134927, -112515, -144364, -57762, -68078, -153891, -115480, -156292, -115252, -90821, -58215, -24489, 68619, 86026, 19656, -72865, -117141, 2437, -85630, -63160, -37543, -98391, -21860, 79715, 76264, -77416, -38506, -58540, -54546, -70475, -211078, -139526, -175277, -213456, -132233, -156264, -89385, -98912, -137685, -102490, -52789, -21431, -40287, -18566, -58789, -10801, 67340, -99269, -59573, -114544, -109409, -45460, -65985, -46075, -27642, -68193, -205076, -283990, -93854, -98526, -107174, -47155, 5860, -29957, -14439, -11858, -95218, 22300, -106204, -62135, 36947, -28100, -21250, -34895, -49841, -126810, -111511, -136264, -87754, -41091, -124872, -78917, -7155, 10996, 35284]
96C5284q0171L2745J51345j22756l8375J8223j4682L5631q3401J9833o059O4797
84A2414Q560j2913j01591O7049K328j04783k5839K6166J22976n0166O3462j8229
72a0566O3272j26789N165O7414j02932m7114M4596m4407l1831L0043N8179o9779
60a64749M9051N1365J02267j3230M2050j01622j24529J8683Q8972p6142J10084
49a7800q3362k022K6294j11175Q3462J94448l5600n9845m5361j31195J24839j1919
37f9236M6420o697p9704K0539J10048q0940J3003k1826k7454j03113J41271j28879
25a86568R7948L5639o407j6558n1271P4455P8073j73726M477Q3376j9073O5991
13a3644K6630j71712K8676l9476P0481J22134l92j04908J8066P0257n0283l7959
$$ y = [35284, -44887, -12142, 139203, 16447, -21928, -3705, -18387, 17244, -66157, -46324, -52383, 12414, 20974, 8061, -93530, -26481, -24153, -128936, -154775, -128609, -5633, -55799, 7663, -10566, 52706, -74083, -68918, -1504, -104436, -151550, -106954, -151361, -183192, -153149, -94970, -164749, -115698, -64333, 37934, 24704, 66754, -34868, -159397, -140714, -51742, -127884, -17800, -101162, -103184, -76890, -188065, -104603, 89845, 54245, -5600, -50961, -182156, -57317, -69236, -22816, -29513, -109217, -88678, 21370, -59570, -46567, -68393, -95847, -198960, -57689, -186568, -88620, -52981, -59388, -75946, -127217, -52762, 25311, -148415, -143938, -60562, -79635, -13644, 12986, -158726, -130050, -169526, -99045, 23089, 22697, -82211, -64145, 6112, -44171, -82130]
1h2130M8350
0c3780
$$ y = [-82130, -33780]
$$ Imaginary data points
##PAGE= N=2
##DATA TABLE= (X++(I..I)), XYDATA
16383b984772K2035Q018J8610O5466J40527m9364R7687j5787J12974J10950j7188
16372b490844j07097Q7495J31721Q4017p5831m7433J80146J11599k3114j43093
16362b292434L1536J04377P3419R2986P2729P9532j67605J03750K6274J11560
16352a763876P1724j17682Q2765L7254O5219R8780j8886Q0643M8685P811M9890
16341a357673J256k1134J6733M3670o9849J26477M509N6289R3769K1751Q649O9676
16329a005877O559j5947J3550O9187m3902L3076J65275P0491j35825R4320Q5965
16318f63128J1275M8942L5511j2066m1914J53912r939k7169J19951m3727r007
16307d37359J56651j3386m781J29233r1583k0894J02588R4196L1553J23951n6971
$$ y = [-2984772, -2962737, -2954719, -2936109, -2870643, -2730116, -2779480, -2681793, -2697580, -2584606, -2473656, -2490844, -2597941, -2510446, -2378725, -2294708, -2370539, -2417972, -2237826, -2126227, -2149341, -2292434, -2260898, -2156521, -2083102, -1990116, -1917387, -1837855, -2005460, -1901710, -1875436, -1763876, -1692152, -1809834, -1727069, -1689815, -1624596, -1525816, -1544702, -1464059, -1415374, -1407563, -1357673, -1356417, -1377551, -1360818, -1317148, -1386997, -1260520, -1256011, -1199722, -1105953, -1084202, -1075553, -1005877, -999318, -1015265, -1001715, -932528, -976430, -943354, -778079, -707588, -843413, -749093, -663128, -651853, -602911, -567400, -579466, -621380, -467468, -477407, -504576, -384625, -428352, -437359, -280708, -294094, -298875, -169642, -261225, -282119, -179531, -85335, -53782, 70169, 13198]
16296A3198Q7435k519J05730O9190n9312L0191j34782q803Q2752M0530O1980m9329
16284B36261N1922J58481K8594N2406j5728k4123l2311J09694l4071j5521L1052
16273E46656J13533J08427L7321K2325j07101p9945J50261P6533p2449P6076P67
16262H72404o005j9777q80J73115Q8197j21149Q9628K2879p9504N3692o231Q0751
16250A147120j1421Q8700P0936j09039N2969J40551N9060p126l1053J1834j9441
16239A393090L2655J7415P0729o8229n8357Q9898J14509j26951l237K5498L9616
16228A526636J52032m6362N6871O8582J7060K2551r0911J58036O3773j10846o0309
16217A757113J8177o9397m6805O9479J41048P2696p6506Q4697O3270k744k5121
$$ y = [13198, 100633, 98114, 203844, 273034, 213722, 243913, 109131, 100328, 183080, 223610, 285590, 236261, 288183, 446664, 475258, 527664, 511936, 487813, 455502, 565196, 531125, 515604, 546656, 660189, 768616, 805937, 828262, 721161, 641216, 791477, 868010, 795561, 871637, 872404, 866399, 846622, 845742, 1018857, 1107054, 985905, 1075533, 1098412, 1018908, 1072600, 1066369, 1147120, 1135699, 1224399, 1295335, 1186296, 1239265, 1379816, 1438876, 1431750, 1400697, 1412531, 1393090, 1425745, 1443160, 1513889, 1445660, 1387303, 1477201, 1591710, 1464759, 1461522, 1487020, 1526636, 1678668, 1632306, 1689177, 1757759, 1774819, 1797370, 1706459, 1864495, 1928268, 1817422, 1757113, 1775290, 1705893, 1659088, 1728567, 1869615, 1942311, 1865805, 1950502, 2013772, 2011028, 1985907]
16206A985907l364K06559p5027K8520j02893r6274K33267J3971m1791l222m9727
16195B095926J3713N7626l4779k386J50509J07791j39214j03226q127P2357k937
16184B207253K5744P4163n3804J8782L9563P8356J5626k46625R9096J16109M3070
16173B417333n9458N6778O8040N5390q6759k4165n4708l0740J23903J0870O9763
16162B546247M2870k9291L7062L8629l3030l5285J06699J01799p9927n4015N7601
16151B699359o2238M7286o6114p400k3934k0365K04200k2284j70511O4647j4927
16140B627719j8867Q7619K9485L4584k9814j19971R2854l4665L1399N211j15655
16129B589899P3409M0991K6589q724J5489j15217P2838r960o0061M5989N7756
$$ y = [1985907, 1982543, 2189102, 2114075, 2142595, 2039702, 1943428, 2176695, 2190666, 2148875, 2145653, 2095926, 2109639, 2167265, 2132486, 2130100, 2280609, 2388400, 2249186, 2145960, 2137833, 2210190, 2207253, 2232997, 2307160, 2253356, 2272138, 2311701, 2390057, 2405683, 2159058, 2258154, 2374263, 2417333, 2357875, 2414653, 2482693, 2538083, 2451324, 2427159, 2372451, 2341711, 2465614, 2476484, 2546247, 2589117, 2559826, 2596888, 2635517, 2602487, 2567202, 2673901, 2775700, 2695773, 2641758, 2699359, 2637121, 2684407, 2618293, 2610893, 2586959, 2566594, 2770794, 2748510, 2577999, 2642646, 2627719, 2608852, 2696471, 2725956, 2760540, 2730726, 2610755, 2703609, 2668944, 2700343, 2705554, 2589899, 2663308, 2704299, 2730888, 2722164, 2737653, 2622436, 2695274, 2685314, 2625253, 2671242, 2728998]
16118B728998j4698Q7440m4863M8608j68016J72556J40744j33608J20483o8143
16108B869501k6614M2688Q8755q7636M9067o762R8992r8376m157M095q9474J98692
16096C038771j60555K2993O5677P2652p1376P3279j5289n9742q0654M1272j0992
16085B916036q5032K46949p6877k8527M0400K0744o9706P6157j9326m0621k0856
16074B959341R2401p4977o1705J12878n4054L0668m71K52677r7678j13037q1730
16063B964313K555K29342m488l2527j49096L7815N147K5255q3661J57746k41740
16052B910661J01489j7896l0349K2650m0161J6233j7472J63124j2499J00115r987
16041C185908j73675n4599J70605j04324m8168J257j9818n841J78904l992o2084
$$ y = [2728998, 2714300, 2801740, 2756877, 2805485, 2637469, 2810025, 2950769, 2817161, 2937644, 2869501, 2842887, 2885575, 2974330, 2886694, 2935761, 2928999, 3027991, 2929615, 2925458, 2929553, 2840079, 3038771, 2878216, 2901209, 2966886, 3039538, 2968162, 3041441, 3026152, 2966410, 2885756, 2927028, 2916036, 2831004, 3077953, 3001076, 2972549, 3012949, 3033693, 2963987, 3040144, 3020818, 2980197, 2959341, 3051742, 2976765, 2915060, 3027938, 2973884, 3004552, 3004081, 3256758, 3159080, 3046043, 2964313, 2966868, 3196210, 3191722, 3159195, 3010099, 3047914, 3053061, 3078316, 2994655, 3152401, 2910661, 3012150, 2994254, 2963905, 2986555, 2946394, 2962627, 2945155, 3108279, 3095780, 3195895, 3185908, 3012233, 2957634, 3128239, 3023915, 2975747, 2977004, 2957186, 2951345, 3130249, 3126257, 3064173]
16030C064173m7679J37613j27613j18505K7369L4923J6021O0164l9916j9645n4758
16019B932147N1746P2442M4622M797Q3955k00049q5967N9103o5642j519J22636
16008C018271P4743J13208J01560j80245K3202r0523j13402O6017m9351R941j9108
15997B954313J15230j41987O3318J42041K1890l2866j25202p394q6467J16578
15987C019454Q1958K5711r2049K5677M6391q7980j00810j5522R6405o2051O0730
15976B997914M0232j34768K8446K1777J19047m9088P9163L3317p0990l2316l3592
15965B999142P6405Q8183k2848m9583m6338j15663J64514l8643j07026J51589
15955C099732j1620J4129P9630j84371J6172K08405j10835j19642J87668r4650
$$ y = [3064173, 3016494, 3154107, 3026494, 2907989, 2935358, 2970281, 2986302, 3046466, 3006550, 2986905, 2932147, 2983893, 3056335, 3100957, 3105754, 3189709, 2989660, 2903693, 2962796, 2897154, 2895635, 3018271, 3093014, 3206222, 3307782, 3127537, 3150739, 3060216, 2946814, 3012831, 2963480, 2973421, 2954313, 3069543, 2927556, 2990874, 3132915, 3154805, 3121939, 2996737, 2989343, 2902876, 3019454, 3101412, 3127123, 3035074, 3060751, 3107142, 3019162, 2918352, 2902830, 2999235, 2937184, 2997914, 3038146, 2903378, 2931824, 2953601, 3072648, 3023560, 3102723, 3136040, 3065050, 3032734, 2999142, 3075547, 3163730, 3140882, 3091299, 3044961, 2929298, 3093812, 3055169, 2948143, 3099732, 3088112, 3102241, 3181871, 2997500, 3013672, 3222077, 3111242, 2991600, 3179268, 3084618]
15945C084618p9044J36821k05367Q6197j5393N3264O7794j24779m243l5951J7389
15934B981306J70560j46497L3467j8297Q0228O0307p4763j98952K50652M9246
15924C187257j44428L0349O8279p5600n6333n9610K5870M7951M9060R5385q5348
15913C082832q206K657N0323o8993J01580j55569R0055O6535q2701j48781K2647
15902B952379J48556M3292J7206k2945j21147j10133J18297L9559N2784N275K5049
15891C148172j8117j98090J69159L0258o5916j5267q6312O1944J0622l7607K9478
15880C028324q860p0674J62233L0215p6958J6553P7415q6348j16236J14120j16348
15869B953436J73258Q9332k73032J30176Q136k5616k4746o8272J47739P8093q8636
$$ y = [3084618, 3005574, 3142395, 2937028, 3023225, 3007832, 3061096, 3128890, 3004111, 2999868, 2963917, 2981306, 3151866, 3005369, 3038836, 3020539, 3100767, 3161074, 3086311, 2887359, 3138011, 3187257, 3042829, 3073178, 3141457, 3065857, 3009524, 2949914, 2975784, 3023735, 3072795, 3168180, 3082832, 3074626, 3077283, 3127606, 3058613, 3160193, 3004624, 3094679, 3161214, 3078513, 2929732, 2952379, 3100935, 3144227, 3161433, 3138488, 3017341, 2907208, 3025505, 3065064, 3117848, 3123123, 3148172, 3130055, 2931965, 3101124, 3131382, 3065466, 3050199, 2963887, 3025831, 3036453, 2998846, 3028324, 3019464, 2948790, 3111023, 3141238, 3064280, 3080833, 3158248, 3071900, 2955664, 3069784, 2953436, 3126694, 3216026, 2942994, 3073170, 3081306, 3055690, 3030944, 2962672, 3110411, 3188504, 3099868]
15858C099868o5660P739P8437j25254l3532O5617n6449k7932J01880N8390j4497
$$ y = [3099868, 3034208, 3041947, 3120384, 2995130, 2961598, 3027215, 2970766, 2942834, 3044714, 3103104, 3088607]
$$ [...]
##END NTUPLES=NMR SPECTRUM
##END=
