##TITLE=1H_CG-1208-X41
 CDCl3
 8 sc, 
 9.9.2024
##JCAMPDX= 6.0         $$ Bruker NMR JCAMP-DX V2.0
##DATA TYPE= NMR SPECTRUM
##DATA CLASS= NTUPLES
##ORIGIN= UXNMR, Bruker Analytische Messtechnik GmbH
##OWNER= root
$$ XWIN-NMR		Version 3.5
$$ Mon Sep  9 14:16:55 2024 Russian Standard Time (UT+4h)  she@DPX200
##.OBSERVE FREQUENCY= 200.1318
##.OBSERVE NUCLEUS= ^1H
##.ACQUISITION MODE= SIMULTANEOUS
##.ACQUISITION SCHEME= undefined
##.AVERAGES= 8
##.DIGITISER RES= 18
##SPECTROMETER/DATA SYSTEM= spect
##.PULSE SEQUENCE= zg30
##.SOLVENT NAME= CDCl3
##.SHIFT REFERENCE= (INTERNAL, CDCl3, 0, 21.0017)
##AUDIT TRAIL= $$ (NUMBER, WHEN, WHO, WHERE, WHAT)
$$ ##TITLE= Audit trail, XWIN-NMR		Version 3.5
$$ ##JCAMPDX= 5.01
$$ ##ORIGIN= Bruker BioSpin GmbH
$$ ##OWNER= she
$$ F:/spectra/data/she/nmr/H-F/1/pdata/1/auditp.txt
$$ ##AUDIT TRAIL=  $$ (NUMBER, WHEN, WHO, WHERE, WHAT)
(   1,<2024-09-09 14:15:41.78 +0400>,<she>,<DPX200>,
      <created by zg, POWCHK disabled, PULCHK disabled
       configuration hash MD5:
       00 E9 B6 7A A2 85 ED C7 34 08 36 98 17 FE 4E 26
       data hash MD5: 16K
       25 19 74 A3 ED 2E B1 9D 8B 58 EE 48 31 2C B6 66>)
(   2,<2024-09-09 14:15:44.32 +0400>,<she>,<DPX200>,
      <Start of raw data processing
       efp BC_mod = 2 LB = 0.24 FT_mod = 6 PKNL = 1 PHC0 = -25992.54 PHC1 = 10.78748 SI = 16K 
       data hash MD5: 16K
       72 E9 41 A6 5F 77 2D BE 3E 7A F9 CF F9 01 36 31>)
(   3,<2024-09-09 14:16:07.56 +0400>,<she>,<DPX200>,
      <pk PHC0 = 2.644031 PHC1 = -3 
       data hash MD5: 16K
       8F BF 4E 0E EE EF 71 97 90 E0 1C A5 2C 5A 6B 7C>)
(   4,<2024-09-09 14:16:11.59 +0400>,<she>,<DPX200>,
      <abs ABSG = 5 
       data hash MD5: 16K
       ED 27 17 A9 47 A4 70 3C 6D 75 C5 C7 A0 8E 22 7C>)
$$ ##END=
$$ 
$$ hash MD5
$$ DE 3C F6 67 6D E6 80 C2 EC FE E1 1F AA 7C 4A 50
##$RELAX= 
##$RELAX= 
##$RELAX= 
##$RELAX= 
##$RELAX= 
##$RELAX= 
$$ Bruker specific parameters
$$ --------------------------
##$DU= <F:/spectra>
##$EXPNO= 1
##$NAME= <H-F>
##$PROCNO= 1
##$TYPE= <nmr>
##$USER= <she>
##$AMP= (0..31)
100 100 100 100 100 100 100 100 100 100 100 100 100 100 100 100 100 100 
100 100 100 100 100 100 100 100 100 100 100 100 100 100 
##$AQSEQ= 0
##$AQ_mod= 1
##$AUNM= <au_zg>
##$AUTOPOS= <>
##$BF1= 200.13
##$BF2= 200.13
##$BF3= 200.13
##$BF4= 200.13
##$BF5= 200.13
##$BF6= 200.13
##$BF7= 200.13
##$BF8= 200.13
##$BYTORDA= 1
##$CFDGTYP= 0
##$CFRGTYP= 5
##$CHEMSTR= <none>
##$CNST= (0..31)
1 1 145 1 1 1 1 1 1 1 1 1 1 1 1 1 1 1 1 1 1 1 1 1 1 1 1 1 1 1 1 1 
##$CPDPRG= <>
##$CPDPRG1= <>
##$CPDPRG2= <>
##$CPDPRG3= <>
##$CPDPRG4= <mlev>
##$CPDPRG5= <mlev>
##$CPDPRG6= <mlev>
##$CPDPRG7= <mlev>
##$CPDPRG8= <mlev>
##$CPDPRGB= <>
##$CPDPRGT= <>
##$D= (0..31)
0 1.2 0 0 0 0 0 0 0 0.06 0 0.03 0 0 0 0 0.0002 0 0 0 0 0 0 0 0 0 0 0 0 
0 0 0 
##$DATE= 1725876941
##$DBL= (0..7)
120 120 120 120 120 120 120 120 
##$DBP= (0..7)
150 150 150 150 150 150 150 150 
##$DBP07= 0
##$DBPNAM0= <>
##$DBPNAM1= <>
##$DBPNAM2= <>
##$DBPNAM3= <>
##$DBPNAM4= <>
$$ [...]
##$SUBNAM3= <"">
##$SUBNAM4= <"">
##$SUBNAM5= <"">
##$SUBNAM6= <"">
##$SUBNAM7= <"">
##$SUBNAM8= <"">
##$SUBNAM9= <"">
##$SW= 24.0689170037331
##$SWIBOX= (0..15)
0 0 2 0 0 0 0 0 0 0 0 0 0 0 0 0 
##$SW_h= 4816.95568400771
##$TD= 16384
##$TD0= 1
##$TE= 0
##$TE2= 300
##$TE3= 300
##$TEG= 300
##$TL= (0..7)
0 120 120 120 120 120 120 120 
##$TP= (0..7)
150 150 150 150 150 150 150 150 
##$TP07= 0
##$TPNAME0= <>
##$TPNAME1= <>
##$TPNAME2= <>
##$TPNAME3= <>
##$TPNAME4= <>
##$TPNAME5= <>
##$TPNAME6= <>
##$TPNAME7= <>
##$TPOAL= (0..7)
0.5 0.5 0.5 0.5 0.5 0.5 0.5 0.5 
##$TPOFFS= (0..7)
0 0 0 0 0 0 0 0 
##$TUNHIN= 0
##$TUNHOUT= 0
##$TUNXOUT= 0
##$USERA1= <user>
##$USERA2= <user>
##$USERA3= <user>
##$USERA4= <user>
##$USERA5= <user>
##$V9= 5
##$VALIST= <valist>
##$VCLIST= <CCCCCCCCCCCCCCC>
##$VD= 0
##$VDLIST= <DDDDDDDDDDDDDDD>
##$VPLIST= <PPPPPPPPPPPPPPP>
##$VTLIST= <TTTTTTTTTTTTTTT>
##$WBST= 1024
##$WBSW= 4
##$XGAIN= (0..3)
0 0 0 0 
##$XL= 0
##$YL= 0
##$YMAX_a= 308331
##$YMIN_a= -295644
##$ZGOPTNS= <>
##$ZL1= 120
##$ZL2= 120
##$ZL3= 120
##$ZL4= 120
##$ABSF1= 20.95472
##$ABSF2= -3.114412
##$ABSG= 5
##$ABSL= 3
##$ALPHA= 0
##$AQORDER= 0
##$ASSFAC= 0
##$ASSFACI= 0
##$ASSFACX= 0
##$ASSWID= 0
##$AUNMP= <proc_1d>
##$AZFE= 0.1
##$AZFW= 0.1
##$BCFW= 0
##$BC_mod= 2
##$BYTORDP= 0
##$COROFFS= 0
##$CY= -3
##$DATMOD= 1
##$DC= 0
##$DFILT= <>
##$DTYPP= 0
##$F1P= 0
##$F2P= 0
##$FCOR= 1
##$FTSIZE= 16384
##$FT_mod= 6
##$GAMMA= 0
##$GB= 0
##$INTBC= 1
##$INTSCL= 3.70164e-10
##$ISEN= 128
##$LB= 0.24
##$LEV0= 0
##$LPBIN= 0
##$MAXI= 10000
##$MC2= 0
##$MEAN= 0
##$ME_mod= 0
##$MI= 1.114404
##$NCOEF= 0
##$NC_proc= -7
##$NLEV= 6
##$NOISF1= 3.799351
##$NOISF2= 2.8
##$NSP= 0
##$NTH_PI= 0
##$NZP= 0
##$OFFSET= 21.00173
##$PC= 1
##$PHC0= -25989.89
##$PHC1= 7.78748
##$PH_mod= 1
##$PKNL= yes
##$PPARMOD= 0
##$PSCAL= 0
##$PSIGN= 0
##$REVERSE= no
##$SF= 200.13000540173
##$SI= 16384
##$SIGF1= 3
##$SIGF2= 2
##$SINO= 5.538805
##$SIOLD= 16384
##$SREGLST= <1H.CDCl3>
##$SSB= 0
##$STSI= 16384
##$STSR= 0
##$SW_p= 4816.95568400771
##$SYMM= 0
##$S_DEV= 0
##$TDeff= 16384
##$TDoff= 0
##$TI= <>
##$TILT= no
##$TM1= 0
##$TM2= 0
##$TOPLEV= 0
##$USERP1= <user>
##$USERP2= <user>
##$USERP3= <user>
##$USERP4= <user>
##$USERP5= <user>
##$WDW= 1
##$XDIM= 16384
##$YMAX_p= 457338945
##$YMIN_p= -686232
$$ End of Bruker specific parameters
$$ ---------------------------------
##NTUPLES= NMR SPECTRUM
##VAR_NAME=  FREQUENCY,     SPECTRUM/REAL,   SPECTRUM/IMAG
##SYMBOL=    X,             R,               I
##VAR_TYPE=  INDEPENDENT,   DEPENDENT,       DEPENDENT
##VAR_FORM=  AFFN,          ASDF,            ASDF
##VAR_DIM=   16384,         16384,           16384
##UNITS=     HZ,            ARBITRARY UNITS, ARBITRARY UNITS
##FACTOR=    0.29402158847633, 1,            1
##FIRST=     4203.07633138314, 0,            0
##LAST=      -613.879352624566, 0,           0
##MIN=       -613.879352624566, -686232,     0
##MAX=       4203.07633138314, 457338945,    0
$$ Real data points
##PAGE= N=1
##DATA TABLE= (X++(R..R)), XYDATA
$$ [...]
7641 811970 944399 981138 775537 525895 697925 1094085 675000 807460 1019111 1010808
7631 1010808 800316 1097007 1288905 1083621 1226224 949127 1068612 941173 855033 845210
7621 845210 1293194 994018 1046512 1039469 1065738 1188278 1240176 1256261 1414726 1245044 1453023
7610 1453023 1396087 1505140 1283860 1466083 1367681 1457104 1218231 1158977 1693681 1407094
7600 1407094 1401241 1571263 1673831 1460284 1685456 1814320 1671098 1645636 1618418 1739413
7590 1739413 1499534 1618732 1636176 1472245 1582491 1594837 1936935 1839641 2056249 2036848
7580 2036848 2084307 2152414 2244534 2145622 2282964 2590542 2973850 2735044 2470450 2272110
7570 2272110 2344073 2627517 2507760 2270934 2625329 2627617 2983766 3039538 3660588 4208675
7560 4208675 4398557 4634842 4753995 4990153 5674165 6417576 6649538 6659752 6883399 6542995
7550 6542995 6625130 6337898 5733024 5452849 4945163 4431797 4044974 3687033 3587220 3674070
7540 3674070 3561898 3441082 3852200 3929202 3893028 4117520 4538076 4977375 5302034 5355781
7530 5355781 6068338 6625960 7159105 7375736 7422165 7235655 6716281 6653542 6071097 5688922
7520 5688922 5194493 4897601 4211421 3878288 3231473 2940975 2851847 2518559 2623850 2340451
7510 2340451 2048703 2142068 2077941 1910580 1745629 1876323 1837400 2002883 2056998 2044536
7500 2044536 1701721 1616320 1904528 1841457 1631939 1858718 1848722 1765748 1752962 1782578 1728992
7489 1728992 1610969 1853426 1658812 1529616 1832708 1371465 1187291 1180369 920666 1346287
7479 1346287 1232183 1221408 1094862 1374243 1717996 1238683 1223154 927440 1151131 1274951
7469 1274951 1425090 1359393 1206151 1250620 1299287 1146237 1095265 1072148 1329727 1387907 1282630
7458 1282630 1058084 989522 1341196 970006 1055127 1411508 1008382 1015058 1117201 924687
7448 924687 901844 739211 744512 1093353 1026372 1209857 1205902 1268457 1069434 796134 1121159
7437 1121159 1095269 995340 1055876 875423 902587 1148836 1042374 839900 1002678 1030970
7427 1030970 831741 570781 880920 996991 695464 726314 631776 700337 797744 586828
7417 586828 588858 633298 518221 869237 906240 708056 749222 954949 723640 740518 866757
7406 866757 805783 451538 888619 940514 710954 661249 798937 981020 644876 868356
7396 868356 1059808 1086132 1273813 917745 807926 780927 1076028 1332735 1129859 990196
7386 990196 942398 948892 1319597 1074643 1007262 922990 1125177 1076557 909791 1531521 1623537
7375 1623537 1454833 1186716 1396363 1411365 1478291 1719716 1807658 1893931 1994306 2107285
7365 2107285 2500644 2604364 3204125 3225708 3181528 3548842 4181148 4613809 5093867 5336657
7355 5336657 5365915 5266386 5482930 5634833 5753822 5965810 5883714 5634081 5386106 5370743
7345 5370743 5517092 5152578 5131738 4713168 4041409 3917231 3739875 3338338 3702923 3926919
7335 3926919 3697033 3635818 3737920 4007636 4229870 4476279 4633273 5121557 5247501 5474766
7325 5474766 5721271 5903984 5843605 5923507 5714952 5853340 6016339 5935613 5668891 5595644
7315 5595644 5207220 5198694 4773694 4319125 3885561 3701491 3548479 3376301 3030696 2986697
7305 2986697 3096250 2829207 2351953 2440966 2543911 2671421 2522377 2577915 2478971 2515790
7295 2515790 2537047 2530199 2572115 2216880 1986732 2417259 2463661 2616840 2624608 2611944 3243184
7284 3243184 3192326 3035848 3321207 3663376 3647311 3701302 3518804 3578831 3643435 3368189
7274 3368189 3514139 3242764 2849961 3049312 3087415 3137954 3628959 3727946 3677092 3597464
7264 3597464 3793753 3698104 3106115 3027677 2997463 2891082 2866572 3285779 3098023 3252490
7254 3252490 3279493 3341852 3407394 3878350 4126478 4275912 4062376 4196661 4425408 3729577
7244 3729577 3772927 3595941 3572794 3599461 3704707 3618424 3685188 3934272 4139593 4516532
7234 4516532 4664351 4880537 4528222 4151437 4020647 4169817 3971527 3897426 4094131 4181956
7224 4181956 3981799 4326782 3988902 4040460 4270756 4255105 4579865 4415968 4388928 5133213
7214 5133213 5577394 5492937 5470160 5736703 6186506 6695596 7351995 7576679 7814775 8659903
7204 8659903 9066811 9172124 9301281 9452971 9210733 9294801 9491103 9257909 9500228 10168906
7194 10168906 10919065 11551928 12698050 13786405 15092649 16461464 17734064 18833850
7186 18833850 19395972 20156144 20379885 20208789 20073820 19434373 19165312 18780083 18349432
7177 18349432 17951266 17731645 17265801 16448203 16213141 15589523 15187946 15062948 15115994 14980525
7167 14980525 14573397 14111166 14283028 14277166 14101590 13857088 13362866 13128873 12631804 11997570
7157 11997570 11252297 10532063 9824552 9147099 8522922 7957414 7482178 7208762 6685295
7148 6685295 6397880 6361545 6339444 6243322 6141325 5873801 5827558 5898806 5978373 6149220 5909607
7137 5909607 5927241 5791291 5564658 5370936 5274503 4983464 4817546 4784186 4756063 4551575
7127 4551575 4466901 4427104 4286567 4207894 4173082 4279794 4418483 4507412 4422160 4465582 4287320
7116 4287320 4166718 4555902 4599722 4432671 4230663 4338153 4299137 4404401 4537385 4376028
7106 4376028 4531826 4522892 4650797 4892521 4879602 4755762 4958250 4887432 5067490 5246859
7096 5246859 5383300 5669221 5577820 5384425 5544002 5689675 5612737 5628079 5457853 5706292
7086 5706292 6210336 6400742 6643472 6699594 6639708 6689227 7354488 7376074 7460296 7507027 7731159
7075 7731159 8200621 8048976 8273762 8892096 9147485 9434689 9634297 10181335 10663035 11225976
7065 11225976 11540979 11661771 11984592 12552725 13084771 13831498 14289903 14909529 15585178
7056 15585178 16584455 17218819 18334558 19379495 20937561 22656674 24897937 27308587
7048 27308587 30107733 33469831 37741484 43139215 49538947 56456265 66054225 74021587
7040 74021587 72894783 67007577 59209763 51511310 45852402 42725977 40818687 39444372
7032 39444372 38955338 38907929 39450714 40954653 41565739 42379095 41819257 41064754 40093792
7023 40093792 38273076 36602337 35320531 34631923 34588909 34844497 35748421 36974324 38429239
7014 38429239 40538131 42863571 44289441 44442560 44433965 43412925 41666698 40037182 38680096
7005 38680096 37963202 37647472 37524473 37812642 38730743 39942615 41351373 42367670 42415475
6996 42415475 41566528 40283703 37992319 35043005 32350849 29566434 27425367 26006501
6988 26006501 24561182 23194296 22376300 21395874 20612275 20368831 20164324 20369961 20492018
6979 20492018 20942479 20953819 20895652 20874681 20819843 21143948 20876313 20473135 20428680 20435622 20188972
6968 20188972 19871088 19238089 18656659 18078968 17625472 16878014 16461213 16368012 16236936 16022133
6958 16022133 15722926 15583435 15218450 14990616 14965395 14752413 14813409 15134363 15282510 15609327
6948 15609327 15772982 16169306 16693973 17102719 17295398 17588838 17923881 18352243 18892131
6939 18892131 19704645 20151848 20850521 21332930 21937329 22901813 23917755 25020298 26677859
6930 26677859 28671268 30779510 32998180 34836776 35685555 36276145 37033689 37042090 36881127
6921 36881127 36788405 36890230 36942564 36683581 36208542 35078032 33977255 32160742 29623874
6912 29623874 27276628 25127347 23553679 22718079 21873578 21606493 21070355 20734374 20749481
6903 20749481 20886296 21422863 22167247 22762252 23856090 25432154 27653625 29728411 31408405
6894 31408405 32788203 33539295 34017633 34140492 34095688 33669472 33616682 33623675 33389640 32850899
6884 32850899 31536565 29550055 27782006 25124376 22866912 20622773 18509483 16706340
6876 16706340 15131795 14145563 13511304 12556391 11697017 11125905 10854390 10352851 9962447
6867 9962447 9552074 9395366 9222625 9010687 8840134 8569530 8020407 7959491 7693545 7628495
6857 7628495 7561479 7272630 7301768 6961338 6523446 6489143 6699089 6349946 6342688 6195914
6847 6195914 5871726 5908322 5862992 6057203 5872934 5732831 5509316 5526963 5807226 6009431
6837 6009431 5962580 5959251 6178907 6353626 6198554 6162386 6348927 6568367 6826685 7004020
6827 7004020 6980644 6629204 6795328 6750637 6828020 6674702 6858610 6531403 6304965 6537421
6817 6537421 6609230 6500594 6288126 6221191 6511548 6496389 6572395 6200727 6110700 6377781
6807 6377781 6581749 7121339 7240857 7279573 7759461 8121129 8268498 8540376 8922384 8944330
6797 8944330 8938735 9526676 9276726 9617815 9820936 9994835 9867229 10231785 10420971 10372331
6787 10372331 10911837 11338617 12088794 12537200 13316759 14441345 15450913 17209504 18589769
6778 18589769 19967279 20736378 21289494 21913521 21812449 21666230 22013513 22178644 22296213
6769 22296213 22242899 21949146 21616684 21176513 20630416 19447040 18537370 17739085 17405122
6760 17405122 17285965 16908603 16952029 17059766 17402467 18054734 18666932 19681529 20824851
6751 20824851 22066980 23975536 25954063 28315439 30259789 31436555 32177060 32201767 32003702
6742 32003702 31557071 31625962 31663530 31440248 31150218 30349711 29159385 27482175 25554966
6733 25554966 24013883 21990632 20049454 18673103 17587884 16279532 15681224 14858354
6725 14858354 14356239 14207793 14299209 14571094 14659385 14881505 15501627 16125322 16883354 17748861
6715 17748861 17809521 17910341 17986535 17643604 17222599 16890023 16907129 16260220 16008264 15567507
6705 15567507 14709539 13763870 12693127 11703246 10532965 9540115 8704589 8254580 7778700
6696 7778700 7590997 7185053 6764578 6467066 6077096 5756523 5558331 5263857 5038625 4930053
6686 4930053 4803302 4737991 4100650 4120155 4056174 3900917 3888847 3724593 3542572 3126812
6676 3126812 3655854 3730658 3264434 3375588 3161193 3097952 2915012 3075840 2720694 2402369
6666 2402369 2607642 2752753 2846738 2581837 2476771 2027297 2013289 1973219 2365979 2425319
6656 2425319 2369700 2176142 2126936 2003218 1734631 1858919 1793046 1639855 1797848 1961013
6646 1961013 1841312 1681801 1928230 1926522 1811649 1407578 1370767 1394776 1382321 1697000
6636 1697000 1104391 1143730 1292955 1548984 1379370 1352320 1219211 1316976 1229496 1208750
6626 1208750 1202295 1348219 1284958 1198917 1231594 1093058 1087544 876818 754164 983865 989483
6615 989483 823614 1023927 1075802 820346 919564 1179291 1155916 971813 638352 743106
6605 743106 642455 814811 863742 776561 587631 715156 888584 1004288 548412 582995
6595 582995 743127 440401 621036 819449 713926 875744 867633 727354 730702 701575 533283
6584 533283 747117 644962 529879 102446 302176 407257 490461 448895 328444 345207
6574 345207 371326 476992 719255 735353 788537 896093 997011 795512 937877 808699
6564 808699 824367 764397 373734 574045 352905 522421 403802 500261 266721 287725
6554 287725 190545 363498 370135 620341 621748 605840 804850 559979 446775 478898 549484
6543 549484 406665 313040 620067 575065 486532 604151 390180 300061 429102 458665 349660
6532 349660 786185 512465 368364 270417 299878 653899 572924 845560 567381 555751
6522 555751 274842 251764 155721 144231 113562 231616 178410 369843 440327 457882 239974
6511 239974 202827 134318 -53905 68845 288851 282665 97167 46772 89508 196074 124066
6500 124066 186384 215937 352490 451688 679465 257291 269171 377635 74696 4598 317672
6489 317672 365946 210627 288669 206642 74795 153024 350559 294617 258506 396170 294899
6478 294899 889373 527653 411335 581394 508847 454617 199834 633918 695723 512844
6468 512844 562851 264257 417702 270740 397954 370980 343925 323485 256744 60830 147168
6457 147168 472215 298412 10083 -86507 171836 362507 342364 371966 191333 257197
6447 257197 105398 -160858 -183341 -86028 -235598 111246 224221 -21962 194272 307157
6437 307157 118934 -6020 351848 139688 -29553 89055 -197438 20559 244987 279466
6427 279466 549652 703594 639479 468928 282210 28563 71505 498508 169375 786
6417 786 57890 -10990 62467 47892 76883 -17738 -175415 -246111 114603 -181386 30434
6406 30434 247794 366965 268245 -143136 -176885 -2442 -68877 155914 30908 247870
6396 247870 -114092 -73724 217273 365345 273508 283150 -70216 77617 152167 158600 93562
6385 93562 -59503 -413478 -76033 259243 272297 41302 199119 -54067 116407 134800
6375 134800 -20263 -167393 -29496 165344 232022 85137 -86645 19075 47104 902
6365 902 -3136 69158 -70740 128474 -19458 16705 115695 30139 -101301 -53671 -242081
6354 -242081 92254 -20854 -101274 -199694 -234186 -95427 57065 432997 482754 156334
6344 156334 330602 254264 179461 213426 31353 -187001 -123102 -183783 -58692 -47421 171998
6333 171998 191632 -263977 -378435 21270 -35204 -387460 -184910 -195298 -365533 -238234
6323 -238234 -123131 -62145 -189925 -256126 -180040 -358790 -113517 159257 -341364 -253461
6313 -253461 -135742 -64603 -306716 -261812 39516 -402447 -272468 -283941 -267000 -179101 -160361
6302 -160361 -68456 -21666 -135091 -193410 64756 -359 9047 -121659 98611 -70933 154084
6291 154084 60823 378947 352317 7856 9471 178267 140411 62986 9979 -107900 138266
6280 138266 36112 -218677 27262 -114896 -101232 -43399 35732 96611 -74977 -238107
6270 -238107 -289790 -209348 337413 248434 119034 216756 31283 -215729 -394210 -109315
6260 -109315 50093 55303 -305113 -525089 -427911 -212638 -135287 -471747 -343122 95885
6250 95885 47268 -70964 -29475 -181184 -232137 -274330 -127172 -70721 -79495 -16938 120065
6239 120065 -174115 -39307 220459 411354 137239 89530 28846 -365819 -276689 -2895
6229 -2895 -102157 124573 184252 -137689 27533 87371 -35216 -137612 196031 57200 -38015
6218 -38015 -341207 -260430 -283067 -193754 -338246 -493595 -285508 157542 61588 11112 297795
6207 297795 280162 147709 234565 27917 203197 48249 206579 -78847 -89972 304578
6197 304578 304396 136978 41104 84816 -113300 213723 589770 423050 323660 325418 90883
6186 90883 -48680 -35719 -242999 -121304 -112165 -1607 132907 169396 21320 107667 -313998
6175 -313998 -190850 173734 261914 171818 235635 203045 -42447 99507 60126 -28961 -169843
6164 -169843 -275601 112524 65251 -131824 -350318 -212379 -109221 -86396 202527 -91477
6154 -91477 -18555 399935 -54345 -258606 160545 233161 208767 475567 -52938 132340
6144 132340 257066 135808 43152 -67982 -62649 -263915 -188513 -13642 -131817 -30551
6134 -30551 41038 84937 113562 17495 85204 -46342 62588 -315682 -269762 -90214 -130000
6123 -130000 -309448 -111395 54344 -144887 6865 -115801 -62870 98547 -18533 -178112
6113 -178112 -7607 182834 -186612 -179743 -220815 -46266 147993 463899 250433 132140
6103 132140 42715 -226948 -252259 -34686 191 90345 71956 238579 292525 306632 106366
6092 106366 41808 103113 29534 -84711 -190234 -122681 -140850 -287739 -138384 116353 -101119
6081 -101119 -12280 -16291 80874 203388 -135755 -172170 -297490 28889 -237759 -104081 -44566
6070 -44566 62391 183814 17756 -312765 -197151 -69185 1588 -102153 -303807 -261030
6060 -261030 101322 -68472 -360671 26443 -82601 22222 123450 -26582 222193 284204
6050 284204 -157198 -211058 -298601 -316340 -375274 -221471 -36978 -132244 -85187 -45296 -317253
6039 -317253 -143938 289443 139296 -77576 -12446 79610 90583 -133818 -150768 298
6029 298 -51167 56308 -112851 -307642 -334489 -429260 -244455 140097 175680 -182832 -274586
6018 -274586 -83832 -188368 71592 153629 113932 -67150 -170759 -10592 -208617 -57074
6008 -57074 54746 236956 379507 407582 117646 -3906 118526 -248430 -96829 44954
5998 44954 23769 -268509 -212371 318598 113363 -175055 -100944 -273148 -244789 -173114 39483
5987 39483 -432327 -71278 135336 -39161 -185345 -86678 132053 -137521 -80841 60758
5977 60758 317771 -243277 -409055 -259396 -197606 -286314 -349692 -346404 160938 -176547 -297928
5966 -297928 -291447 -120379 85020 19764 -226857 -357121 -353475 -424127 -43339 -127809 -381825
5955 -381825 -152458 -38499 92692 162290 143354 99794 -172048 15220 221724 145877
5945 145877 -128547 -237113 -16116 -15317 247411 32595 58766 209688 107510 -53926
5935 -53926 -322024 -417200 -515659 -23717 33300 211377 22205 -73109 92241 -111254 -256870
5924 -256870 -23188 -136566 -73326 204391 227662 158203 6816 -2522 -284508 -194967 -84501
5913 -84501 69367 -22771 -151036 -240937 236848 -78868 -25108 -72881 80879 71593 133281
5902 133281 -19129 -102604 -153411 -70275 -106497 -6254 -108974 -244414 -384246 78847
5892 78847 -56033 -17916 112562 -13657 -397709 -378966 -306461 -501602 -352021 -344950 161141
5881 161141 69304 -30594 45241 -77905 -371935 18830 166711 -174638 39824 133203
5871 133203 -123012 -68236 -325653 4760 18208 -115623 -156403 -92415 -466031 -494416 -141478
5860 -141478 -248841 101341 57450 25613 39424 -231940 -686 -286937 -124555 144363
5850 144363 -100560 -169837 -174198 -291576 -109746 172547 91483 -63324 -175291 -146759 -43523
5839 -43523 -154318 -117723 18603 319512 107039 -110226 187375 -1387 -72636 136289
5829 136289 -143554 -102976 -224408 -171558 96707 133914 -27900 -93913 104929 98762 68502
5818 68502 35070 -117675 -272341 -124759 -208043 -55072 -295779 -466822 51096 25524
5808 25524 -1486 -59455 103133 -92559 -36505 177624 48498 -74128 95933 99373 9793
5797 9793 -172378 -214659 -68209 -53229 107724 105340 -268630 -131883 -173643 -210480 -250512
5786 -250512 53055 -160074 192410 106073 350727 63299 -95896 -429 75223 487177
5776 487177 169153 217004 -76849 -176513 -239133 -220711 -97925 -349590 -113377 17690
5766 17690 180367 -56930 -327460 -9418 188499 111554 175 117457 223754 -50841
5756 -50841 125114 -17365 10530 -37286 -264656 125210 264197 -117111 -4683 -59149
5746 -59149 273735 -47313 -21385 -2161 -340738 -79875 -188522 124419 -28674 -86480
5736 -86480 -158369 -399265 -277060 74582 -33588 -173695 -377955 -212506 -192357 -32446
5726 -32446 -199930 345436 213297 -10480 -52198 -122832 -102993 207531 -9878 48061 -13221
5715 -13221 198855 50987 -73036 7164 186721 343898 282664 55837 133226 231232 383709
5704 383709 24418 33414 21344 -48563 -24942 -5234 -108327 130590 358364 309459 183196
5693 183196 -126150 40886 421075 336287 110357 81601 -20398 70089 26465 287755
5683 287755 430904 315093 330692 472860 414254 333096 98165 388824 388521 424836 460078
5672 460078 158232 263836 287537 170823 164840 193151 330553 -6156 -99749 235071 -38964
5661 -38964 -134797 289106 425789 318650 319743 52302 11867 134568 148562 14658 262456
5650 262456 213072 230576 154334 -3898 69227 47262 42179 11082 191665 -16459 -120614
5639 -120614 114561 50090 125573 266629 87211 464019 382555 154692 111053 171785 339760
5628 339760 -217455 -34613 -85318 175796 245353 146460 80739 -107298 141572 108064 117380
5617 117380 186082 292855 147392 37896 14939 493095 387235 308266 315343 217830 258152
5606 258152 61701 280620 749472 515265 431590 548462 540806 389516 461951 731904
5596 731904 553346 476213 683170 755679 580975 302568 225568 288259 6421 369853
5586 369853 401678 273460 113129 -106805 36892 19335 -76957 119505 93047 93271 363666
5575 363666 2677 412293 420783 261550 200992 339771 375080 589529 174095 77493 213001
5564 213001 523239 438128 273472 308024 133575 398035 334818 266609 145548 268841
5554 268841 537436 535918 329954 8328 521352 451555 377602 515780 476065 365002 97708
5543 97708 201925 387180 559353 613368 610412 475147 431099 779052 678921 780818 585514
5532 585514 287923 493136 514951 574301 507321 748220 603617 332832 483167 415244
5522 415244 169729 388946 277310 84926 449484 669096 367743 666622 1151156 774583
5512 774583 708068 645185 1191862 1243812 976962 466927 305262 512812 807441 730700
5502 730700 986664 830721 561959 1031710 898558 758265 794491 937417 788854 652263
5492 652263 609624 1000925 1300069 1144499 1152166 1063925 1118678 1156694 849672 1212225 1069894
5481 1069894 1251068 1513310 1609556 1472428 1207538 1333059 1367875 1541628 1881770 1778295
5471 1778295 1820558 1848107 2086041 2115567 2122780 2278551 2577143 2634165 2626909 2561956 2414242
5460 2414242 2170205 2393781 2443749 2054065 1809654 2073144 2240095 2055115 1850890 1944830
5450 1944830 1979643 1536610 1513234 1931939 1627374 1167909 1402949 1410947 1323912 1391109 1375007
5439 1375007 1417456 1560644 1380227 1426468 1151204 1013817 873164 1267759 1463966 1143960
5429 1143960 1069393 806559 525699 867855 985989 939414 935354 1131085 1117316 927253
5419 927253 1115634 1050526 1033685 911929 953113 846588 1042472 1010499 1015196 1008100 999808
5408 999808 920977 1095711 831875 1060812 1316910 1001763 979633 798656 508366 437611
5398 437611 813360 1022105 1018260 1048273 921274 1141203 1097187 1146285 653477 924758 1192633
5387 1192633 975136 1028852 1182571 1092266 920197 829663 1324370 1313050 1059666 949974
5377 949974 937893 940894 1049644 1290987 1571235 1287844 1170623 1021487 1185636 1146309
5367 1146309 1151959 1356953 1258429 1237545 890461 1153621 1387997 1498393 1157532 1171381
5357 1171381 1590260 1524517 1415899 1473963 1315758 1437121 1588694 1480261 1492228 1610008
5347 1610008 1876952 1667479 1547342 1654311 1616234 1857135 1621000 1529596 1792265 1861426
5337 1861426 2032358 2301668 2180871 2177832 2077798 2560861 2376372 2553896 2529666 2500975
5327 2500975 2314978 2713743 2878751 3212497 3490721 3614005 3974635 4399367 4544883 4546955
5317 4546955 4352651 4514853 4626665 4647304 4440699 4622283 4736314 4855060 5240945 5328391
5307 5328391 5402045 5623464 5845609 5857748 6247033 6543697 6771926 6651619 6457850 6036847
5297 6036847 5908473 6210481 5933212 5734431 5526873 5386838 5002495 5014201 5039119 5157811
5287 5157811 4884934 4878638 4879369 4871562 4879867 4679228 4478247 4244850 3992166 3748924 3709478
5276 3709478 3584360 3560065 3398119 3074656 3179052 2925156 2398763 2656079 2376877 2235465
5266 2235465 2392072 2533710 2303419 2123274 2183511 2276387 2312210 2347031 2475178 2465666 2511621
5255 2511621 2650077 2464327 2458745 2661915 2476819 2514793 2162855 2210452 2488310 2347496
5245 2347496 2295990 2021993 2273904 2381526 2417589 2366696 2563151 2725047 2663361 2338541
5235 2338541 2404831 2471140 2420773 2493629 2645142 2759462 2648656 2580147 2392339 2413481 2374069
5224 2374069 2427275 2421834 2444481 2442323 2749691 2631803 2637208 2911744 2835222 2874021 2823140
5213 2823140 3023652 2976283 2945618 3315088 3353797 3382339 3759768 3888914 4042313 3874080
5203 3874080 4052132 4150968 4380604 4572696 4923703 5049001 5567688 5885002 6167450 6505593
5193 6505593 6609406 7327687 7862496 8241956 8528193 8967499 9124478 9143529 9169035 9050313
5183 9050313 9042290 9298674 9543789 9504855 10080007 10292384 10399778 10952656 11445991 12004880
5173 12004880 12708628 13193812 13941768 13789294 13952826 13932855 13580406 12756712 12206778 11685190
5163 11685190 11141885 10775849 10305231 10068173 10163386 10214025 9960213 9756564 9717717 10002195
5153 10002195 10072341 9872275 9557678 9263685 8899952 8556349 8000761 7623513 7089391 6691514
5143 6691514 6268627 5927738 5583495 5199445 5144781 5076145 4860329 4839570 4589418 4502610
5133 4502610 4627610 4208148 4067842 3950058 3749719 3619975 3686673 3580949 3809868 3667688
5123 3667688 3522364 3631863 3356752 3394004 3528398 3372684 3475511 3277819 3605078 3634783
5113 3634783 3400414 3117034 3093633 3110391 3128914 3325821 3109086 3122190 3155913 3252320 3342331
5102 3342331 3360618 3483826 3370179 2908447 3140190 3396645 3302668 3184363 3162955 3282805
5092 3282805 3630516 3517389 3366193 3276936 3367426 3335332 3454715 3031098 3231109 3363447
5082 3363447 3572879 3530814 3650016 3906858 3740327 3952399 3664666 3394454 3679397 3584930
5072 3584930 3629128 3734979 4262548 4170229 4291939 4209174 4245258 4379841 4750116 4877991
5062 4877991 4929643 4789864 4824085 5042113 5193978 5208459 5526511 5728600 5429866 5559000
5052 5559000 5550993 5777981 6011008 6294853 6762144 6904572 6652636 6667431 7029096 6968362
5042 6968362 7052144 7249303 7383897 7612028 7607392 7772230 7735868 7568929 7418867 7440754
5032 7440754 7345176 7252240 7282583 7381207 7330803 7189246 7121539 7191559 7569009 7580138 7538242
5021 7538242 7114828 7489353 7559689 7569472 7661338 7758924 7825205 7753722 7635835 7829790 7605940
5010 7605940 7589598 7597415 7808728 7786300 7708078 7976258 7865378 8043510 8234125 8280733 8916027
4999 8916027 9173026 8915812 9561076 9229136 9402758 9842016 10142137 10583338 10777140 11005842
4989 11005842 11300259 11490283 11798176 12129372 13521326 13829063 13950343 14576217 15154929
4980 15154929 15544860 16205752 16899678 17548197 18415526 19432628 20429272 21816775 23103770
4971 23103770 24577498 26335762 28037443 29843131 32275186 34306750 36808458 39500682
4963 39500682 41332512 43356909 44658720 45585220 46037539 46112900 46309312 46396724 46879377
4954 46879377 47635698 48670585 50111500 52168238 54178549 57222079 60694644 64318924
4946 64318924 67776397 70321179 72198669 73373048 73218091 71867782 69332178 66143992
4938 66143992 63049213 59787230 56594867 54129060 52036705 50736318 49721074 49246016
4930 49246016 49196589 49437969 49633262 49681527 49370018 48912438 47536262 45605466 43198773
4921 43198773 40377972 37835085 34770185 32167591 29720350 27725540 25844500 24456645
4913 24456645 22929967 21580385 20524538 19534016 18491294 17886371 16861117 15919058 15777639
4904 15777639 15331847 14931830 14218505 13775656 13929212 13510482 12914115 12559394 12433925
4895 12433925 12189596 12022367 11787291 11438667 11376870 10849499 10724415 10845749 10689660 10828443
4885 10828443 10611495 10436505 10641713 10446573 10414510 10527800 10401419 10142998 9761372 9570576
4875 9570576 9455862 9187602 9315177 9189526 9328292 9282685 8822156 8659737 8534364 8253389
4865 8253389 8066014 8165001 8184824 8215646 8039696 7998291 7858491 7869766 7786199 7529741 7388202
4854 7388202 6911199 6952524 7209101 6922221 6949554 6932319 6603906 6227574 6213340 6273168
4844 6273168 6064378 5750294 5709825 5707948 5921441 5924046 5801353 5416876 5634421 5714882 5495407
4833 5495407 5710143 5383133 5361879 5494982 5208272 5477018 5362463 5362968 5288043 5180592
4823 5180592 5245466 5136726 5134292 5288070 5290103 5154705 5152448 5170052 5347487 5483088 5354919
4812 5354919 5138883 5164007 5352744 5398708 5554692 5692660 5768847 5527288 5525481 5729752
4802 5729752 6059515 6130361 6007047 6113274 5916481 6075755 6210963 6351397 6547319 6665957
4792 6665957 6764305 6935768 6947427 6858704 7216421 7100255 7173884 7204869 7254529 7088757 7099901
4781 7099901 7435797 7757354 7917813 8288293 8069814 7969855 7993072 8243508 8554947 8413274
4771 8413274 8615888 9178753 9062732 9113055 9122426 9283090 9635209 9814567 10073700 10620131
4761 10620131 10752569 10995167 11073343 11233343 11832899 11804109 12105213 12593240 13019014 12983728
4751 12983728 13223175 13703407 14088572 14257490 15027357 15690611 16248127 16675890 17502949
4742 17502949 18226659 18751784 19330634 19961037 20801570 21371093 21540363 22085310 22173046 22363206
4732 22363206 22685155 23245727 23300833 23838777 24370095 25081348 25829528 26986024 28235307
4723 28235307 28981393 30107217 31095522 31690885 32471476 33124420 33636103 34078685 34149596
4714 34149596 34591307 35039710 35294771 35819242 36347580 36912359 37652392 38532984 39760174
4705 39760174 40785761 41813942 43540732 45210297 46926025 48498759 50506069 52695302
4697 52695302 55010783 57041713 59134854 60813778 62752160 64255473 65104344 65895811
4689 65895811 66688254 67084384 67408424 67966841 68319718 69520199 70303365 72015693 74372447
4680 74372447 76924876 79550220 82610991 86096299 89442063 92405082 94937799 97001117
4672 97001117 98062125 98789999 99215717 98480665 97764219 96924914 95259731 94491274 93859907
4663 93859907 93663447 94566912 95590961 97114648 99301245 102241209 104468404 106630757
4655 106630757 108493197 109593916 110098221 109973133 109184807 107701781 105892771 103875058
4647 103875058 102058449 100363342 98849356 98330580 98624218 99088269 100416281 102275051
4639 102275051 103603083 104984771 105670717 105266060 104014042 101966042 99413971 96291174
4631 96291174 92336407 88067355 83522904 79379646 75848975 72438533 69747604 67791442
4623 67791442 66363794 65136769 64045583 62807258 61895794 60322511 58767630 56597022
4615 56597022 54493633 52018335 48972754 46576041 43779397 40953288 38258572 36190988
4607 36190988 33965736 31913714 30162299 28589980 27278822 26178931 24747551 23917743
4599 23917743 22875257 22088810 21211751 20232819 19847132 18824253 18148780 18020894 17444294
4590 17444294 16792334 16562317 15914512 15490916 15098718 14414498 14183276 14120327 13790531 13522571
4580 13522571 13118014 12735369 12829604 12416422 11753092 11929569 11772358 11361419 11175010 10751693
4570 10751693 10460712 10456514 10317649 10252474 9918741 9668451 9595152 9416347 9125710 8685045
4560 8685045 8957117 8932647 8528077 8703150 8159043 8314417 8531913 8124330 7946886 7753030
4550 7753030 7699387 7691655 7706877 7703181 7650442 7486771 7494137 7387594 7190042 7114956 7549272
4539 7549272 7208070 7201432 6935731 6974977 7058716 7150344 7061338 7165869 6995473 6544034 6698619
4528 6698619 6844395 7053907 7026482 6793152 6706973 6850212 6729762 6923657 7036535 7049942
4518 7049942 7171492 7037931 7046730 6892432 6817422 7140350 7295067 7343204 7135924 7237496
4508 7237496 7242614 7255539 7095193 7045140 6885530 6765480 6772151 6846766 6696730 6628066 6898528
4497 6898528 6809441 6635269 6796965 6821617 6817553 6399595 6379791 6520262 6125859 6297167
4487 6297167 6202183 6503448 6296014 6211231 6049057 5692127 5557640 5800811 5720294 5880089
4477 5880089 6017533 5587702 5561196 5257430 5221580 5384929 5279734 5132341 5182196 5260161
4467 5260161 5163818 5145529 5127527 4969345 5013821 5163601 5269536 4764418 4655511 4608768
4457 4608768 4921220 4745665 4509783 4331743 4435875 4213651 4226691 4325421 4447208 4450448
4447 4450448 3911226 3862202 4039589 4046610 4019873 4169799 4232897 4108625 4056217 4078453 3849017
4436 3849017 3931466 4116636 3877194 4059374 4263282 4094945 3952039 3858404 3797411 3591471
4426 3591471 3682486 3746767 3764405 3809744 3701513 3401784 3421531 3250240 3369666 3067003
4416 3067003 3182474 3412995 3231071 3164174 3269585 3380581 3298474 3370611 3399141 3412762
4406 3412762 3408347 3241751 3196965 3173288 3114079 2964760 2897219 2654766 2637616 2780894 2733650
4395 2733650 2642566 2483547 2813897 2857182 2836264 2935246 3112793 2801371 2817242 2589754
4385 2589754 2510777 2508353 2283310 2072400 2132056 2567647 2743057 2661347 2543806 2695857
4375 2695857 2479757 2585236 2391102 2264195 2236559 2433817 2510593 2431250 2500187 2506685 2366900
4364 2366900 2094877 2283613 2242568 2497360 2276240 2342577 2153036 2243787 2143180 2064148
4354 2064148 2131386 2126670 2329568 2329172 2395381 2156901 1932212 1999614 1954292 2076944 2103326
4343 2103326 2091811 2105647 1747355 1898378 2237837 2175806 1963077 1998015 2129992 2281977
4333 2281977 2236049 2256485 1983451 2285069 2387127 2369992 2225624 2186433 2258068 2354161 2438552
4322 2438552 2334806 2571333 2792050 2509964 2314253 2378118 2313867 2321984 1969846 2153016
4312 2153016 2314106 2278520 1964425 2105580 2313210 2181696 2118878 2220810 2453029 2255656
4302 2255656 2241581 2408679 2455678 2437791 2564989 2430748 2613562 2299957 2296776 2449101
4292 2449101 2338490 2587729 3009161 2951708 2549066 2375202 2499625 2658865 2484310 2189037
4282 2189037 2448371 2856319 2471442 2438129 2527284 2629558 2660507 2620865 2468838 2448149
4272 2448149 2579181 2712074 2735489 2498464 2886583 2668004 2680472 2733414 2486446 2802528
4262 2802528 2749921 2677836 2606342 2731773 3014053 2761298 2656815 2527366 2477443 2898029
4252 2898029 3174863 3049234 2975596 2861592 3014862 3072329 3146744 3094272 3159933 3177015 2839108
4241 2839108 2987236 2794588 2800509 3209939 3421110 3378369 3358009 3211035 3137834 3324256
4231 3324256 3462119 3434733 3067607 3303514 3425799 3115601 3008886 3314899 3595937 3217082
4221 3217082 3162540 3482621 3496051 3706489 3807067 3615638 3409938 3462360 3388667 3530899
4211 3530899 3552242 3677185 3659382 3768847 3599681 3660634 3852383 3709155 3756193 3843421
4201 3843421 3993892 3926057 3458654 3474373 3870063 3784364 3824948 3970521 4142189 4082184
4191 4082184 4118647 4078520 4469578 4692875 4674481 4519442 4494412 4412592 4601624 4844663
4181 4844663 4726977 4764439 4969800 5031226 5184554 5263599 5461343 5315889 5486753 5721452
4171 5721452 5759664 5866900 5941301 5784164 5531411 5754198 5861999 6287387 6527193 6557645
4161 6557645 6305433 6626960 6647983 6645284 6715476 6837752 7080342 6932297 7156282 7237557
4151 7237557 7574353 7463197 7774460 7704003 7799756 7938521 7465861 7896523 8055193 8233866
4141 8233866 8701446 8930717 9127811 9135206 9688934 9503137 9463795 9931423 10473296 10634209
4131 10634209 10660302 10716909 10872927 10976642 10979017 10942523 11248125 11490133 11477068 11562921 11712868
4120 11712868 11757293 11903669 12091794 12515589 12980331 13249573 13351998 13455395 13469175 13968121
4110 13968121 14206846 13988089 13864106 13759296 13641544 13461529 13287708 12990775 13073893 12837301
4100 12837301 12668332 12656676 12640921 12588903 12982943 13180930 13301735 13380056 13665639 13798881
4090 13798881 13577647 13883333 13827462 13691038 13436406 13677173 13625487 13393776 13495403 13355891
4080 13355891 13347654 13593485 13726169 13776990 14066343 13953947 13969006 14239858 14383183 14313405
4070 14313405 14899618 15122359 15160345 15663220 15650011 15820318 16201275 16491582 16880001 16892551
4060 16892551 17350134 17735898 18032004 18702656 18810895 19160275 19666186 19983259 20373642
4051 20373642 20743580 21272837 21854948 22101368 22368282 23164820 23381574 24222178 24733704
4042 24733704 25323323 26277001 26969213 27913506 28643417 29230041 30139321 30868728 31794421
4033 31794421 32563003 33382438 33990168 34893692 35783864 36771367 37653409 38543388 39491284
4024 39491284 40366635 41549524 42905985 43575784 44863075 46152955 47351940 48344248 49456400
4015 49456400 50802688 52022291 52897152 53961262 55042208 55710804 56923002 57703013 58257823
4006 58257823 59222082 59821181 60620896 61248677 61871548 62418342 63001548 63289407 63666178
3997 63666178 64192823 64685005 65067085 65073334 65396039 65550197 65764959 65610940 65896705 65743295
3987 65743295 65759735 65734651 65675588 65125791 64808919 64379910 63955947 64023679 63715151 63065397
3977 63065397 62955973 62636397 62236505 62158029 61775519 61658151 61621475 61071219 60721912 60628225
3967 60628225 60664848 60748153 61098148 61481196 61997115 62144738 62998684 63850421 64757226 65576491
3957 65576491 66562688 67604676 68690608 69743539 70000790 70521426 71048661 71352301 71854398
3948 71854398 72120314 72394715 73079841 73797998 74629644 76059752 77478526 79019528 80863775
3939 80863775 82274795 83910372 85492658 86859951 87415806 87667327 87578631 86807954 85607158
3930 85607158 84354627 82970615 81421878 79748672 78533253 77468938 76868183 77016366
3922 77016366 77295430 78095030 79086088 80400605 81788356 83128507 84256745 85328316 85950466
3913 85950466 86513303 86050914 85390774 84521351 83104708 81687801 80049027 78777669 77594262
3904 77594262 76726417 76471355 76813119 77042809 78246055 79237282 80961655 83051132 84302116
3895 84302116 85561418 86404556 87347925 87282390 86654339 85536789 83783449 81780889 79516756
3886 79516756 77212937 74871130 72702345 70664221 68701284 67383141 65883911 64664093
3878 64664093 63766632 63013392 62066879 60812608 59581726 58406750 56636852 54595619 52145718
3869 52145718 49844176 47385795 45087619 42880253 40370056 38364610 36163837 34429794
3861 34429794 32635167 31059056 29784189 28514954 27219087 26180369 25090111 24215064
3853 24215064 23605593 22448177 21639138 21065819 20262774 19704784 19059647 18648164 18136981
3844 18136981 17893345 17301974 17112685 16695523 16133262 15991650 15604326 15454975 15080384
3835 15080384 14633451 14308386 14429059 14099252 13448159 13354001 13028520 12821887 12698474 12449595
3825 12449595 12421814 11785074 11615532 11313649 11096904 10869206 10582736 10389702 10463273 10262244
3815 10262244 10177591 10107242 9764648 9519621 9206372 9617222 9400180 9468901 9008916 8568490
3805 8568490 8438225 8351046 7921776 8157352 8433699 8339472 7849985 7849357 8249367 8111629
3795 8111629 7637444 7334750 7466110 7474742 7391982 7432168 7144531 7179560 7010085 6943280 6977039
3784 6977039 6676759 6792679 6823349 6738075 6635666 7030799 6928713 6924848 7128578 6932352
3774 6932352 6797922 6663714 6532509 6452774 6552882 6139508 6132597 6541816 6388544 6092837
3764 6092837 6226975 6178800 6161840 6167660 5892829 5729093 6081614 6230849 6038590 5977243
3754 5977243 6049154 5926001 5798521 5815926 5818626 5723026 5517919 5593544 5695213 5877094 6063429
3743 6063429 6036260 5800817 6035599 5813120 5657484 5779253 5777606 5889776 5711428 5970059
3733 5970059 6155977 6031861 5936066 5918196 5666050 5601528 5858546 5906582 6094000 5706447
3723 5706447 5837707 5735573 5784954 5772006 5760706 6050464 6054889 5999392 6100323 5745823 5923727
3712 5923727 5915883 5923034 6150381 6169017 6034439 5798201 5871015 6098201 5996629 5849299 5960297
3701 5960297 5931834 6147281 6174803 6315559 6239822 6191055 6120230 6150385 6214786 6559086 6694530
3690 6694530 6446509 6661943 6667745 6767164 6743578 6798273 6732939 6581249 6593974 7042577 6848384
3679 6848384 6685874 7103815 7197864 7278468 7210446 7389152 7445660 7704144 7635555 7680887 8067211
3668 8067211 7973623 7870050 8163245 8209394 8265759 8201778 8343252 8603958 8753101 9222980
3658 9222980 8895498 8693263 9013581 9279562 9569520 9892390 9983631 10167790 9961395 10095688
3648 10095688 10573185 10571012 10652943 10585336 10721397 11068942 11177543 11530131 11821009 12116391
3638 12116391 12162445 12434946 12534222 12922686 13160825 13497945 13839202 14244078 14653730 15082482
3628 15082482 15608763 16089483 16091379 15975631 16335637 16855498 17379471 17420176 17750082 18274505
3618 18274505 18398985 18443479 18853238 19552484 20000570 20033125 20828098 21354662 21755224 22438887
3608 22438887 22982992 23353878 23983902 24492385 24941134 25467819 25932400 26723302 27335949
3599 27335949 27752933 28312186 28741268 29456795 29941320 30784187 31590623 32526628 33604632
3590 33604632 34459780 35328292 36248774 37466436 38647499 39620201 40681275 41480892 42934845
3581 42934845 43937326 45063473 46204791 47233780 48025383 49057096 49896535 50613001 51257385
3572 51257385 51609802 51967061 52514380 53005738 53361694 53772437 53910019 53785671 53788983 53387090
3562 53387090 52965437 52235075 51397878 50560399 49832217 49168098 47998113 47301246 45806225
3553 45806225 44316627 43001228 41837685 40442170 39274730 37979367 36544067 35596543
3545 35596543 34391333 33193576 31757797 30721520 29668002 28712311 27651810 26537628
3537 26537628 25616511 24484751 23824272 23129505 22428368 21907893 21383878 20569218 19931891
3528 19931891 19221171 18518753 18209533 17877169 17770208 17282313 16515667 16415087 16088950
3519 16088950 15912161 15183782 15097329 14802994 14546509 14513558 14148034 13884395 13686902 13499300
3509 13499300 13385394 13302917 12944074 12720510 12683655 12426686 12080631 12195919 12418416 12286278
3499 12286278 12013025 12173170 11831114 11732401 11435913 11654444 11710268 11725031 12157070 11964223
3489 11964223 11806143 11878750 11801084 11730302 11968354 11867305 11891335 11859115 11574893 11555613
3479 11555613 11854763 11731358 12170139 12178233 11958819 12073421 12367287 12702082 12430591 12713205
3469 12713205 13093481 12972804 13147551 13458578 13654013 13779799 13910587 14049942 14394930
3460 14394930 14614565 14962210 15194370 15742537 16247949 16550350 16888670 17340515 18108703
3451 18108703 18839000 19061765 19555734 20362896 21279855 21764370 22398044 23042427 23658973
3442 23658973 24124174 24865477 25319001 25925269 26860625 27575536 28490941 29363793 29995458
3433 29995458 30668609 31419000 32438513 33259915 34100381 35156688 36098326 37029137 37702876
3424 37702876 38848557 39937764 41167501 41693356 42659083 43613751 44785105 46160755 48018867
3415 48018867 49627315 50763629 51988009 53630177 54997022 55962209 56910275 57778670 58564060
3406 58564060 59360429 59844512 60998360 61837980 62429466 63129635 64071686 65083611 66099206
3397 66099206 67530037 68655743 70085753 71749871 73325754 75112349 76713395 78157119
3389 78157119 79817065 81529459 82979665 84361044 85344931 85916810 86740505 87002489 87544229
3380 87544229 87787733 88007000 88180694 88386814 88754987 88440299 88045063 88115934 88323831 88269108
3370 88269108 88325833 88288916 87839190 87499071 87591605 87287694 87053639 87032484 86605674 85686178
3360 85686178 84784019 83484774 82543427 81006879 79712876 78245801 76374863 74655812
3352 74655812 72627581 70779050 69395490 67888377 66562658 65638717 64665761 63851369 63256703
3343 63256703 62442745 61314933 60494567 59497589 59168399 58533606 57872964 57091544 56394715
3334 56394715 55207821 54070218 53192755 51973946 50906050 49821933 48314300 47381567
3326 47381567 46412116 45500275 44876893 44175064 43705813 42945530 42311440 41958007 41394144
3317 41394144 40871437 40491351 40245616 39925053 39367801 38977139 38111030 37359673 37160832
3308 37160832 36911461 36196887 35596924 35394486 34788560 34142707 33866922 33724128 33057089
3299 33057089 32517469 31918155 31435580 30912528 30912643 30486423 29834203 29267247 28890361 28684408
3289 28684408 28641687 28579088 28507142 28262870 28354562 28408793 28656106 28733335 28472546 28546795 28530612
3278 28530612 28993175 28997616 29433857 29762203 30031487 30419423 30970700 31312412 31612108 31942429
3268 31942429 32801280 33581334 34392848 35079219 35757436 36365897 37262828 38456743 39624918
3259 39624918 40445800 41943489 43386307 44601788 46163113 47532266 48976724 50378107
3251 50378107 52005138 53474644 55048647 56492773 58106197 60295751 62452071 64735525
3243 64735525 67593030 69989516 72938335 76296945 79317897 82277334 85516649 88436095
3235 88436095 90621871 92604314 94255156 95086807 95265387 95394889 94976534 94322832 93865244
3226 93865244 93180114 91921053 90320411 88371793 86130759 83041555 79980420 76535630
3218 76535630 72683579 69125621 65529522 61845223 58426171 55150502 52335011 49819755
3210 49819755 47273388 45433918 43571879 41559051 39927227 38598340 37832636 36952346
3202 36952346 35555542 34985542 34295647 33380344 32832517 32243515 31883248 31616100 31056077
3193 31056077 30539578 29805253 29196308 28958236 28934139 28420306 28062481 27607168 27356086 26959384
3183 26959384 26875023 26561440 26292994 26153473 25783275 25726882 25463204 25588062 25590177 25603867
3173 25603867 26000562 26070580 26007432 26285588 26625249 26661337 27007674 27327239 27723909 28759490
3163 28759490 29040659 29384139 29818786 30208012 31185520 31881093 32431198 33032754 33223839
3154 33223839 33215560 34178957 34425520 34423781 34820694 34975890 35468497 35882398 36175380 36244822
3144 36244822 36930414 37766690 38146385 38540315 39236346 39926390 40720749 41413061 41870482
3135 41870482 42435283 43082478 43388022 44191136 44877762 45222769 45720391 46256242 47043392
3126 47043392 48168076 48988542 50022165 51176827 52503658 53783106 55386976 56794644
3118 56794644 57976980 58910964 59591120 60108812 60552164 59846977 59496087 59048152 58603689
3109 58603689 58351255 57852417 58104614 58015824 58431527 59105453 59992753 60627216 61575237 62567514
3099 62567514 63262849 64115899 64898105 65715565 66567693 67585980 68656514 69766272 71351578
3090 71351578 72911512 74871888 77507322 80354425 83673014 87188604 91222666 94932895
3082 94932895 99297236 103537746 107304720 110443699 113393334 115299970 116172754 115957822
3074 115957822 114369534 112359023 109891390 107176519 103937428 101251203 98338625 95662126
3066 95662126 93447043 91681416 89901066 88399756 87541731 87295418 87088128 87521688 88491621
3057 88491621 89709413 91161357 93204965 94918151 97416856 99840620 101905329 104223715
3049 104223715 105893495 107293107 108248913 108529304 108412432 107435516 105585084 103351736 101438474
3040 101438474 99067840 96761922 94369783 92296995 90602020 88657702 87057511 85957279
3032 85957279 84612846 83694901 83198932 82434465 81819431 81242967 80991911 81050646 81102698 81485608
3022 81485608 82130069 82604279 83268809 83952036 84947695 85992997 87279662 88905189 91126829
3013 91126829 93203392 95656524 98161209 100885610 103642493 106217120 108990185 111505904
3005 111505904 113680115 116042661 118742392 121758445 124463150 127361968 130676982 134291801
2997 134291801 138660362 143212209 148349672 154139669 159880793 165922260 172404559 178288700
2989 178288700 184135227 189296512 194087986 198588761 202377146 205733387 208839084 211467078
2981 211467078 212911428 213708428 213666554 212311669 209971995 206466102 202005552 197007615
2973 197007615 191518212 186063008 180437665 174185036 168183276 162317386 156085043 149715766
2965 149715766 143516223 137746490 131771712 126593124 121889115 117999652 115276059 112488294
2957 112488294 110458692 109024400 108150514 107777448 107336275 107076492 106364549 105389875 104058643
2948 104058643 101814707 99035365 96181072 93378601 90200977 87378333 84719844 81720827
2940 81720827 79132814 76419596 73967049 71513702 69114635 66676539 64713993 62736921
2932 62736921 60369367 58448418 56703306 55024038 53455360 51906879 50334247 49159193
2924 49159193 47609661 46090726 45125286 43941043 42907987 41938043 41298838 40627550 39783800
2915 39783800 39289454 39162252 38695514 38373143 38051908 38223761 38067496 38041592 38285900 38406082
2905 38406082 38697005 38734731 39150143 39375646 39674607 39881595 40461403 41226073 41397741 42004546
2895 42004546 42610962 43206049 44229038 44841009 45999856 47108131 48351139 49393595 50779642
2886 50779642 52576913 54372600 56240978 58093640 60174785 61930307 63710144 65803846
2878 65803846 67878158 70002503 72541397 75018601 77467637 80794886 84712389 88821348
2870 88821348 93420519 98362881 104123201 109930160 115767074 121444989 126495368 130617808
2862 130617808 132991623 133565163 132501827 129584444 124718250 118639754 111597442 104371086
2854 104371086 96918933 90196215 83439896 77393858 71877945 66833462 62300550 58275117
2846 58275117 54590883 51148624 48253338 45637968 43691462 41546902 40081143 38369626
2838 38369626 36888740 35803663 34628950 33483035 32592496 31469879 30508876 30123582 29467540
2829 29467540 28431266 27720877 26987326 26126560 25721950 25221437 24315244 23295854 22744907
2820 22744907 22002964 21314272 20833446 20289322 19834656 19390300 18760525 18313483 17789867
2811 17789867 17284464 16881596 16619282 16463591 16252991 16072898 15613131 15792311 15052750
2802 15052750 14892402 14909685 14844614 14538791 14167706 14069380 13854147 13940768 14144871 13914364
2792 13914364 13565842 13627508 13527715 13664340 13447945 13519434 13547365 13456309 13430911 13648977
2782 13648977 13445041 13578132 13749146 13602265 13505640 13479784 13746551 13691253 13699318 14201268
2772 14201268 14238189 14146720 14085592 14378739 14406592 14497315 14726768 14373086 14586936 15246942
2762 15246942 15262285 15622868 15626172 15604923 15945848 16019295 16200970 16365557 16351792 16768486
2752 16768486 16959169 16870845 17520270 18062254 18703951 18933273 19413240 19625697 19702440 20416660
2742 20416660 20869892 21397990 21938524 22691393 23302766 24165537 24575894 25098401 26263753
2733 26263753 27199381 27937429 29140687 30172464 31313604 32720368 33996874 35541048
2725 35541048 36795424 38531088 39991723 41815319 43795544 45605210 47655263 50099784
2717 50099784 52210367 54325244 56635029 59110545 61658612 64475120 66826447 69568389
2709 69568389 72316053 74505384 77186889 80194518 82831218 86128091 89967241 93512735
2701 93512735 97598331 101690407 106671224 111931975 117010545 122481197 128475602 134930548
2693 134930548 141822686 149051242 157415565 166063524 174354661 182493393 190537182 198098519
2685 198098519 206761442 215826928 226868575 239021346 252441382 267445812 284023433
2678 284023433 303091683 324947508 349568178 376675424 404410270 429906799 448932804
2671 448932804 457338945 453665557 439721502 418283407 392016106 364524663 337163916
2664 337163916 311640848 286565842 263033582 240643202 219713375 200686508 184345341
2657 184345341 170117342 157969575 147250624 137805569 129543614 122358504 116272421 110754026
2649 110754026 105615163 101018471 95967004 91703274 87642764 83785023 80051045 76379923
2641 76379923 72828180 69343552 65992068 62502946 59112625 55834187 53038997 50397754
2633 50397754 47689207 45409984 43370640 41516118 39888799 37913731 36093762 34467779
2625 34467779 33088145 31914510 30653336 29779991 28519262 27566903 26475376 25312146
2617 25312146 24354166 23697371 22842192 21918330 21631650 20834254 20044927 19541780 19023001
2608 19023001 18064862 17870100 17291263 16700492 16270928 15960242 15473245 14702549 14357413
2599 14357413 13930854 13420968 13182974 13007245 12749193 12087600 11547600 11461626 11540191 11148113
2589 11148113 10905918 10403652 10374003 9931177 9438709 9191602 9106071 9080916 8586445 8757541
2579 8757541 8493688 7870119 7756261 7544424 7311040 7372669 7123668 7187148 7073401 6887266
2569 6887266 6648538 6216792 6368300 6158043 6007035 5955081 5770722 5572157 5760291 5374594
2559 5374594 5217513 5344343 5098004 4905267 4854962 4705029 4674011 4644984 4591842 4606475
2549 4606475 4555372 4454686 4322897 4538767 4171387 4306181 4112776 3737462 3764170 3933907
2539 3933907 4007746 3839092 3855056 3619221 3547227 3452852 3393732 3312816 3225678 3237363 3049839
2528 3049839 3010256 3098886 3126474 3079625 3178416 2885032 2769166 2776742 3055958 3144171 3015206
2517 3015206 3051705 2750380 2854124 2575136 2802770 2772026 2766547 2380433 2293887 2320726 1993982
2506 1993982 2243000 2149791 2214813 2152791 2134952 2271471 2365011 2274767 2286429 2309104 2189593
2495 2189593 2132096 2181488 2356963 2387024 2464377 2435811 2148467 2082578 2081214 2280855 2375063
2484 2375063 1972202 1953569 2011978 2242079 2236868 2120771 2337811 2156835 2244986 2263542 1906802
2473 1906802 2136065 2250604 2446566 2329946 2160303 2212294 2215308 2407200 2392425 2188670
2463 2188670 2384001 2481493 2501580 2774298 2567928 2697265 2852790 2933978 2783733 2453924
2453 2453924 2622668 2592698 2327404 2228177 2085206 2066224 1774577 1694501 1603260 1473913
2443 1473913 1304341 1387799 1281892 1338346 1193221 998497 1026147 871055 863034 803433 1007446
2432 1007446 1091722 827286 1068282 854113 774289 634166 736587 753739 731703 661075
2422 661075 750083 985158 541917 670600 479161 316157 597938 703766 1021560 745299
2412 745299 561473 496186 520170 827941 707723 590294 913108 880671 611952 468624
2402 468624 498476 651953 471054 464069 497887 551523 585918 836804 471680 393131 636700
2391 636700 590890 436362 436609 457027 411496 65939 182188 379477 337139 438794 334187
2380 334187 450606 541830 696223 374852 446006 619128 327578 265576 527380 620896
2370 620896 499447 441994 424055 260109 433457 534621 364240 651483 378788 400288
2360 400288 479453 391343 580452 828995 602562 514221 760548 589910 329810 394005
2350 394005 425125 640004 402052 318415 478912 231879 161346 47041 266426 327122
2340 327122 548802 497921 200440 159627 187148 416765 6718 84142 318643 246443 352505
2329 352505 392213 365823 285288 724295 553312 476211 463518 317568 24747 492367 214224
2318 214224 10853 186388 52410 118976 201720 84518 243000 550816 416729 320319
2308 320319 205457 209144 338377 307167 282961 409282 460455 549158 422481 247231 262249
2297 262249 476395 463286 431445 463203 807822 970336 841427 622841 768894 768389 540667
2286 540667 658827 523629 400234 675636 406266 324794 387680 453035 434404 386135 272912
2275 272912 426992 373190 409104 266159 171021 107235 247416 422396 566806 365904
2265 365904 361866 178255 206180 396355 300837 298195 259459 90981 -6131 23679 -68106
2254 -68106 58743 108803 114855 277256 357925 248523 235165 127337 -70160 38091 -111300
2243 -111300 66708 -35739 132906 245290 139103 412129 354728 578772 357925 558322
2233 558322 603120 335201 270332 382952 160210 129075 21033 250529 388725 104768
2223 104768 142640 168373 415249 507526 444165 461558 521301 365203 202685 196667 200726
2212 200726 171488 142830 303255 386629 519121 556698 178202 152262 220597 287329 341261
2201 341261 268629 -90714 235179 391516 348406 94551 240361 157085 25678 343099
2191 343099 258014 -31270 101264 502636 353663 316389 234914 385680 281850 242955
2181 242955 441552 639570 378487 245762 410872 427507 234093 294777 474437 567132
2171 567132 318880 334846 159373 484314 582026 601642 733687 697162 665863 450674 517724
2160 517724 442292 479987 707875 645956 755570 803703 1156595 871941 820325 856789 978290
2149 978290 1077571 1165782 1339767 1483474 1149683 1082531 1287988 1470060 1538967 1660472
2139 1660472 1609810 1656231 1688769 1900378 2022664 1957800 1971190 2145828 1993300 2133127
2129 2133127 2367020 2731060 2587913 2728141 2975951 3095492 3295530 3498601 3570386 3629518
2119 3629518 4094574 4395883 4312044 4578068 4786589 5078044 5453322 5779030 6259674 6452329
2109 6452329 6814453 7393956 7798056 8234093 8748787 9295564 9929115 10778744 12281397
2100 12281397 13472660 14533142 15841444 17524331 19257547 21447793 25035819 28920741
2092 28920741 34297372 40708405 50110839 59491642 60513970 59329753 52601781 45520542
2084 45520542 37474869 30062438 24799163 21261627 18760161 16640348 15092480 14038063
2076 14038063 12744913 11254358 10026832 9020468 8290811 7536841 6865528 6415056 5945260
2067 5945260 5371808 4978368 5069132 4602061 4180873 4066957 4006082 3662763 3120090 3052806
2057 3052806 2593000 2569903 2266846 2527316 2403698 2008939 1870350 2160910 2160777 2062200
2047 2062200 2258738 2032207 1769894 2000478 1939554 1910497 1518715 1634713 1650720 1515719
2037 1515719 1357042 1623480 1466332 1343116 1214180 1340127 1114772 1240030 909491 879910
2027 879910 960022 1130050 1248891 1210264 995935 948594 1010076 826866 1015418 1119122
2017 1119122 1062647 689249 766333 331851 415825 668231 403211 352758 605622 907439
2007 907439 359453 358910 418346 296718 616900 459645 286370 236094 470202 632000 412500
1996 412500 157878 243425 145800 40639 180724 27857 231467 475403 246385 47816
1986 47816 84944 224645 131685 451136 677380 461350 400201 -32710 295556 323887 498984
1975 498984 293541 298687 455664 208360 354472 551036 213560 124729 222911 239192 162958
1964 162958 430877 486311 325106 29054 92409 -40643 71787 113935 -44635 47010
1954 47010 -50343 293855 288671 194179 164393 -113065 -38234 90901 132894 332366 218978
1943 218978 -140646 -289377 63343 -109977 165308 215767 145892 178822 170016 -9152 -179564
1932 -179564 21454 170384 33236 -36237 24113 236785 -11755 247136 -129624 -213612
1922 -213612 64739 257325 474339 424547 265309 54281 -19229 53633 -68812 151856
1912 151856 156760 69396 -206817 -223363 -42378 25288 -232937 -96173 351325 220669 140980
1901 140980 -77986 -4740 84955 -39357 -25653 233338 19007 -220802 -172047 -62590
1891 -62590 447801 280182 400044 398439 188556 630264 436180 145933 26772 171455
1881 171455 239232 42699 -105677 -31342 -40134 69025 148502 84784 4812 223315 -34559
1870 -34559 188976 170231 -62540 -189441 -88447 321273 219545 -53395 -68135 -41937
1860 -41937 49316 -314602 -241292 10060 -12619 -36248 152337 -207282 -339668 -209310 132064
1849 132064 225026 101940 -159170 -189538 -85564 -81887 151351 -83531 -214798 -291405 -207021
1838 -207021 -114099 -18538 135160 121711 -44905 -208051 -281102 -154924 135258 -87399
1828 -87399 -176622 -212242 -141512 -256681 -365435 -123677 -85090 -10346 -69035 137526 -102369
1817 -102369 157186 25253 -107634 -54575 161913 103753 84682 -45565 -281665 -323910
1807 -323910 -202138 -90309 -34775 -221685 -268439 -114808 108528 -50092 -4343 -75111
1797 -75111 -264130 -69092 243110 77211 -172481 54221 32811 1697 -229421 -77389
1787 -77389 -21898 98242 -167228 25342 291518 67291 -405076 -588974 -85916 -128518
1777 -128518 -140046 -264627 56080 -16592 -409730 -12288 190964 140853 -70377 -28347
1767 -28347 217937 49314 -251041 -305546 103581 90408 336467 93264 -59866 -145015
1757 -145015 -161625 -161557 -42400 -9840 -59946 -125217 68992 34404 -250714 -113026 84101
1746 84101 97207 -162052 -291552 -308854 -368801 -499419 -143185 -131653 -73605 -67483 71158
1735 71158 -102117 57442 92415 47463 -89315 126232 76417 -108508 -115397 -263207 -334642
1724 -334642 176948 -61122 -28957 8966 -82164 -164596 -104872 175241 186796 11991 27433
1713 27433 -6772 110969 373691 210455 150940 -309682 44068 37079 -45690 -2792 274249
1702 274249 182790 34284 -83919 116561 69705 -182553 -279297 -273381 -104291 -10239 -66476
1691 -66476 36661 -255353 -164759 -115308 -225990 -367901 -363353 -222220 -390517 -49960 25756
1680 25756 21304 -249092 79311 129196 -57480 -86563 24840 97484 125869 -148809 -14395
1669 -14395 12878 293967 289466 -127567 -183689 -340309 -318372 -302854 -327953 -235886 -196171
1658 -196171 -384039 -176078 124755 -237091 61548 146419 -190596 -220291 -111130 -45476
1648 -45476 53187 -327799 -189136 -236977 -173975 24209 72033 -15265 -50726 -193428 -176569
1637 -176569 149441 20779 -268239 -301293 -304579 -128815 95631 -142800 -145887 -149950 -327393
1626 -327393 -142896 40409 109419 -59023 -313498 -145053 -141802 -132728 -125484 66125 -134594
1615 -134594 -245485 -446579 -149853 -159023 -28969 -11942 33123 -71214 -172140 -24185
1605 -24185 65651 22843 -52242 -282597 -224251 -87252 -74602 35908 36656 19465 -130914
1594 -130914 -92107 -26761 -102082 -75453 -181542 -380259 -136106 -239731 -453981 -228106
1584 -228106 -212653 -85550 -449733 -205404 -198493 34426 21455 -265927 -375266 -388989 -304224
1573 -304224 -320384 -275845 -234973 -324296 -183646 -83032 -446924 -498756 -465876 -119749 -90027
1562 -90027 -280781 -322565 -11809 -144642 -255402 -311303 -494822 -306918 -286797 -275063 -167114
1551 -167114 -229434 -280016 -215450 -239236 37635 -13619 -55949 29873 149611 -57106 -259194
1540 -259194 -25967 135069 66221 -349947 -433552 -517487 -79260 -204281 -269922 -2875
1530 -2875 -182683 -215183 -111877 122312 116569 181629 361391 -118235 -367178 -109514 -104284
1519 -104284 -278537 77415 63718 -89917 -114026 -250521 -221023 -199351 -137320 -263719 -213728
1508 -213728 -163299 -81709 -2401 -241980 -294312 -89688 -131773 -59694 -363855 -373858 -138060
1497 -138060 -173822 -237519 -74698 -108730 -229271 -76232 22845 -11275 -251544 -150464 -231832
1486 -231832 -193137 -246562 -361915 -192354 27721 -136410 -115369 -196030 -185821 -14592 -72933
1475 -72933 142097 265461 167798 -137752 -41965 44228 -329584 -159166 -225963 -339096 -417381
1464 -417381 -104376 -13975 -26223 20148 82207 71582 96295 78573 20993 374847 8089
1453 8089 -152927 -267637 -43164 96075 9756 -139105 -144152 122244 105401 -121656 -134095
1442 -134095 45705 -141047 -67186 36465 87675 -102612 -205194 64126 49404 -228738
1432 -228738 -256545 -356456 -198888 23077 136044 -55060 -48787 -77701 24676 377903 217531
1421 217531 -94800 4303 193718 120438 -169074 -27546 -4813 -232377 -44937 13835
1411 13835 -4420 -101073 -137264 -81295 96093 93101 72158 233930 130390 114147 -84801
1400 -84801 -104362 -40244 50813 28517 64740 -46341 -152038 -222397 -166704 211540 111938
1389 111938 -16688 -173113 -256565 -231256 -314406 -53719 -359837 -334437 -107500 -195926 -261008
1378 -261008 -68442 -158849 -233615 167644 -167474 -129496 -298854 -135637 -338740 -288311
1368 -288311 -22915 -16950 -316789 -275607 -364637 -347843 -378346 -170598 19588 23217 -205613
1357 -205613 -186272 13238 266761 138799 -1912 224474 -184792 185833 -28757 -42191
1347 -42191 255575 233890 314204 73744 -92461 -68374 -171441 -346505 22464 216265
1337 216265 -27243 -317763 -274272 2926 7454 -134155 -73406 -49533 77574 -29303 -59699
1326 -59699 36610 -166634 -263364 -152346 180132 298717 30505 -165397 -152426 -235308 -317224
1315 -317224 -21496 -54331 100885 -23328 -284883 -650061 15988 340735 -365639 -521714
1305 -521714 -186733 27819 93867 189112 236972 49161 -120398 6287 84348 27001 -26455
1294 -26455 47878 112696 26384 101743 -171929 134682 313051 100045 200893 -20544 -82946
1283 -82946 -57344 24562 -241581 -125006 -376967 -172090 -265837 -151061 29989 -139974
1273 -139974 -11377 -149020 -304112 55805 249297 -30837 82113 86346 -23758 -168604
1263 -168604 -222496 68047 58927 -44656 76441 40996 -20410 -2618 -269225 4204 -150862
1252 -150862 -398191 -280695 -114155 -356008 -43306 -194877 -458545 -329831 -327792 -178124
1242 -178124 36873 161530 173166 236057 84458 -170887 -274710 -439120 -141553 -265585
1232 -265585 -252596 -232747 37098 -25697 136564 176397 69679 108810 -32311 -139059 -134094
1221 -134094 120995 -27517 31238 -146346 -227906 -186966 29779 75034 -11342 -7259 193278
1210 193278 -62109 23377 -106491 -34036 146055 208986 -129427 -83027 -230719 -166487 -123118
1199 -123118 -661463 -349589 -160160 -133775 -217452 -293129 -202801 -211625 -118374 107084 249132
1188 249132 283006 188281 252059 -186667 -204811 -246856 -257040 -110749 -337932 -115334 -12438
1177 -12438 139776 96639 21577 130288 107102 -55774 -241863 -5099 51700 -164224 -247640
1166 -247640 148450 122127 158663 1859 16356 -274456 -67942 137462 -109677 -211941
1156 -211941 -173094 -58162 10362 -174195 -15931 312688 206908 107642 -184636 -273089
1146 -273089 -309295 9933 -74891 -26329 67185 -4169 -29339 335263 78841 -100319 -41860
1135 -41860 117134 317089 138700 -147256 127587 86585 236461 201850 283391 53848
1125 53848 37529 -218472 -242609 22921 191606 187268 -35870 -8852 -134467 43687 90458
1114 90458 16684 -31806 -466646 -240759 -159239 -221201 -183976 13149 -125586 -261674 147191
1103 147191 97645 40545 78759 241620 196471 156994 51117 -11226 -16144 126523 78629
1092 78629 23448 120493 -89719 -370388 -263971 117537 -44475 -203500 -243924 -405829
1082 -405829 -69544 -119290 -282122 106730 -27605 -85062 -11303 -309 -265353 -141694
1072 -141694 31676 -349827 -103561 281468 232342 255284 6934 68466 371001 -8285
1062 -8285 -53225 -74596 143220 -89814 -210523 -148905 -207914 -107337 -321892 -511871 -152766
1051 -152766 -153643 -72744 196128 122771 302322 331130 249628 268717 39050 -12186 -24260
1040 -24260 -115435 -218159 -367207 -66671 -133707 -359232 -239642 -106736 -120379 -279861
1030 -279861 48380 -221636 8689 127294 -299318 -218585 -123523 -360997 -121888 58591
1020 58591 79430 -37332 -275813 -298884 -49479 -356282 -408559 -302635 -319433 -197150 -82129
1009 -82129 -155167 -406608 -66479 349491 279090 -52178 -136893 25266 64294 201582 225808
998 225808 226250 -85629 -155227 47240 53783 160103 -28503 -154880 -324257 -218541 -80079
987 -80079 -232443 -114087 78606 329228 277116 -59472 -42639 144151 -328209 94829
977 94829 36267 -93934 -139591 109110 146017 264135 198434 -138721 165116 159341 -19971
966 -19971 -94664 -7472 -104548 187344 -194908 -50457 242970 95635 -81217 -104886 -217720
955 -217720 -262957 -246313 -66026 -128692 -315063 -262327 -106665 113205 162340 -162376 -2270
944 -2270 -286331 -238370 41450 3853 48563 141903 102117 19546 -40201 251776 152239 259779
932 259779 -168429 -111127 -192982 -6427 -187367 108281 118443 -64604 -130491 -62147 208970
921 208970 -137863 -381166 -266895 -13643 -103643 -81018 9645 170651 90034 258471 131819
910 131819 333687 231570 197917 309539 -51267 -284362 -46731 -53875 -282879 -273128 195127
899 195127 186718 165251 73516 100750 -62346 227176 -39461 -100262 30464 -46424 -117511
888 -117511 142861 -14134 -146005 119299 204456 306809 114214 -54060 158485 62704
878 62704 54467 104018 54731 23692 -57812 -142724 68618 -21958 -173802 -28901 9231 203403
866 203403 21938 311585 281260 255537 264877 154375 103347 -94200 -26193 -171160 -313159
855 -313159 -139754 -42938 -51766 160973 13347 5310 130160 -450950 -327644 -227907 40970
844 40970 -117686 -176479 -30766 -179492 -372413 -149449 109505 -39074 -96733 -258935
834 -258935 -106859 -150764 -386779 -68258 -210370 -182469 -280227 173038 -94596 196475
824 196475 284826 162409 498105 391000 78417 -100857 27467 -53733 23664 -148863
814 -148863 -121834 -104119 11473 -261009 -337403 -136428 -113285 -181954 97651 61625 44660
803 44660 221132 58205 91596 53804 46816 56158 111906 261133 316222 65140 -248879
792 -248879 97782 115124 59674 209320 120754 175000 236871 -129607 -16485 -71520 52340
781 52340 280259 468392 247725 -84076 -36667 160785 76936 -109913 58919 10751 28604
770 28604 -75761 223806 284121 12002 -40855 -14737 326232 239444 265480 290295 287796
759 287796 331605 378470 -23726 158776 217648 498379 119127 102242 131428 -90802 272276
748 272276 200219 133303 482168 357265 -31837 89832 235752 264735 95409 259250
738 259250 203124 373065 137152 -59343 -160092 -260999 -59966 168801 21855 -183306
728 -183306 -119837 -190771 51354 131247 -82522 -146061 192 257092 234397 76450 -163905
717 -163905 39624 201414 150740 9691 173220 275274 109043 -66199 -161332 15708
707 15708 -70385 -3662 224878 474863 349026 -147046 37024 146841 167953 107313 175892
696 175892 407966 62954 -71072 -123439 81594 186897 -37815 173020 175402 -23178
686 -23178 37795 173720 -32113 -345986 -174516 -132829 -76205 -71913 70735 175648 198526
675 198526 -18561 -22194 36665 -104000 -24208 -22224 278251 164123 88227 77408 448656
664 448656 112276 -117203 -45013 -86594 98809 -238002 -31405 6188 52622 -169780 -71482
653 -71482 84673 117552 462732 171361 16534 -915 -241871 -87529 312504 169716
643 169716 -22772 147317 340064 90621 184802 -76023 -44225 -26642 41572 256786 516099
632 516099 184003 -50234 158300 -115308 111002 322394 -72987 120817 401858 269993
622 269993 -232103 96375 -59917 -23745 240132 299648 351398 162912 229651 84145 19793
611 19793 -78606 115608 -92631 170916 121923 96751 80030 101967 61565 124547 328696
600 328696 56985 23785 128368 -112058 -57044 223455 96764 -226279 46925 -47822
590 -47822 86261 123817 -20008 -18216 -52324 99588 377487 234660 222712 19949 -21677
579 -21677 137141 81132 168897 160677 101357 -32060 100763 -27007 393140 152911 -48434
568 -48434 183382 56451 64683 -161188 -390811 -299904 -270278 53651 -142360 -183081 -224593
557 -224593 -470563 -430896 -164979 -176173 -30454 -145395 -109496 271103 37055 -89614
547 -89614 -147123 162503 400456 226054 487155 208080 100577 36197 -173614 -16918
537 -16918 255847 160361 -99053 103273 -69282 -95969 35057 26634 269750 214642 58619
526 58619 73915 297738 254023 -50533 149478 369611 206140 34519 152222 -224709
516 -224709 -23086 66863 27519 118527 224355 -142147 -214460 -173262 176934 66099 -245357
505 -245357 -6171 214349 37889 -64950 3388 32497 169810 324144 -63168 -133229
495 -133229 -6440 155262 73482 110503 351438 417022 254382 19307 151104 226416 401481
484 401481 263079 186549 270927 84050 35472 101009 -37980 137826 266548 -45467 143897
473 143897 115655 347275 289473 200065 236652 103496 171885 109115 -31551 212902 269127
462 269127 31880 -18100 163489 165743 136503 -32508 10145 -62800 -145784 190688 235295
451 235295 132302 397101 330758 -31770 75525 -48521 -262334 -258960 -108169 38184
441 38184 74036 -159660 203474 317280 329127 90171 -11587 -44422 -54658 -203671 -5627
430 -5627 126813 187392 -16939 15217 -124953 164173 104958 -54268 -305348 130156 399816
419 399816 185176 65809 3206 64264 -46102 -47995 124566 -72904 -127556 83176 -198858
408 -198858 -344353 -326831 -67400 -109289 149884 263400 85125 213385 -184648 -108898
398 -108898 22074 265331 209467 -17093 -57942 -31809 35746 -308900 -135825 113262 -205577
387 -205577 -70975 276633 -76897 19692 251340 272208 109614 -75634 43645 24265
377 24265 20970 133065 177867 173964 -13296 11871 42906 256254 336157 63480 -28276 290063
365 290063 139188 113807 125047 35955 101109 162199 155092 -103163 -18008 -161324 -217399
354 -217399 118124 -38631 -134998 -134335 -286509 -159876 -11623 -320058 -96647 216947 35096
343 35096 -154294 -60730 -165464 -10780 126521 -174744 -360467 80211 3379 -240095
333 -240095 -256665 -116080 140703 -80311 31781 232632 -92328 -142628 -63603 -114757 -138832
322 -138832 -169524 -197759 -127782 -339123 -47541 -72255 -9004 113355 234296 -6079 158366
311 158366 257616 216830 159430 -74533 183478 -84397 59241 243273 40629 -218056
301 -218056 101665 1129 -225825 -375376 -158533 -84605 253522 132104 111511 436283
291 436283 435987 144712 -68418 -92407 -179335 -211035 -107450 -207634 -123570 -185688 -88519
280 -88519 -107716 292214 216637 -88992 86543 3034 -31762 245135 175564 242280 62039
269 62039 -60369 302672 148410 -189728 -121740 -13953 8425 26581 -39489 221971 89828
258 89828 -24258 107076 110083 -5151 332357 217969 -114004 -290388 -23922 87403
248 87403 -122027 -24334 207033 266654 206975 -106642 -9689 117735 -26225 26259 87681
237 87681 -147771 56165 11950 -133763 -40025 -119639 164107 25395 6023 -106753 -13171
226 -13171 235192 64460 181415 128806 293170 19794 -122728 -382664 -172774 149448
216 149448 57769 -15912 -200071 -155046 -75052 -185703 132707 58014 -243991 -410368 -157866
205 -157866 -264664 -213373 -71517 -103090 -91973 -22533 290603 -113572 -32455 31313 111017
194 111017 135448 28482 -107035 -97384 -40481 -74516 -118056 -168256 12055 66650 27497
183 27497 95871 -9 -208748 -213636 78324 186382 78994 441258 367878 218012 170775
172 170775 -44494 -270701 -113995 23674 -8161 120566 133381 33929 -42891 -92272 -104165
161 -104165 43516 53370 63003 -94514 -45823 42730 -31340 -34005 10093 32814 60143 204314
149 204314 -93370 -132573 -133558 -299365 -279612 -160819 91795 34323 -159850 -69737 53688
138 53688 144073 -41907 -46505 -121935 46442 213597 218314 291362 -119556 200379 147388
127 147388 -95814 -155655 -118178 -133936 74050 52894 -47134 -266320 111112 -72009 -62506
116 -62506 1811 -64914 107989 60501 -51890 150739 45085 114964 29884 -80956 -165460
105 -165460 6261 96416 96424 113460 62276 -26779 -50417 57657 25291 106760 -132192 -13089
93 -13089 222913 40398 93264 -11609 41100 91909 212607 243885 6068 47993 25484
82 25484 -1055 -80319 -67539 77683 54722 -135581 -63733 46907 -11219 -77355 -119563 -144731
70 -144731 240065 88369 169217 245792 256619 28330 -253436 -207879 -77204 31181 43701
59 43701 161801 -23726 -35990 -15104 -109737 -8344 -94237 -137064 116368 130304 92978
48 92978 241296 20303 -116195 -247560 -89012 -132268 -192253 33265 -71122 -135170 -85509
37 -85509 -103222 -251003 -115924 185914 178360 -117966 -103195 19976 -109264 -142179 -203140
26 -203140 -124541 71779 144331 13405 -32121 -160364 113497 -97657 40958 31037 47414
15 47414 214421 260759 58461 -255787 -183798 -47896 -127578 -34337 191361 54450 4279
4 4279 41656 126449 102768 129556
0 129556
$$ Imaginary data points
##PAGE= N=2
##DATA TABLE= (X++(I..I)), XYDATA
16383 -3676290 -3559051 -3429088 -3353546 -3368457 -3347793 -3359711 -3302004 -3152872 -3012781 -3092886
16373 -3092886 -3080772 -2985742 -3020892 -2911032 -2901835 -2854250 -2768467 -2862933 -3038408 -2967679 -2906586
16362 -2906586 -2913285 -2805562 -2631625 -2476376 -2544603 -2661830 -2705645 -2683497 -2428047 -2249994
16352 -2249994 -2211430 -2217605 -2047783 -2064613 -2289494 -2086231 -2011278 -1895541 -2131610 -2237276
16342 -2237276 -1908253 -1737175 -1687093 -1537593 -1519508 -1536261 -1487546 -1667161 -1412471 -1408286
16332 -1408286 -1361262 -1335592 -1315791 -1467496 -1354851 -1399606 -1196123 -1243862 -1180157 -954544
16322 -954544 -1009942 -1172296 -1115082 -924126 -763128 -938001 -1000610 -862250 -773378 -792145
16312 -792145 -758262 -701591 -885764 -828465 -765676 -564684 -348002 -635855 -419942 -332046
16302 -332046 -448149 -311132 -292099 -481656 -201327 -35660 -30996 -147362 -88857 -95513 104683
16291 104683 -137351 -234575 -85047 -164121 89965 479715 272266 317292 456889 318911
16281 318911 140513 95109 545852 456926 251168 154554 366978 336021 375331 481888
16271 481888 666972 867340 850618 606721 600333 531581 600170 859271 793487 687173 801915
16260 801915 864189 1052421 1029955 727283 816372 892600 897007 904446 766471 754912 961983
16249 961983 1204123 843231 1201036 1144946 1233688 1509546 1506190 1446629 1613580 1502784
16239 1502784 1366931 1391802 1570717 1439185 1542868 1659190 1504670 1576447 1657084 1481413
16229 1481413 1509317 1774158 1712689 1907621 1925521 1967574 1909206 1882263 1756744 1727826 1889345
16218 1889345 1767237 1894954 2027050 1786986 1838768 1849705 1835578 1971407 1904327 2107776
16208 2107776 2197301 2077829 2070682 1957894 2023348 2027201 2033204 1990095 2055360 2049688 1980388 1938052
16196 1938052 2096224 2234286 2377572 2243318 2244752 2238657 1849357 2141516 2317203 2522353
16186 2522353 2574382 2550316 2484797 2583531 2460760 2415082 2486900 2506356 2550995 2587217 2576490
16175 2576490 2614688 2429460 2284995 2297352 2758827 2805765 2628276 2506745 2707898 2628099
16165 2628099 2670934 2652490 2587675 2698321 2557522 2657320 2841788 2726642 2695565 2671241
16155 2671241 2644999 2635960 2770876 2386813 2435042 2617173 2565477 2853284 2692254 2809515
16145 2809515 2758820 3052642 2894297 3142940 2864636 2760231 2812859 2913939 2878830 2911072
16135 2911072 2757432 3030553 3126553 2943658 2881376 2886097 3055999 2825239 3153703 3189431
16125 3189431 3095663 2963127 2993845 3197164 3106211 2629920 2835446 3062167 2967467 3147460
16115 3147460 3038074 3010672 3022001 2820394 2978105 2853962 2821087 2719613 2509797 3017195
16105 3017195 2865567 2879435 2885765 2866009 2885878 3063591 3003290 2960111 3100211 3117426 2929586
16094 2929586 3006986 3170580 3344256 3111149 3052112 3192427 3106701 3207940 3182032 3116647
16084 3116647 2995404 2948046 2907322 3061429 3069777 3107024 2899095 2676242 2965401 2895144
16074 2895144 3199935 3291521 3012234 2942040 3132381 2892567 3124851 3145323 3115271 2997565
16064 2997565 3056816 3276106 3248205 3363918 3211297 3223039 3011528 3001235 3185974 3362688
16054 3362688 3102569 3400089 3089010 3007848 3390329 3331183 3569434 3362756 3107509 3240666
16044 3240666 3236561 3072512 3192143 3367366 3140150 3084098 3052115 3222924 3094390 3179998
16034 3179998 3218519 3100798 3143056 3183971 3142144 2935483 3343179 3116730 3059418 3267739
16024 3267739 3197641 3246309 3403078 3425073 3368905 3247023 3216078 3443573 3334609 3400307
16014 3400307 3481800 3188304 3106245 2962151 3076646 3370710 3216284 3231443 3022681 3212291
16004 3212291 3311690 3003493 2956960 3170663 3224467 3125348 2954118 3020995 2999219 3085446 3282139
15993 3282139 3396256 3221711 3022570 2948592 3265969 3315665 3234626 3373788 3817047 3566285
15983 3566285 3256008 3132070 3208481 3259740 3235159 3306206 3217754 3093783 3175469 3243215 3279802
15972 3279802 3412236 3379913 3426930 3364145 3420310 3361084 3319809 3389927 3285329 3375106 3489580
15961 3489580 3210109 3378924 3616178 3367412 3317216 3356885 3181853 3392612 3261885 3331048
15951 3331048 3336868 3141398 3150469 3487322 3282121 3209248 3680692 3748116 3151847 3131076 3312763
15940 3312763 3246213 3229647 3143453 3132258 3283901 3468899 3470742 3263439 3450306 3544153 3322895
15929 3322895 3658356 3446455 3305445 3417156 3428454 3437889 3200989 3308844 3493066 3382989
15919 3382989 3523733 3359312 3203825 3133322 3186607 3514444 3196692 3287686 3143368 3048396
15909 3048396 2980056 3170998 2990348 3067221 3379238 3318300 3399990 3295980 3114253 3131825
15899 3131825 3123959 3221370 3314844 3287263 3107982 2976758 3168785 3168449 3466543 3412418 3643710
15888 3643710 3334806 3519994 3470914 3280777 3428154 3411292 3506829 3636880 3706079 3511285
15878 3511285 3221328 3341592 3490956 3331899 3343575 3316483 3390041 3399351 3260950 3239189
15868 3239189 3283868 3380112 3453137 3477654 3400873 3486702 3352209 3298400 3138680 2828122 2905572
15857 2905572 3051704 3064198 3218773 3215585 3343198 3312900 3267678 3152054 3124672 3171266 3405512
15846 3405512 3258728 3104784 3556034 3445019 3378205 3134627 3268593 3373538 3001911 2904079
15836 2904079 2960272 2930023 3264038 3237127 3266550 3122450 3228179 3491875 3597603 3434651
15826 3434651 3285369 3434098 3390207 3046567 3203606 3324460 3349663 3451408 3685799 3598014
15816 3598014 3119614 3123181 3453181 3523697 3362524 3248909 3465997 3251685 3473147 3477331
15806 3477331 3133190 3112349 3118244 3369700 3137890 3494669 3504782 3423372 3329606 2822473
15796 2822473 2941288 2839737 2958213 2791483 2796089 3200743 3336329 3277565 3016667 3556811
15786 3556811 3324597 3200117 3390530 3459154 3194850 3234898 3403462 3499938 3339345 3446763
15776 3446763 3437115 3540768 3215792 3255017 3436182 3708413 3544058 3195759 3018814 3296188
15766 3296188 3379484 3422818 3468818 3385815 3242742 3282526 3507996 3428027 3356992 2993889 3182861
15755 3182861 3223068 3489469 3444222 3678105 3442015 3414631 3402352 3558175 3481884 3402796
15745 3402796 3243491 3217000 3236438 3028151 3004480 3456769 3259716 3309167 3477960 3394785
15735 3394785 3397114 3266474 3338753 3608677 3638393 3721611 3516011 3601681 3204617 3146101 3186202
15724 3186202 3080200 2882006 3036267 3441056 3559302 3369788 3235887 3450637 3319219
15715 3319219 3152364 3355628 3499516 3440753 3374687 3273801 3219835 2997021 3086613 2990155
15705 2990155 3048335 3041754 3433692 2983571 3137566 3162398 3223302 3157011 3318323 3520712
15695 3520712 3449993 3472103 3401161 3430900 3336227 3392662 3202889 3189291 3383135 3375103 3382809
15684 3382809 3125745 3135549 3468448 3513824 3399351 3449344 3260704 3165369 3362300 3309831
15674 3309831 3400549 3419075 3365356 3343904 3366626 3570022 3345702 3314507 3319661 3434798 3383971
15663 3383971 3251912 3192987 3347308 3351546 3095803 3013916 3255190 3136476 2910796 3344424
15653 3344424 3557738 3442609 3203627 3483188 3393314 3422381 3524827 3371300 3167561 3212020
15643 3212020 3228003 3012632 3101703 3002056 2978557 3011154 3001039 3433614 3222432 2970825
15633 2970825 3137507 3261258 3398596 3334557 3195439 3278686 3411795 3354996 3463023 3327718
15623 3327718 3272140 3278288 3139186 3582765 3409806 3589227 3646161 3361332 2989667 3270343
15613 3270343 3370997 3175598 2855272 2971545 3379307 3282735 3682768 3761177 3795719 3631285
15603 3631285 3435314 3557704 3587573 3545375 3681682 3388088 3372538 3285482 3046387 3260862
15593 3260862 3365684 3403360 3335025 3064010 3212013 3253639 3358543 3569802 3333380 3338903
15583 3338903 3445848 3016440 3228621 3556916 3539544 3492742 3563982 3390897 3419753 3172523
15573 3172523 3656077 3660153 3326752 3036727 3155790 3427996 3572777 3389663 3248443 3321129
15563 3321129 3213901 3445582 3551229 3474208 3428033 3557524 3657721 3489336 3291265 3353767
15553 3353767 3313749 3191226 3129930 3170423 3437815 3580168 3624543 3675987 3408526 3450522
15543 3450522 3172602 3474746 3666206 3276837 3321318 3480438 3644792 3383775 3536095 3515479
15533 3515479 3475698 3336567 3185477 3044543 3272593 3551094 3186931 3479632 3193948 3313877
15523 3313877 3488975 3254148 3338660 3451810 3582895 3643205 3252337 3398765 3290211 3056190
15513 3056190 3110353 3450830 3251936 3255337 3183630 3156413 3160598 3406934 3386299 3431673 3286928
15502 3286928 3255058 3458943 3411172 3397661 3398884 3598963 3520815 3174995 3406276 3449045 3707733
15491 3707733 3570444 3592551 3609437 3637056 3479127 3400785 3665053 3210242 3100846 3489244
15481 3489244 3573138 3402206 3577681 3172175 3187798 3073484 3229490 3241857 3256676 3174804
15471 3174804 3132055 3434624 3437725 3349706 3392718 3530582 3794618 3670906 3495482 3538084
15461 3538084 3379343 3534466 3738610 3710474 3376203 3488459 3557546 3441760 3195035 3520506
15451 3520506 3919073 3583117 3227565 3006491 3210333 3340364 3425081 3497257 3601178 3674003
15441 3674003 3571338 3259904 3570891 3611020 3596775 3586123 3290629 3289639 3182831 3065872
15431 3065872 3271867 3401099 3471231 3419744 3526926 3336683 3434252 3538184 3292230 3406467
15421 3406467 3611252 3529593 3428703 3212838 3468900 3562876 3324132 3394579 3286457 3313229
15411 3313229 3264331 3678683 3498369 3628137 3627310 3671972 3513984 3225380 3339009 3323619
15401 3323619 3404626 3253493 3394945 3154197 3156123 3047993 2957932 3180563 3271582 3184334
15391 3184334 3020878 3345873 3377763 3132859 3257646 3328834 3449456 3563483 3326209 2999622
15381 2999622 3583256 3519538 3309764 3450933 3054824 3091560 3316648 3618710 3644235 3626357
15371 3626357 3664041 3254122 3423532 3504933 3338390 3544547 3345707 3617472 3615410 3371446
15361 3371446 3388077 3420790 3455603 3338322 3436485 3267473 3471649 3588277 3433859 3345125
15351 3345125 3271814 3669128 3742751 3517404 3535205 3316581 3389361 3271248 3412991 3468281
15341 3468281 3386869 3347486 3458877 3667540 3676190 3397040 3592062 3418307 3459592 3225880
15331 3225880 3415124 3673834 3290481 3278640 3371731 3202033 3524217 3878208 3405258 3191585
15321 3191585 3308533 3395730 3365119 3462479 3142279 3557220 3709952 3137582 3179838 3254172
15311 3254172 3382759 3423911 3614613 3464375 3205110 3215831 3392694 3329977 3484876 3484534
15301 3484534 3482873 3248570 3286541 3396593 3566390 3336087 3069365 3416370 3696635 4153347
15291 4153347 3966967 3806405 3610128 3411631 3441491 3449009 3634735 3879821 3307635 3506115
15281 3506115 3672556 3577705 3243827 3437996 3612819 3507184 3343414 3592083 3361382 3366322
15271 3366322 3621415 3514761 3217100 3446510 3263004 3315125 3157735 3457517 3721940 3366578
15261 3366578 3641825 3770536 3730757 3628115 3433554 3290365 3262013 3593788 3607504 3503314
15251 3503314 3611502 3677971 3472400 3670588 3765099 3831538 3577484 3338297 3340924 3318621
15241 3318621 3423296 3374981 3281501 3188957 3383825 3550970 3412610 3324011 3361541 3432691
15231 3432691 3645330 3237642 3217553 3363614 3537286 3586959 3605643 3712556 3340782 3544771
15221 3544771 3439301 3419453 3435560 3687143 3621181 3347361 3396879 3522149 3639516 3859232
15211 3859232 3636576 3504296 3594416 3537239 3600345 3368576 3377935 3246847 3396799 3389556 3166665
15200 3166665 3256085 3150664 3352237 3448098 3611180 3782263 3593596 3598258 3559486 3488064
15190 3488064 3293683 3299214 3224707 3364441 3174319 3143293 3461533 3619199 3328165 3349026
15180 3349026 3430991 3462967 3790241 3908216 3376647 3354927 3469181 3439588 3630431 3550643
15170 3550643 3547656 3576261 3572626 3451728 3407859 3510810 3568006 3655592 3433320 3631356 3263793
15159 3263793 3288432 3486087 3764406 3335924 3475120 3516665 3559022 3560747 3471610 3440606 3625140
15148 3625140 3737147 3471321 3257813 3376126 3562799 3421653 3276639 3481571 3442851 3600679
15138 3600679 3724114 3750063 3418281 3429897 3281779 3419137 3704845 3410402 3593484 3683067
15128 3683067 3696261 3566983 3497071 3742740 3863667 3746086 3616885 3547149 3870518 3750407
15118 3750407 3813645 3502703 3469047 3582420 3589847 3470730 3534695 3442436 3607026 3510544 3388637
15107 3388637 3370551 3507986 3766090 3584914 3764790 3533210 3499838 3440648 3545761 3678814
15097 3678814 3332660 3469740 3595119 3431696 3556577 3582431 3394203 3386593 3615966 3494511
15087 3494511 3492088 3660337 3414635 3541512 3303350 3446967 3429702 3601906 3540715 3515693
15077 3515693 3375080 3391883 3504176 3359630 3194091 3218472 3372096 3384543 3438647 3658846
15067 3658846 3842821 3576291 3369259 3592667 4031043 3807335 3771273 3706825 3339273 3524107
15057 3524107 3088960 2978429 3280854 3274525 3393060 3890971 3900080 3427653 3144092 3350403
15047 3350403 3624842 3596449 3617632 3742741 3651286 3743232 4021969 3542605 3555311 3607830
15037 3607830 3499665 3588710 3431401 3453516 3509050 3583363 3287139 3508971 3682262 3430268
15027 3430268 3494478 3165420 3493802 3732418 3868321 3673733 3555501 3480789 3455439 3579895
15017 3579895 3404973 3097469 3373941 3151640 3492658 3364341 3736136 3801713 3470413 3741207
15007 3741207 3723720 3571540 3540874 3690566 3428671 3366560 3518956 3428127 3490660 3689000
14997 3689000 3410866 3650361 3238621 3711911 3429972 3413210 3483078 3469636 3307871 3325376
14987 3325376 3721572 3878276 3713598 3523878 3474405 3528805 3568828 3560970 3495587 3553590 3540441
14976 3540441 3656117 3612337 3467150 3973489 3642894 3406022 3722152 3578908 3432012 3574034
14966 3574034 3880990 3427179 3646474 3724449 3649001 3650659 3434922 3448078 3506614 3372496
14956 3372496 3319102 3384857 3290780 3375655 3547119 3750554 3698001 3497077 3506448 3490121 3401499
14945 3401499 3267835 3266149 3767118 3658806 3503663 3531119 3521107 3495463 3540050 3562821 3725048
14934 3725048 3640433 3573714 3698981 3660334 3581086 3549930 3616117 3582021 3477979 3492169 3587831
14923 3587831 3472628 3604937 3675870 3768906 3570769 3638768 3817067 3613857 3627112 3492450
14913 3492450 3557353 3503244 3290439 3187909 3177250 3558365 3724240 3576329 3812543 3523044
14903 3523044 3659147 3846482 3822089 3734237 3526124 3461076 3466445 3604855 3707139 3565210
14893 3565210 3604085 3533265 3602363 3841658 3515112 3386986 3699185 3319113 3426257 3403422
14883 3403422 3104688 3204240 3589770 3590863 3548817 3553060 3331972 3449698 4073429 3968332
14873 3968332 3750907 3624774 3767457 3585040 3694514 3362069 3330051 3519024 3794940 3465106
14863 3465106 3543137 3577588 3379218 3376175 3425908 3678823 3541769 3556284 3601060 3381974 3220532
14852 3220532 3393911 3556190 3774238 3504741 3671769 3649247 3629892 3785362 3374299 3269393
14842 3269393 3460629 3628713 3698660 3891391 3609924 3365875 3726836 3564310 3602234 3554192
14832 3554192 3915760 3773173 3560838 3668924 3554313 3686431 3628314 3511625 3510295 3501735
14822 3501735 3329116 3584334 3654951 3532132 3815401 3874664 3732308 3607457 3676601 3789146
14812 3789146 3479471 3453147 3562589 3723664 3835629 3743581 3494384 3693140 3629356 3763060
14802 3763060 3784735 3395091 3558123 3376140 3447510 3541733 3875031 3592971 3522934 3633540
14792 3633540 3718250 3719579 3691853 3554636 3802664 3474415 3417351 3671105 3799836 3499559
14782 3499559 3570573 3576618 3628894 3740785 3597220 3483197 3647659 3401127 3868612 3559237
14772 3559237 3390224 3646612 3599742 3519296 3498761 3600473 3811806 3718742 3695205 3690436 3310451
14761 3310451 3649629 3732145 3789362 3851864 3893128 3646242 3492392 3391667 3636423 3814377
14751 3814377 3676496 3587791 3709486 3548605 3543596 3618224 3758032 3601390 3039865 3436941
14741 3436941 3545826 3859728 3851526 3689253 3510274 3384939 3719051 3744676 3657328 3428813
14731 3428813 3427168 3546533 3499037 3558216 3584035 3849129 3619180 3356430 3448869 3387275 3609935
14720 3609935 3693204 3486827 3651465 3747022 3410680 3698429 3794576 3670371 3515221 3583770
14710 3583770 3656343 3744413 3699567 3547098 3588977 3678575 3924232 3888562 3490431 3188183
14700 3188183 3590059 3940310 3736309 3567784 3886441 4109914 3900622 3743151 3677097 3603931
14690 3603931 3352632 3412201 3767755 3869852 3984326 3928722 3691768 3638409 3654524 3415442
14680 3415442 3289375 3601738 3542317 3844841 3649332 3734847 3827929 3717109 3664473 3577723
14670 3577723 3616239 3822561 3534706 3406006 3411938 3635215 3852989 3932868 3678302 3651722
14660 3651722 3739420 3863645 3443450 3903245 4004108 3764666 3782153 3763692 3713212 3534439
14650 3534439 3470242 3527855 3729547 3626294 3683992 3537756 4090974 3896282 3772279 3906187
14640 3906187 3932302 3871496 3654631 3750383 3780909 3791599 3554406 3749613 3892758 3823176
14630 3823176 3710958 3773975 3747851 3750034 3901146 3951200 3647727 3624266 3763724 3833714 3334663
14619 3334663 3554011 3914866 3744590 3984739 3876223 3698221 3460909 3531794 3705566 3778548
14609 3778548 3820064 3550978 3662922 3914350 4025580 3842898 3930160 3749816 3524607 3521396
14599 3521396 3790892 3774457 3584521 3711546 3805324 3610539 3634433 3755814 3660462 3920284
14589 3920284 3904658 3716255 3589257 3970113 3480408 3518357 3688120 3726698 3456695 3569072
14579 3569072 3821400 3616888 3780133 3695331 3419332 3421290 3403861 3490187 3165628 3579760
14569 3579760 3612290 3566617 3865631 3834679 3833382 3940141 3987665 4013445 3920617 3787193 3524835
14558 3524835 3882423 3556836 3696031 3566292 3372125 3801846 3789485 3698765 3778946 3732139
14548 3732139 3706995 3959866 3959707 3996287 4144622 3932543 3777549 3719716 3801432 3921661 3647166
14537 3647166 3465687 3631162 4012921 4011533 4031872 3700692 3671876 3730725 3963821 3720956
14527 3720956 3569207 3343631 3551083 3770985 3857699 3705037 3922888 3633929 3744838 3754740
14517 3754740 3691809 3893400 3811632 3813418 3651582 3530552 3692263 3546282 3499326 3756814
14507 3756814 3692931 3980554 3726148 3863140 3945546 3870950 3772197 3633588 3378438 3571884
14497 3571884 3752002 3668493 3561721 3525493 3708765 3638086 3746597 3716818 3598621 3576810
14487 3576810 3469775 3314362 2983130 3366460 3495836 3590541 3664360 3634520 3474165 3788611
14477 3788611 3742361 3694264 3902038 4037009 3685834 3284840 3689772 3620200 3382821 3242251
14467 3242251 3551493 3675523 3434397 3668591 3952865 3940106 3634337 3589629 3803341 4117785
14457 4117785 3899829 3901342 3851811 3179001 3236676 3223277 3501834 3750202 3718481 3811438 3584348
14446 3584348 3502006 3431799 3706676 3798680 3673630 3826758 3884194 3841270 3590832 3747089
14436 3747089 4060352 3995646 3714969 3808544 3930739 4088834 4125548 3831490 3854495 3888295
14426 3888295 3896671 3864008 3804987 3551184 3459811 3892888 3915789 3758112 4120891 3724710
14416 3724710 3525390 3849714 3696024 3775548 3839013 3910415 3638700 3741976 3844355 3877459
14406 3877459 3638779 3840591 3732361 3800761 3918335 3617117 3809703 3769615 3729782 3908784
14396 3908784 3994857 3993397 3818985 3905488 3918799 3888076 3843964 3800389 3481438 3833635 4259191
14385 4259191 3771309 3557212 3510219 4343493 4424758 4307147 4285294 3975236 3820228 3785239
14375 3785239 4004348 4163789 3869996 3690500 3486007 3434319 3555447 3627150 3862766 3771641
14365 3771641 3978079 3661511 3714399 3643208 3657340 3805625 3777580 3571257 3750408 3689509
14355 3689509 3745727 3831812 3894777 3649029 3665299 3754329 4106263 3677227 3884257 3904603
14345 3904603 3812235 3881705 3858624 3961575 3853852 3920130 3655519 3489833 3604806 3858795
14335 3858795 4090372 4277697 3986136 4317827 3992586 3773080 3696793 3603757 3720761 3767819
14325 3767819 3499324 3876330 4068698 3732538 3408116 3537897 3577785 3603692 3615920 3754814
14315 3754814 3650467 3719455 3366993 3581292 3817115 3864871 3977331 4003993 4005895 3838751
14305 3838751 3884272 3957495 3967452 3890759 3702419 3696382 3760971 3576728 3711101 3822213 3860611
14294 3860611 3899354 3966223 3770087 3760545 3630835 3893536 3803363 3920039 4151201 3808400
14284 3808400 3639993 3528034 3691453 3649491 3706645 3480880 3699884 3735591 3769343 3856176
14274 3856176 3852691 3691715 3393909 3719500 3914227 4114171 4322551 3973109 3944733 3740510
14264 3740510 3691652 3957424 3800237 3709168 3841404 3867070 3757637 3554924 3506649 3696405
14254 3696405 3827174 3555394 3440899 3657283 4058197 3953541 3884308 3852037 4189112 4014462
14244 4014462 3850640 4019385 3820633 3764474 3759139 3769238 3603551 3844133 4143938 3827546
14234 3827546 3656140 3824600 3816448 3594015 3597311 3828766 3646888 3719272 3900427 3934043
14224 3934043 3749006 3689114 3735465 3794805 3785855 3631081 3484576 3993276 4045508 3738253
14214 3738253 3858733 4028872 3580136 3588606 3860946 4151683 3780800 3733510 3631243 3458378
14204 3458378 3619269 3508349 3375143 3796115 4020393 3963553 4127828 3982825 3767334 3726813
14194 3726813 3700599 3970029 3944649 3838154 3975854 3665808 3806700 3692857 3689623 3564083
14184 3564083 3434105 3796534 3871031 3915952 3827079 3854068 3818939 3662158 3684387 3672660 3990779
14173 3990779 3853923 3705125 3950758 3747308 3622221 3876474 3851042 3958564 3777388 3799692
14163 3799692 3740582 3810008 3961678 3761342 3977495 3877655 3816758 3863183 3963521 4095385
14153 4095385 3970281 4010308 3972580 3798756 3984027 3884561 3710648 3868892 4055344 3815813
14143 3815813 3745157 4045518 4076589 3974670 3771797 3776445 3908436 3890725 3630672 3820745
14133 3820745 3915101 3796376 3831413 4043737 3791402 3765497 3774550 3874738 3815495 4092598
14123 4092598 4281158 4012935 3929704 3635197 3866129 3785473 4081424 4196005 4217474 4243234
14113 4243234 4093451 4219832 3908500 3936061 4123859 3877734 3793134 3912622 3893092 3698155
14103 3698155 3876123 4194554 3852056 3939929 4065005 3809796 3600723 3655380 3730081 3661908
14093 3661908 3707155 3644312 3976757 4176890 4068978 3862340 3584225 3710235 3558009 3820544
14083 3820544 3938824 3907906 3863505 3932404 3856144 3697179 3749296 3642647 3787318 3950171
14073 3950171 4125452 4075182 4282653 3981429 3954745 3838327 4034463 3794723 3633472 3707615
14063 3707615 3914333 4064050 4010446 3833069 3860858 3675911 3812323 3620813 4037366 3957896
14053 3957896 3784302 3811445 3815096 3835028 3971453 3841760 3923102 4040918 3905177 3889558
14043 3889558 3567658 3999870 4104220 3962204 3937747 4192609 4225119 4131270 4168278 4216141
14033 4216141 4034261 4079975 4074727 4010258 3918936 3948188 3954266 4016938 4186365 3832413 3899248
14022 3899248 4109271 3989865 4179429 3731435 3759274 4153835 4080463 3926004 4115597 4267302
14012 4267302 4147486 3998590 3971568 4014953 3906780 4187983 4077506 3921332 4099004 3833187
14002 3833187 3880747 3959872 3783387 3781085 3928220 3889127 3982442 3786898 3725360 3853694 3911465
13991 3911465 3866538 4243609 4326024 4130404 4241999 4123967 3833627 3919581 3809098 4010119
13981 4010119 3626487 3836918 3896143 3781412 3820632 3731530 3892159 4066752 3963222 3970462
13971 3970462 3699430 3622413 3711875 3710529 3848611 4063351 3804456 3987046 3885856 3715432
13961 3715432 3983067 3706139 3717960 3977301 4225271 3901709 4042894 3879823 3920726 4003382
13951 4003382 3865040 3892440 3916343 4099380 3823644 3993170 3914295 4074023 4387164 4297781
13941 4297781 3779196 3841887 3989759 3990919 4100609 4017959 3861481 4016531 4081197 3886054
13931 3886054 3837731 3681688 4016193 4176875 4143278 4090971 4166124 3898113 4005939 4187878
13921 4187878 4077688 3989748 3951627 4024820 4263708 4214524 3815712 3909207 4047216 3918660
13911 3918660 3900154 3770255 3596987 3816742 3970169 3944874 4075971 3940865 3992275 4076619
13901 4076619 4049569 4070813 3791698 3626303 3613029 3663942 4027838 4148327 3928104 3881785
13891 3881785 4061820 4132259 4162936 3961512 4175643 4056451 4014232 3892758 3669626 3589075
13881 3589075 3807097 3879077 4024101 4104842 3715024 3668558 4039586 3911998 3745855 3924110
13871 3924110 4080009 3862234 3783532 3732983 3999713 3872776 3969710 3885999 3967276 3765649
13861 3765649 4093762 4064146 3653051 3854258 4187585 4069910 4205176 3888935 3719798 3984779
13851 3984779 4007345 3992039 3710343 4051254 3784797 3939955 3865214 3704482 3747811 3589434
13841 3589434 3816404 4024269 3913555 3847125 3940606 3581529 3780409 3853931 3722404 3627185
13831 3627185 3765815 3766830 3949568 4000737 3949732 4165984 3986957 3906079 3921618 4191518
$$ [...]
##END NTUPLES=NMR SPECTRUM
##END=
