##TITLE=1H_CG-1208-X31
 CDCl3
 8 sc, 
 14.8.2024
##JCAMPDX= 6.0         $$ Bruker NMR JCAMP-DX V2.0
##DATA TYPE= NMR SPECTRUM
##DATA CLASS= NTUPLES
##ORIGIN= UXNMR, Bruker Analytische Messtechnik GmbH
##OWNER= root
$$ XWIN-NMR		Version 3.5
$$ Wed Aug 14 13:43:02 2024 Russian Standard Time (UT+4h)  she@DPX200
##.OBSERVE FREQUENCY= 200.1318
##.OBSERVE NUCLEUS= ^1H
##.ACQUISITION MODE= SIMULTANEOUS
##.ACQUISITION SCHEME= undefined
##.AVERAGES= 8
##.DIGITISER RES= 18
##SPECTROMETER/DATA SYSTEM= spect
##.PULSE SEQUENCE= zg30
##.SOLVENT NAME= DMSO
##.SHIFT REFERENCE= (INTERNAL, DMSO, 0, 21.0105)
##AUDIT TRAIL= $$ (NUMBER, WHEN, WHO, WHERE, WHAT)
$$ ##TITLE= Audit trail, XWIN-NMR		Version 3.5
$$ ##JCAMPDX= 5.01
$$ ##ORIGIN= Bruker BioSpin GmbH
$$ ##OWNER= she
$$ F:/spectra/data/she/nmr/H-F/1/pdata/1/auditp.txt
$$ ##AUDIT TRAIL=  $$ (NUMBER, WHEN, WHO, WHERE, WHAT)
(   1,<2024-08-14 13:41:11.62 +0400>,<she>,<DPX200>,
      <created by zg, POWCHK disabled, PULCHK disabled
       configuration hash MD5:
       00 E9 B6 7A A2 85 ED C7 34 08 36 98 17 FE 4E 26
       data hash MD5: 16K
       AD 7B 1E 95 94 33 DA 5E 24 50 43 30 DD 66 90 62>)
(   2,<2024-08-14 13:41:14.20 +0400>,<she>,<DPX200>,
      <Start of raw data processing
       efp BC_mod = 2 LB = 0.24 FT_mod = 6 PKNL = 1 PHC0 = -25997.18 PHC1 = 16.18748 SI = 16K 
       data hash MD5: 16K
       19 81 CA 6A AD 87 B6 55 70 1B B3 37 8F 4D 7D 9A>)
(   3,<2024-08-14 13:41:39.07 +0400>,<she>,<DPX200>,
      <pk PHC0 = 1.051459 PHC1 = -3.4 
       data hash MD5: 16K
       12 E0 BE ED D9 85 05 21 BF 31 3E CF 76 BD 6E D7>)
(   4,<2024-08-14 13:41:42.64 +0400>,<she>,<DPX200>,
      <abs ABSG = 5 
       data hash MD5: 16K
       28 67 D9 68 2D 9C A0 1E BC 5E B2 CA 3F A1 EB E6>)
$$ ##END=
$$ 
$$ hash MD5
$$ 56 3E 69 0B DC 6C 1F D8 58 A0 C1 F4 97 5C 05 91
##$RELAX= 
##$RELAX= 
##$RELAX= 
##$RELAX= 
##$RELAX= 
##$RELAX= 
$$ Bruker specific parameters
$$ --------------------------
##$DU= <F:/spectra>
##$EXPNO= 1
##$NAME= <H-F>
##$PROCNO= 1
##$TYPE= <nmr>
##$USER= <she>
##$AMP= (0..31)
100 100 100 100 100 100 100 100 100 100 100 100 100 100 100 100 100 100 
100 100 100 100 100 100 100 100 100 100 100 100 100 100 
##$AQSEQ= 0
##$AQ_mod= 1
##$AUNM= <au_zg>
##$AUTOPOS= <>
##$BF1= 200.13
##$BF2= 200.13
##$BF3= 200.13
##$BF4= 200.13
##$BF5= 200.13
##$BF6= 200.13
##$BF7= 200.13
##$BF8= 200.13
##$BYTORDA= 1
##$CFDGTYP= 0
##$CFRGTYP= 5
##$CHEMSTR= <none>
##$CNST= (0..31)
1 1 145 1 1 1 1 1 1 1 1 1 1 1 1 1 1 1 1 1 1 1 1 1 1 1 1 1 1 1 1 1 
##$CPDPRG= <>
##$CPDPRG1= <>
##$CPDPRG2= <>
##$CPDPRG3= <>
##$CPDPRG4= <mlev>
##$CPDPRG5= <mlev>
##$CPDPRG6= <mlev>
##$CPDPRG7= <mlev>
##$CPDPRG8= <mlev>
##$CPDPRGB= <>
##$CPDPRGT= <>
##$D= (0..31)
0 1.2 0 0 0 0 0 0 0 0.06 0 0.03 0 0 0 0 0.0002 0 0 0 0 0 0 0 0 0 0 0 0 
0 0 0 
##$DATE= 1723628471
##$DBL= (0..7)
120 120 120 120 120 120 120 120 
##$DBP= (0..7)
150 150 150 150 150 150 150 150 
##$DBP07= 0
##$DBPNAM0= <>
##$DBPNAM1= <>
##$DBPNAM2= <>
##$DBPNAM3= <>
##$DBPNAM4= <>
$$ [...]
##$SUBNAM3= <"">
##$SUBNAM4= <"">
##$SUBNAM5= <"">
##$SUBNAM6= <"">
##$SUBNAM7= <"">
##$SUBNAM8= <"">
##$SUBNAM9= <"">
##$SW= 24.0689170037331
##$SWIBOX= (0..15)
0 0 2 0 0 0 0 0 0 0 0 0 0 0 0 0 
##$SW_h= 4816.95568400771
##$TD= 16384
##$TD0= 1
##$TE= 0
##$TE2= 300
##$TE3= 300
##$TEG= 300
##$TL= (0..7)
0 120 120 120 120 120 120 120 
##$TP= (0..7)
150 150 150 150 150 150 150 150 
##$TP07= 0
##$TPNAME0= <>
##$TPNAME1= <>
##$TPNAME2= <>
##$TPNAME3= <>
##$TPNAME4= <>
##$TPNAME5= <>
##$TPNAME6= <>
##$TPNAME7= <>
##$TPOAL= (0..7)
0.5 0.5 0.5 0.5 0.5 0.5 0.5 0.5 
##$TPOFFS= (0..7)
0 0 0 0 0 0 0 0 
##$TUNHIN= 0
##$TUNHOUT= 0
##$TUNXOUT= 0
##$USERA1= <user>
##$USERA2= <user>
##$USERA3= <user>
##$USERA4= <user>
##$USERA5= <user>
##$V9= 5
##$VALIST= <valist>
##$VCLIST= <CCCCCCCCCCCCCCC>
##$VD= 0
##$VDLIST= <DDDDDDDDDDDDDDD>
##$VPLIST= <PPPPPPPPPPPPPPP>
##$VTLIST= <TTTTTTTTTTTTTTT>
##$WBST= 1024
##$WBSW= 4
##$XGAIN= (0..3)
0 0 0 0 
##$XL= 0
##$YL= 0
##$YMAX_a= 450626
##$YMIN_a= -443310
##$ZGOPTNS= <>
##$ZL1= 120
##$ZL2= 120
##$ZL3= 120
##$ZL4= 120
##$ABSF1= 23.62504
##$ABSF2= -0.4441566
##$ABSG= 5
##$ABSL= 3
##$ALPHA= 0
##$AQORDER= 0
##$ASSFAC= 0
##$ASSFACI= 0
##$ASSFACX= 0
##$ASSWID= 0
##$AUNMP= <proc_1d>
##$AZFE= 0.1
##$AZFW= 0.1
##$BCFW= 0
##$BC_mod= 2
##$BYTORDP= 0
##$COROFFS= 0
##$CY= -3
##$DATMOD= 1
##$DC= 0
##$DFILT= <>
##$DTYPP= 0
##$F1P= 0
##$F2P= 0
##$FCOR= 1
##$FTSIZE= 16384
##$FT_mod= 6
##$GAMMA= 0
##$GB= 0
##$INTBC= 1
##$INTSCL= 3.70164e-10
##$ISEN= 128
##$LB= 0.24
##$LEV0= 0
##$LPBIN= 0
##$MAXI= 10000
##$MC2= 0
##$MEAN= 0
##$ME_mod= 0
##$MI= 1.114404
##$NCOEF= 0
##$NC_proc= -5
##$NLEV= 6
##$NOISF1= 3.799351
##$NOISF2= 2.8
##$NSP= 0
##$NTH_PI= 0
##$NZP= 0
##$OFFSET= 21.01054
##$PC= 1
##$PHC0= -25996.13
##$PHC1= 12.78748
##$PH_mod= 1
##$PKNL= yes
##$PPARMOD= 0
##$PSCAL= 0
##$PSIGN= 0
##$REVERSE= no
##$SF= 200.130003638169
##$SI= 16384
##$SIGF1= 3
##$SIGF2= 2
##$SINO= 5.538805
##$SIOLD= 16384
##$SREGLST= <1H.CDCl3>
##$SSB= 0
##$STSI= 16384
##$STSR= 0
##$SW_p= 4816.95568400771
##$SYMM= 0
##$S_DEV= 0
##$TDeff= 16384
##$TDoff= 0
##$TI= <>
##$TILT= no
##$TM1= 0
##$TM2= 0
##$TOPLEV= 0
##$USERP1= <user>
##$USERP2= <user>
##$USERP3= <user>
##$USERP4= <user>
##$USERP5= <user>
##$WDW= 1
##$XDIM= 16384
##$YMAX_p= 288882195
##$YMIN_p= -182918
$$ End of Bruker specific parameters
$$ ---------------------------------
##NTUPLES= NMR SPECTRUM
##VAR_NAME=  FREQUENCY,     SPECTRUM/REAL,   SPECTRUM/IMAG
##SYMBOL=    X,             R,               I
##VAR_TYPE=  INDEPENDENT,   DEPENDENT,       DEPENDENT
##VAR_FORM=  AFFN,          ASDF,            ASDF
##VAR_DIM=   16384,         16384,           16384
##UNITS=     HZ,            ARBITRARY UNITS, ARBITRARY UNITS
##FACTOR=    0.29402158847633, 1,            1
##FIRST=     4204.83944834999, 0,            0
##LAST=      -612.11623565772, 0,            0
##MIN=       -612.11623565772, -182918,      0
##MAX=       4204.83944834999, 288882195,    0
$$ Real data points
##PAGE= N=1
##DATA TABLE= (X++(R..R)), XYDATA
$$ [...]
6784B877688P4347J04419P0896J51106N1995J58455J81427Q8525J06231J44720
6774D009809K16981J97665J74998J10311K02062J82894K73241J97904J72725K15115
6764E953705J09350K47335Q0867K38911J40058J98787N5030J7108J18598K05916
6754G365665M8156N3060L5481N6332M7104K5169L6167J18455P3546N7741M1520
6743G958396J30451J31537J73577J11383J12681K06774K11378J50154J12425K1691
6733I320447J01609J04813O6017N1363n8473K7707L3918j64766j42505q2122j67195
6722I090813q2070j76237j97305k36787j49385k17172k04563j69584j28824k17589
6712G311297j11575j15604p6962j47346q3087j39995j33579k6198j48337q8480
$$ y = [2877688, 2952035, 3056454, 3127350, 3278456, 3330451, 3488906, 3670333, 3758858, 3865089, 4009809, 4226790, 4424455, 4599453, 4709764, 4911826, 5094720, 5367961, 5565865, 5738590, 5953705, 6063055, 6310390, 6391257, 6630168, 6770226, 6969013, 7024043, 7041151, 7159749, 7365665, 7413821, 7466881, 7502362, 7558694, 7605798, 7630967, 7667134, 7785589, 7859135, 7916876, 7958396, 8088847, 8220384, 8393961, 8505344, 8618025, 8824799, 9036177, 9186331, 9298756, 9320447, 9422056, 9526869, 9592886, 9644249, 9585776, 9613483, 9647401, 9482635, 9340130, 9258008, 9090813, 9008743, 8832506, 8635201, 8398414, 8249029, 8031857, 7827294, 7657710, 7528886, 7311297, 7199722, 7084118, 7007156, 6859810, 6776723, 6636728, 6503149, 6476951, 6328614, 6240134]
6702F240134j15952j46519j43299n7152j77797j51525j50330k03137j24503k51165
6692D718755j40171k12188j78103j42183j86246j92155j82946j40007j40424j49272
6682C055060o5284j95001j20793j17172r9923r3532j66967o0034q2066p1581m9514
6671A933193j10892j27123m8695N7172o6977j30749K5384k5844j19878k3555m5961
6660A316075j4499n6865m6138k9745m4217J4866K5856q4766p1137j1895L667o464
6648I94738L2583o5906l7164N3251J2961q0410K1266l0863o4102n1789k9666K3112
6636G78011R042n0917m9747m8276K0250K5793l7148n13k4258l71o786q9552l0499
6623D95029l103N4800J4985j7716R019o9380J4211k6534J9707K4850K1345q0566
$$ y = [6240134, 6124182, 5977663, 5834364, 5777212, 5599415, 5447890, 5297560, 5094423, 4969920, 4718755, 4578584, 4366396, 4188293, 4046110, 3859864, 3667709, 3484763, 3344756, 3204332, 3055060, 2989776, 2794775, 2673982, 2556810, 2456887, 2363355, 2196388, 2136354, 2054288, 1982707, 1933193, 1822301, 1695178, 1646483, 1703655, 1636678, 1505929, 1531313, 1505469, 1385591, 1362036, 1316075, 1301576, 1244711, 1198573, 1168828, 1124611, 1139477, 1165333, 1080567, 1009430, 997535, 1001202, 994738, 1027321, 961415, 924251, 977502, 990463, 910053, 931319, 900456, 836354, 784565, 754899, 778011, 787053, 736136, 686389, 638113, 658363, 684156, 647008, 646495, 622237, 621866, 615080, 525528, 495029, 491926, 546726, 561711, 543995, 553014, 483634, 497845, 471311, 491018, 515868, 537213, 456647]
6611D56647r115m863k0095j2828M8628L2654n7434L2931K5456j7720n9298L1589
6599D46552p1306r0309q763P0441L4481j8245r472L2934R682j9146m7169J3155
6587C42835J6478p570o5443Q167N774k2832N087K7127j9587L0085L7571r8940
6575B58752l5864O8321L170o9827L1211l8641M8147J3968N605p983m3823j048
6563B31988M7255r1899M2114M3590K8415l181j3186O0123J7915n4916L6152q6143
6551B58227J3302M136L3703l1046p552M800m2436Q188k658n847Q6209l2322l9228
6538B47476P168N9625j7526L6119R188p4555O109N5397q675m7607O137l4955m358
6525B39543m1332K4220j182K7874K8942L339m4372m035P5513n847j069n0128p212
$$ y = [456647, 447532, 442669, 422574, 409746, 458374, 491028, 433594, 466525, 491981, 474261, 414963, 446552, 375246, 284937, 276174, 346615, 381096, 362851, 353379, 386313, 395995, 376849, 329680, 342835, 359313, 351743, 286300, 294467, 300241, 277409, 282496, 309623, 290036, 320121, 357692, 258752, 222888, 291209, 294379, 224552, 255763, 217122, 265269, 279237, 284842, 276859, 233036, 231988, 279243, 187344, 229458, 273048, 301463, 298282, 285096, 345219, 363134, 308218, 344370, 258227, 271529, 275665, 309368, 278322, 270770, 275570, 233134, 241322, 238664, 232817, 319026, 286704, 247476, 254644, 314269, 296743, 332862, 342050, 267495, 273604, 329001, 320326, 272719, 278856, 243901, 239543, 198211, 222431, 221249, 249123, 278065, 281404, 237032, 232997, 308510, 302663, 301594, 251466, 244254]
6512B44254M6712J9135l6287n028K5231j9322o8755K93K5216J7899K2870l6922
6500B35296J2957o4375J01011R188l9047r964P7245l3070m914K6043J3203L086
6488C26659n1288J5174j425q6580R0818K953m1688L1988q4374K8056R4124n0239
6476B74178m4648J1804M2026P3490o9374o4769L5472K4747n7130j389P5123n3930
6464B45600j7745k5891J3151Q4933j5769p888m9449J4159J3468J2960K5195k5494
6452B67230k8853K7882K0717o0333l2275K6248j0711n2955m2708J20769M8621
6441B83632o0073j7538p1344N0117L5172k3475P0634p9793k5845J1654K1882l3810
6429A61213m8408o152N4440L0426o4544j6916m611K4376j14621J5230J1897Q2339
$$ y = [244254, 290966, 310101, 273814, 268786, 294017, 274695, 205940, 206233, 231449, 249348, 272218, 235296, 248253, 183878, 284889, 294077, 255030, 245066, 322311, 289241, 284327, 310370, 323573, 326659, 275371, 290545, 289120, 202540, 293358, 296311, 254623, 286611, 202237, 230293, 324417, 274178, 229530, 241334, 283360, 356850, 287476, 222707, 258179, 282926, 225796, 224407, 299530, 245600, 227855, 201964, 215115, 300048, 284279, 276391, 226942, 241101, 254569, 267529, 292724, 267230, 238377, 266259, 286976, 226643, 194368, 220616, 209905, 156950, 114242, 235011, 283632, 223559, 206021, 134677, 184794, 219966, 196491, 267125, 187332, 161487, 173141, 195023, 161213, 112805, 106653, 161093, 191519, 126975, 110059, 105448, 129824, 15203, 30433, 42330, 124669]
6417A24669K1519M6733l1335j2626m4809O1311J2529N556k0805j5328l7839k3538
6405H6037N1215j5169K2881k2105n013n9216Q766K6155n8932R8591K288n6981
6393G8517m2882l5526M0457J8929j205l0175k5501Q0685M2902J378n0421j60350
6381h3192J36187J1717J8139n545Q534k2458l4663j4776J01295l4304R83o5311
6369A6606R066m9920J8505O7859n3329K6240l5460O0944k957l1928l2182J00298
6357I3742n2096o466K1243J837J1381k0100K2900j1446Q421l7434P7487K4973
6345A34442n9114j8436N2022l0539q9779O7675j6862q8199K1134l800m5095k243
6333g8794O9127l120N1868k4282j475K6738m5554n5574L7703J3028K8909J8477
$$ y = [124669, 146188, 192921, 161586, 148960, 104151, 165462, 177991, 183547, 162742, 147414, 109575, 86037, 137252, 122083, 144964, 122859, 117846, 58630, 67396, 93551, 34619, 133210, 135498, 78517, 35635, 109, 40566, 59495, 58290, 28115, 2614, 83299, 126201, 127579, 77158, -83192, 52995, 64712, 82851, 77306, 85840, 63382, 28719, 13943, 115238, 80934, 81917, 16606, 25672, -24248, -5743, 62116, 8787, 35027, -433, 60511, 57554, 25626, -6556, 93742, 41646, 35180, 56423, 58260, 69641, 49541, 72441, 60995, 69416, 31982, 109469, 134442, 75328, 56892, 108914, 78375, -11404, 56271, 39409, -48790, -27656, -31456, -76551, -78794, -9667, -12787, 39081, 14799, 13324, 40062, -5492, -61066, -23363, -10335, 18574, 37051]
6321C7051j4528L3893r859J1546k8883r752K9778N0534l8990m9094m1420J4890
6309a4834P5769j4031l7917j8342k4072O5886m626m8457q938K2801m6842N5315
6297A712J3678n6888P9524M2151m697m6571l2563L7671j1336P3734j16068M6775
6285B7122j7252m627k1722r701P289l7717k3681J24519J7187q27n57m6056K592
6272A6569L9747K00p0601J3431j9069K0531l8974N1267m7431J5808L2975O5952
6260H0405j07217k716K1556j144N3087O5264j0649k0011n9520l08K6904j3908
6248C1743n0658O7253M2746j2577n761j4201J1516k8688j6467L9085l4716M3056
6236G2331M8809p2456J0252l4461L1559N5272k9034p1322l9227N9679K3892k4409
$$ y = [37051, 22523, 56416, 46557, 58103, 29220, 19468, 49246, 99780, 60790, 11696, -29724, -14834, 60935, 46904, 8987, -9355, -33427, 32459, 27833, -20624, -29562, -6761, -53603, 1712, 15390, -41498, 38026, 80177, 75480, 28909, -3654, 34017, 22681, 96415, -19653, 27122, 9870, 5243, -16479, -26180, -18891, -56608, -80289, 44230, 61417, 60590, 60033, 13977, 16569, 56316, 56516, -14085, -654, -19723, 808, -38166, 13101, -34330, -18522, 14453, 80405, -26812, -29528, -7972, -9116, 43971, 109235, 98586, 78575, 19055, 18747, 45651, 31743, -18915, 48338, 91084, 78507, 72746, 58545, 70061, 41373, 24906, 63991, 29275, 72331, 121140, 48684, 58936, 24475, 56034, 111306, 82272, 10950, -28277, 31402, 55294, 30885]
6224C0885m4305O0460K2236N460Q431M7844r980M3879n8914N829L3332j35029
6212A0128M5652M4778j0027r812L4665o0130q9623K7424m3120J01897R5287n0916
6200I6203k4569J4547O6758J0296n7983j784K9294l2868K3478P0516q1628k426
6188A09834K0487R124m1259o4290L7873m7745M5777r048m0317p213K8135k9694
6176A1664l2752l9432M7727k1758N3790j3872K1278j4695o1595l2097Q4372J3086
6164A5716J5016l7834N2406n8772N0655k7984L4783O331p1669N6218m2360P4859
6152F7365j724p0050M2501n2880L9824k1251m9098M8728N9345l2101j0730k0194
6140b65J06210m1721p0300J44574l9792l7840l161M0287n7513K427p2537n3913
$$ y = [30885, -13420, 47040, 69276, 74736, 83167, 131011, 121031, 164910, 105996, 111825, 145157, 10128, 55780, 100558, 90531, 80719, 115384, 55254, -34369, -6945, -50065, 51832, 147119, 96203, 71634, 86181, 152939, 163235, 105252, 103468, 132762, 99894, 123372, 193888, 112260, 109834, 130321, 139445, 98186, 33896, 71769, 24024, 69801, 60753, 20436, 13223, 41358, 11664, -21088, -60520, -12793, -34551, 19239, 5367, 26645, 11950, -49645, -81742, 2630, 15716, 30732, -7102, 45304, -13468, 37187, 9203, 43986, 50317, -21352, 34866, -7494, 67365, 65641, -4409, 38092, -14788, 25036, 3785, -45313, 3415, 62760, 30659, 19929, -265, 105945, 64224, -6076, 138498, 98706, 60866, 57705, 97992, 40479, 42906, -29631, -83544]
6128h3544J43J3419O9004J13860o7891O1628l4048L131o8417j3620J9507J9163
6116C2335k6531J0514m3701Q199M6940l7354N724L5249p018L060R734l8570j4584
6103a6003K8189O7903l1278n8462O5236J2010l6458k0059N0207j7584M9233q3647
6091I287n8540L4162j9186m3600Q8012J43416R251o1236q8491k4075j3317M4193
6079A9876N5823j8689o4650N3620k5699N9706l0456R889m8196K7541m2002Q757
6067E520P7206j6166m2611J9072P978L7159L9413p8081p4512J3980L2606l7811
6055a6247j3680L2264O1993l810p941j6414m4620p581R5845J5765m4400k3889
6043B7285l243k9374O0935l8785o10l1651J7795N0677M168n032r512K1504o7770
$$ y = [-83544, -83401, -69982, -978, 112882, 44991, 106619, 72571, 75702, 7285, -6335, 13172, 32335, 5804, 16318, -27383, -19184, 27756, -9598, -3874, 31375, 24357, 27417, 37151, -1419, -16003, 12186, 80089, 48811, -9651, 55585, 67595, 31137, 11078, 61285, 43701, 92934, 9287, -49253, -15091, -34277, -77877, 10135, 153551, 162802, 101566, 13075, -11000, -24317, 19876, 75699, 57010, -7640, 45980, 20281, 79987, 49531, 59420, 11224, 38765, -3237, 5520, 82726, 66560, 23949, 43021, 50999, 88158, 127571, 49490, -25022, -11042, 21564, -16247, -29927, 2337, 64330, 60520, 52579, 36165, -8455, -16036, 79809, 95574, 51174, 27285, 24042, -5332, 55603, 16818, 16208, -15443, 2352, 53029, 57197, 52165, 42653, 64157, -3613]
6030c613J8118K6321o099l770j2225P0022j6080q796L160n7083j0942j5333M4065
6017B7745m03k0220P980P5788l2190k3459l1285J2039K3328l9375r06N074P9567
6004H3683l2500m9665O4833P048o5291J3888Q151K600r891M1714m1257O3110o0724
5991B5699k1961J1985J1338J5046o8848R3081l4323O3036p1188k5028Q0901k0970
5979E8768n735l0082J0484M894M535K7432l6642P970k8819N2801J5060m2600j5258
5966B2808j3299R8967o5934q902l0772N6410k0417M846N7054n3922M0720o4084
5954B3475J5204j5847R985j3569O6452L3072l5728Q10r037n3395J3038M1758j16073
5941c9855Q3879K3301j02880K3017N8842J5775l5809O2166l8669o5276l6308R0377
$$ y = [-3613, 14505, 40826, 34727, 30957, 18732, 88754, 72674, 63878, 67038, 9955, -987, -16320, 27745, 27342, 7122, 15102, 90890, 58700, 35241, 3956, 15995, 39323, -52, -958, 4116, 83683, 51183, 1518, 66351, 73399, 8108, 21996, 30147, 32747, 22856, 64570, 23313, 86423, 25699, 3738, 15723, 27061, 42107, -26741, 66340, 32017, 95053, 23865, -1163, 79738, 58768, 53033, 22951, 33435, 38329, 42864, 70296, 33654, 41624, 12805, 65606, 80666, 38066, 22808, 9509, 108476, 42542, 33640, 2868, 59278, 38861, 43707, 100761, 46839, 87559, 23475, 38679, 22832, 32817, 19248, 85700, 118772, 83044, 83854, 74817, 21422, 34460, 76218, -39855, 44024, 67325, -35555, -12538, 46304, 62079, 26270, 88436, 49767, -15509, -51817, 38560]
5929C8560k9678P6544M0450J4907p6448l8649K1445p9515J5177R5878J7036j7969
5917G7738L5595M0026j4359m982l0483k1498Q969l9587r1984L3958K6511K3048
5905D2952m5261M5253R968p7851L7774l6699N7232j1528J4340k277M5663o6504
5893A3062j7904j8695P4428q1234L2312L6130r682o5886N9055n6789O6671J01009
5881A32477o7457L440J8556J9690j6493l3489o652k708k2604P744j918Q530J6064
5868E5180N8399j41876O4562J00175l4050n6639L4152m400o8993K9736k6476N2191
5856F1961m8350k6062L2815L0126l9055L3926l2739K434L3130L2360l4538r381
5844C6627J4719k8096M5094k9993L7198j9338m0730N4591L8082l8685l9191o082
$$ y = [38560, 8882, 85426, 125876, 140783, 64335, 25686, 47131, -32384, -17207, 78671, 95707, 77738, 113333, 153359, 139000, 134018, 103535, 82037, 91006, 51419, -40565, -6607, 19904, 42952, -2309, 42944, 52912, -24939, 12835, -23864, 33368, 21840, 36180, 33903, 79566, 13062, -4842, -23537, 50891, -30343, 1969, 38099, 28417, -37469, 21586, -35203, 31468, 132477, 65020, 68460, 87016, 106706, 90213, 56724, 50072, 47364, 24760, 32504, 30586, 39116, 55180, 113579, -28297, 36265, 136440, 102390, 45751, 79903, 75503, 6510, 36246, 9770, 61961, 13611, -12451, 20364, 50490, 11435, 45361, 12622, 15056, 48186, 80546, 46008, 36627, 51346, 23250, 68344, 38351, 75549, 56211, 15481, 70072, 108154, 69469, 30278, 24196]
5832B4196K1158K8851J2384l0089N688m852m2134N650P8546n1556M9750M6826
5820A44418k7754l4649K2697J3425o4918o0534O4233J0176K593K4250o429l6307
5808E1201k5969N703k7542M9255R208O980k350m5576Q2638K6022l7944l7112Q383
5795F2897m2099N8694k3337k2783L1986L5980j07615n892P2915n7637L8553j7663
5783B3999r47M555J11105j2377r4008K3409K2455m3416p1842P1610p225p7025
5771d9707j0292O8496n876L6202Q8831l7771L2027r094k0942n983k9440Q0544
5759A36995o3252o9516L5502j8095K2381M5664J9867l8740n4549M0338J13591
5748A70186k5918K0430l9364L7868n9727N93l1513P379K9258P641n916p5096M2183
$$ y = [24196, 45354, 74205, 86589, 56500, 62188, 57336, 15202, 20852, 99398, 47842, 97592, 144418, 116664, 82015, 104712, 118137, 53219, -7315, 56918, 67094, 69687, 93937, 87508, 51201, 25232, 30935, 3393, 52648, 61856, 68836, 66486, 20910, 103548, 129570, 91626, 54514, 62897, 20798, 79492, 56155, 33372, 65358, 101338, -6277, -12169, 60746, 3109, 41662, 23999, 23052, 27607, 138712, 126335, 32327, 55736, 78191, 34775, -37067, 34543, 27318, -49707, -59999, 8497, 2621, 38823, 127654, 89883, 121910, 112816, 91874, 85891, 56451, 136995, 73743, 4227, 39729, 21634, 44015, 89679, 109546, 70806, 16257, 56595, 170186, 144268, 164698, 125334, 163202, 103475, 104068, 72555, 79934, 109192, 116833, 110917, 35821, 78004]
5735G8004Q2700j04264q499K0305M950K3718m4887o8310P4827Q4542q8525n2311
5723B250J05096K8512j0854l9761l4274k9140L9827R7443k3896j16668N313L7318
5711F1166l7762J08375o2896L124p9243L1611J35832j1892j73646Q9748L2530
5700I6947m016Q40J3327o8376M6247o0818k4773O9210k9331N1309J9248k3764
5688H6050l1205P5702O689l6827j1007l8943L299k0644J6742L4630J8605o8409
5676C4682J522R5771o0236L9441J4533k1594j7705L020o6979N2902l079J3664
5664H5942n3568l5958R9220l5976K2179n7257L14N7675n4463N5718l052L721m3234
5651D1261j0339o3102Q6594Q749k6749O1172O018L1284j3109n5428J9454J1284
$$ y = [78004, 160704, 56440, 47941, 68246, 73196, 96914, 52027, -16283, 58544, 143086, 54561, 2250, 107346, 135858, 125004, 85243, 50969, 21829, 61656, 159099, 135203, 18535, 23848, 61166, 23404, 131779, 68883, 72007, -7236, 24375, 160207, 148315, -25331, 64417, 96947, 92931, 93771, 107098, 38722, 84969, 24151, -622, 68588, 39257, 90566, 109814, 86050, 54845, 130547, 137236, 100409, 89402, 50459, 53758, 33114, 49856, 84486, 103091, 34682, 36204, 131975, 71739, 111180, 125713, 104119, 86414, 89434, 22455, 75357, 72278, 85942, 32374, -3584, 95636, 59660, 81839, 24582, 24896, 82571, 28108, 83826, 80774, 84495, 41261, 30922, -32180, 54414, 63163, 36414, 97586, 103604, 134888, 121779, 66351, 85805, 97089]
5639I7089N4329q4172L2332r427j9053L1819k6029L9026j01302O3778K3291l4052
5627F7629M6526j7477k2994J6863K6713l3129J512J19736m5461N2779m6310j6231
5615A50156K0615m9089l4845K8581j3675O0244r2556n5212J29084K6430n9674
5604A10059J2724L2130q121K137m230j5437k2570j0408J5580L1061K0665R6574
5592B60164n3834N0962m1717q155L3855K678j7300p1328j1439m5789l7863J29807
5580A90041L1713j57050L0891J4369n2868M0726K0200L9853J0914k5696l126L9586
5568A79553o6968J3930J9015j303j8312n271L8668M6206L5048j764p5142m5226
5556A18434L1605l944m7399l1477J14161K0936J7127r7285R7857o7944R518K313
$$ y = [97089, 151418, 67246, 99578, 90151, 71098, 102917, 76888, 115914, 14612, 78390, 101681, 67629, 114155, 96678, 73684, 90547, 117260, 84131, 85643, 205379, 159918, 212697, 166387, 150156, 170771, 121682, 86837, 115418, 101743, 161987, 69431, 14219, 143303, 169733, 110059, 122783, 154913, 146792, 148929, 144699, 129262, 106692, 96284, 111864, 142925, 163590, 260164, 206330, 257292, 215575, 207420, 241275, 243953, 226653, 155325, 143886, 98097, 60234, 190041, 221754, 64704, 95595, 109964, 57096, 97822, 118022, 157875, 168789, 143093, 139967, 179553, 112585, 126515, 145530, 144227, 125915, 120644, 159312, 205518, 240566, 238802, 163660, 118434, 150039, 146095, 98696, 67219, 181380, 202316, 219443, 122158, 220015, 152071, 161589, 163902]
5544A63902r3434J1751Q8672k5159L696p9951L9202J9328k0813J9884p439L174
5532A22813j0786n465P2396J1482k3582M0561m422n1011q360J3260K8836l0059
5520A55663L3724J9449k8584k2968p1800J11718O3598j0895o1437N4448o4189
5509A78727M5859k7463K3063J2694o2495J7333O3928n2489J0106k825R0356n7130
5497B39664j5693K8663j659M063k8193l4947K7095K5737K3060m1157J3746M5559
5485B85938K8330o8563k7774J6702p553l5334k5246L2029J6693k6623O0500q5411
5473A63688q7783L3221L7495K7544O039L1233Q391m1976N7469j9712j0722L0239
5461B35126p4243L6523L5804N8636q8975j2808M218J6480l1967K3066M9780K9627
$$ y = [163902, 70468, 82219, 170891, 145732, 149428, 69477, 108679, 128007, 107194, 127078, 119639, 122813, 112027, 106562, 178958, 190440, 166858, 207419, 202997, 151986, 143626, 156886, 185722, 155663, 189387, 208836, 180252, 157284, 85484, 197202, 260800, 249905, 188468, 242916, 178727, 224586, 197123, 220186, 232880, 170385, 187718, 251646, 199157, 209263, 206438, 296794, 239664, 223971, 252634, 250975, 255038, 226845, 191898, 218993, 244730, 267790, 226633, 240379, 285938, 314268, 245705, 217931, 234633, 227080, 191746, 166500, 198529, 215222, 188599, 249099, 163688, 75905, 109126, 146621, 174165, 180204, 211437, 219828, 177852, 235321, 215609, 204887, 235126, 160883, 197406, 233210, 291846, 202871, 190063, 194281, 210761, 178794, 201860, 251640, 281267]
5449B81267k0957j6761o2058P5229K0713m473J3126l5851q1696O6L4361J113o119
5436A97960j2134l9315M2585L5188j4063j0433R5935k7340j7871J1985J8579j6595
5424B64481q5484O3852l4360P2489m7276p243j0898k1471P9695p7232O6422J2981
5412B75956L6099m0126M0110k3700L746Q2907m5810l2724l7001O3380j1238l799
5400C07800R04K2408l8980k4786K2339K8818r884m8263l356K6921m0498Q0129
5388C23552k0014O414Q9575o7515q6795J5083j6525j9363N9488M121N9982r1544
5376B56459J0600k7379O528Q0812j6981l2014K2530M5528j1420k5615M1944r372
5364C41620J090R6513j20795m5814P727J0821N7604p2226r982O9296L5256m2336
$$ y = [281267, 260310, 243549, 181491, 256720, 277433, 272960, 286086, 250235, 168539, 168605, 202966, 204079, 197960, 185826, 146511, 189096, 224284, 210221, 199788, 295723, 268383, 250512, 262497, 281076, 264481, 178997, 242849, 208489, 280978, 233702, 226459, 215561, 194090, 273785, 196553, 262975, 275956, 312055, 271929, 312039, 288339, 292085, 374992, 329182, 296458, 259457, 322837, 311599, 307800, 308704, 331112, 292132, 267346, 289685, 318503, 308619, 260356, 257000, 283921, 243423, 323552, 303538, 309952, 399527, 332012, 245217, 260300, 243775, 224412, 283900, 288021, 348003, 256459, 267059, 239680, 246208, 327020, 310039, 278025, 300555, 346083, 334663, 309048, 350992, 341620, 342710, 439223, 318428, 272614, 280341, 291162, 348766, 276540, 266558, 335854, 371110, 328774]
5352C28774J6499M6338n8705L8453J0717k2590j5057Q6098l8083j0965k2533n0364
5340C08582O6298J8213N86N5265K2557m3299K0371J9553L7042K0127k0798k3772
5328D80725l2828L801L7952k85R85L1219k1820k7274J8173N8893j1547j5614N7255
5315E79635k7881M9920K3816K7275L2613O6952p6207o3465L4201R6305m5503l615
5303F94046M7637n2113l5794N5692L3774j4753O6309l5364M2135L4110O296l7035
5291H04940Q273r813M2088k9666j9433J7169N7085k7736J9188r3857M1870k1337
5279G88771l009J5441P4272K3682r5533N7045k0262J525o2102N1102j3363K2864
5267H40433j9312N2076l3799m72L1066l4423N5776l6924k0779M4705o2959j5736
$$ y = [328774, 345273, 391611, 332906, 371359, 382076, 359486, 344429, 430527, 392444, 381479, 358946, 308582, 374880, 393093, 393679, 448944, 471501, 428202, 448573, 468126, 505168, 525295, 504497, 480725, 447897, 451698, 489650, 489365, 490350, 521569, 499749, 472475, 490648, 549541, 537994, 522380, 579635, 551754, 601674, 625490, 652765, 685378, 752330, 676123, 612658, 646859, 743164, 697661, 694046, 741683, 689570, 653776, 709468, 743242, 728489, 794798, 759434, 801569, 835679, 841975, 804940, 813213, 803400, 845488, 815822, 796389, 813558, 870643, 842907, 862095, 768238, 810108, 788771, 785762, 801203, 875475, 899157, 803624, 860669, 840407, 841932, 779830, 830932, 817569, 840433, 821121, 873197, 839398, 838926, 869992, 835569, 891345, 854421, 833642, 878347, 815388, 799652]
5255G99652k8122M526J00469n3098l9009j7307M2863R1981o164J3732k4868L2196
5243I16851Q893J2335n5342l9690K2947M9275M4791j09014n4835j5302P6107N3100
5231I10116J06757p5610m5634j7103P8755j7811n4901k6490K4534Q9091r1406
5220H80298p658Q580N343L6466L9741o9148J8981K3969K3779Q55M3049o1320K30
5207I43165N2526M454L8826n62L1218J9495l5568p5203L9405J06798k989L433
5195A124998N0820m7552Q7K9131n195l7577M6895J16376m316j99M1380n0939N7926
5182A321835k7957P6798n7340o8606P0253N4136q171j2420j3158O2102j3315p735
5170A376422R083k687L0033j08979K9277p514N722K4357O966K2010l0191l6274
$$ y = [799652, 771530, 776056, 876525, 823427, 784418, 767111, 809974, 901955, 895791, 909523, 884655, 916851, 925744, 938079, 882737, 843047, 865994, 915269, 960060, 851046, 796211, 780909, 857016, 910116, 1016873, 941263, 895629, 878526, 957281, 939470, 884569, 858079, 882613, 971704, 880298, 872640, 881220, 886563, 923029, 962770, 893622, 912603, 936572, 960351, 961206, 1004255, 942935, 943165, 995691, 1000145, 1038971, 1038409, 1069627, 1089122, 1053554, 978351, 1017756, 1124554, 1121565, 1124998, 1175818, 1128266, 1128353, 1157484, 1152289, 1114712, 1161607, 1277983, 1273667, 1273468, 1314848, 1263909, 1321835, 1293878, 1370676, 1313336, 1244730, 1314983, 1369119, 1360948, 1348528, 1335370, 1397472, 1384157, 1376422, 1385505, 1382818, 1412851, 1303872, 1333149, 1325635, 1331357, 1355714, 1362680, 1384690, 1354499, 1318225]
5158A318225L4596L6328j1353N7898l6189p8523O1948o0179K7898O9078l505r4311
5146A321911M2080o5591M1159J08107L3805j85294P9865k8239M0972J1851l0098
5135A370528M6359n4344M179J6703q4759l3721j9849K2450O8964Q917O9246o7992
5123A346681n6210O0958R4603m4390o9079N3571l0383k6270N041K3922k2463M603
5111A340584m6817m3623J71185j1093j16786N9728M9708o1600J04129q4348j7542
5100A343525N7137k1451p8555J04348m4485M3388p252N6881p576l0787p084o7987
5088A340102K8804J9723M2320o1731J8761o1401N4199J16581M3188r2640Q976
5077A456882L5336k6607J8621m806m010M4354o924K8225n5344l7864L1962j5301
$$ y = [1318225, 1352821, 1389149, 1377796, 1435694, 1399505, 1320982, 1382930, 1322751, 1350649, 1419727, 1416222, 1321911, 1363991, 1298400, 1339559, 1447666, 1481471, 1296177, 1376042, 1347803, 1388775, 1400626, 1370528, 1416887, 1362543, 1366722, 1383425, 1298666, 1264945, 1245096, 1267546, 1336510, 1345427, 1414673, 1346681, 1290471, 1351429, 1446032, 1401642, 1332563, 1386134, 1355751, 1329481, 1334522, 1358444, 1335981, 1340584, 1293767, 1250144, 1421329, 1410236, 1293450, 1353178, 1402886, 1341286, 1445415, 1361067, 1343525, 1400662, 1379211, 1300656, 1405004, 1360519, 1403907, 1396655, 1453536, 1445960, 1415173, 1408089, 1340102, 1368906, 1388629, 1430949, 1369218, 1387979, 1326578, 1380777, 1497358, 1540546, 1447906, 1456882, 1492218, 1465611, 1484232, 1479426, 1475416, 1519770, 1512846, 1541071, 1485727, 1447863, 1479825, 1464524]
5065A464524Q104m6771J64329L6292m9618j8127J28707n589L7082m0210j2718
5054A666005P7595L8683q0985N9986K7723M4837K8309N509J07214k9264n4824
5043A890788K2183L4543P7565Q071K5663Q10J6148K1173Q6592L415j1018Q8549
5031B264482m6971L4406J1337J0209J5839P3221k9247L4761P609K5105M0887P0826
5019B512464l5335M5555N4481J12431O297o4221P1295l5435k0157Q9335K6061
5008B762771m5586K9539J28022O6703L1848P309k760M5085M9925Q0514N005M0364
4996C198739K9008O3795N0759M8511m474M6800J94005R2808M2716J00587N8634
4985C921888Q1440R2213R9488M1909J36075J60685J12298P3048Q8375J80847J17733
$$ y = [1464524, 1472628, 1425857, 1590186, 1626478, 1576860, 1558733, 1687440, 1681851, 1718933, 1678723, 1666005, 1743600, 1782283, 1701298, 1761284, 1789007, 1833844, 1862153, 1867662, 1974876, 1945612, 1890788, 1912971, 1947514, 2025079, 2033150, 2058813, 2059623, 2075771, 2096944, 2183536, 2186951, 2175933, 2264482, 2217511, 2251917, 2263254, 2273463, 2289302, 2362523, 2333276, 2368037, 2375646, 2400751, 2441638, 2512464, 2477129, 2522684, 2577165, 2689596, 2695893, 2631672, 2702967, 2667532, 2647375, 2736710, 2762771, 2717185, 2746724, 2874746, 2941449, 2973297, 2980606, 2977846, 3022931, 3072856, 3153370, 3158375, 3198739, 3227747, 3291542, 3342301, 3390812, 3386338, 3433138, 3627143, 3719951, 3762667, 3863254, 3921888, 4003328, 4095541, 4195029, 4236938, 4373013, 4533698, 4645996, 4719044, 4807419, 4988266, 5105999]
4974E105999J47053Q3348K32925R8777J97664K40483K51584O3363J94092K77515
4964F892803K91569K31085K51673K79109J30788K31346K79477K79486K44204L73920
4954I485460L55322K92358L18754K98113K49202K86741L81296K91021L19323K30827
4944A2508417L24189K21523K32719J84560K04176K29404J55476P6607m916J88324
4934A4320479L7027m4793Q2227N3136n3158m813K562l7292q0318q8807j22918
4923A4063332j34304k23397j96465k80736k22651k53866j58387k64717j99199
4914A2129610k22694k25939k48610j70523k17001k92048j12187j85796j39193
4905A0315619j47202j51252j17628k72256j28414j87976j63199k23730k57928
$$ y = [5105999, 5253052, 5336400, 5569325, 5668102, 5865766, 6106249, 6357833, 6421196, 6615288, 6892803, 7184372, 7415457, 7667130, 7946239, 8077027, 8308373, 8587850, 8867336, 9111540, 9485460, 9840782, 10133140, 10451894, 10750007, 10999209, 11285950, 11667246, 11958267, 12277590, 12508417, 12832606, 13054129, 13286848, 13471408, 13675584, 13904988, 14060464, 14137071, 14132155, 14320479, 14357506, 14312713, 14394940, 14448076, 14394918, 14390105, 14392667, 14355375, 14275057, 14186250, 14063332, 13929028, 13705631, 13509166, 13228430, 13005779, 12751913, 12593526, 12328809, 12129610, 11906916, 11680977, 11432367, 11261844, 11044843, 10752795, 10640608, 10454812, 10315619, 10168417, 10017165, 9899537, 9627281, 9498867, 9310891, 9147692, 8923962, 8666034]
4896H666034j73260j47948k19859j62012j16243j68294j89708j67110j50055j72992
4886F998553k0322r7858m6929j17094p5673q8622j02138m8584q6881m8704j68294
4875F097454r8376p8824j10591M864J5589j34825j02839q893k7150l1613P909
4864E532705k39J108k5711k7222O3232l8307J4347L5978N734l2305R9235Q260
4852E636815O7173M0073K798J4384m3984L765N3344K2578m219M0032N7871m211
4840E886419O1926M5716M5372J10921Q4012R895J49010R1785l2401l820j8608
4829F430227j8456j32795j09309j20228n6462o0816j21396q9517j1958o6491j17390
4818E525409J06922M5457p0381m3750J158l9937l0588j04161j14620p9518r0389
$$ y = [8666034, 8492774, 8344826, 8124967, 7962955, 7846712, 7678418, 7488710, 7321600, 7171545, 6998553, 6978231, 6880373, 6833444, 6716350, 6640677, 6552055, 6449917, 6401333, 6314452, 6265748, 6097454, 5999078, 5920254, 5809663, 5814527, 5830116, 5695291, 5592452, 5583559, 5556409, 5524796, 5532705, 5532466, 5533574, 5507863, 5480641, 5543873, 5505566, 5519913, 5555891, 5561625, 5529320, 5628555, 5636815, 5703988, 5744061, 5746859, 5761243, 5717259, 5721024, 5774368, 5796946, 5792727, 5832759, 5890630, 5886419, 5948345, 5994061, 6039433, 6150354, 6234366, 6244261, 6393271, 6485056, 6452655, 6448835, 6430227, 6411771, 6278976, 6169667, 6049439, 5992977, 5932161, 5810765, 5721248, 5709290, 5642799, 5525409, 5632331, 5677788, 5607407, 5563657, 5564815, 5524878, 5494290, 5390129, 5275509, 5195991, 5105602]
4807E105602m3701r9642j31079n7371n8658q3342n0851j3270n3127o0886k3759
4796D429916j3454l8792p7847l8083j2403L4709m9552n4478l6635M696K0481o5775
4784D102783J6311K6953l8214J6845L3063k6204J0178j1085K3441K6798j5842
4773D165027N1707r6183k9791M5118J8997j8944J2573m5182M7905n0322j7402
4762D083503O5132R9751l3144L4233L5619K2978n1599M4600R147J6202J39418
4751D465840K0990J9607J48699o9407K3858J05802Q3493Q2548N728O7090N2611
4740E006859N5987Q5944R7526M3175L0909J22275P8011R9493J17595L5796J09249
4729E882819J11959J53696J08648R8615M5134J48431L7794J34918J34928J67248
$$ y = [5105602, 5061901, 4962259, 4831180, 4773809, 4715151, 4631809, 4580958, 4567688, 4514561, 4453675, 4429916, 4416462, 4377670, 4299823, 4261740, 4249337, 4284046, 4234494, 4180016, 4143381, 4148077, 4168558, 4102783, 4119094, 4146047, 4107833, 4124678, 4157741, 4131537, 4141715, 4130630, 4154071, 4180869, 4165027, 4216734, 4120551, 4090760, 4135878, 4154875, 4135931, 4148504, 4103322, 4151227, 4100905, 4083503, 4148635, 4248386, 4215242, 4249475, 4285094, 4308072, 4256473, 4301073, 4310220, 4326422, 4465840, 4486830, 4506437, 4655136, 4585729, 4609587, 4715389, 4798882, 4881430, 4887158, 4954248, 5006859, 5062846, 5148790, 5246316, 5289491, 5320400, 5442675, 5520686, 5620179, 5737774, 5773570, 5882819, 5994778, 6148474, 6257122, 6355737, 6400871, 6549302, 6587096, 6722014, 6856942, 7024190]
4719G024190j6665J21632K30097J29268J10025Q0786J99837J10907J49264J55886
4709H295227J18261J53261K51353J73854P3244K16744K27859O1383R8874K59734
4699I929794J29911J33253K05297K60603J89801J03773K23928K93370J75163J67494
4689A1812387J82044K17015J99697K11781K36599K24289J63386J43999K67298
4680A3658495L51246R8870J59926K43888K40578J83628K02047L07744J75813J85102
4670A5807337J90216K02802J82573J92123J36898J15194P2289K67855J96634J42080
4660A7506001J23720R6000J05845J53355J34594n0137K04939Q8375J15235P0194
4650A8548121n0879O2696J39771N8575Q5805J3350P3812L2613j5516q3766Q7575
$$ y = [7024190, 7007525, 7129157, 7359254, 7488522, 7598547, 7679333, 7879170, 7990077, 8139341, 8295227, 8413488, 8566749, 8818102, 8991956, 9065200, 9281944, 9509803, 9571186, 9670060, 9929794, 10059705, 10192958, 10398255, 10658858, 10848659, 10952432, 11176360, 11469730, 11644893, 11812387, 11994431, 12211446, 12411143, 12622924, 12859523, 13083812, 13247198, 13391197, 13658495, 14009741, 14108611, 14268537, 14512425, 14753003, 14936631, 15138678, 15446422, 15622235, 15807337, 15997553, 16200355, 16382928, 16575051, 16711949, 16827143, 16899432, 17167287, 17363921, 17506001, 17629721, 17725721, 17831566, 17984921, 18119515, 18069378, 18274317, 18362692, 18477927, 18548121, 18497242, 18559938, 18699709, 18758284, 18844089, 18857439, 18931251, 18963864, 18948348, 18864582, 18952157]
4639A8952157m830p0906l0239j4881O9114j41217j9814j11798j59993m9262p8457
4628A8339874q8576j28264r6493p9467j70036j72391j75282j57337k38025j80945
4618A6853058j56436j15615k43014k46206k64963k66419k18137k05577k29105
4609A4907586k20773j90992j94902k51616k38347j75107j43622j91081j72761
4600A3128385k05066j23655k39148k84256j27364k66860j90845j80309j93762
4591A1317120k08534j69679j63773j16381n1706k67355j53965j39251j62091j46051
4581I738334j11328j63841j62059j30202k01796k30454r7385q6003j64456j43278
4571H247532o1091o199j53972q3877m7088l8213q9045j68902r3377j41568j25626
$$ y = [18952157, 18947327, 18876421, 18846182, 18831301, 18900415, 18759198, 18739384, 18627586, 18467593, 18418331, 18339874, 18251298, 18123034, 18026541, 17947074, 17777038, 17604647, 17429365, 17272028, 17034003, 16853058, 16696622, 16581007, 16337993, 16091787, 15826824, 15560405, 15342268, 15136691, 14907586, 14686813, 14495821, 14300919, 14049303, 13810956, 13635849, 13492227, 13301146, 13128385, 12923319, 12799664, 12560516, 12276260, 12148896, 11882036, 11691191, 11510882, 11317120, 11108586, 10938907, 10775134, 10658753, 10607047, 10339692, 10185727, 10046476, 9884385, 9738334, 9627006, 9463165, 9301106, 9170904, 8969108, 8738654, 8641269, 8555266, 8390810, 8247532, 8186441, 8180242, 8026270, 7942393, 7895305, 7857092, 7768047, 7599145, 7505768, 7364200, 7238574]
4560G238574j32715k2778j44783j39996q0709j00915q3322o4332j17264P93N7671
4549F410224j23067J0955j5976p1038l6018p4333p1487M220m2796k7548j03456
4538E859680q0416p1454m1237k4786k3639K8009m0175r8509l1606R1825N308r074
4526E563926J5239M3683j27811O3568L4368j00087l905J8974n3923m579M5321
4515E494774L8537O8914p012R7667K6431N0787J12176J07381O0428J87094K0854
4504F258031Q8718Q1596N1363J15779n1679l8386K4593J6071N395M0659Q3772
4493F675912N3296J4850J02403R0425P3310M2443J68978J65267R3049K7059L6958
4482G543950m1048q4752r8818o5408n3454q0342j54729q8652r5110j94334m7331
$$ y = [7238574, 7105859, 7083081, 6938298, 6798302, 6717593, 6616678, 6533356, 6469024, 6351760, 6352553, 6410224, 6287157, 6298112, 6282136, 6211098, 6175080, 6100747, 6029260, 6033480, 5990684, 5963136, 5859680, 5779264, 5707810, 5666573, 5641787, 5618148, 5646157, 5605982, 5507473, 5475867, 5567692, 5573000, 5563926, 5579165, 5622848, 5495037, 5558605, 5592973, 5492886, 5488981, 5507955, 5454032, 5449453, 5494774, 5533311, 5602225, 5595213, 5692880, 5719311, 5770098, 5882274, 5989655, 6050083, 6237177, 6258031, 6346749, 6428345, 6479708, 6595487, 6543808, 6505422, 6530015, 6546086, 6551481, 6592140, 6675912, 6729208, 6744058, 6846461, 6936886, 7010196, 7052639, 7221617, 7386884, 7479933, 7506992, 7543950, 7502902, 7418150, 7319332, 7253924, 7200470, 7120128, 6965399, 6876747, 6781637, 6587303, 6539972]
4471F539972o849l7755j08426m086M8320N3397q8532j819n9894k8855l8547k8835
4459F238091q6709r2335l0259M341p172N3899P941R2816J94666J18669N6742l5090
4447F515600n5188j51984j43064j82354k40821j78047k05285j07472l3239j36935
4437E081211j39874j9262k8779l2552J0535m7597J0118p589l040Q532o0802P0907
4425D841808K1232Q6626J07348J51744J34387J30181J71240J40475J11447M52
4415E896940l1325j66455r7104j06780j21761k17412j84231k16215j24707j39926
4405D491024j37393j04463n1345j33174q3463p7507J4486q0836m849m6457l7499
4394C748524m7060k6243J17975K2484r01l0971M7955O117j32137m096l9181j18742
$$ y = [6539972, 6533123, 6495368, 6386942, 6382856, 6431176, 6484573, 6396041, 6394222, 6334328, 6305473, 6266926, 6238091, 6151382, 6059047, 6028788, 6033129, 6025957, 6079856, 6087797, 6180613, 6375279, 6493948, 6550690, 6515600, 6460412, 6308428, 6165364, 5983010, 5742189, 5564142, 5358857, 5251385, 5218146, 5081211, 4941337, 4922075, 4893296, 4860744, 4871279, 4823682, 4833800, 4826211, 4823171, 4831703, 4770901, 4841808, 4863040, 4949666, 5057014, 5208758, 5343145, 5473326, 5644566, 5785041, 5896488, 5896940, 5865615, 5699160, 5602056, 5495276, 5373515, 5156103, 4971872, 4755657, 4630950, 4491024, 4353631, 4249168, 4197823, 4064649, 3981186, 3903679, 3918165, 3837329, 3832480, 3786023, 3748524, 3701464, 3675221, 3793196, 3815680, 3814779, 3783808, 3831763, 3837880, 3705743, 3701647, 3662466, 3543724]
4382C543724q8665p6734K0854j35517j39582n3057n2951J3275k7252m9726m483
4371B949886p1449R0800n5035J0897r5711l2180m3353k0669M3777m4455j25514
4360B606994J2319l1431n4942m6760j9428m5045J2154l0644k3283N2646o5974
4349B366606k1811P5519K3390r6866k4079R689J4968K3881L3359j5205p66j50817
4337B237868k3011k8552k4207M8435l7730K7608k8499J7242K2875L6243P6045
4326B324317l9139O4651l3159l0247J06883P3339l6565N1218q7199J5981l8648
4315B371432j43821R0492j7790J2721j18867p2320J05030o4857l0276M6619r1592
4304B086771j2989K9008l0169O229R7063K637K0773M6900n5867J1665m6014k0001
$$ y = [3543724, 3455059, 3378325, 3399179, 3263662, 3124080, 3071023, 3018072, 3031347, 3004095, 2954369, 2949886, 2878437, 2969237, 2914202, 2925099, 2829388, 2797208, 2753855, 2733186, 2776963, 2732508, 2606994, 2619313, 2587882, 2532940, 2486180, 2466752, 2421707, 2433861, 2403217, 2379934, 2432580, 2366606, 2344795, 2420314, 2443704, 2346838, 2322759, 2332448, 2347416, 2371297, 2404656, 2389451, 2388685, 2237868, 2214857, 2186305, 2162098, 2210533, 2172803, 2200411, 2171912, 2189154, 2212029, 2248272, 2324317, 2285178, 2349829, 2316670, 2286423, 2393306, 2466645, 2430080, 2481298, 2394099, 2410080, 2371432, 2227611, 2318103, 2300313, 2313034, 2194167, 2121847, 2226877, 2162020, 2131744, 2178363, 2086771, 2073782, 2102790, 2072621, 2078850, 2175913, 2178550, 2199323, 2246223, 2190356, 2202021, 2156007, 2136006]
4292B136006r0K2176o6613m8965m8106r284j01727k628l396j749r4524l9946Q3432
4279A824586L2477j6102p9802K8377K2291k5203L8203l1446L0460K2999q7257
4268A759583K7140o67K8734n6029J7456O8766l5131k5476j11847j1732p539N5038
4256A708296J3267n070J0274n6553n3727L0373O2393l2665j4135n1879O0793Q588
4244A679955N553L3006j792k531k6921m4071K5978j3904K6632O2538j1195K4285
4232A757533n3571l2007j1377J7706L7326o7351L9996J8592K910J06703r4037
4221A722423n0959K2302K3386J7534n3809O2905K6556j2479M771L9585R550M7065
4209A858830K0618J460N435L7056k6257l1212k4178j5073L8289M9431R123l4826
$$ y = [2136006, 2135916, 2158092, 2091479, 2042514, 1994408, 1985124, 1883397, 1880769, 1877373, 1875624, 1781100, 1741154, 1824586, 1857063, 1840961, 1761159, 1789536, 1811827, 1786624, 1824827, 1793381, 1823841, 1846840, 1759583, 1786723, 1786056, 1814790, 1758761, 1776217, 1844983, 1809852, 1784376, 1672529, 1660797, 1653258, 1708296, 1721563, 1716493, 1726767, 1670214, 1616487, 1646860, 1709253, 1676588, 1662453, 1610574, 1671367, 1679955, 1685508, 1718514, 1716722, 1714191, 1687270, 1643199, 1669177, 1655273, 1681905, 1744443, 1733248, 1757533, 1703962, 1671955, 1660578, 1678284, 1715610, 1648259, 1688255, 1706847, 1709757, 1816460, 1722423, 1671464, 1693766, 1717152, 1734686, 1680877, 1743782, 1770338, 1757859, 1762630, 1802215, 1811765, 1858830, 1879448, 1880908, 1886343, 1923399, 1897142, 1865930, 1841752, 1826679, 1864968, 1914399, 1923522, 1888696]
4197A888696j4484m0680j19K3215m6453L4511K7774l3375L0939L4275k8561O201
4185A881939M8736N0530O2817m1179l5508l6309k8075N7811L0100J2444K6383
4174B029689R129j8705K3575l7525N8603L5840m5667N1514P1174o4583j2195J0018
4162B110867J2821J12355k8772O1152K9082j1316O2607j33074l016N1408M4386
4151B308500J4398J17027q0839k534L1455K8926j0375J33760j54M9358j580k8371
4139B559571M4810k1988O1439k258R146Q4608J20745J4572L1951m9809M6727N5471
4127B954985r603K5144J16331L7792J19569J3391Q0273O9684L5968p6806O8228
4116C434956N5727K9415O3823k9531N2570O0205L5638N6225P3910J32828Q0240
$$ y = [1888696, 1874212, 1833532, 1833413, 1856628, 1810175, 1844686, 1872460, 1839085, 1870024, 1904299, 1875738, 1881939, 1930675, 1981205, 2044022, 2002843, 1967335, 1931026, 1902951, 1960762, 1990862, 2003306, 2029689, 2038818, 2020113, 2043688, 2006163, 2064766, 2100606, 2054939, 2106453, 2177627, 2113044, 2100849, 2110867, 2123688, 2236043, 2207271, 2268423, 2297505, 2286189, 2348796, 2215722, 2212706, 2264114, 2308500, 2322898, 2439925, 2359086, 2356552, 2388007, 2416933, 2406558, 2540318, 2540164, 2589522, 2587942, 2559571, 2604381, 2582393, 2643832, 2641574, 2650720, 2735328, 2856073, 2870645, 2902596, 2852787, 2899514, 2954985, 2945382, 2970526, 3086857, 3124649, 3244218, 3257609, 3337882, 3407566, 3443534, 3366728, 3434956, 3490683, 3520098, 3583921, 3554390, 3606960, 3667165, 3702803, 3759028, 3832938, 3965766, 4046006]
4105D046006m78M6445P3241J6944K2808p891J03190N2486Q0761N6433O5585K7569
4093D583099l1154O8528J03953J0711L9039n224K481P7995M5681M9316k2020R73
4081D923378P2548P0365J5318K9460K1012R229P8592J2626N5041r0931Q1570l2038
4069E246170K8424J47082Q8651N4718j9415J8974j7476J8563J27553J14936o3631
4058E744549P5099K4975O5624J4737K7375J20789L8076k1746O9303J50338K3131
4047F332250N1858J2408N4450Q5429J00652J10388P8735R3664Q1103J18061J16441
4036G235439J49654J06078Q4053K2876J51748P0626J33377J85825O0789J26338
4026H326803J93704J73484J17851J32775J79628J90700R6664J33512K07049K67270
$$ y = [4046006, 4045528, 4091973, 4165214, 4182158, 4204966, 4197075, 4300265, 4352751, 4433512, 4489945, 4555530, 4583099, 4551945, 4620473, 4724426, 4735137, 4774176, 4768952, 4771433, 4849428, 4895109, 4944425, 4922405, 4923378, 4995926, 5066291, 5081609, 5111069, 5132081, 5141310, 5219902, 5232528, 5287569, 5196638, 5278208, 5246170, 5274594, 5421676, 5510327, 5565045, 5545630, 5564604, 5547128, 5565691, 5693244, 5808180, 5744549, 5819648, 5844623, 5910247, 5924984, 5952359, 6073148, 6111224, 6089478, 6158781, 6309119, 6332250, 6384108, 6396516, 6450966, 6536395, 6637047, 6747435, 6826170, 6919834, 7000937, 7118998, 7235439, 7385093, 7491171, 7575224, 7598100, 7749848, 7820474, 7953851, 8139676, 8200465, 8326803, 8520507, 8693991, 8811842, 8944617, 9124245, 9314945, 9411609, 9545121, 9752170, 10019440]
4016A0019440J10750J27676J12956K37490K37312J01595K39128J65698J75759
4007A1527804J75106K80633K16844L43010L07217K76764J18980J18491R2214J06449
3997A3563512L2176O3572K4344k4297p973L8078L9428K5287o6108L4520Q2850
3986A3805389L4207L3938L0295K9011N9827L5225P8618J5640r805J04621J428
3975A4218394J8596J44147K5691j9868L3992J50004P4220L7520J89316M3418J04220
3964A5019650R0774J09223J70454J87678J12518J20248K41325K01597J96035K39395
3954A6688897K09400J78433K74897L74801K23481K75783L13195L13997L07925
3945A9160809K77850K90985L39225L11548M16240K55051K76810L13071L07935
$$ y = [10019440, 10130190, 10257866, 10370822, 10608312, 10845624, 10947219, 11186347, 11352045, 11527804, 11702910, 11983543, 12200387, 12543397, 12850614, 13127378, 13246358, 13364849, 13457063, 13563512, 13595688, 13659260, 13683604, 13659307, 13651334, 13689412, 13728840, 13754127, 13688019, 13722539, 13805389, 13839596, 13873534, 13903829, 13932840, 13992667, 14027892, 14106510, 14122150, 14112345, 14216966, 14218394, 14236990, 14381137, 14406828, 14386960, 14420952, 14570956, 14645176, 14682696, 14872012, 14915430, 15019650, 15110424, 15219647, 15390101, 15577779, 15690297, 15810545, 16051870, 16253467, 16449502, 16688897, 16898297, 17076730, 17351627, 17726428, 17949909, 18225692, 18538887, 18852884, 19160809, 19438659, 19729644, 20068869, 20380417, 20796657, 21051708, 21328518, 21641589, 21949524]
3936B1949524L10903K73340K79568J92503K26464L52361J40576J45589J66467
3927B4037295J90489O5020R8206J05129J56879O4242J09055J07747P9887J76790
3917B5190739J28092J49105J49401J43519J41539J56754J56122L01101K55736
3908B6772108K13011K40337K48384K18758K06492K26096K63286K05645J24079
3899B8718196J97469J79698K00421K41552K54899L06450K23037L06622L52125
3890C0980469L00208L31998L32670M04062L75480L02841J69156J47102P7402j67294
3880C3254094j48677r5258k82483l27295k94805l02959l48812m43684l49835m07734
3870C0252552m92836m88161m93048m96315o40047o79800n92653o77042n91432
$$ y = [21949524, 22260427, 22533767, 22813335, 23005838, 23232302, 23584663, 23725239, 23870828, 24037295, 24227784, 24292804, 24391010, 24496139, 24653018, 24717260, 24826315, 24934062, 25013949, 25190739, 25318831, 25467936, 25617337, 25760856, 25902395, 26059149, 26215271, 26516372, 26772108, 26985119, 27225456, 27473840, 27692598, 27899090, 28125186, 28388472, 28594117, 28718196, 28915665, 29095363, 29295784, 29537336, 29792235, 30098685, 30321722, 30628344, 30980469, 31280677, 31612675, 31945345, 32349407, 32724887, 33027728, 33196884, 33343986, 33421388, 33254094, 33105417, 33010159, 32727676, 32400381, 32105576, 31802617, 31453805, 31010121, 30660286, 30252552, 29759716, 29271555, 28778507, 28282192, 27642145, 26962345, 26369692, 25692650, 25101218]
3861B5101218o73515o73880n96288o78587o51124n48881o11775o65385n92016
3852A9409767n26448n54681n59443n93897m96495m90136m62239m47592m01983
3843A4876853l89097l73515m04648l05539l55550k54226j91160k62041j05706
3834A2235371j78013l10987k72634k90471k36599k44131j68665k61557l19297
3825I953017k58790k48393k73906k11749k41788k58532j15922j04597k56874j45715
3815G836751j91312j25287j60487j30425j14905j76286k19003p8214q2775j93577
3805F364480j29577j31645j44081j18293j45251p2210q3121j51063K3186j30955
3795E281470j02215n3431l6766o3602p1313j33607n7143j08907J9435p5807m4741
$$ y = [25101218, 24427703, 23753823, 23157535, 22478948, 21827824, 21278943, 20667168, 20001783, 19409767, 18883319, 18328638, 17769195, 17175298, 16678803, 16188667, 15726428, 15278836, 14876853, 14487756, 14114241, 13709593, 13404054, 13048504, 12794278, 12603118, 12341077, 12235371, 12057358, 11746371, 11473737, 11183266, 10946667, 10702536, 10533871, 10272314, 9953017, 9694227, 9445834, 9171928, 8960179, 8718391, 8459859, 8343937, 8239340, 7982466, 7836751, 7645439, 7520152, 7359665, 7229240, 7114335, 6938049, 6719046, 6640832, 6558057, 6364480, 6234903, 6103258, 5959177, 5840884, 5695633, 5623423, 5540302, 5389239, 5412425, 5281470, 5179255, 5125824, 5089058, 5025456, 4954143, 4820536, 4763393, 4654486, 4673921, 4598114, 4553373]
3784D553373n0482k7395j4663O5634o6132L6352J73992J5190M8600J61715J93288
3773E089472J00250M6795l9495K8530m3570j24663k22638j70057j75636j32792
3763D356196p7232j41221j52805o1928l9104j36601l0520n8275q6285q4786N5865
3752C543304o2632o9455p6972j6738j369q0789J1871l9894o1036K7746j2578M8766
3740C210224p7007J0106n9304k9222M630o2071J3312K076O226M1368q758m1176
3728C010404O2446k7085j16748K681k5708O4831K4795o044J5155k7346M8421p9329
3716B946473j6020l1841J3887N2246Q4336m868q5485J8785k1245O4926j3851J085
3704C008428k7145n6802Q0182Q5404P790O9495k6340K4912k8806L8763R6238l9039
$$ y = [4553373, 4502891, 4475496, 4460833, 4526467, 4460335, 4496687, 4670679, 4685869, 4734469, 4896184, 5089472, 5189722, 5236517, 5197022, 5225552, 5181982, 5057319, 4834681, 4664624, 4488988, 4356196, 4278964, 4137743, 3984938, 3923010, 3883906, 3747305, 3716785, 3658510, 3572225, 3487439, 3543304, 3480672, 3411217, 3334245, 3317507, 3316138, 3235349, 3247220, 3207326, 3146290, 3174036, 3161458, 3210224, 3133217, 3143323, 3084019, 3054797, 3059427, 2997356, 3010668, 3012744, 3018970, 3060338, 3051580, 3010404, 3072850, 3045765, 2929017, 2931698, 2905990, 2970821, 2995616, 2989572, 3004727, 2977381, 3025802, 2946473, 2930453, 2898612, 2912499, 2964745, 3049081, 3044213, 2958728, 2977513, 2956268, 3021194, 3007343, 3008428, 2981283, 2924481, 3004663, 3090067, 3097857, 3167352, 3141012, 3165924, 3137118, 3175881, 3272119, 3233080]
3692C233080l7443J8479N7505l1778n172O3513J5345J5652r238K1501N6886L4906
3680C433236J33378Q6189n350M3348P4230K5788l8365K7771K4459m8922O7728
3669C823490Q4564k7668Q0067L9474M0786M7386j6768m5579m648L9561o689P011
3657D060987O1123N7901L8009K4049L502J27093j8439J64772J6698j3743J10522
3646D632474J04036m54P5189N0125Q2305L5972P9232M6964J03224Q1551J23765
3635E414383R6779J47620m8077P8325o4488L4573Q6073K9417N1153m801N0797
3624E871754R3688O2463J19985J43450J42979J50738K36715J13676J69821J82817
3614G288086J77654K41918J62323J11956J37689K18981K12538J83779J67692K04667
$$ y = [3233080, 3195637, 3214116, 3271621, 3239843, 3234671, 3298184, 3313529, 3329181, 3319943, 3341444, 3398330, 3433236, 3566614, 3652803, 3647453, 3690801, 3765031, 3790819, 3752454, 3780225, 3804684, 3755762, 3823490, 3908054, 3880386, 3960453, 3999927, 4040713, 4088099, 4071331, 4025752, 4021104, 4060665, 4053976, 4060987, 4122110, 4180011, 4218020, 4242069, 4245571, 4372664, 4354225, 4518997, 4535695, 4521952, 4632474, 4736510, 4736056, 4811245, 4861370, 4943675, 4979647, 5058879, 5105843, 5209067, 5290618, 5414383, 5511162, 5658782, 5610705, 5689030, 5624542, 5659115, 5745188, 5774605, 5825758, 5820957, 5871754, 5965442, 6027905, 6147890, 6291340, 6434319, 6585057, 6821772, 6935448, 7105269, 7288086, 7465740, 7707658, 7869981, 7981937, 8119626, 8338607, 8551145, 8734924, 8902616, 9107283]
3604I107283K83174J45369L24698K00808L07717M61060M12051K50990L64804L33548
3594A2191502M36181M02156O13466O31069O81363O19747N69274O91303P11573
3585A7547634O19654Q91468J023405J258664J529035J996347K348396K740393
3577B9954996L138796L585904L842021L688050K997806K691150K723543K885239
3569E5507505L469467M337812N295725O434251P293448Q743159J0816970J4025916
3561A15924253J8969628K6144562L5265822M8923058M3654872r46392j5816044
3554B72119759j1521632j4883823j6281851k0623414k2874605k5412422k4459534
3547A36062478j9264560j5029264j2265683r791894q111589o679580n688696m824760
$$ y = [9107283, 9390457, 9535826, 9860524, 10061332, 10369049, 10830109, 11242160, 11493150, 11857954, 12191502, 12627683, 13029839, 13643305, 14274374, 14955737, 15575484, 16144758, 16836061, 17547634, 18167288, 19058756, 20082161, 21340825, 22869860, 24866207, 27214603, 29954996, 33093792, 36679696, 40521717, 44209767, 47207573, 49898723, 52622266, 55507505, 58976972, 63314784, 68610509, 75044760, 82338208, 91081367, 101898337, 115924253, 134893881, 161038443, 196304265, 245227323, 288882195, 287935803, 272119759, 260598127, 245714304, 229432453, 208809039, 185934434, 160522012, 136062478, 116797918, 101768654, 89502971, 79711077, 71599488, 64919908, 59231212, 54406452]
3539E4406452m311623l655406l316348k900866k597376k207492k053432j866964
3531C1496945j759315j628169j701954j528285j552221j231101j378627j214925
3523A9502348j118428r48537q96655p61619q43100p02009o66324n28120n61134
3514A2476422m12649m39643m07632l41878l62136m12524k73629k86583l07601
3505I232147l92079k40011l27733j67789j05225j25362j71064j83527j21382k3642
3495G374333j35750n6132j87464j37336j3504o8388r9697r9312j37712j73635
3485F265403r9470j11430o2566j94778j37693Q569j60920j28222q7028N0904j4060
3474E328709Q6903j25281K7047L940M782r104J1991L6047p7839J6881N3162L0659
$$ y = [54406452, 50094829, 46439423, 43123075, 40222209, 37624833, 35417341, 33363909, 31496945, 29737630, 28109461, 26407507, 24879222, 23327001, 22095900, 20717273, 19502348, 18383920, 17435383, 16538728, 15777109, 14934009, 14232000, 13565676, 13037556, 12476422, 12063773, 11624130, 11216498, 10874620, 10512484, 10099960, 9826331, 9539748, 9232147, 8840068, 8600057, 8272324, 8104535, 7999310, 7873948, 7702884, 7519357, 7397975, 7374333, 7238583, 7182451, 6994987, 6857651, 6844147, 6775759, 6676062, 6576750, 6439038, 6265403, 6165933, 6054503, 5991937, 5797159, 5659466, 5668035, 5507115, 5378893, 5291865, 5342769, 5328709, 5415612, 5290331, 5317378, 5321318, 5326100, 5316996, 5328987, 5365034, 5287195, 5304076, 5357238, 5387897]
3462E387897P632L1852P9948O0839k0068K8008L0552J9323L9769J69819j1514
3451E824057M4031J36970Q9855l9386J39065K9428J54928J13095J61190Q4625
3441F737858M3565K02495K5560J54126J21525J76819J63540K27760K47721K46106
3431H347075K74552J94418J67524L35950K87301K17911L24155K75333K92372L06291
3421A1022882K48797L37301L11967L78492K44408L23733K72228L98978L69813
3412A3908599K40861L71279M55492N03467L81385M08241M06217M68308L09675
3403A7453524L75616M47871M17643M53613M32085M31995M41783M48377M41476
3394B1343983N14066M30098M43114N88054M29294N10932N97807M43264M83474
$$ y = [5387897, 5395529, 5427381, 5507329, 5568168, 5548100, 5576108, 5606660, 5625983, 5665752, 5835571, 5824057, 5868088, 6005058, 6094913, 6055527, 6194592, 6224020, 6378948, 6492043, 6653233, 6737858, 6781423, 6983918, 7009478, 7163604, 7285129, 7461948, 7625488, 7853248, 8100969, 8347075, 8621627, 8816045, 8983569, 9319519, 9606820, 9824731, 10148886, 10424219, 10716591, 11022882, 11271679, 11608980, 11920947, 12299439, 12543847, 12867580, 13139808, 13538786, 13908599, 14149460, 14520739, 14976231, 15479698, 15861083, 16269324, 16675541, 17143849, 17453524, 17829140, 18277011, 18694654, 19148267, 19580352, 20012347, 20454130, 20902507, 21343983, 21858049, 22288147, 22731261, 23319315, 23748609, 24259541, 24857348, 25300612, 25784086]
3385B5784086N13148M61831N72219M36288M71269M22971M51402N13685N18998
3376C0145897M21595L76289K60211L99692K70356K92327L61963K50122K13504
3367C2991956J11589K66564K29864K02664J99915J36605R0449J57355M8527l1983
3357C4403505n3687K4616l8810j46790r4707q2737o8211j23366j41357j69296
3347C3509160j15655j57124j31411j73134k7840j2202m0764q2948j30270l31046
3337C2306766l10207l12472l87918l73511m36599l91968m08285m65020m44458
3328B8776328m60809l40199m64903l65773l93678l90602m44968m30622m04556
3319B5080218l47833m22961m35708m66733n32261m59340m38681m61365n01442
$$ y = [25784086, 26297234, 26759065, 27331284, 27767572, 28238841, 28661812, 29113214, 29626899, 30145897, 30567492, 30943781, 31203992, 31603684, 31874040, 32166367, 32528330, 32778452, 32991956, 33103545, 33370109, 33599973, 33802637, 34002552, 34139157, 34229606, 34386961, 34435488, 34403505, 34349818, 34374434, 34335624, 34188834, 34094127, 34011390, 33943179, 33819813, 33678456, 33509160, 33393505, 33236381, 33104970, 32931836, 32903996, 32891794, 32851030, 32768082, 32637812, 32306766, 31996559, 31684087, 31296169, 30922658, 30486059, 30094091, 29685806, 29220786, 28776328, 28315519, 27975320, 27510417, 27144644, 26750966, 26360364, 25915396, 25484774, 25080218, 24732385, 24309424, 23873716, 23406983, 22874722, 22415382, 21976701, 21515336, 21013894]
3310B1013894m08763m25816l98204m15864m06910l99833m16664m01648k18908
3301A7521284l35961l89384l35776l21942l28679k87168l24984k87456l42543
3292A4567391k85963k86589k57708k53619k51930k75866k26873j73314j07734
3283A2447795k25470k24815j65701j86469r1977j26160j12176r5239j27254n6420
3273A1036114n055r4451j33498m2412Q564m4276j0683O344L9306J1122J03365
3262A0874440j2024j4228J27741P1660J30438N9467J39286J66656J15142J59631
3252A1818209K22218K59568K37893J23270K23403L59912K59936K26818L19755
3243A4050982J75533K98502J82335K70803L07744J58073K88253K93971K39289
$$ y = [21013894, 20605131, 20179315, 19781111, 19365247, 18958337, 18558504, 18141840, 17740192, 17521284, 17185323, 16795939, 16460163, 16138221, 15809542, 15522374, 15197390, 14909934, 14567391, 14281428, 13994839, 13737131, 13483512, 13231582, 12955716, 12728843, 12555529, 12447795, 12222325, 11997510, 11831809, 11645340, 11553363, 11427203, 11315027, 11219788, 11092534, 11036114, 11031059, 10936608, 10803110, 10760698, 10769262, 10724986, 10714303, 10720647, 10759953, 10771075, 10874440, 10862416, 10848188, 10975929, 11047589, 11178027, 11237494, 11376780, 11543436, 11658578, 11818209, 12040427, 12299995, 12537888, 12661158, 12884561, 13244473, 13504409, 13731227, 14050982, 14226515, 14525017, 14707352, 14978155, 15285899, 15443972, 15732225, 16026196, 16265485]
3234A6265485J84463K18735K79359K25524J38040K26693J78415J51635J98439
3225A8066788J02639J95517j7332K5431M7746l4960k17710j75780n2278j65601
3215A7774460j51771k31450j95418k02386k81170l13108k22152k04704l12310
3206A5659991l02027k88440k26670k28150k40765k57063l65790j26704k50898
3197A3373484k18431k76426k57900j85296j95409k38407j87166j14086j05713
3188A1594650k06365j80141j53158j60863l5798j86269k18557j22084j48606j36432
3178A0046377k9464o8987j06976j17274p2009r5164j01640j08412n2261K536l5863
3167I260863j33116q0090M5543k5037M1151p7994m9443k7708K4872J2953o0547
$$ y = [16265485, 16449948, 16668683, 16948042, 17173566, 17311606, 17538299, 17716714, 17868349, 18066788, 18169427, 18364944, 18347612, 18373043, 18420789, 18385829, 18168119, 17992339, 17940061, 17774460, 17622689, 17391239, 17195821, 16993435, 16712265, 16399157, 16177005, 15972301, 15659991, 15357964, 15069524, 14842854, 14614704, 14373939, 14116876, 13751086, 13624382, 13373484, 13155053, 12878627, 12620727, 12435431, 12240022, 12001615, 11814449, 11700363, 11594650, 11388285, 11208144, 11054986, 10894123, 10858325, 10672056, 10453499, 10331415, 10182809, 10046377, 10016913, 9947926, 9840950, 9723676, 9651667, 9556503, 9454863, 9346451, 9294190, 9296726, 9260863, 9127747, 9047657, 9093200, 9068163, 9109314, 9031320, 8981877, 8954169, 8979041, 8991994, 8931447]
3156H931447J9385P5684R972m3872P3366n6785M1958L4453m279P7871K1566J1872
3144I192638J7494J02482R4755K1864J9322M2224R6840M7822J46192R8958J25416
3133A0006007M1329R6308J24270P20K43486Q6471J23527J70668J69155J24530
3123A1186471J36008J77288J94179J20490P1782K24912J44678J91116K07072J70027
3113A2824023J97927J75444J15362J81819J76208J76086J57979J52981J31130
3104A4288959R6556J67570J41054J29924Q3354K42385Q2512R7997J64442J61152
3094A5655905J78907J48339K26015J58551K32962J97846K17960K74383L42038
3085A7632906L08099K17510K22035L29438K92742K80676K81093K62784L09598
$$ y = [8931447, 8950832, 9026516, 9036488, 8992616, 9065982, 9009197, 9051155, 9085608, 9081329, 9159200, 9180766, 9192638, 9210132, 9312614, 9407369, 9429233, 9448555, 9490779, 9587619, 9635441, 9781633, 9880591, 10006007, 10047336, 10143644, 10267914, 10268634, 10512120, 10598591, 10722118, 10892786, 11061941, 11186471, 11322479, 11499767, 11693946, 11814436, 11886218, 12111130, 12255808, 12446924, 12653996, 12824023, 13021950, 13197394, 13312756, 13494575, 13670783, 13846869, 14004848, 14157829, 14288959, 14385515, 14553085, 14694139, 14824063, 14907417, 15149802, 15232314, 15330311, 15494753, 15655905, 15834812, 15983151, 16209166, 16367717, 16600679, 16798525, 17016485, 17290868, 17632906, 17941005, 18158515, 18380550, 18709988, 19002730, 19283406, 19564499, 19827283, 20136881]
3076B0136881K73371K63465L36421K58901L12112K15746K16401J85045K44009
3067B2442352J57727R9418J84144J54519J46479R9593Q3301O6031M8206K8522
3057B3510292K4684J82344P874k020N6179O3794O1146n2543m3579K5045m291n5563
3045B3773362R920j8149m0119j26627m4076q1831j22058j90687o769r5083j55787
3034B2902096j37524m9275j53069j14302r4978p0182p1291n4108r3228k9427l9526
3023B1995186K7336N183r6639P1161J33943p5681J9194L7164O7781J48719P4357
3012B2407704O5653R4054J34185K17665K31101L11762K71419K49117L39236L61967
3002B4683863M28405M28454M80124N20118N64175N78484P06835O64691O61124
$$ y = [20136881, 20410252, 20673717, 21010138, 21269039, 21581151, 21796897, 22013298, 22198343, 22442352, 22600079, 22699497, 22883641, 23038160, 23184639, 23284232, 23367533, 23433564, 23481770, 23510292, 23534976, 23717320, 23725194, 23723174, 23779353, 23843147, 23904293, 23851750, 23808171, 23833216, 23828925, 23773362, 23783282, 23765133, 23725014, 23598387, 23554311, 23472480, 23350422, 23159735, 23152966, 23057883, 22902096, 22764572, 22715297, 22562228, 22447926, 22352948, 22282766, 22211475, 22157367, 22064139, 22034712, 21995186, 22022522, 22027705, 21931066, 22002227, 22136170, 22060489, 22079683, 22116847, 22184628, 22333347, 22407704, 22473357, 22567411, 22701596, 22919261, 23150362, 23462124, 23733543, 23982660, 24321896, 24683863, 25112268, 25540722, 26020846, 26540964, 27105139, 27683623, 28390458, 29055149, 29716273]
2993B9716273Q09591P99602R23360R93133R36158J008881J037369J136471J154993
2984C8515831J146722J179654J122421J189595J036704J139237R47407P99697
2976D7077268Q43743P13084M89753L25648K66068O0193o3021l39722l52951n43647
2966D8476416o03865p37306r13404j041151j098632j081986j087479j231572j215873
2957C9465148j179742j046640j090170j031061r42546q70568q59723p89547o28451
2948C1026700m44871m14930l75869k71168j66434j7241o6347l0098M1900n8283
2938B9223359k04985k07166l41562m73001p20552q48926p54521q38531q07195
2929B4026920p60515o59376p54353o10932p00739o30734n57188m96413n31988
$$ y = [29716273, 30525864, 31325466, 32248826, 33241959, 34178117, 35186998, 36224367, 37360838, 38515831, 39662553, 40842207, 41964628, 43154223, 44190927, 45330164, 46277571, 47077268, 47921011, 48634095, 49123848, 49449496, 49715564, 49775757, 49712736, 49373014, 49020063, 48476416, 47872551, 47135245, 46221841, 45180690, 44082058, 43000072, 41912593, 40681021, 39465148, 38285406, 37238766, 36148596, 35117535, 34174989, 33304421, 32444698, 31655151, 31026700, 30581829, 30166899, 29791030, 29519862, 29353428, 29336187, 29269840, 29239742, 29281642, 29223359, 29018374, 28811208, 28469646, 27996645, 27276093, 26427167, 25672646, 24834115, 24026920, 23266405, 22607029, 21852676, 21241744, 20541005, 19910271, 19353083, 18856670, 18324682]
2920A8324682m97940m93980l59817m51635m12585k47691l81592l57834k16629
2911A4904979l13566k74251j63643k08534j47394r6822j04492j75730j08233j35052
2901A3177262r9720k10240j61191j12114j54135r8991p3168p7350l530k3422O1644
2890A2225045Q7005N0764J06663J65095K04024K55697K16490K57595K90833M23789
2880A4283000L55660L35824L11334M09346M19231L96081M48748L97802M24305
2871A7781331N68473N56072N61479P05251P41485P88588R12193R33034J127073
2862B4674979J175510J019146R88165R32605Q96359P88820N80833M34697K41796
2853C1732910l937j00155m32772o60189p51576r61907r53490j060699j003700
$$ y = [18324682, 17826742, 17332762, 16972945, 16521310, 16108725, 15861034, 15479442, 15121608, 14904979, 14591413, 14317162, 14153519, 13944985, 13797591, 13700769, 13596277, 13420547, 13312314, 13177262, 13077542, 12867302, 12706111, 12593997, 12439862, 12340871, 12267703, 12190353, 12186823, 12163401, 12225045, 12312050, 12362814, 12469477, 12634572, 12838596, 13094293, 13310783, 13568378, 13859211, 14283000, 14638660, 14974484, 15285818, 15695164, 16114395, 16510476, 16959224, 17357026, 17781331, 18349804, 18905876, 19467355, 20172606, 20914091, 21702679, 22614872, 23547906, 24674979, 25850489, 26869635, 27857800, 28790405, 29686764, 30475584, 31056417, 31491114, 31732910, 31728973, 31628818, 31196046, 30535857, 29784281, 28822374, 27868884, 26808185, 25804485]
2844B5804485r63922r23118p74530q02572r12023r99142r42713q83153q99119
2835A7704193q74304q25907p99656p28775o03224o87406n12437n17836l94673
2826A1759975m28171m87167l39322l51830k45092l34747k96710k61425k15375
2817H800136j21025k50958k03117k41667k83703q9699k38917k05414k23574k12055
2807F730007j93400j66907n9112j31310j15373j29995j56813o9888l7746j37404
2797E532059j20758j25889P367m8484q6811n7601m2863n6535r9385M3533k5790
2786D918843o0617l7407M1375p3342k5317j14498p7484K4515j5242O4206n1838
2775D593194n4752K1025j0428L8180o1519k2128L8076m6088M1202j835K9534N5613
$$ y = [25804485, 24840563, 23917445, 23142915, 22340343, 21428320, 20429178, 19486465, 18603312, 17704193, 16829889, 16003982, 15204326, 14475551, 13872327, 13184921, 12672484, 12154648, 11759975, 11331804, 10844637, 10505315, 10153485, 9908393, 9573646, 9276936, 9015511, 8800136, 8679111, 8428153, 8225036, 7983369, 7699666, 7609967, 7371050, 7165636, 6942062, 6730007, 6536607, 6369700, 6310588, 6179278, 6063905, 5933910, 5777097, 5707209, 5669463, 5532059, 5411301, 5285412, 5292779, 5244295, 5157484, 5099883, 5057020, 5000485, 4901100, 4944633, 4918843, 4858226, 4820819, 4862194, 4788852, 4763535, 4649037, 4571553, 4596068, 4580826, 4645032, 4593194, 4538442, 4559467, 4549039, 4587219, 4525700, 4503572, 4541648, 4495560, 4536762, 4534927, 4564461, 4620074]
2763D620074O8243l8135O8761M7977M2610n7679R504N4179O0030k2433Q0697K106
2751D935934M5734Q3105O5451N7796k4608R0005N7743M7972N9698N5236Q273J25628
2739E607967M643O7437R8899R7177K8047L1945R9331J65425Q3927P5204J09196
2728F469198P4921J15723J76980K05105R1738J64640K27759K54338K08885J83664
2718H172951K13737K71488K62427L02812L67544L25497L82187K85181K72218K91845
2708A1147887L43101M67395N49244M81004M95655N38171M87909N80730O45936
2699A5737032P13865P86073P38474Q91478Q83751J086700J024393J217986J329311
2690B4409063J423415J498932J634460J650771J906667J954530K107462K108530
$$ y = [4620074, 4688317, 4650182, 4718943, 4766920, 4809530, 4751851, 4761355, 4815534, 4875564, 4853131, 4933828, 4935934, 4981668, 5064773, 5130224, 5188020, 5163412, 5253417, 5311160, 5359132, 5418830, 5474066, 5482339, 5607967, 5612610, 5680047, 5778946, 5876123, 5904170, 5936115, 6035446, 6200871, 6284798, 6360002, 6469198, 6544119, 6659842, 6836822, 7041927, 7133665, 7298305, 7526064, 7780402, 7989287, 8172951, 8386688, 8658176, 8920603, 9223415, 9590959, 9916456, 10298643, 10583824, 10856042, 11147887, 11490988, 11958383, 12507627, 12988631, 13484286, 14022457, 14510366, 15091096, 15737032, 16450897, 17236970, 17975444, 18866922, 19750673, 20837373, 21861766, 23079752, 24409063, 25832478, 27331410, 28965870, 30616641, 32523308, 34477838, 36585300, 38693830]
2682C8693830K130284K054657K187938K398018K432795K683873K884614L111320
2674E8577329L363879L736096L960217M190539M305233M366392M252754L804182
2666I0556621L104098J970416P24719n25660j730856k617520l462930l932491
2658H4086397m184842m281726m249588m101481l935056l696575l337869l068503
2650E3230757k964235k699949k481571k216974k151888k078116j978662j777194
2642C4882168j771803j658637j577666j585950j491031j308914j241140j241713
2634B3005314j180828j039994j001955r28778q91286p88318p70926p25953o98282
2625A4978994o63506n85220n42070n14644m56615m77869n03497l87093m16336
$$ y = [38693830, 40824114, 42878771, 45066709, 47464727, 49897522, 52581395, 55466009, 58577329, 61941208, 65677304, 69637521, 73828060, 78133293, 82499685, 86752439, 90556621, 93660719, 95631135, 96355854, 95830194, 94099338, 91481818, 88018888, 84086397, 79901555, 75619829, 71370241, 67268760, 63333704, 59637129, 56299260, 53230757, 50266522, 47566573, 45085002, 42868028, 40716140, 38638024, 36659362, 34882168, 33110365, 31451728, 29874062, 28288112, 26797081, 25488167, 24247027, 23005314, 21824486, 20784492, 19782537, 18853759, 17962473, 17174155, 16403229, 15677276, 14978994, 14315488, 13730268, 13188198, 12673554, 12216939, 11739070, 11235573, 10848480, 10432144]
2616A0432144m74590l66867l83562l00383k96595l22627m00683k71377j90854
2607G424606j82861l02873k56407j85890k09681k01158j82342k37192n8068j99980
2597E408154j72853j19249j27910j58901k13197j36680j07143j46937k34336q2886
2587C908062q2104j02839q2141o8908r5462j61570j58094j409q7746o5567j23844
2576B878378m5173o7774m6981p3123m7664l6659n8436q2476j52561o8682K6607
2565B225456j1901q3446l7245K0331j33502n8300j6719M7260j41345m3389q4697
2554A682503K1819l8221q2857K2740q3919J699k7531K017l7873l2374J0201J0105
2542A448309j02857m5306n7100j8800J6079o41l9861p5060q005M0074l1519j7844
$$ y = [10432144, 9957554, 9590687, 9207125, 8906742, 8610147, 8287520, 7886837, 7615460, 7424606, 7241745, 6938872, 6682465, 6496575, 6286894, 6085736, 5903394, 5666202, 5608134, 5408154, 5235301, 5116052, 4988142, 4829241, 4616044, 4479364, 4372221, 4225284, 3990948, 3908062, 3825958, 3723119, 3640978, 3572070, 3476608, 3315038, 3156944, 3155535, 3067789, 3002222, 2878378, 2833205, 2765431, 2718450, 2645327, 2597663, 2561004, 2502568, 2420092, 2267531, 2198849, 2225456, 2213555, 2130109, 2092864, 2113195, 1979693, 1921393, 1904674, 1951934, 1810589, 1767200, 1682503, 1704322, 1666101, 1583244, 1605984, 1522065, 1523764, 1496233, 1498250, 1460377, 1428003, 1438204, 1448309, 1345452, 1300146, 1243046, 1224246, 1240325, 1239684, 1199823, 1124763, 1116758, 1156832, 1125313, 1107469]
2530A107469p0262k7285J4435o3813r653L0388o5557M1231P3144l5387n1234p5878
2518H67598P1634k9972l8378m47K4817M108n8664j0598k043N146O0460m4413J1324
2505H60572K1086r076o6467n7676M1345K2228j7783l1510k1409J6560N8226o7404
2493G48692o8123O9182K2136J5534L1528r8408K0726j1674j5569O7798m6989j1230
2481G23603o8787n6312n8142K0323J12832Q515P8069J7328k7107o963l8768l5975
2469F68616K3604l3247L8266L6315n746l1464j1756M2470P2325K3316M5685J6267
2457H84651L8990j2603j8580L608N7404m3422m614L0879n8818O6096k6746l9334
2445H77511k417l5362r1891Q124k5255Q221N137k1506k2280o3081q687p560j12474
$$ y = [1107469, 1037207, 1009922, 1024357, 960544, 950891, 981279, 915722, 956953, 1030097, 994710, 943476, 867598, 939232, 909260, 870882, 870435, 895252, 899360, 840696, 830098, 828055, 833201, 893661, 849248, 860572, 881658, 872582, 806115, 748439, 789784, 812012, 794229, 762719, 741310, 757870, 816096, 748692, 680569, 749751, 771887, 787421, 818949, 720541, 741267, 729593, 714024, 781822, 734833, 723603, 654816, 598504, 540362, 560685, 673517, 682032, 760101, 777429, 750322, 743359, 704591, 668616, 692220, 658973, 697239, 733554, 727808, 696344, 684588, 727058, 799383, 822699, 868384, 884651, 923641, 911038, 892458, 896066, 953470, 910048, 905434, 936313, 877495, 943591, 916845, 877511, 875094, 839732, 747841, 755965, 730710, 738931, 744068, 722562, 700282, 637201, 628514, 620954, 508480]
2432E08480M8687J031k3075j4993k2065N5791L6857n1421o4458J3719Q109J1609
2420E08271m1371l4476m2774P0333Q198n6635J2255K1321L3105J4974l7661l2991
2408D22549N1259l4254l7040r600n4885L1565J7878l3016K2571p764o1923J7191
2396C24531J5537k2482m324N3251q103o0927n775m8181M5116J5618o5069O80P183
2383B47055j2372k834J8779k4755L1923l4032K3758k5226k2639K1643J866N6260
2371B79426k3565p4179L1430l847j0158L542J7431p323K9573L2943k4255n9548
2359A91470K4388O1865m5109o3800P1587K4388j00318K6794P563L3049j7209l3884
2347A80784j8549M3424p0198m1871M6055P0547L8804j8427j9323l7778j6595J0450
$$ y = [508480, 557167, 558198, 535123, 520130, 498065, 553856, 590713, 539292, 474834, 488553, 496662, 508271, 466900, 432424, 389650, 459983, 468181, 411546, 423801, 445122, 478227, 493201, 455540, 422549, 473808, 439554, 402514, 392914, 338029, 369594, 387472, 354456, 377027, 369263, 307340, 324531, 340068, 317586, 313262, 366513, 358410, 297483, 291708, 243527, 288643, 304261, 239192, 239872, 247055, 234683, 231849, 250628, 225873, 257796, 223764, 247522, 222296, 199657, 221300, 223166, 279426, 255861, 181682, 213112, 209265, 199107, 202649, 220080, 212757, 242330, 275273, 251018, 191470, 215858, 277723, 232614, 168814, 240401, 264789, 164471, 191265, 198828, 231877, 214668, 180784, 162235, 205659, 135461, 93590, 139645, 210192, 248996, 230569, 211246, 173468, 156873, 167323]
2335A67323j1855m7767L2896L6675m7667l2331K9027J5734K3359o646j1556k1876
2323A25316j4232N3456q8842L4160J6584L9707K8141k201k7822r4023M9063O0994
2311A80301r3572J7575L2402m0856K996K8684P0865o9745N061R0874J4698q0079
2299A59204K8313o8616l3805j901j3020K9225o855M3304l3234K8771m2956K0149
2287A08579J2603J059j974J06463L0466p7382K5690n5242p956m9090k2063n481
2275F5672P4869K1089m9048K516L4375l5707L798m6455l5860L2966j8459M8126
2263I7882J9342n3355k2401J9396M8416M7335m3850J4581N7453K3264o9340r9422
2251C9301J8902J866L6341l7861n4129K0145M0793k3220P600j198L2962N107R006
$$ y = [167323, 155468, 107701, 140597, 177272, 129605, 97274, 126301, 142035, 165394, 158748, 147192, 125316, 111084, 164540, 75698, 109858, 126442, 166149, 194290, 192089, 164267, 70244, 119307, 180301, 86729, 104304, 136706, 95850, 98846, 127530, 198395, 128650, 133711, 224585, 239283, 159204, 187517, 118901, 85096, 83195, 70175, 99400, 92545, 135849, 102615, 131386, 88430, 108579, 121182, 122241, 120267, 226730, 257196, 179814, 205504, 150262, 142306, 93216, 71153, 65672, 140541, 161630, 112582, 115098, 149473, 113766, 117564, 71109, 35249, 68215, 49756, 97882, 117224, 63869, 41468, 60864, 109280, 156615, 112765, 127346, 184799, 208063, 138723, 39301, 58203, 60069, 96410, 58549, 4420, 24565, 65358, 42138, 49738, 48540, 81502, 86609, 95615]
2238I5615K0556n9777k6324L2044K2944K1079J9872q0985k5044J05626k9140o7045
2226B9421L2756J04647p9525n0354M9768n6842L9334J511n99l99l399M9917M2271
2213A58507l3198j9079m2507L4477o3192Q1768J360m4390p149M0821p282k0325
2201G9811R8481q9600J1135k1390K0426Q461K6353j2676j7202j4732K5668M100
2189A18835k1417K2263l4292m0863M48K7822m9769j912m9992N569M6890j8957
2177D625K3394P0755j2113r6069K5905O5650N1827m3625K987q946l0702L1319
2165H5007p581m7465L8180J3115M600J6567j4779r2936P4264J05639q2506O849
2153I8954q477Q68m5250P986L4543R472o1300J9652M9653K1486l6183L9560j6674
$$ y = [95615, 116171, 56394, 30070, 62114, 85058, 106137, 126009, 45024, 19980, 125606, 96466, 29421, 62177, 166824, 87299, 36945, 86713, 29871, 69205, 70716, 70117, 69718, 66319, 116236, 158507, 125309, 106230, 63723, 98200, 35008, 116776, 118136, 73746, 66597, 107418, 100136, 79811, 178292, 88692, 99827, 78437, 98863, 107324, 133677, 121001, 103799, 89067, 114735, 118835, 97418, 119681, 85389, 44526, 44974, 72796, 23027, 21115, -28877, -23308, 23582, 4625, 28019, 98774, 86661, -9408, 16497, 82147, 133974, 90349, 93336, 84390, 53688, 85007, 77426, 29961, 68141, 81256, 85856, 102423, 87644, -5292, 68972, 174611, 92105, 98954, 90477, 91345, 46095, 54081, 88624, 98096, 36796, 56448, 106101, 127587, 91404, 130964, 114290]
2140A14290K2003J0293j02070O8701Q7994m8578m4864M577j9421R6764m3564l0499
2128A15626N1334k0658r172o2451M0160M3068J0892k1979O9927N0052k1439L0230
2116B75590O3364l6022K3934q0429N7729L1512k3097N1798Q2432Q9091J36342
2105F72244Q4003J37824O6776L2214J63907Q7051Q2852Q7044Q2084J04143J67197
2094A767339K73696J40383K28354L22851L10925L86658M61569Q54608J257113
2085F003496J573218K270364J866274m37881q90420j257271j348741j145479j215079
2076E418481j099692p10863m53677l62207k55839k10954j70926k37682k21269
2067A695372k17321j17348j39099j31962j22443m6515O000r8886j07736j8740
$$ y = [114290, 136293, 146586, 44516, 113217, 201211, 152633, 107769, 112346, 92925, 189689, 146125, 115626, 166960, 146302, 137130, 74679, 114839, 157907, 168799, 146820, 216747, 266799, 245360, 275590, 338954, 302932, 326866, 246437, 304166, 335678, 312581, 364379, 446811, 535902, 672244, 756247, 894071, 960847, 993061, 1156968, 1244019, 1326871, 1413915, 1495999, 1600142, 1767339, 2041035, 2181418, 2409772, 2732623, 3043548, 3430206, 3891775, 4746383, 6003496, 7576714, 9847078, 11713352, 11275471, 10385051, 9127780, 7779039, 6633560, 5418481, 4318789, 3607926, 3154249, 2792042, 2536203, 2325249, 2154323, 1916641, 1695372, 1478051, 1360703, 1221604, 1089642, 967199, 920684, 926684, 827798, 720062, 701322]
2057G01322p1387L566n1905r0419n4277J3918l7504o3496R493J7110m9382l4748
2045B92291L8371m6687j22967K7633j6466j1497L6919l4113j3587n0474n091P2152
2033A66484Q306j4197K5898o1234j2743j3672N726L5144k5990J940l1571M2965
2021A27056k9238m9571P0884k6128l2399O9330p5027k1984Q6918j0247m8259o204
2009E5131q9788N2910j7423o8018Q0751L1932Q4078o660k7444p945j4808j0399
1997F2317m7395K585K1129p677J6754q7452n4880O0815k0551N9824K2859P515
1985C5843L7402j5774k4855o4629Q1009l4775L2054j3941j3605k142o56J8165
1973C4096J4306j08782J4921J9851K283K8716j0867k0332N997J8530j4036K2833
$$ y = [701322, 629935, 633501, 581596, 491177, 436900, 450818, 413314, 349818, 359311, 376421, 327039, 292291, 330662, 283975, 161008, 188641, 172175, 160678, 197597, 163484, 149897, 99423, 94332, 166484, 174790, 160593, 186491, 125257, 112514, 98842, 104568, 139712, 113722, 115662, 84091, 127056, 97818, 48247, 119131, 93003, 60604, 129934, 54907, 32923, 119841, 109594, 61335, 55131, -34657, 18253, 830, -67188, 13563, 45495, 129573, 122913, 95469, 87524, 72716, 62317, 14922, 17507, 38636, 30959, 47713, -39739, -94619, -33804, -54355, 5469, 28328, 35843, 73245, 57471, 32616, -32013, 48996, 14221, 46275, 32334, 18729, 16587, 15931, 34096, 48402, -60380, -45459, -25608, -23325, 5391, -5476, -25808, -19811, -1281, -15317, 7516]
1961G516J4956j2171r1708J2665O5230N9656N787l1982m4875l567j8296O831L5846
1948E888l179j3704j4197o114O7229O080k1882k6003L7317l093n6880k608J4893
1935a6253k9702l3037R879N7248M1744N121m8704j218R646J0548l6949K335l4010
1922f3352P1877j06275j3209J2461J0003O0234p369k586Q295m0406O3141J0375
1910C189M401L0215J5703m5831l5390K8397k8294k3113J14486o624p5875l758
1898b2494n879K1429j6561L3388Q249P2029n8546J8592j8992M9578k1961j8531
1886D0301L982O2127J9477p3449n9654k711M0395r0458K2343O9522Q929p3392
1874c2588j6726N9122p0900K6953O5134O058j2864n315j8883N583o0031k7752
$$ y = [7516, 22472, 10301, -81407, -68742, -3512, 56144, 61931, 29949, -14926, -18493, -36789, -29958, 5888, 2709, -10995, -25192, -31306, 35923, 42003, 20121, -5882, 31435, 28342, -28538, -31146, -16253, -45955, -78992, -69113, -11865, 29879, 35000, -13704, -14922, -5276, 5272, -31677, -29342, -63352, 8525, -97750, -110959, -98498, -88495, -28261, -35630, -38216, -29921, -70327, -7186, 3189, 7590, 37805, 53508, 7677, -27713, 684, -27610, -50723, 63763, 57139, -18736, -22494, -28373, -6944, -23505, 9883, 18132, 90161, 31615, 50207, 31215, 80793, 58832, 40301, 44283, 106410, 125887, 52438, -7216, -9927, 30468, -59990, -37647, 31875, 40804, -32588, -49314, 9808, -61092, -34139, 30995, 37053, 24189, 18874, -9, 5574, -54457, -82209]
1862h2209p126O9606o2401R888L0764k7948K3792K8205n641Q949r962k2779J4919
1849c1943N2107N2942p2015j0047J0173m1360m1458M7890L8384M678J9767o3540
1837c4422R235k8967K2928J18549n6463j10110k4172J8464l737O404N5921j6566
1825d2936Q2870M6220p1536J2201m8772N66p437m676M8870M4113l6115n5974L5683
1812C077m4540k8284P1989k7318j9232R2014r7438n3383Q0792l325q798K3624
1800a0822J9042L4463j4333m4648l5213j1031P9699r461q4206P123R6261q1886
1788e5012O4638k7048L2809k9142n5785O0006K6703o7636L1106L720l3590N4695
1776E464M1828m8577J9195r126o9786L3397K774l4169m9111R3836J8062k9128
$$ y = [-82209, -89335, -19729, -82130, -72242, -41478, -69426, -45634, -17429, -23070, -14121, -24083, -46862, -31943, 20164, 73106, 1091, -8956, 1217, -40143, -81601, -33711, 4673, 9351, 29118, -34422, -25187, -54154, -31226, 87323, 30860, -79250, -103422, -84958, -88695, -82291, -26370, -42936, 39934, 86154, 14618, 26819, -21953, -21387, -28824, -33500, 15370, 59483, 23368, -32606, 3077, -41463, -69747, 2242, -25076, -44308, 47706, -49732, -103115, -22323, -25648, -34446, -10822, 8220, 42683, 28350, -16298, -51511, -62542, 17157, 7696, -76510, -69387, 26874, -55012, 9626, -17422, 15387, -13755, -69540, -9534, 17169, -50467, -19361, -15641, -49231, 5464, 47292, -1285, 17910, 8784, -61002, -27605, -24831, -59000, -108111, -14275, 3787, -25341]
1764b5341l0248l1967K4242J2509R298m7876R186k1943O9198N7529q495K670p6197
1751e7435Q2250p958m0414P207Q8513p3287m3530m5719M8321J07670q3338O8124
1739E0404j1617j47781L1814R3007o2000M6194M4337l042j830K7137J008q3917
1727a6286L693j24543Q535k0310N1554J14263k9341k9631M9322l1864l7446L7895
1715b4159M4639n5082k3632M6697k8414j9631K1214K2514N2007k9589k4088n8356
1703g5880K234L8074O348K4230K5371j5139K1410K511J4409M3265r5576N15J9960
1690A1732L4781q8568M664o519q4846K3485O4681j2384o910n2914N6315n0592
1678a07075j3619Q4569N6851o7894l513q8K1697k2177L7761M92J1350m2551M3747
$$ y = [-25341, -55589, -87556, -63314, -50805, -41507, -89383, -80197, -102140, -32942, 24587, 16092, 18762, -57435, 24815, 16857, -23557, -16350, 72163, -1124, -44654, -90373, -42052, 65618, -17720, 50404, 38787, -108994, -77180, 15827, -46173, 21, 44358, 41316, 39486, 66623, 67631, -16286, -12593, -137136, -128601, -148911, -97357, 16906, -12435, -42066, 7256, -24608, -62054, -24159, 20480, -34602, -58234, -11537, -39951, -59582, -38368, -15854, 36153, 6564, -17524, -75880, -73646, -35572, -29224, -4994, 20377, 5238, 26648, 29159, 43568, 86833, -8743, -8228, 11732, 46513, -42055, -37391, -43910, -128756, -105271, -40590, -52974, -59884, -112798, -56483, -107075, -120694, -36125, 20726, -47168, -50681, -50769, -29072, -51249, -13488, -12996, -1646, -44197, -450]
1665d50M1201R06r065p290k5967l4788K9383J468K9861j3935M5192l9624o7621
1652e0729l1366L4605o192M3692p5852L5317k2843M3674L944k702m272Q4390l4739
1639A6927l8792k326k3546P4363k2408o7118K7979P980J4888L5780p0290q84K0045
1626b7402J00L7075O648J7383p5155J7524N2613k5290l4944K1685L9632K7748
1614E7617q0165R5433L0099j10984j7505O5250o5520m3979P9948K033N8498j5773
1602E4952j5384k8414J5762n044K153j8224m6312j2829o188M3173M5456k3461
1590E640J0425p1343j6267J4613M9852J7000n0478l88L2539j6320r231N9112n9125
1577c3971K075J9429j01039L4389K9461K5101K93R5736n1804k8135q250n7506
$$ y = [-450, 40751, 41657, 32592, 25302, -665, -35453, -6070, -4602, 25259, 11324, 56516, 16892, -50729, -82095, -47490, -53682, -9990, -85842, -50525, -73368, -29694, -25750, -28452, -32724, 51666, 16927, -21865, -24191, -47737, 26626, 4218, -62900, -34921, -26941, -12053, 23727, -46563, -47447, -27402, -27302, 9773, 16421, 33804, -41351, -23827, 28786, 3496, -31448, -9763, 29869, 57617, -22548, 72885, 102984, -8000, -25505, 39745, -25775, -69754, 10194, 12227, 70725, 54952, 39568, 11154, 26916, 21872, 24025, 5801, -40511, -53340, -59528, -16355, 29101, 5640, 16065, -55278, -71545, -56932, -7080, 9920, -40558, -40946, -8407, -24727, -33958, 25154, -33971, -31896, -12467, -113506, -79117, -49656, -24555, -24262, 71474, 19670, -8465, -16715, -74221]
1565g4221j8703K2917J15372j1242k6453j3091l6178K6890m2077K137K7971J001
1553b5677q1003O9351L9216m9776J6720K0674j794Q042p5505j1150Q7102M8750
1541D4950r0035L0297m468m4282k6835p1252L4248L8644l4160r577J05438p5103
1529a02135M3067P2652o3598N87L1000L6124l3553M566j706O115L6585k3375m2753
1516c6424j4087M2629k2254R759m9086K4835R4123p5371r2401J8639P8990L9792
1504A9144j2403m7385l3318l286P7336N7778m0579m4392l562J2957n8733K3964
1492e2479J06570m0919k4941J01844n4416r537o4832P2357Q735l3971l3719m1178
1480f6486N6765m3600m72K0282l3585J0385O2100r767j20372M7827n1103J04542
$$ y = [-74221, -92924, -70007, 45365, 34123, 7670, -5421, -41599, -14709, -56786, -54649, -26678, -25677, -106680, -37329, 1887, -47889, -31169, -10495, -12289, -4247, -79752, -90902, -3800, 44950, -45085, -14788, -19256, -63538, -90373, -161625, -127377, -88733, -122893, -132470, -27032, -102135, -59068, 13584, -50014, -49427, -18427, 17697, -15856, -11290, -12996, -6881, 29704, 6329, -36424, -50511, -7882, -30136, -20377, -69463, -44628, 49495, -25876, -118277, -99638, -20648, 19144, 6741, -40644, -73962, -77248, 88, 57866, 17287, -27105, -30667, -17710, -76443, -52479, 54091, 13172, -11769, 90075, 35659, 26122, -38710, 33647, 42382, 8411, -25308, -66486, -9721, -53321, -53793, -33511, -67096, -56711, 5389, -4378, -124750, -76923, -128026, -23484]
1468b3484j957j11278J531K9890L126R5509M1149k0512p3570m527N6966m0212
1456d7369l7971K6266L8335M3410j5354j0030k5715k2099N148L3456M5567m3526
1444i882K033k037O629M2428r1084L698N466k1593N6464O339P375j14844N2081
1431e6927N7782L793J335p018l8184Q2181r377q4452n0850K6375l4698L3765J12330
1418C6055M9772j03339K1002p664r3159O2698J15928K1461o5666q9279q4798O8252
1406f8737N9264J2250P6831k0003l4662l2692N4494l908k3452m6516n1578j6221
1394i4930P1506l1845q4225J5931P7060N5307p6206k9984M4722K4285l9534P033
1382f0880m3470N4721N1268j1646n3355L329M5090q94p5739J3880M2071n1514
$$ y = [-23484, -25441, -136719, -135188, -105298, -102172, -6663, 34486, 13974, -59596, -64123, -7157, -47369, -85340, -59074, -20739, 22671, 7317, -2713, -28428, -50527, -45379, -11923, 33644, -9882, -7849, -9886, -3257, 39171, -51913, -48215, -42749, -64342, -7878, -1539, 5836, -109008, -56927, 855, 4648, 5983, -1035, -39219, 42962, 33585, -50867, -101717, -75342, -110040, -76275, 36055, 85827, -17512, 3490, -4174, -97333, -34635, 81293, 102754, 37088, -52191, -136989, -68737, -9473, 2777, 79608, 59605, 24943, -7749, 46745, 42837, 19385, -27131, -78709, -94930, -23424, -55269, -139494, -123563, -46503, 8804, -67402, -97386, -52664, -28379, -67913, -60880, -104350, -49629, 1639, -10007, -63362, -60033, -14943, -15837, -91576, -77696, -35625, -87139]
1370h7139L0547J1608M7997M6672m8263L6518K4613j36229M635M2653p5009R6377
1358e020O6153p4673K2293m3719K0323J4485n3390K586J0432K2158J7140m7263
1346d8495O5725K8800o7426L9163l4996P9437J3076q5684K2658n628M1759o9564
1334b1175r1113J5083R2963m0208m1465R1553M6931Q458m6209K2813j2809m9716
1322b4894m5374N6517P9148m3432k8157M8410P1023l8958p1750J3373j48m4362
1310b8604Q2411k7052n1198L7628M6193k3237j03512P3241o532n692K5043p5157
1298e6468J0976K384N202j3459q96J84P1728M310o235p469n673O245m1400k236
1284c2807P5675L5999j19812J4203Q689J8932m6690r029Q7812J4269l3736L214
$$ y = [-87139, -56592, -44984, 3013, 49685, 1422, 37940, 62553, -73676, -69041, -26388, -101397, -5020, 61133, -13540, 8753, -34966, -14643, -158, -53548, -50962, -40530, -18372, -1232, -48495, 17230, 46030, -21396, 17767, -17229, 62208, 75284, -10400, 12258, 6630, 48389, -21175, -112288, -97205, -4242, -44450, -85915, 5638, 52569, 61027, 14818, 37631, 24822, -24894, -70268, -13751, 65397, 21965, -6192, 42218, 113241, 74283, 2533, 15906, 15758, -28604, 53807, 26755, -24443, 13185, 59378, 36141, -67371, 5870, -662, -6354, 18689, -56468, -45492, -43108, -37906, -51365, -52261, -52077, 19651, 23961, 17726, 10257, 4584, 10829, -30571, -32807, 42868, 78867, -40945, -26742, -18053, 879, -45811, -54840, 32972, 47241, 13505, 16719]
1272A6719l2909O7722n8825k3997j0062j903N9431J2325n4050K0598o945l3505
1260d5401L0789P9674J8701p1847J476N0276j7981m0560j395m2925K0951M4985
1248B6743J479k9750k9037Q751L9368K2401o8149l5794L4535P4104l2738o531
1236E382M3892k3465o1264N3695k0337q134L2299J806m2233O314m1281L6268Q3662
1223F6604o3553j8953l26l4542j3080P2950r349n261r3254L8558M5827K7693K0241
1210C3555q815n0483l5641j7576M6511K3456n5682m0341R0050J6425n9020O4441
1198F880M0954o4782j0381j3967n5010L1682Q1318k296l0040P947N8728m5100
1186E933P601j5437j9643K2800k3439O6855q1730l7423K8648q5594L7507P9025
$$ y = [16719, -16190, 51532, -7293, -31290, -41352, -43255, 16176, 28501, -25549, -4951, -11896, -45401, -14612, 65062, 83763, 11916, 13392, 63668, 45687, 5127, 3732, -39193, -18242, 26743, 28222, -1528, -30565, -21814, 17554, 39955, -28194, -63988, -29453, 44651, 11913, 5382, 49274, 25809, -35455, 18240, -2097, -10231, 22068, 23874, -18359, -12045, -53326, -17058, 66604, 3051, -15902, -16228, -50770, -63850, 9100, -249, -5510, -98764, -60206, -14379, 13314, 33555, 24740, -25743, -61384, -78960, -32449, -8993, -64675, -105016, -14966, 1459, -57561, 6880, 47834, -16948, -27329, -41296, -96306, -64624, 16694, 14398, -15642, -7695, 51033, 5933, 13534, -1903, -21546, 1254, -22185, 44670, -37060, -74483, -45835, -131429, -93922, -14897]
1174a4897l1157M9277q591l6635M6272k0377M2195q5496l1121R2966q519J9351
1162A3268J1347l1062k4173k529P047N7796l779J5211l2015r1642R0356J6279
1150B6104m6995k596r459N2536n097j2175o2869M8961J6137m3272M5316m400m3943
1137d1752O7347N2782n9801n1834K3014J0693k5511J8915L7001K0365p6825l1314
1125e6920M0703O165k9879j1876r350N5695k914J4049r3375Q5012j2192l3980
1113d8862L173L4645N898o1191J4037M3378p2496L0266P9690L5111n9373n4905
1101e0629M0539j8467k1588n5137J32725j26j7309k0729K6033K9584m167n7607
1089a6878N380J7342L7458l1624p0861J5534n425K6629p915J0475m767j228j0589
$$ y = [-14897, -46054, 3223, -5368, -42003, 4269, -16108, 26087, -59409, -90530, 2436, -6083, 13268, 24615, -6447, -30620, -33149, -26102, 31694, 27915, 43126, 11111, -80531, 9825, 26104, -20891, -23487, -32946, 19590, 14493, 2318, -60551, -11590, 4547, -38725, 6591, 2191, -41752, 25595, 78377, 18576, -33258, -10244, 449, -25062, -6147, 30854, 51219, -25606, -56920, -16217, -10052, -39931, -51807, -61157, -5462, -8376, 5673, -87702, -2690, -14882, -48862, -45689, -11044, -5146, -66337, -52300, -8922, -81418, -51152, 28538, 63649, 4276, -50629, -10090, -28557, -50145, -105282, 27443, 27317, 10008, -10721, 15312, 44896, 40729, -16878, -11498, 5844, 43302, 11678, -59183, -43649, -49074, -22445, -30360, -19885, -24652, -25880, -36469]
1076c6469K5356m153l6748k0924r343Q9151m2756K8839o7032Q351J2724l258n5514
1063a11776J9946L6685k7923M1764K5287K038L6129m0478M103m6987k7011K4402
1051f3821P8123k1740n3347P0044M9966L9865n0698k0074l1993n6360l5527N1356
1039d4206O746M3406N8319r4956J7464L7009n748L1570m0671J7874J5809q8602
1027d5986K0942N5795o497K3237n3111P765k0645k495K8940K7424K3161o8533
1015a0003q799P1592n3858L2700J8705n8274k2609K538q1542J07679P359l828
1003A660p3902J5212O7234M959P579j2625k6474o8657J05972l1063l2766Q5250
991D2379k2771m2301J5077q3094J0426R8485K8665O295o1466n0660k3405O1565
$$ y = [-36469, -11113, -15266, -52014, -72938, -82281, 6870, -35886, -7047, -74079, -65728, -53004, -56262, -111776, -91830, -55145, -83068, -41304, -16017, -13979, 22150, -18328, -14225, -61212, -88223, -63821, 14302, -7438, -60785, 9259, 59225, 99090, 48392, 28318, -3675, -60035, -95562, -44206, -37460, 5946, 64265, -30691, -13227, 23782, 18034, 49604, 8933, 26807, 42616, -45986, -25044, 30751, 24254, 47491, -5620, 2145, -18500, -20995, 7945, 35369, 58530, -10003, -18802, 52790, -1068, 31632, 50337, -7937, -30546, -28008, -109550, -1871, 5488, 1660, -72242, -57030, 10204, 15163, 22742, 10117, -16357, -85014, 20958, -10105, -42871, 42379, 19608, -22693, -7616, -90710, -80284, 18201, 46866, 53161, -8305, -58965, -82370, -20805]
979b0805k196N4857N2537n1372p2484p7075J33835J3640L64J5120K8372j11709
967c6916L802R6589m9474k5283K6446O726l3470k8490q1849Q7736r353r7773P7238
954f4071P1936m9105J6510l6458j448K4721J8761m3826l1955R2902k1851p5545
942i9429K9015L0212L8197Q3567n2129K2760o9060J9373N1163m1145R179O2989
930H4692o7965o4397m8370J04538M8464n3650o8088K1925O5108N6743n0846o961
918B1193o3309K4088Q8150q0158L9550N5981m1719m7747L5455o4729q9488L0686
906i2047J31484P76l0541n6370K9002l6258K1507m05P6903j02219K5153P6189
894D3174l7990j8070n1439R4084L4019m669R815k6152j5887l5504o4164P2111
$$ y = [-20805, -23001, 31856, 84393, 33021, -39463, -116538, 17297, 30937, 31301, 46421, 74793, -36916, -33114, 63475, 14001, -11282, 15164, 21890, -11580, -40070, -121919, -34183, -43536, -141309, -64071, 7865, -41240, -24730, -61188, -62636, -37915, -19154, -62980, -94935, -2033, -23884, -99429, -70414, -40202, -2005, 81562, 29433, 52193, -16867, 2506, 53669, 12524, 21703, 84692, 16727, -47670, -96040, 8498, 56962, 3312, -64776, -42851, 22257, 79000, 28154, 21193, -42116, -18028, 70122, -10036, 29514, 85495, 43776, -3971, 31484, -33245, -122733, -92047, 39437, 40213, 9672, -46698, -17696, -53954, -32447, -32852, 44051, -58168, -33015, 43174, 5184, -12886, -64325, 29759, 63778, 59109, 68924, 42772, 26885, -8619, -72783, -672]
882f72K7971q959o1075L3847L6142p7820K2857K4407P2112n4264M9938n1359k6345
869a3220O0619l0084K3556J5521o2142j2070R7488m5926k7308M4675m5529N1016
857E6596l93j1791M910p8531R2930k4729m6515r0974J2602j1941M4656o821K1282
844c8719J0464O6801p277n4343m6203L8240P737R257O8323p79o8221k5872J00545
831E9953r0381P1502l715K9199n6316J2870Q727k9015j2177o0774R4684j4793
819I764O0192l6656p4609Q0753q9924k629N3316J0757r9244P4554L6801k0P901
806C0956l3185j9781m6228j0162M5949J8472J4802K6566N2172n7760k2965K6841
794B5677p5782J5935K4298k3087N8248k3799k7913O9430J4713O0278n2704N7234
$$ y = [-672, 27299, 18340, -42735, -8888, 27254, -50566, -27709, -3302, 68810, 14546, 64484, 13125, -13220, 47399, 17315, 40871, 56392, -5750, -17820, 79668, 33742, 6434, 51109, 5580, 56596, 56203, 44412, 49322, -29209, 63721, 38992, -7523, -98497, -85895, -97836, -53180, -60001, -38719, -28255, 38546, 31269, -23074, -69277, -31037, -23300, -14043, 54280, 53501, -14720, -40592, 59953, -30428, 41074, 37359, 66558, 10242, 23112, 31839, 2824, -9353, -70127, 24557, 9764, 69956, 33300, -41309, 39444, -50480, -53109, 207, 10964, -88280, -13726, 23075, 23055, 30956, -2229, -22010, -68238, -78400, -32451, -13979, 823, 27389, 79561, 21801, -1164, 25677, -50105, -34170, -9872, -32959, 25289, 1490, -26423, 43007, 57720, 117998, 65294, 122528]
782A22528n202M132l61k2753j2703q8553n9244P1317J8757M7956n5619K838r870
769A3223m9033n659J09496j3501l4607j8149J1512J00004m5219m9696O0352k561
757G6162o4626K2973o5627j9079K5398N055J9889l5026N275k2005N2781J9141
745B0311l2022j6737O0509M7654p6566M4797R263K861J7556p8654K1630k7251
733f649j2936M1985m0169K8155j9131N2807L171K5686p7607m9281N1538n519m740
720a2690K9288j1266O387n3298K1582O1340K3431p0471j3714l8030L4584O1572
708C8715P952k3270J9472L459M5208J9687r0729L761K7794l1889M8253M0771J5652
695A24836j6245o6646M8135l4259n8166J7688q396Q203K4164j93k0872j7832k2429
$$ y = [122528, 117326, 121458, 121097, 98344, 85641, -2912, -62156, 9161, 27918, 75874, 20255, 23093, 13223, -35810, -41469, 68027, 54526, 19919, 1770, 13282, 113286, 68067, 18371, 78723, 76162, 11536, 34509, -31118, -50197, -24799, -19744, 145, -34881, -29606, -51611, 1170, 20311, -11711, -28448, 32061, 79715, 3149, 47946, 57209, 60070, 77626, -1028, 20602, -6649, -19585, 22400, -17769, 10386, -8745, 44062, 47233, 72919, -4688, -53969, -2431, -7950, -12690, 16598, 5332, 11719, -41579, -19997, 41343, 64774, -5697, -19411, -57441, -22857, 38715, 46667, 23397, 42869, 46328, 91536, 111223, 20494, 24255, 52049, 20160, 68413, 109184, 124836, 108591, 41945, 90080, 55821, -2345, 15343, 6947, 15150, 39314, 39121, 18249, 417, -22012]
682b2012L6577J8075k9653N9152n4248K7500m5786j0531P2207j4646m2458m6902
670e2725r532J61630j0945p4544Q437k5049k2382l0474O8257K8374k9119L0004
658D1932O946k0122J6875o8561K1058r431j6461k834J624R546m6950L2208N5403
645B1233K2463m2904q439j6071M0896O30K0928l7706j0903J2275K4590N813q383
632B4422k4930q955J11355n5923j6732Q673L201k946j9036L6030m7771K0721o3279
619c5170K4821K6160L9252K7528r1558o376j1079O7696L9248l7868O950J3739
607F3343K9283j3384l4876M9181n8083R82J1162o0623l2032M6389O899p0385M1846
594b0298N3406o5761J0219M0709n224R727R540r167O1294j4663q0177k8764q044
$$ y = [-22012, 14565, 32640, 2987, 62139, 7891, 35391, -10395, -20926, 51281, 36635, -5823, -52725, -62257, 99373, 88428, 13884, 22321, -2728, -25110, -55584, 12673, 41047, 11928, 41932, 48878, 28756, 45631, -22930, -1872, -11303, -27764, -30598, -28974, -19428, -66378, -34170, 21233, 43696, 792, -7647, -23718, 17178, 17808, 38736, 1030, -9873, 2402, 26992, 32805, 24422, -508, -9463, 101892, 45969, 29237, 37910, 41111, 38165, 19129, 55159, 7388, 28109, -35170, -10349, 15811, 55063, 82591, -8967, -15343, -26422, 41274, 80522, 42654, 49604, 63343, 92626, 79242, 44366, 93547, 35464, 36446, 47608, -13015, -45047, 1342, 8241, -62144, -20298, 33108, -32653, -22434, 18275, 13051, 22778, 32318, 23151, 84445, 69782, -10395, -39159, -47203]
581d7203K277j597j4272P033M1644n9333J04896P031M0869L1401o6439R378M9363
568A05048o3500J7488q1072j04471J13774l132l7697L9329O8097m4012k0721J1697
556H28K9360n0750j120L8623l4457j3962j820J355L2889J285K2251k544M3087
543F5025n9622l696R018m3430L1119j6219K4588R1174j4753j9572m3173K1493
531D1952m1858k3884M8868N2078o7277L833k2698K6471M4433N094L097o1764O4037
518G2382l2888J9479N2726O104o6222K0788Q4807k6458j36006L3303M9869l7490
506D0394k5179k8878L9267j9027N2386j4325q9881P9328q259N974L5613p0567
494c154J6928l539K1274K3491k4927l1812K1262L811j1994J8654K8418K905M2160
$$ y = [-47203, -44926, -46523, -60795, -53762, -12118, -71451, 33445, 40476, 81345, 112746, 46307, 55685, 105048, 41548, 59036, -22036, -126507, -12733, -15865, -53562, -14233, 53864, 9852, -10869, 828, 30188, -20562, -21682, 16941, -17516, -31478, -33298, -31943, 946, 2231, 24482, 21938, 65025, 5403, 1707, 10725, -32705, -1586, -17805, 6783, 97957, 83204, 63632, 20459, 41952, 94, -23790, 25078, 77156, 9879, 13712, -8986, 17485, 61918, 67012, 70109, 8345, 72382, 39494, 58973, 111699, 117803, 51581, 72369, 157176, 130718, -5288, 28015, 77884, 40394, 15215, -13663, 25604, 6577, 58963, 44638, -45243, 34085, 25826, 31800, 67413, -3154, 13774, 10235, 31509, 55000, 30073, -1739, 19523, 23334, 11340, 29994, 58412, 61317, 103477]
481A03477l5805o7629j4262K5665L7810J7269k0829r670P1299m3271j2896n4073
469b915M8215K9692j9195j3908l7525j6030L0336N1718k2582n1161m1179j3555
457e8089M8989J14274o0794m5230M2116n9548p010P0389j1640m9670P3232m7845
445I174k340J2270J6747J7598K7880m0997M8394j2613k5261j9427j4955R4860
433A11330l9996p8712N010P4748j0564m6410j990l4098P426J6353P3293l0569
421D5821l7856o1279K8293O56K0135M1638j8729N5775o7858p0862J25586K7551
409H8871p0364j1076R8052O2297n3967n4272l95M0903k6193L7177k7215r3752
397i934o552R35M4191M8102l1393n0991L8594M9024r9590L7164N203O3549n5186
$$ y = [103477, 67672, 43, -14219, 11446, 49256, 66525, 45696, 36026, 107325, 64054, 51158, -2915, 45300, 74992, 55797, 41889, 4364, -11666, 18670, 70388, 47806, -3355, -44534, -58089, -9100, 105174, 44380, -850, 41266, -18282, -25292, 45097, 33457, -16213, 57019, 9174, 6834, 19104, 35851, 53449, 81329, 40332, 88726, 76113, 50852, 31425, 16470, 111330, 71334, -7378, -2368, 72380, 61816, 15406, 13416, -20682, -13256, 3097, 76390, 45821, 7965, -53314, -25021, -24365, -4230, 37408, 18679, 74454, 6596, -64266, 61320, 88871, 18507, 7431, 105483, 167780, 113813, 59541, 59146, 100049, 73856, 111033, 83818, -9934, -16486, -15551, 28640, 76742, 45349, -5642, 32952, 81976, -17614, 19550, 24753, 88302, 33116]
384C3116N8122J3756n9020p6858J0086M2778j4104J4728l4456J5407P2777M965
372H1297L1055m6305l4290m185o156N8796n1304L0281L3835J5404P1061r8208
360H1281L9170o314p9664p377J862l793j473j001M2721j7540n6501J6282k4301
347a6648M0447o5681J05166n392l243O2661m4244K1770m4259J4799J0610k7377
335D8609J5122j884l964l5868K5206p9805P2209o4675L7062N1648o0991P1913
$$ y = [33116, 91238, 104994, 45974, -30884, -20798, 21980, 7876, 22604, -11852, 3555, 76332, 81297, 112352, 66047, 31757, 27572, 21416, 80212, 28908, 59189, 93024, 108428, 179489, 81281, 120451, 114137, 34473, 27096, 28958, 25165, 23692, 22691, 65412, 47872, -8629, 7653, -16648, 23799, -41882, 63284, 57892, 54649, 117310, 73066, 94836, 50577, 65376, 75986, 48609, 63731, 61847, 57883, 22015, 47221, -32584, 39625, -25050, 12012, 63660, 2669, 74582]
$$ [...]
##END NTUPLES=NMR SPECTRUM
##END=
