##TITLE=1H_CG-1208-3x
 CDCl3
 32 sc, 
 1.8.2024
##JCAMPDX= 6.0         $$ Bruker NMR JCAMP-DX V2.0
##DATA TYPE= NMR SPECTRUM
##DATA CLASS= NTUPLES
##ORIGIN= UXNMR, Bruker Analytische Messtechnik GmbH
##OWNER= root
$$ XWIN-NMR		Version 3.5
$$ Thu Aug  1 14:31:26 2024 Russian Standard Time (UT+4h)  she@DPX200
##.OBSERVE FREQUENCY= 200.1315
##.OBSERVE NUCLEUS= ^1H
##.ACQUISITION MODE= SIMULTANEOUS
##.ACQUISITION SCHEME= undefined
##.AVERAGES= 32
##.DIGITISER RES= 18
##SPECTROMETER/DATA SYSTEM= spect
##.PULSE SEQUENCE= zg30
##.SOLVENT NAME= DMSO
##.SHIFT REFERENCE= (INTERNAL, DMSO, 0, 21.4542)
##AUDIT TRAIL= $$ (NUMBER, WHEN, WHO, WHERE, WHAT)
$$ ##TITLE= Audit trail, XWIN-NMR		Version 3.5
$$ ##JCAMPDX= 5.01
$$ ##ORIGIN= Bruker BioSpin GmbH
$$ ##OWNER= she
$$ F:/spectra/data/she/nmr/H-F/1/pdata/1/auditp.txt
$$ ##AUDIT TRAIL=  $$ (NUMBER, WHEN, WHO, WHERE, WHAT)
(   1,<2024-08-01 14:30:18.39 +0400>,<she>,<DPX200>,
      <continue with go, POWCHK disabled, PULCHK disabled
       configuration hash MD5:
       00 E9 B6 7A A2 85 ED C7 34 08 36 98 17 FE 4E 26
       data hash MD5: 16K
       1B 77 C3 46 3E 79 7D 83 B2 98 43 1E 82 B4 B0 28>)
(   2,<2024-08-01 14:30:20.60 +0400>,<she>,<DPX200>,
      <Start of raw data processing
       efp BC_mod = 2 LB = 0.24 FT_mod = 6 PKNL = 1 PHC0 = -25617.74 PHC1 = -13.61251 SI = 16K 
       data hash MD5: 16K
       17 0F 15 7D 70 1E 19 EA 7E AE 9E 7B E7 74 3B 62>)
(   3,<2024-08-01 14:30:38.45 +0400>,<she>,<DPX200>,
      <pk PHC0 = -8.635371 PHC1 = 10.6 
       data hash MD5: 16K
       B9 0D 96 42 55 3A CA 82 E9 4C 86 A2 D3 C5 46 9C>)
(   4,<2024-08-01 14:30:41.48 +0400>,<she>,<DPX200>,
      <abs ABSG = 5 
       data hash MD5: 16K
       AC 4A BC 92 AD F7 90 87 A3 0C 26 E9 A5 23 F2 D9>)
(   5,<2024-08-01 14:30:57.39 +0400>,<she>,<DPX200>,
      <abs ABSG = 5 
       data hash MD5: 16K
       E7 ED 8F 12 B8 F0 CF 21 1A 17 3E B5 03 42 3B ED>)
$$ ##END=
$$ 
$$ hash MD5
$$ C7 39 FE 67 72 2A 42 8F 0C 16 70 36 AD 00 1A 03
##$RELAX= 
##$RELAX= 
##$RELAX= 
##$RELAX= 
##$RELAX= 
##$RELAX= 
$$ Bruker specific parameters
$$ --------------------------
##$DU= <F:/spectra>
##$EXPNO= 1
##$NAME= <H-F>
##$PROCNO= 1
##$TYPE= <nmr>
##$USER= <she>
##$AMP= (0..31)
100 100 100 100 100 100 100 100 100 100 100 100 100 100 100 100 100 100 
100 100 100 100 100 100 100 100 100 100 100 100 100 100 
##$AQSEQ= 0
##$AQ_mod= 1
##$AUNM= <au_zg>
##$AUTOPOS= <>
##$BF1= 200.13
##$BF2= 200.13
##$BF3= 200.13
##$BF4= 200.13
##$BF5= 200.13
##$BF6= 200.13
##$BF7= 200.13
##$BF8= 200.13
##$BYTORDA= 1
##$CFDGTYP= 0
##$CFRGTYP= 5
##$CHEMSTR= <none>
##$CNST= (0..31)
1 1 145 1 1 1 1 1 1 1 1 1 1 1 1 1 1 1 1 1 1 1 1 1 1 1 1 1 1 1 1 1 
##$CPDPRG= <>
##$CPDPRG1= <>
##$CPDPRG2= <>
##$CPDPRG3= <>
##$CPDPRG4= <mlev>
##$CPDPRG5= <mlev>
##$CPDPRG6= <mlev>
##$CPDPRG7= <mlev>
##$CPDPRG8= <mlev>
##$CPDPRGB= <>
##$CPDPRGT= <>
##$D= (0..31)
0 1.2 0 0 0 0 0 0 0 0.06 0 0.03 0 0 0 0 0.0002 0 0 0 0 0 0 0 0 0 0 0 0 
0 0 0 
##$DATE= 1722508067
##$DBL= (0..7)
$$ [...]
##$SUBNAM3= <"">
##$SUBNAM4= <"">
##$SUBNAM5= <"">
##$SUBNAM6= <"">
##$SUBNAM7= <"">
##$SUBNAM8= <"">
##$SUBNAM9= <"">
##$SW= 24.0689530833862
##$SWIBOX= (0..15)
0 0 2 0 0 0 0 0 0 0 0 0 0 0 0 0 
##$SW_h= 4816.95568400771
##$TD= 16384
##$TD0= 1
##$TE= 0
##$TE2= 300
##$TE3= 300
##$TEG= 300
##$TL= (0..7)
0 120 120 120 120 120 120 120 
##$TP= (0..7)
150 150 150 150 150 150 150 150 
##$TP07= 0
##$TPNAME0= <>
##$TPNAME1= <>
##$TPNAME2= <>
##$TPNAME3= <>
##$TPNAME4= <>
##$TPNAME5= <>
##$TPNAME6= <>
##$TPNAME7= <>
##$TPOAL= (0..7)
0.5 0.5 0.5 0.5 0.5 0.5 0.5 0.5 
##$TPOFFS= (0..7)
0 0 0 0 0 0 0 0 
##$TUNHIN= 0
##$TUNHOUT= 0
##$TUNXOUT= 0
##$USERA1= <user>
##$USERA2= <user>
##$USERA3= <user>
##$USERA4= <user>
##$USERA5= <user>
##$V9= 5
##$VALIST= <valist>
##$VCLIST= <CCCCCCCCCCCCCCC>
##$VD= 0
##$VDLIST= <DDDDDDDDDDDDDDD>
##$VPLIST= <PPPPPPPPPPPPPPP>
##$VTLIST= <TTTTTTTTTTTTTTT>
##$WBST= 1024
##$WBSW= 4
##$XGAIN= (0..3)
0 0 0 0 
##$XL= 0
##$YL= 0
##$YMAX_a= 402371
##$YMIN_a= -442539
##$ZGOPTNS= <>
##$ZL1= 120
##$ZL2= 120
##$ZL3= 120
##$ZL4= 120
##$ABSF1= 21.45424
##$ABSF2= -2.614939
##$ABSG= 5
##$ABSL= 3
##$ALPHA= 0
##$AQORDER= 0
##$ASSFAC= 0
##$ASSFACI= 0
##$ASSFACX= 0
##$ASSWID= 0
##$AUNMP= <proc_1d>
##$AZFE= 0.1
##$AZFW= 0.1
##$BCFW= 0
##$BC_mod= 2
##$BYTORDP= 0
##$COROFFS= 0
##$CY= -3
##$DATMOD= 1
##$DC= 0
##$DFILT= <>
##$DTYPP= 0
##$F1P= 0
##$F2P= 0
##$FCOR= 1
##$FTSIZE= 16384
##$FT_mod= 6
##$GAMMA= 0
##$GB= 0
##$INTBC= 1
##$INTSCL= 3.70164e-10
##$ISEN= 128
##$LB= 0.24
##$LEV0= 0
##$LPBIN= 0
##$MAXI= 10000
##$MC2= 0
##$MEAN= 0
##$ME_mod= 0
##$MI= 1.114404
##$NCOEF= 0
##$NC_proc= -5
##$NLEV= 6
##$NOISF1= 3.799351
##$NOISF2= 2.8
##$NSP= 0
##$NTH_PI= 0
##$NZP= 0
##$OFFSET= 21.45424
##$PC= 1
##$PHC0= -25626.38
##$PHC1= -3.012509
##$PH_mod= 1
##$PKNL= yes
##$PPARMOD= 0
##$PSCAL= 0
##$PSIGN= 0
##$REVERSE= no
##$SF= 200.129614849485
##$SI= 16384
##$SIGF1= 3
##$SIGF2= 2
##$SINO= 5.538805
##$SIOLD= 16384
##$SREGLST= <1H.CDCl3>
##$SSB= 0
##$STSI= 16384
##$STSR= 0
##$SW_p= 4816.95568400771
##$SYMM= 0
##$S_DEV= 0
##$TDeff= 16384
##$TDoff= 0
##$TI= <>
##$TILT= no
##$TM1= 0
##$TM2= 0
##$TOPLEV= 0
##$USERP1= <user>
##$USERP2= <user>
##$USERP3= <user>
##$USERP4= <user>
##$USERP5= <user>
##$WDW= 1
##$XDIM= 16384
##$YMAX_p= 422414500
##$YMIN_p= -1428489
$$ End of Bruker specific parameters
$$ ---------------------------------
##NTUPLES= NMR SPECTRUM
##VAR_NAME=  FREQUENCY,     SPECTRUM/REAL,   SPECTRUM/IMAG
##SYMBOL=    X,             R,               I
##VAR_TYPE=  INDEPENDENT,   DEPENDENT,       DEPENDENT
##VAR_FORM=  AFFN,          ASDF,            ASDF
##VAR_DIM=   16384,         16384,           16384
##UNITS=     HZ,            ARBITRARY UNITS, ARBITRARY UNITS
##FACTOR=    0.29402158847633, 1,            1
##FIRST=     4293.62894798201, 0,            0
##LAST=      -523.3267360257, 0,             0
##MIN=       -523.3267360257, -1428489,      0
##MAX=       4293.62894798201, 422414500,    0
$$ Real data points
##PAGE= N=1
##DATA TABLE= (X++(R..R)), XYDATA
$$ [...]
7309A76359M0265j37672O4079O3580r668M5172j47462j1368r018l9946J00793
$$ 176359 216624 78952 143031 206611 196943 242115 94653 83285 74267 34321 135114
7298A35114N2545l2409m7089J64496L2483o5086j7608k66546N1891J2619L335
$$ 135114 187659 155250 108161 272657 305140 240054 222446 -44100 7791 20410 23745
7287B3745k9972J50152J6293m6969n4675R8904p1936P6976N5049K9582P3957l7819
$$ 23745 -6227 143925 160218 113249 58574 157478 85542 162518 217567 247149 321106 283287
7275B83287r5781J6614k00264J08212P8746j05444n9588k4551J9485J79645J8807
$$ 283287 187506 204120 3856 112068 190814 85370 25782 1231 20716 200361 219168
7264B19168O0057O5507j45930K0080P6982q9084j4783J7021J5201J01652j6007
$$ 219168 279225 344732 198802 218882 295864 206780 191997 209018 224219 325871 309864
7253C09864K4608j39394l6969L5313l4448N4839J17792J9767P2516k6251j7706
$$ 309864 334472 195078 158109 193422 158974 213813 331605 351372 423888 397637 379931
7242C79931k7946p2631r8365l5026M1091N8208J38221R4482l1076Q3966Q6685
$$ 379931 351985 279354 180989 145963 187054 245262 383483 477965 446889 530855 617540
7231F17540k18318k3898o7706J3487J0979j02417J09695n025j66321P9645L9853
$$ 617540 399222 375324 307618 321105 332084 229667 339362 334337 168016 247661 287514
7220B87514o3015K8161o1550j927J12429o4820j1344J00949o489R5509O963J4005
$$ 287514 224499 252660 191110 189183 301612 236792 225448 326397 319908 415417 422380 436385
7208D36385j48568l1101r7295j1933J51382k20703k5157J82586J58499l4806k26066
$$ 436385 287817 256716 159421 147488 298870 78167 53010 235596 394095 359289 133223
7197A33223K19366l7467r6365j7106P7345M5717j22608P878n1034L5964N4076
$$ 133223 352589 315122 218757 201651 278996 324713 202105 209983 158949 194913 248989
7186B48989O668j61243o028K46077j03384q4006J10800n2979l023j2343J0472
$$ 248989 255657 94414 88386 334463 231079 147073 257873 204894 201871 189528 200000
7175B00000M1620r9377Q395J6625N4905m5323R8498m1320j43820l2076N3013p5355
$$ 200000 241620 142243 150638 167263 222168 176845 275343 234023 90203 58127 111140 35785
7163C5785J18369j7678j19693M2617k9923L5950M9373N4139N0476p6412m7979
$$ 35785 154154 136476 16783 59400 29477 65427 114800 168939 219415 143003 95024
7152I5024L0689n0448Q6286m943j75419o0808K09672m7633M4461o9254K7370O833
$$ 95024 125713 75265 161551 156608 -18811 -79619 130053 82420 126881 57627 84997 91830
7140I1830j62733J53299J22674q6116j60573R7855M827P8109m356o5621R5942
$$ 91830 -70903 82396 205070 118954 -41619 56236 61063 139172 134816 69195 165137
7129A65137k5511k2083q4698j00730J67366l6825J46795j0567q0271o5664p025
$$ 165137 139626 117543 32845 -67885 99481 62656 209451 198884 118613 52949 45924
7118D5924M0947K7161k0910j39331J6219j0878L8166J09052m0676O3794O6292
$$ 45924 86871 114032 93122 -46209 -29990 -40868 -2702 106350 65674 129468 195760
7107A95760j49540r351l6504K661O7404J3477L8859l3309r9051K10182j05067
$$ 195760 46220 36869 365 3026 70430 83907 122766 89457 -9594 200588 95521
7096I5521O102L5752R901O3420j78812L5742J47837p2344j07305J4675J26401
$$ 95521 101623 137375 147276 210696 31884 67626 215463 143119 35814 50489 176890
7085A76890k0708l6016o7851J33514r4109Q944j22694m675M0299q9035J75671
$$ 176890 156182 120166 52315 185829 91720 100664 -22030 -26705 13594 -75441 100230
7074A00230J04641j75210m7783J3565J925J5027j28408Q2863p2135l9921J69067
$$ 100230 204871 29661 -18122 -4557 -2632 12395 -116013 -33150 -105285 -145206 23861
7063B3861M3860j05998J5705N9856M7138o9436k4061L6614j0458M8117R845M4447
$$ 23861 67721 -38277 -22572 37284 84422 14986 -9075 27539 17081 65198 75043 119490
7051A19490K7898J00348o0869n7232l5029J17640J94422j47498j00167j0475j5746
$$ 119490 147388 247736 186867 129635 94606 212246 406668 259170 159003 148528 132782
7040A32782R8441r2476J7554N492r0496l4449M9554O4983q2147J6269J9874N2989
$$ 132782 231223 138747 156301 161793 71297 36848 86402 151385 69238 85507 105381 158370
7028A58370O2976M8776j21385N5414m455j6798j31695p2466J48571J82859J8410
$$ 158370 221346 270122 148737 204151 199696 182898 51203 -21263 127308 310167 328577
7017C28577L4365r6043J22209J0307o264p6564j70090l6394J13055R503q0589
$$ 328577 362942 266899 389108 399415 393151 316587 146497 110103 223158 232661 152072
7006A52072J14117j24924M0573J67629j39403j2909J84911q5326R6297j04134
$$ 152072 266189 141265 181838 349467 210064 197155 382066 296740 393037 288903
6996B88903n2548J2713k9602J42666j0020j597k3565Q6604l1356j9414o1254M9751
$$ 288903 236355 249068 219466 362132 352112 350515 326950 413554 382198 362784 301530 351281
6984C51281r6748j63555l5423J95195k4344K5985j10844m6622J07066j5688r6014
$$ 351281 254533 90978 55555 250750 226406 252391 141547 94925 201991 186303 90289
6973I0289J09164J0967M7478m7863p0412J55869j04182j4135m2810J42534o2099
$$ 90289 199453 210420 257898 210035 139623 295492 191310 177175 134365 276899 214800
6962B14800J07497j09300N4758q9216k3247R5724j46629P1875n2650k2880R5506
$$ 214800 322297 212997 267755 178539 155292 251016 104387 176262 123612 100732 196238
6951A96238o1765P4833p4637j25958L5207M0l1575J75971m6432r5166p8892J45606
$$ 196238 134473 209306 134669 8711 43918 43958 12383 188354 141922 46756 -32136 113470
6939A13470m5795j11669M3966K4083J14642N544j15598q4834J58822K7955k4433
$$ 113470 67675 -43994 -28 24055 138697 144241 28643 -56191 102631 130586 106153
6928A06153n6578O3066N7328r9290J48072j23379o4687L1141P6916o3744L6449
$$ 106153 49575 112641 169969 70679 218751 95372 30685 61826 138742 74998 111447
6917A11447k1440Q6444q099k41084J98153k3084J28450N7422o9638L3701j12982
$$ 111447 90007 176451 168352 -72732 125421 102337 230787 288209 218571 252272 139290
6906A39290q7552o5691J2741M4053m106L1182M7430p8611j56896J46645Q5592
$$ 139290 51738 -13953 -1212 42841 38735 69917 117347 38736 -118160 28485 114077
6895A14077j167K13878j40666j03088J5985N3947P9782o9515N7384l4281j9886
$$ 114077 112910 326788 186122 83034 99019 152966 232748 163233 220617 186336 166450
6884A66450J12450Q445k36339P9987o279O7308J19657p3137L0887N2361j2226
$$ 166450 278900 287345 51006 130993 124714 192022 311679 238542 269429 321790 309564
6873C09564m9152o9172l5876J56774O9353J11916r292r4999J17345o1695j5464
$$ 309564 260412 191240 155364 312138 381491 493407 484115 389116 506461 444766 429302
6862D29302K9265O386Q5947K2460K2375o5499Q5699J01159P3871K9999j42696
$$ 429302 458567 464953 550900 573360 595735 530236 615935 717094 790965 820964 678268
6851F78268P6259J84738K2291n0912K03877j23889R4282k4226q1040J83742Q6520
$$ 678268 754527 939265 961556 910644 1114521 990632 1084914 1060688 979648 1163390 1249910
6840A249910Q9221J38754K78800J3252K7029J21189Q6397K2513J473P8266n8753
$$ 1249910 1339131 1477885 1756685 1769937 1796966 1918155 2004552 2027065 2028538 2106804 2048051
6829B048051Q9262q5225R4231j47775n624j03258J01144M3191L0908j26454o3859
$$ 2048051 2137313 2052088 2146319 1998544 1992920 1889662 1990806 2033997 2064905 1938451 1874592
6818A874592J45680j42J77400J44680K46963P2301J46677K48271K50004J27559
$$ 1874592 2020272 2020130 2197530 2342210 2589173 2661474 2808151 3056422 3306426 3433985
6808C433985K25364J13192O5525Q8947j2685j30725j5295j13453l25768j91081
$$ 3433985 3659349 3772541 3838066 3927013 3914328 3783603 3768308 3654855 3329087 3138006
6798C138006j09213j14007j40529j34562k4746j1632j55479j41092r143j13208
$$ 3138006 3028793 2914786 2774257 2639695 2614949 2603317 2447838 2306746 2297603 2184395
6788B184395Q8049J45906q8606J10930J29008j7942R8427O282P8930M3760k9536
$$ 2184395 2272444 2418350 2329744 2440674 2569682 2551740 2650167 2656449 2735379 2779139 2749603
6777B749603j44734L0590j10368q0327k49209j53976r9810j29041o9848l5730
$$ 2749603 2604869 2635459 2525091 2444764 2195555 2041579 1941769 1812728 1742880 1707150
6767A707150j29977j3356j32032j58333r244L7374p7625k12162l6083P8196j42816
$$ 1707150 1577173 1563817 1431785 1273452 1264208 1301582 1223957 1011795 975712 1053908 911092
6756I11092P6942r8426q4277J15413j70194Q6393j07670q5245R4884l364j10474
$$ 911092 988034 889608 805331 920744 750550 836943 729273 644028 738912 735548 625074
6745F25074J29743J01018j51718m8350q5488J3953K5717k2220j01461l5261j9530
$$ 625074 754817 855835 704117 655767 570279 584232 609949 587729 486268 451007 431477
6734D31477m7391p7707N4688K7543J07662j8190j95635J59605p4837Q9997P2487
$$ 431477 384086 306379 361067 388610 496272 478082 282447 442052 367215 457212 529699
6723E29699j70510P3675J73709p3397k39537J70081Q8270j41585J37993J7983
$$ 529699 359189 432864 606573 533176 293639 463720 551990 410405 548398 566381
6713E66381P0689p5811m9840Q5268L8903j38503p5526L9395J3442Q661n8954l1114
$$ 566381 637070 561259 511419 596687 635590 497087 421561 460956 474398 483059 424105 392991
6701C92991o5747j1443J9357J83318j12649o6724J56994R6095p6055j57321K3159
$$ 392991 327244 315801 335158 518476 405827 339103 496097 592192 516137 358816 381975
6690C81975M4430R2791k7269J18833n8804j900l1848n2409N1058N9369l5316R558
$$ 381975 426405 519196 491927 610760 551956 550056 518208 465799 516857 576226 540910 550468
6678E50468k47466R1447j6819j0313J1533o5358k8226J97612P245m1598K5334
$$ 550468 303002 394449 377630 367317 378850 313492 285266 482878 490123 448525 473859
6667D73859n2898k5563j9604L0817k06244K34907q7273q511L5307j01456N9729
$$ 473859 420961 395398 375794 406611 200367 435274 348001 339490 374797 273341 333070
6656C33070K9960P5334l9505j15222n9762R6349l6353L2768M3429j01045J39051
$$ 333070 363030 438364 398859 283637 223875 320224 283871 316639 360068 259023 398074
6645C98074Q1207j55514j34417P6977j03536N3284L7254L5441N9136O3719p5654
$$ 398074 479281 323767 189350 266327 162791 216075 253329 288770 347906 411625 335971
6634C35971R4994q0830P1544j51353R6872j2492l9514L3538J16320Q017j25121
$$ 335971 430965 350135 421679 270326 367198 354706 315192 348730 465050 473067 347946
6623C47946J81254J425n0751n3829P0370l3737n2725J09745n710J08149J42888
$$ 347946 529200 530625 479874 426045 496415 462678 409953 519698 513988 622137 765025
6612G65025j7855J3153R6965M6104q1575R2677l2717L7585J27116J5183j04800
$$ 765025 747170 760323 857288 903392 821817 914494 881777 919362 1046478 1061661 956861
6601I56861J06344P7662J8887m5184L0351n3447Q1262p0095Q4067K6329l0881
$$ 956861 1063205 1140867 1159754 1114570 1144921 1091474 1172736 1102641 1186708 1213037 1182156
6590A182156J62484O3318k3274J78149L0399k8591K1913O1102J69249Q8773M0070
$$ 1182156 1344640 1407958 1384684 1562833 1593232 1564641 1586554 1647656 1816905 1905678 1945748
6579A945748j6066k5450q6239Q5004L4324j35085j58069l9834J4919N415m1734
$$ 1945748 1929682 1904232 1817993 1902997 1937321 1802236 1644167 1604333 1619252 1624667 1582933
6568A582933r803q8092J3473l4704R3312O8971O7253R3207O4478J79022r3869
$$ 1582933 1573130 1485038 1498511 1463807 1557119 1626090 1693343 1786550 1851028 2030050 1936181
6557A936181R9538K1801L5266J2785j4533J75415k9751m209k5355R4026K7311
$$ 1936181 2035719 2057520 2092786 2105571 2091038 2266453 2236702 2232493 2207138 2301164 2328475
6546B328475q3768J27261K3834p6322p5170k79j97148m640R4759j21817j50575
$$ 2328475 2244707 2371968 2395802 2319480 2244310 2244031 2046883 2042243 2137002 2015185 1864610
6535A864610p4726K0823k6623j02824Q1652j14912R9159P5269j44005K0782J36669
$$ 1864610 1789884 1810707 1784084 1681260 1762912 1648000 1747159 1822428 1678423 1699205 1835874
6524A835874L2029J33267R3222J31809j8463j19782L0135j09558M1957p6982j95581
$$ 1835874 1867903 2001170 2094392 2226201 2207738 2087956 2118091 2008533 2050490 1973508 1777927
6513A777927k57326L1382r4012L7968m7047k15150M9402Q0437l4510J1725K4424
$$ 1777927 1520601 1551983 1457971 1495939 1448892 1233742 1283144 1363581 1329071 1340796 1365220
6502A365220j04619p5075O399q717j29668J81058j6717j30123l9457q0713m8476
$$ 1365220 1260601 1185526 1191925 1183208 1053540 1234598 1217881 1087758 1048301 967588 919112
6491I19112j06190J5902O8047q5002k4892N7021j71615r6723M1536Q5102k9611
$$ 919112 812922 828824 896871 811869 786977 843998 672383 575660 617196 702298 672687
6480F72687n7845j63979j19372M0880K0086O1569P8136o0870q9019j00857q0943
$$ 672687 614842 450863 331491 372371 392457 454026 532162 471292 382273 281416 200473
6469B00473m9330J88814J29595j5146j47562l7789p7740J12722r1923j18378J9262
$$ 200473 151143 339957 469552 454406 306844 269055 191315 304037 212114 93736 112998
6458A12998j006k9292J32974R4942j39789K3531L5501q8105J28087j12714n0461
$$ 112998 111992 82700 215674 310616 170827 194358 229859 141754 269841 157127 106666
6447A06666J3933J4972P983j34170J655K1516K4592J07216R9905M9125k81223
$$ 106666 120599 135571 143554 9384 11039 32555 57147 164363 264268 313393 32170
6436C2170K5755J39659n4998k8165M4252N9892j04390R5085o9772j28044K8353
$$ 32170 57925 197584 142586 114421 158673 218565 114175 209260 139488 11444 39797
6425C9797K3795j52801K07588R598j23637j09227O1223J61205N5289j00886J0507
$$ 39797 63592 -89209 118379 127977 4340 -104887 -43664 117541 172830 71944 82451
6414H2451L2312j5967p1457n9944J36671L6843j49852M9012R4884J34865k15433
$$ 82451 114763 98796 27339 -32605 104066 140909 -8943 40069 134953 269818 54385
6403E4385N309K5474j47513k8888O4664q9810J42529R2621P4600j12391K3851
$$ 54385 59694 85168 -62345 -91233 -26569 -116379 26150 118771 193371 80980 104831
6392A04831L6604m3619k1910J3990o0474o1000q591J7677Q9232n9316K1256p5155
$$ 104831 141435 97816 75906 89896 29422 -31578 -40169 -22492 66740 7424 28680 -46475
6380d6475J11447L3061M2495K1319j35792M9970P8543M7349k489j58952q6289
$$ -46475 64972 98033 140528 161847 26055 76025 154568 201917 199428 40476 -45813
6369d5813Q183M3125K3431J58056q8453o8709K4235q1801j5573J30804J9260K7683
$$ -45813 -37630 5495 28926 186982 98529 29820 54055 -27746 -43319 87485 106745 134428
6357A34428p6530m4870J26756j2015m476M8129r3408Q9998l7192j54587j0474
$$ 134428 57898 13028 139784 127769 123293 171422 78014 168012 130820 -23767 -34241
6346c4241J58127N2127J00681r0993l6582j01451J2671k5752k0114J51016r0136
$$ -34241 123886 176013 276694 185701 149119 47668 60339 34587 14473 165489 75353
6335G5353n8463R2938m6953o4833M3385J74913j21063J3552p9945J35137M1295
$$ 75353 16890 109828 62875 -1958 41427 216340 95277 108829 28884 164021 205316
6324B05316q840m8222j1227j23949m3764M2506j04096J1888J79107J53335j16012
$$ 205316 196476 148254 137027 13078 -30686 11820 -92276 -80388 98719 252054 136042
6313A36042j13800m7570J21778L3258p1338k4777k3293l7591L3817J23983N012
$$ 136042 22242 -25328 96450 129708 58370 33593 10300 -27291 6526 130509 135521
6302A35521j41991k5774P2444J16969r6562o0391m871j3704j00275K2203J7458
$$ 135521 -6470 -32244 40200 157169 60607 216 -4655 -18359 -118634 -96431 -78973
6291g8973J19290l2985J34427j05006M7592J5634j21065L2701L8627P550J24695
$$ -78973 40317 7332 141759 36753 84345 99979 -21086 11615 50242 57792 182487
6280A82487r4372J0069m748p8015J24234O6179j27346m3437p0508J06362p0691
$$ 182487 88115 98184 93436 15421 139655 205834 78488 35051 -35457 70905 214
6269B14J4712N4614p7192J055j9553j45165J20356l8167k1771K03414n6033r135
$$ 214 14926 69540 -7652 -6597 -26150 -171315 -50959 -89126 -110897 92517 36484 27349
6257B7349o6753o8718K6199J8721l345j95717K54298J40776j43428O0447o8928
$$ 27349 -39404 -108122 -81923 -63202 -66547 -262264 -7966 132810 -10618 49829 -19099
6246a9099J7766P978J2641j3650p792L0392J7473j20140K8943j2530J2232J26916
$$ -19099 -1333 6645 19286 5636 -2156 28236 45709 -74431 -45488 -58018 -45786 81130
6234H1130m3986q6996n601J5016n2482M0557M3765p6002M9794q3345N7034j2195
$$ 81130 37144 -49852 -55453 -40437 -92919 -52362 -8597 -84599 -34805 -118150 -61116 -73311
6222g3311j07665K03367P1303j09886R6013K9487j06962M2380P3829o9280j09967
$$ -73311 -180976 22391 93694 -16192 79821 109308 2346 44726 118555 49275 -60692
6211f0692P678P2638O3112M9269J7873j34194j5357j27825J65940r558j70997
$$ -60692 -53014 19624 82736 132005 149878 15684 327 -127498 38442 28884 -142113
6200a42113k5996k0711P2076p828j4525M7934q3174Q277R5840R33J22272n2830
$$ -142113 -168109 -188820 -116744 -124572 -139097 -91163 -174337 -166060 -70220 -69287 52985 155
6188A55J36504k08651L891O5569n655K2147q9339M140o5310Q7570j17554Q4369
$$ 155 136659 -71992 -68101 -2532 -8187 13960 -75379 -71239 -136549 -48979 -166533 -82164
6176h2164J15751l7751J16497m0112J2383j08755m6713L1620J51804r0513j39640
$$ -82164 33587 -4164 112333 72221 84604 -24151 -70864 -39244 112560 22047 -117593
6165a17593Q8663J36313p0047R0270j82594P9728j44983K7326O6021M9925J7954
$$ -117593 -28930 107383 37336 127606 -54988 24740 -120243 -92917 -26896 23029 40983
6154D0983l7512j16029n68Q7098k1147j28046l3773Q7901J4273j2283R4816J04061
$$ 40983 3471 -112558 -113126 -26028 -47175 -175221 -208994 -121093 -106820 -119103 -24287 79774
6142G9774j58942j08899J51490N8645j07074n7388J30074k6904J7026j2044K1433
$$ 79774 -79168 -188067 -36577 22068 -85006 -142394 -12320 -39224 -22198 -34242 -12809
6131a2809K254N6376N2177n6971l7112m9704N2864M62M1916N4931p9335N2238
$$ -12809 -10555 45821 97998 41027 3915 -45789 7075 7537 49453 104384 25049 77287
6119G7287l3629k11656J36440J9426N8289P585Q4595j58603J00699K0238K1285
$$ 77287 43658 -167998 -31558 -12132 46157 53742 138337 -20266 80433 100671 121956
6108A21956j02528k9083o6678Q3231J01215q2592n0262K2225j4394k1841o4728
$$ 121956 19428 -9655 -76333 6898 108113 25521 -24741 -2516 -16910 -38751 -103479
6097a03479J3773l375O701N2420j5363K195Q483R3836m1471j73267J36908K5857
$$ -103479 -89706 -93081 -86380 -33960 -49323 -47128 -38645 55191 13720 -159547 -22639 3218
6085C218O7093O1502o6834j39039m916M9580L0441j7280j00532n0433N6492J56627
$$ 3218 70311 131813 64979 -74060 -78976 -29396 1045 -16235 -116767 -167200 -110708 45919
6073D5919m3640O8057M9706j55723J86830o7862o7777p6627k1801J8519p7226
$$ 45919 2279 70336 120042 -35681 151149 83287 15510 -61117 -82918 -64399 -141625
6062a41625o783j9243m4434J61915N131l7088Q1857N5497q7658k5406M3242k4686
$$ -141625 -148408 -167651 -212085 -50170 -45039 -82127 -270 55227 -32431 -57837 -14595 -39281
6050c9281j9142m2216p2428Q8730M713p1826n1059N2075N9322N9653J75431n2505
$$ -39281 -58423 -100639 -173067 -84337 -79624 -151450 -202509 -150434 -91112 -31459 143972 91467
6038I1467p930k24r5771L0314Q0547j13076o3956P921Q6996k2829o0819P3193
$$ 91467 83537 83313 -12458 17856 98403 -14673 -78629 -70708 16288 -6541 -67360 5833
6026E833q5566r1160p4910K25996m184j08280M3284r765P3751L8407j17312r0560
$$ 5833 -79733 -170893 -245803 -19807 -23991 -132271 -88987 -98752 -25001 13406 -103906 -194466
6014a94466K01406r0803k1856Q557M2535n05N5208K2996m1499k17894J28627K5935
$$ -194466 6940 -83863 -105719 -97162 -54627 -55132 76 23072 -18427 -236321 -107694 -81759
6002h1759O0224J8315k4023L8188l5626L9389J4157L6667O5063r9991k8461m6532
$$ -81759 -21535 -3220 -27243 10945 -24681 14708 28865 65532 130595 30604 2143 -44389
5990d4389J04854K1142r3337q5216L3696R0958K4284l0914R3681j61208l3729
$$ -44389 60465 81607 -11730 -96946 -63250 27708 51992 21078 114759 -46449 -80178
5979h0178K307N3014j02906P2099o984j2365j8242R7568J36276j71589M9422L6926
$$ -80178 -77871 -24857 -127763 -55664 -62648 -75013 -93255 4313 140589 -31000 18422 55348
5967E5348Q5503j09433j26979J9912P4686k7524L5225J41989j09718j25103R0491
$$ 55348 140851 31418 -95561 -75649 -963 -28487 6738 148727 39009 -86094 4397
5956D397j43911J91729j0027j19040O8031o23O0375K2007r2748l4657q3083P2920
$$ 4397 -139514 52215 42188 -76852 -8821 -9444 50931 72938 -19810 -54467 -137550 -64630
5944f4630r9922R4579j11815K20548j6296J12251j15413j45025J7624j31113K33340
$$ -64630 -164552 -69973 -181788 38760 22464 134715 19302 -125723 -108099 -239212 -5872
5933e872j62827K32556J20190k71811R8178j350J8163J5172q3336J3430K8146
$$ -5872 -168699 63857 184047 -87764 10414 9064 27227 42399 -40937 -27507 639
5922F39M256j36251K22127o2642j35201m379J00236m9590l079l1854J32883M3224
$$ 639 4895 -131356 90771 28129 -107072 -111451 -11215 -60805 -63884 -95738 37145 80369
5910H0369j9753O0114p2381j16738O330n7708K6609J44260j79637J504J38036
$$ 80369 60616 120730 48349 -68389 -62059 -119767 -93158 51102 -128535 -127031 11005
5899A1005l748n9906p4349K46J27886j71940J36960Q1536j64576N4921N0833k7043
$$ 11005 7257 -52649 -126998 -126752 1134 -170806 -33846 47690 -116886 -61965 -11132 -38175
5887c8175j1962K2525q3108m3896N0495J5583n3557j14893J8135K15425P307j38763
$$ -38175 -50137 -27612 -110720 -154616 -104121 -88538 -142095 -256988 -238853 -23428 -16121 -154884
5875a54884J7322j09731J61857L3490r0118O9123j6522L2431K7015M1844O3275
$$ -154884 -137562 -247293 -85436 -51946 -142064 -72941 -89463 -57032 -30017 11827 75102
5864G5102n2785j48572j7078J3598O1396K1889K1620M399K5633j55423R6217P1042
$$ 75102 22317 -126255 -143333 -129735 -68339 -46450 -24830 -20431 5202 -150221 -54004 17038
5852A7038k5215j20755M3626M7111l8606l2496R5679l2807Q824j1024m6199P2400
$$ 17038 -8177 -128932 -85306 -38195 -76801 -109297 -13618 -46425 -37601 -48625 -94824 -22424
5840b2424j90196Q8091P8825R3386k461j53539K0148J31817k0310k7579k49688
$$ -22424 -212620 -124529 -45704 47682 45221 -108318 -88170 43647 23337 -4242 -253930
5829b53930P3388O5780R3391k411l1914L3997J6070N3988J14856j2625j22458
$$ -253930 -180542 -114762 -21371 -23782 -55696 -21699 -5629 48359 163215 150590 28132
5818B8132P9453j48466J27364Q0690l2281o2539r1937M6559j0072p3438j4246
$$ 28132 107585 -40881 86483 167173 134892 72353 -19584 26975 16903 -56535 -70781
5807g0781J03076O6899o6659J08707j44244m635N18p5728Q9317L2471r4229L0340
$$ -70781 32295 99194 32535 141242 -3002 -7637 -7119 -82847 6470 38941 -55288 -24948
5795b4948q6782J33751j37366R7072J17524l9875p800j96740q0346O9391J75063
$$ -24948 -111730 22021 -115345 -18273 99251 59376 51576 -145164 -225510 -156119 18944
5784A8944o2265p2634l8013J09510N9492k18561m4897J32489m6963K15773N6709
$$ 18944 -43321 -115955 -153968 -44458 15034 -203527 -248424 -115935 -162898 52875 109584
5773A09584o3744j17652p5152J72416M8222q4671P5364j89554J64173j926j34374
$$ 109584 45840 -71812 -146964 25452 73674 -10997 64367 -125187 38986 37060 -97314
5762i7314m4417O7965n9955N5331m0948K3548p5612L33316m375j46586P2764j25149
$$ -97314 -141731 -73766 -133721 -78390 -119338 -95790 -171402 161914 157539 10953 83717 -41432
5750d1432l8171j29132P2131R4659N8234J07863j73577R7838N7766j07535n6406
$$ -41432 -79603 -208735 -136604 -41945 16289 124152 -49425 48413 106179 -1356 -57762
5739e7762r922J7163O395J2059j51144N9550L4819j08354L7704J74952n7034n2650
$$ -57762 -67684 -50521 -44126 -32067 -183211 -123661 -88842 -197196 -159492 15460 -41574 -94224
5727i4224J70902R292r767j40692J6641J11893R099p1102m0692J23333j2262j98627
$$ -94224 76678 85970 76203 -64489 -47848 64045 73144 2042 -38650 84683 72421 -126206
5715a26206k8767J84811O0133j34575K764j2585j56675L8001J7778P5572M5946
$$ -126206 -154973 29838 89971 -44604 -41840 -54425 -211100 -173099 -155321 -79749 -33803
5704c3803M5667k29412P95j04854K2977L0902Q110J44405L9098n1834Q0834k1231
$$ -33803 11864 -217548 -216753 -321607 -298630 -267728 -259618 -115213 -76115 -127949 -47115 -68346
5692f8346O5965r918l0485M770P8481P954k8606j86937k6130J81511J8325p4068
$$ -68346 -2381 -12299 -42784 -38014 40467 48421 19815 -167122 -193252 -11741 6584 -67484
5680f7484k478k6848m5569n3886r915M770l6295R3565R6324K473j6501j13046
$$ -67484 -69962 -96810 -142379 -196265 -206180 -201410 -237705 -144140 -47816 -45343 -61844 -174890
5668a74890J70688o149k15334J06920K10884n8901p7333o954Q876P669K8800j24602
$$ -174890 -4202 -10351 -225685 -118765 92119 33218 -44115 -51069 -42193 -34524 -5724 -130326
5656a30326K5344J91038o7340Q9997q1482l2675N3221k87318J32822l105o0153
$$ -130326 -104982 86056 18716 108713 27231 -5444 47777 -239541 -106719 -109824 -169977
5645a69977K28623l1089j04398p379k835J56640o7885J5277k2617o5293R0426
$$ -169977 58646 27557 -76841 -84220 -87055 69585 1700 16977 -5640 -70933 19493
5634A9493k672m1802n8678o6972P9317o703j65426J30249K7725m9761J6162j2379
$$ 19493 16821 -24981 -83659 -150631 -71314 -78017 -243443 -113194 -85469 -135230 -119068 -131447
5622a31447J3916N9276o7302P3677M8905j16467o2221J50980p8719P1368p9236
$$ -131447 -117531 -58255 -125557 -51880 -2975 -119442 -181663 -30683 -109402 -38034 -117270
5611a17270j21812R8046M5140n5099Q3348O2036K5862J2355k7812q157L0482m6889
$$ -117270 -239082 -141036 -95896 -150995 -67647 -5611 20251 32606 4794 -3363 27119 -19770
5599a9770j18645J1428K8989L255L2211M1788r0996o0996J10394J6005j19338
$$ -19770 -138415 -126987 -97998 -94743 -62532 -20744 -111740 -172736 -62342 -46337 -165675
5588a65675l395J60716O8360n4352J11306o2210n506m0666P5059j57398K6239
$$ -165675 -169070 -8354 60006 5654 116960 54750 49244 8578 83637 -73761 -47522
5577d7522p7450L5542Q6993n7612l9631M8936N5435j21908K2662l7890l1302P2672
$$ -47522 -124972 -89430 -2437 -60049 -99680 -50744 4691 -117217 -94555 -132445 -163747 -91075
5565i1075J38731q2350l0991K3931n9714j12585K37751L765j6217N780N2140k41945
$$ -91075 47656 -34694 -65685 -41754 -101468 -214053 23698 27463 11246 17026 69166 -172779
5553a72779r371Q4165m5566l9322K551R6514J32238j87807j25357J14288k1374
$$ -172779 -182150 -97985 -143551 -182873 -180322 -83808 48430 -139377 -264734 -150446 -171820
5542a71820J67436O0075j71120j3825n4863L6161L0187l2638m8468P8058n2455
$$ -171820 -4384 55691 -115429 -129254 -184117 -147956 -117769 -150407 -198875 -120817 -173272
5531a73272M6160J278Q1064J8539j00124q0016l7350O8159M6445K4985M4238K7836
$$ -173272 -127112 -125834 -44770 -26231 -126355 -206371 -243721 -175562 -129117 -104132 -59894 -32058
5519c2058O0178k0421m2347M3656P9829r0333l7993O19k0545K3843k2900k7567
$$ -32058 28120 7699 -34648 9008 88837 -1496 -39489 -38870 -59415 -35572 -58472 -86039
5507h6039k9147J2139K3432p6929Q6861J13970r6982p3613M598p7416Q2780j5831
$$ -86039 -115186 -103047 -79615 -156544 -69683 44287 -52695 -126308 -121710 -199126 -116346 -132177
5495a32177l0177J9449n1825K57849j3042l3829j6893Q0195j11468m1064q3751
$$ -132177 -162354 -142905 -194730 63119 50077 16248 -645 79550 -31918 -72982 -156733
5484a56733K199K03948k15794J28234J87462k29007r1473P5585O2629n2526P8106
$$ -156733 -154534 49414 -166380 -38146 149316 -79691 -171164 -95579 -32950 -85476 -7370
5473g370m7111J03863J3840M2863q0858q3197J3032j06308p4009J97523l5630
$$ -7370 -54481 49382 63222 106085 25227 -57970 -44938 -151246 -225255 -27732 -63362
5462f3362P0247n4280o0176J14069Q3916l531r8804r1430q9059k0295J57623R4417
$$ -63362 6885 -47395 -107571 6498 90414 86883 -11921 -103351 -192410 -212705 -55082 39335
5450C9335j34262q553R1536j11131N9537n4544m8539K0705Q3637N9845j22182
$$ 39335 -94927 -103480 -11944 -123075 -63538 -118082 -166621 -145916 -62279 -2434 -124616
5439a24616Q0020o5024N6695O9811L9518r1155k30075N9808J55049N340J6331
$$ -124616 -44596 -109620 -52925 16886 56404 -34751 -264826 -205018 -49969 -44629 -28298
5428b8298j0588j01465P5494J57066p7329K4140j03915q7918J20743J2890n0111
$$ -28298 -38886 -140351 -64857 92209 14880 39020 -64895 -152813 -32070 -19180 -69291
5417f9291L1174L3223k00229J91119J18987j8978j60498J02924n140M2621J22243
$$ -69291 -38117 -4894 -205123 -14004 104983 86005 -74493 28431 23291 65912 188155
5406A88155o4241j05519j11072N8287J15983r8262k5330J14302r6019o3855Q2894
$$ 188155 123914 18395 -92677 -34390 81593 -16669 -41999 72303 -23716 -87571 -4677
5395d677m0321l7381N6809l9760p6048J79664M2248j22127o5777n9000J40821
$$ -4677 -44998 -82379 -25570 -65330 -141378 38286 80534 -41593 -107370 -166370 -25549
5384b5549j3605R1946k0247J39900r2485N245j12208j20163J07204k111j08027
$$ -25549 -39154 52792 32545 172445 79960 85205 -27003 -147166 -39962 -42073 -150100
5373a50100J46318r2750l4872L8289M2976J44634r0683j58694j13934P3709L2340
$$ -150100 -3782 -96532 -131404 -93115 -50139 94495 3812 -154882 -268816 -195107 -162767
5362a62767J94253j1980L82o1251J57138k01831j09636O5120P8801o4020l9337
$$ -162767 31486 19506 19888 -41363 115775 -86056 -195692 -130572 -51771 -115791 -155128
5351a55128l0719N0403R6536j72047J85322K3164L0874P3787j30590R026p2628
$$ -155128 -185847 -135444 -38908 -210955 -25633 -2469 28405 102192 -28398 -19372 -92000
5340i2000L9350J19363j43332O4688l7358r5981l4306J82834j05324P0494r686
$$ -92000 -52650 66713 -76619 -11931 -49289 -145270 -179576 3258 -102066 -31572 -41258
5329d1258j22186q0764K2449J23162L9850O6250j21652P330m3922j55111J11713
$$ -41258 -163444 -244208 -221759 -98597 -58747 7503 -114149 -106819 -150741 -305852 -194139
5318a94139J64459K3916p2807R2152j1300J12670p5938J66848j87921N0172m155
$$ -194139 -29680 -5764 -78571 13581 2281 114951 39013 205861 17940 68112 63957
5307F3957l1041r8943o9698m3110K27J13479j12639m4843L9827R1301Q4067Q0965
$$ 63957 32916 -66027 -135725 -178835 -178608 -65129 -177768 -222611 -182784 -91483 -7416 73549
5295G3549l4107N2553m7884P544p7223k4593J21477n0691q5292J0713p8893k0844
$$ 73549 39442 91995 44111 51655 -25568 -50161 71316 20625 -64667 -53954 -132847 -153691
5283a53691P0451k07672K12857l861j28047K10333p386k0710r8541Q5347J37261
$$ -153691 -83240 -290912 -78055 -81916 -209963 370 -7016 -27726 -126267 -40920 96341
5272I6341m3671r5059n5581M5779K50344j73219r9057q7851Q9478o4004J53995
$$ 96341 52670 -42389 -97970 -52191 198153 24934 -74123 -161974 -72496 -136500 17495
5261A7495k4550K338n2834J05068r7930Q513L7466l047N0800j87585J09832J41709
$$ 17495 -7055 -4717 -57551 47517 -50413 -41900 -4434 -7481 43319 -144266 -34434 107275
5249A07275q9002n5493N4903j61070J36656j7113J20792o0458j8613j41157q3314
$$ 107275 18273 -37220 17683 -143387 -6731 -23844 96948 36490 17877 -123280 -206594
5238b06594K22363p9507P4813N2767k836o5035q4008j22102J42227J02712k1784
$$ -206594 15769 -63738 11075 63842 61006 -4029 -88037 -210139 -67912 34800 13016
5227A3016k9901r1341J55500J77805k20721n2182j9587J12569J42024r5634r2015
$$ 13016 -16885 -108226 47274 225079 4358 -47824 -67411 45158 187182 91548 -467
5216d67n8370Q436J46865j00641k29730N0327R9223N9722L0792L4305Q6251m2176
$$ -467 -58837 -50401 96464 -4177 -233907 -183580 -84357 -24635 6157 40462 126713 84537
5204H4537P928j09749L5552M8701n3850O9623k4859j14361N4521j0648j12465
$$ 84537 92465 -17284 18268 66969 13119 82742 57883 -56478 -1957 -12605 -125070
5193a25070R8145k1436m2582J90243k4133k7812M6230O0444j24619o4401J725
$$ -125070 -26925 -48361 -90943 99300 75167 47355 93585 154029 29410 -34991 -33266
5182c3266l8563M9186L0902K3989m8489J02568O9008K1814j69683j41618J27569
$$ -33266 -71829 -22643 8259 32248 -16241 86327 155335 177149 7466 -134152 -6583
5171f583o0847k7544K89761r3324r5526p3144N3916Q526N5857p1505l2046m5755
$$ -6583 -67430 -94974 194787 101463 5937 -67207 -13291 -4765 51092 -20413 -52459 -98214
5159i8214K9803M6908P9611o7532J54745q8332o8205J52057L64n4688q488j16527
$$ -98214 -68411 -21503 58108 -9424 145321 56989 -11216 140841 141205 86517 78029 -38498
5147c8498J25800j38334R2639J10831j50292J9502j10900l188M6336L7513K24110
$$ -38498 87302 -51032 41607 152438 2146 21648 -89252 -92440 -46104 -8591 215519
5136B15519j10122j69276O3985O8422J9111N4522O2373k40783n7338J55795J45066
$$ 215519 105397 -63879 106 68528 87639 142161 204534 -36249 -93587 62208 207274
5125B07274k21759o2168J05727M0852l5451k8295P2261j32163M5593J33323q0367
$$ 207274 -14485 -76653 29074 69926 34475 6180 78441 -53722 -8129 125194 44827
5114D4827n3099K0012J03099k5764O123j26545J16896m0173m3543j7735k3409
$$ 44827 -8272 11740 114839 89075 95198 -31347 85549 45376 1833 -15902 -39311
5103c9311m1634K00618n0016j21036R7191J0958q2634O8606j48931r6522j9717
$$ -39311 -80945 119673 69657 -51379 45812 56770 -25864 42742 -106189 -202711 -222428
5092b22428J32473j8706Q3714l6587r5187J06871J27429k4288q4251J19213R315
$$ -222428 -89955 -108661 -24947 -61534 -156721 -49850 77579 53291 -30960 88253 97568
5081I7568j12037Q7435k5072k4139m6563k7468j03902O3569l9069J51507M4592
$$ 97568 -14469 72966 47894 23755 -22808 -50276 -154178 -90609 -129678 21829 66421
5070F6421j1085L5133j03269L4943j17015K02906J1425j05099j10003J68328q6920
$$ 66421 55336 90469 -12800 22143 -94872 108034 119459 14360 -95643 72685 -14235
5059a4235n978J34558j45141Q090O3243j47352O6463N0251m7960j08698J06160
$$ -14235 -20213 114345 -30796 -22706 40537 -106815 -40352 9899 -38061 -146759 -40599
5048d0599j5044P0383j8445P4665o575j01366M4757p2669k1550J5595o1715O4840
$$ -40599 -55643 14740 -3705 70960 64385 -36981 7776 -64893 -86443 -70848 -132563 -67723
5036f7723M2142o4081l9706j4137Q6045P8590r684J0748j26513J01825J5041J18992
$$ -67723 -25581 -89662 -129368 -143505 -57460 21130 11446 22194 -104319 -2494 12547 131539
5024A31539l2158k6485j0483J6511M2738J9197l1904q1763K0026k2570N6141O8590
$$ 131539 99381 72896 62413 78924 121662 140859 108955 27192 47218 24648 80789 149379
5012A49379J0223j03333M7646N7668j10361o8860K28766j10705j9949Q0917q9808
$$ 149379 159602 56269 103915 161583 51222 -17638 211128 100423 80474 161391 71583
5001G1583R1882k04125K0498K20561M5785j4333j47176j9058O9159j19656q0570
$$ 71583 163465 -40660 -20162 200399 246184 231851 84675 65617 134776 15120 -65450
4990f5450P1509j04387J7433L2141P1341J6604J24090N2675J3510p082j7846j46537
$$ -65450 6059 -98328 -80895 -48754 22587 39191 163281 215956 229466 222384 204538 58001
4978E8001l8109J9337P5078K5069n1119O8272M1822n2241j75546J501O7414j6989
$$ 58001 19892 39229 114307 139376 88257 156529 198351 146110 -29436 -27935 39479 22490
4966B2490P9644o0914k12821M9239N7681J99627m715J223n1439j6910O8326K4637
$$ 22490 102134 41220 -171601 -122362 -64681 134946 130231 131454 80015 63105 131431 156068
4954A56068P3252k84332r939J65202M6573K9952j42407k2749K4398Q7255r1326
$$ 156068 229320 -55012 -64951 100251 146824 176776 34369 11620 36018 123273 31947
4943C1947K14428m282j85426j27562J14136J28757j7362p0099j373R3427J647
$$ 31947 246375 242093 56667 -70895 43241 171998 154636 84537 83164 176591 178238
4932A78238K6390q0566L524Q5486Q0824J8198r8420m4454P4427k2570l9633N1582
$$ 178238 204628 124062 127586 213072 293896 312094 213674 169220 243647 221077 181444 233026
4920B33026P7167k9946n540k0780l2457r659l1124M5731N847m4950M8322P2822
$$ 233026 310193 280247 274707 253927 221470 211811 180687 226418 232265 187315 235637 308459
4908C08459p2292L0981L8557j4643j26152n7279P4955j56444Q0875q330Q1742
$$ 308459 236167 267148 305705 291062 164910 107631 182586 26142 107017 98687 180429
4897A80429N5068P5244k31526P6747P035j13202j0734P0226P8929O7148l8481
$$ 180429 235497 310741 79215 155962 162997 49795 39061 109287 188216 255364 216883
4886B16883r0190q8288J02336j2292n7194M1163l6317L4129M3802n2671j15865
$$ 216883 126693 38405 140741 128449 71255 112418 76101 110230 154032 101361 -14504
4875a4504m0138M3276J09155O5572n9840M5035p7480J7733R8673n411j40094Q1313
$$ -14504 -54642 -11366 97789 163361 103521 148556 71076 88809 187482 182071 41977 123290
4863A23290j7284j07949K6308J11069p864K2563n7045n0441J23899m2006P2414
$$ 123290 106006 -1943 24365 135434 127570 150133 93088 42647 166546 124540 196954
4852A96954p00p4035l3469K7966l3936O3182R3478j34162j27420J27467p0374
$$ 196954 196254 122219 88750 116716 82780 145962 239440 105278 -22142 105325 34951
4841C4951M4546j1839O3072R9219J7300j18065k5856o2936m2525Q3140M5448J3375
$$ 34951 79497 67658 130730 229949 247249 129184 103328 40392 -2133 81007 126455 139830
4829A39830m5127J05474J4075J4313r8351j21524m6591P8165m0210j12732O7157
$$ 139830 94703 200177 214252 228565 130214 8690 -37901 40264 54 -112678 -45521
4818d5521J28680j42598J25430J33361l9467J25m0548Q76l4785J6198j5043J66488
$$ -45521 83159 -59439 65991 199352 159885 160010 119462 120338 85553 101751 86708 253196
4806B53196k24681J1730j17553R3236J10146K1518J05210j62402l4792J51735
$$ 253196 28515 40245 -77308 15928 126074 147592 252802 90400 55608 207343
4796B07343J08126j03591J2288O3078n710N0887O0388M6319j994j16281j80343
$$ 207343 315469 211878 224166 287244 281534 332421 392809 439128 437134 320853 140510
4785A40510O4763k3130J24634L4509p2630j76964J32950r88r7380L4978J30378
$$ 140510 205273 182143 306777 341286 268656 91692 224642 223654 126274 161252 291630
4774B91630p8264L9485O7163j3752n5927J6483o7495J19023M7078j63605R8624
$$ 291630 213366 252851 320014 306262 250335 266818 199323 318346 365424 201819 300443
4763C00443L8387N9592j79912M8687J22820j53457m4936J52643K9198Q328P2686
$$ 300443 338830 398422 218510 267197 390017 236560 191624 344267 373465 381793 454479
4752D54479n0754q8030k2948j3413K6692J72143N3012j49014j82153n680P2226
$$ 454479 403725 315695 292747 279334 306026 478169 531181 382167 200014 194334 266560
4741B66560J11952k2618q8996q3447J6292J53275o9804J22301k17471K5260J25156
$$ 266560 378512 355894 266898 183451 199743 353018 283214 405515 188044 213304 338460
4730C38460L1733J4545K5621j00145R1994J38191q0164M032P6366r028k08217
$$ 338460 370193 384738 410359 310214 402208 540399 460235 464267 540633 531605 323388
4719C23388R6200P2197O5363j42720M1123J58674j8316L1732r1930J37679O6925
$$ 323388 419588 491785 557148 414428 455551 614225 595909 627641 535711 673390 740315
4708G40315N2661M0212L1368O0296J01603J25749k1494J59287K65868P4587K310
$$ 740315 792976 833188 864556 924852 1026455 1152204 1130710 1289997 1555865 1630452 1632762
4697A632762L7858J26009Q5610n9210P5696Q8423K13239J35329m5232Q1806M0044
$$ 1632762 1670620 1796629 1882239 1823029 1898725 1987148 2200387 2335716 2290484 2372290 2412334
4686B412334J9904j611K30539J90001J57927j21150J17012J02661R6902M2059
$$ 2412334 2432238 2430627 2661166 2851167 3009094 2887944 3004956 3107617 3204519 3246578
4676C246578K01143Q9176P1531n7505Q52j14159k4772n2853j59618R861q6664
$$ 3246578 3447721 3536897 3608428 3550923 3551775 3437616 3412844 3359991 3200373 3210234 3123570
4665C123570L1071k22183l7934o4093n7069L6310m5399p4589j07224K8971p6258
$$ 3123570 3154641 2932458 2894524 2830431 2773362 2809672 2764273 2689684 2582460 2611431 2535173
4654B535173j22520k37219q0399j7093j17487M6473j74469j12081j41345j36346
$$ 2535173 2412653 2175434 2095035 2077942 1960455 2006928 1832459 1720378 1579033 1442687
4644A442687o9663n0328o2313m6279K6771J7544j43772k8370r5083M6083P9160
$$ 1442687 1373024 1322696 1260383 1214104 1240875 1258419 1114647 1086277 991194 1037277 1116437
4633A116437p4933K6582r7554l3437J4111j569j08212r0402q87n8043o4257J45532
$$ 1116437 1041504 1068086 970532 937095 951206 949637 841425 751023 750136 692093 627836 773368
4621G73368K2111N5216o1167j79127n7810L0685n5k786M4914Q2638j4753o5329
$$ 773368 795479 850695 789528 610401 552591 583276 583221 580435 625349 707987 693234 627905
4609F27905j19810j15514O2458M7874M018l2988M0166R9913n2806m1190m682j55526
$$ 627905 508095 392581 455039 502913 506931 473943 514109 614022 561216 520026 515344 359818
4597C59818J23437k3610n0273k6825L3858J314Q1951J7951p1690L0052N793J7779
$$ 359818 483255 459645 409372 382547 416405 417719 499670 517621 445931 475983 481776 499555
4585D99555l1593J01497j18346M2543k7606n674J78703k39930r68k8559k3377
$$ 499555 467962 569459 451113 493656 466050 460376 639079 399149 398181 369622 346245
4574C46245J22060m3652n3783R3274K0703j4162m454J774q7983J4615J62P4973
$$ 346245 468305 424653 370870 464144 484847 470685 466231 468005 380022 394637 394799 469772
4562D69772N6776j54125j34873J14146k8869K1663m3206J23501J175m4101q7823
$$ 469772 526548 372423 237550 351696 322827 344490 301284 424785 425960 381859 294036
4551B94036J67316j70621l024R2546P7259J6125o1009l3128M5393L2956Q9545
$$ 294036 461352 290731 287707 380253 457512 473637 412628 379500 424893 457849 547394
4540E47394J83145k46936o6215O9592M0515k5281j11244k9804L3929r1977K1464
$$ 547394 730539 483603 417388 486980 527495 502214 390970 361166 395095 303118 324582
4529C24582p5926J55392j28346r19l5381J55739O5650r092j42072J20188N7191
$$ 324582 248656 404048 275702 274783 239402 395141 460791 451699 309627 429815 487006
4518D87006q9911j6822q6983M3348J20993j34357M2912m1571j3210P0224r9785
$$ 487006 397095 380273 293290 336638 457631 323274 366186 324615 311405 381629 281844
4507B81844L827K2597J0990n0492O4854M1397K0541l0213o4732K38562J9089j34576
$$ 281844 285671 308268 319258 268766 333620 375017 395558 365345 300613 539175 558264 423688
4495D23688J29137k8853j41067P7687R9131n0066m2091l2139R2072j72668k2005
$$ 423688 552825 523972 382905 460592 559723 509657 467566 435427 527499 354831 332826
4484C32826J36047J20631L354o5659o2438m3969p6406Q5390N5282n7953J213Q3131
$$ 332826 468873 589504 592858 527199 464761 420792 344386 429776 485058 427105 428318 511449
4472E11449J74878j54968m1608j779r6889P3071R0412m773j27138J16423k9826
$$ 511449 686327 531359 489751 487972 391083 464154 554566 549793 422655 539078 509252
4461E09252M0869j74562J2092J27583J63160j298j60025J9743J6649J21380k985
$$ 509252 550121 375559 387651 515234 678394 677096 517071 536814 553463 674843 671858
4450F71858J4762K0938r134n3368k2145J1356Q952J06577j56083j00217J10336
$$ 671858 686620 707558 698424 645056 622911 634267 643219 749796 593713 493496 603832
4439F03832R62J66806n1335j22230J01906q9124J2735Q8306p2194L3341J02355
$$ 603832 604794 771600 720265 598035 699941 610817 623552 711858 639664 673005 775360
4428G75360J6064l1072j1055O6545m0763N6070L252j40000l4476P0221j0455K9530
$$ 775360 791424 760352 749297 815842 775079 831149 834401 694401 659925 730146 719691 749221
4416G49221n7870M0528J65569O3886J49491j70385j38668j9520J08117p4982J04261
$$ 749221 691351 731879 897448 961334 1110825 940440 801772 782252 890369 815387 919648
4405I19648j9132J12850R2981R7730J8753o7485m9716L5859j38675k69M8316J13772
$$ 919648 900516 1013366 1106347 1204077 1222830 1155345 1105629 1141488 1002813 1002544 1050860 1164632
4393A164632j00899M4302n9861k9597J73222k3887j86407p3857J28188n8668o0620
$$ 1164632 1063733 1108035 1048174 1018577 1191799 1167912 981505 907648 1035836 977168 916548
4382I16548K5647K1527Q026J01633m1026j03644Q5485j6493N7539O7851o7465
$$ 916548 942195 963722 971748 1073381 1032355 928711 1014196 997703 1055242 1123093 1055628
4371A055628N0995J31903j20805J30065L744j6413K36294j30348o7197M1018K2077
$$ 1055628 1106623 1238526 1117721 1247786 1251530 1235117 1471411 1341063 1273866 1314884 1336961
4360A336961J5529K7629P1672K6266q1988O3576r5254p710K9536O3266P5142p9473
$$ 1336961 1352490 1380119 1451791 1478057 1396069 1459645 1364391 1356681 1386217 1449483 1524625 1445152
4348A445152j9630O8791j08758J75656L5088M1156L8495J67635k5537L1435k39257
$$ 1445152 1425522 1494313 1385555 1561211 1596299 1637455 1675950 1843585 1818048 1849483 1610226
4337A610226J7468K01889J02011q5784J06919J04781J4699N1325J36398m3179
$$ 1610226 1627694 1829583 1931594 1845810 1952729 2057510 2072209 2123534 2259932 2216753
4327B216753M4225J44039N8056J49289J27265J17339J97517K38011P1440J79377
$$ 2216753 2260978 2405017 2463073 2612362 2739627 2856966 3054483 3292494 3363934 3543311
4317C543311J21658J48203Q8416Q2494J11462J91330L9885j20108L9749Q3381
$$ 3543311 3664969 3813172 3901588 3984082 4095544 4286874 4326759 4206651 4246400 4329781
4307D329781J62039K6996R6989M9281k6763L84737Q411Q3593J02368K90938O1057
$$ 4329781 4491820 4518816 4615805 4665086 4638323 5023060 5031471 5115064 5217432 5508370 5569427
4296E569427p4358J38333l7166J2148j46285j36427q227J50884q48k30705p9125
$$ 5569427 5495069 5633402 5596236 5608384 5462099 5325672 5317445 5468329 5467481 5236776 5157651
4285E157651k1791l2208o936j07314K9299q1731O6151J29996o684j12629k10175
$$ 5157651 5135860 5103652 5096716 4989402 5018701 4936970 5003121 5133117 5126433 5013804 4803629
4274D803629J03689P4725j40614j43440m2782q0589P0166J05941q5862p0362m601
$$ 4803629 4907318 4982043 4841429 4697989 4655207 4574618 4644784 4750725 4664863 4594501 4589900
4263D589900j09248P437m7907n622m1719J40780j9181o3033m9903J01517m7406
$$ 4589900 4480652 4488089 4440182 4434560 4392841 4533621 4514440 4451407 4401504 4503021 4455615
4252D455615j6176J23620L8315o5205J29933J75718J85993J25939J60359J24117
$$ 4455615 4439439 4563059 4601374 4536169 4666102 4841820 5027813 5153752 5314111 5438228
4242E438228J06372J08512J69826O2635P7680K85023J7078L07749j2685K40773
$$ 5438228 5544600 5653112 5822938 5885573 5963253 6248276 6265354 6573103 6560418 6801191
4232F801191R6861J06419J96848J43744L40J4072K76711J02911Q8451K34266J44914
$$ 6801191 6898052 7004471 7201319 7345063 7345403 7359475 7636186 7739097 7827548 8061814 8206728
4221H206728P6210J03611j2423j03734O7389M7382p1782J22335j0813j1852K40056
$$ 8206728 8282938 8386549 8374126 8270392 8337781 8385163 8313381 8435716 8424903 8413051 8653107
4210H653107o2814K1220j02211J05938m0283m0944R430J0745J04358K26414J7677
$$ 8653107 8590293 8611513 8509302 8615240 8574957 8534013 8543443 8554188 8658546 8884960 8902637
4199H902637k0106q4473J5260M9758N491K83312j50350J39053j0430J25149J06741
$$ 8902637 8882531 8798058 8813318 8863076 8868567 9151879 9001529 9140582 9130152 9255301 9362042
4188I362042J03150n2852L3266J01585k9948J95415J86373J73501Q5249p5741
$$ 9362042 9465192 9412340 9445606 9547191 9517243 9712658 9899031 10072532 10157781 10082040
4178A0082040J50181J46066J11854P2477J33144J22961K13210k1575J76911L41656
$$ 10082040 10232221 10378287 10490141 10562618 10695762 10818723 11031933 11010358 11187269 11528925
4168A1528925J21042J81618R9936K22022J88138K17222K39781J82460L83879K26916
$$ 11528925 11649967 11831585 11931521 12153543 12341681 12558903 12798684 12981144 13365023 13591939
4158A3591939J03013L77113L85507L65272K73915N46110M58512L95690N28591
$$ 13591939 13694952 14072065 14457572 14822844 15096759 15642869 16101381 16497071 17025662
4149A7025662O16065N18734O44157N94743N51237Q51926N58090O37904M45825
$$ 17025662 17641727 18160461 18804618 19399361 19950598 20802524 21360614 21998518 22444343
4140B2444343R44443Q13433P28913Q06796Q03850R08855J040505J029747J029083
$$ 22444343 23388786 24202219 24931132 25737928 26541778 27450633 28491138 29520885 30549968
4131C0549968R71881J257818J297583J277092J440316J398091J580426J919428
$$ 30549968 31521849 32779667 34077250 35354342 36794658 38192749 39773175 41692603
4123D1692603J962746K029381K281848K199940K657916K975903L036995L355686
$$ 41692603 43655349 45684730 47966578 50166518 52824434 55800337 58837332 62193018
4115F2193018L626886L850761M133380M637090N059634N302530N835842O276666
$$ 62193018 65819904 69670665 73804045 78441135 83500769 88803299 94639141 100915807
4107A00915807O684517P218835P551977P923889Q721158Q872618R395987R838249
$$ 100915807 107600324 114819159 122371136 130295025 139016183 147888801 157284788 167123037
4099A67123037J0004106J0874858J1938153J2564230J3674650J4643250J5820512
$$ 167123037 177127143 188002001 199940154 212504384 226179034 240822284 256642796
4092B56642796J6814158J7929170J8714736J9402096J9253691J8777383J7588559
$$ 256642796 273456954 291386124 310100860 329502956 348756647 367534030 385122589
4085C85122589J5296925J1869532P412726K712728k468294p112679j1552328j4719629
$$ 385122589 400419514 412289046 419701772 422414500 419946206 412833527 401281199 386561570
4077C86561570j6803516j8197404j8908743j8770966j8101747j7564323j6513908
$$ 386561570 369758054 351560650 332651907 313880941 295779194 278214871 261700963
4070B61700963j5687975j4533246j3656765j2707361j1769346j1029709j0175106
$$ 261700963 246012988 231479742 217822977 205115616 193346270 182316561 172141455
4063A72141455r483353q897854q249573p607284p264884o647581o155678n672243
$$ 172141455 162658102 153760248 145510675 137903391 130638507 123990926 117835248 112163005
4055A12163005n639644n012933m717966m389222l983235m036504l526709l402648
$$ 112163005 106523361 101510428 96792462 92403240 88420005 84383501 80856792 77454144
4047G7454144l345436k937369k800732k700386k401082k446850k206358k203643
$$ 77454144 74108708 71171339 68370607 65670221 63269139 60822289 58615931 56412288
4039E6412288j963140j824583j956438j545319j543176j613525j512834j612278
$$ 56412288 54449148 52624565 50668127 49122808 47579632 45966107 44453273 42840995
4031D2840995j373250j372905j241423j163254j175219j133769r32331j018198
$$ 42840995 41467745 40094840 38853417 37690163 36514944 35381175 34448844 33430646
4023C3430646j132619r67369r93050r84671p75724q72846q45270o30914p36708
$$ 33430646 32298027 31330658 30337608 29352937 28577213 27704367 26859097 26228183 25491475
4014B5491475q24719p35899o41333m36813m77091p82398n46470m92680m61600
$$ 25491475 24666756 23930857 23289524 22852711 22375620 21593222 21046752 20554072 20092472
4005B0092472o53590m18158m11419l83274m59953m96607m27916k71835j53255
$$ 20092472 19438882 19020724 18609305 18226031 17766078 17269471 16841555 16569720 16416465
3996A6416465n01322l93932k33096k76099k16520l71198j45755k45077l26098
$$ 16416465 15915143 15521211 15288115 15012016 14795496 14424298 14278543 14033466 13707368
3987A3707368l71024j09995j60282l46500j21697l62410j32985j83318l81725
$$ 13707368 13336344 13226349 13066067 12719567 12597870 12235460 12102475 11919157 11537432
3978A1537432k56026k22817k74071k42439k33144k9149k12753k85651j87395k77387
$$ 11537432 11281406 11058589 10784518 10542079 10308935 10279786 10067033 9781382 9593987 9316600
3968I316600j52625l2020l29307j78686m1677k53124j27433k49389l4369k5633
$$ 9316600 9163975 9131955 8802648 8623962 8582285 8329161 8201728 7952339 7917970 7892337
3958G892337k18485j75620o54j02274q4333k1459P1705j39365j23513j55924J4946
$$ 7892337 7673852 7498232 7497578 7395304 7310971 7289512 7361217 7221852 7098339 6942415 6957361
3947F957361l7381P0925j68009j07113L5145k28998N1740o4889j07647m013n2476
$$ 6957361 6919980 6990905 6822896 6715783 6750928 6521930 6573670 6508781 6401134 6397121 6344645
3936F344645r6259j66512r1856r6731r341k57768m0957k40466o3483j8662j68516
$$ 6344645 6248386 6081874 5990018 5893287 5883946 5626178 5585221 5344755 5281272 5262610 5094094
3925E094094N6139r1712J9579p7666J64951j64796m02906n0748J53867j70316
$$ 5094094 5150233 5058521 5078100 5000434 5165385 5000589 4597683 4546935 4700802 4530486
3915D530486r6016O60N4361O9807j48097p8846J864P625p1477N5321j04467m2873
$$ 4530486 4434470 4435130 4489491 4559298 4411201 4332355 4334219 4341844 4270367 4325688 4221221 4178348
3903D178348R5013o1683N320k9958m6987j48998J26532O5645r1861j23747O8339
$$ 4178348 4273361 4211678 4216998 4187040 4140053 3991055 4117587 4183232 4091371 3967624 4035963
3892D035963m7354m2340k0625p8558j78264K5401K5843j87602r8115k4336o177
$$ 4035963 3988609 3946269 3925644 3847086 3668822 3694223 3720066 3532464 3434349 3410013 3403836
3881C403836L4988K1221p1594o0341J05015j75183j22287o0568k163K1900P8074
$$ 3403836 3438824 3460045 3388451 3328110 3433125 3257942 3135655 3075087 3072924 3094824 3172898
3870C172898N6880j80520K7533Q138L9986P8981o9733M5373j03796k0493M2418
$$ 3172898 3229778 3049258 3076791 3084929 3124915 3203896 3134163 3179536 3075740 3055247 3097665
3859C097665N6890M8522j48642O2326l2091J00057K8143J06927o7959n0958Q4588
$$ 3097665 3154555 3203077 3054435 3116761 3084670 3184727 3212870 3319797 3251838 3200880 3285468
3848C285468n7741k0383j29132j73756j16488P7053q1913J19772k30706q7971
$$ 3285468 3227727 3207344 3078212 2904456 2787968 2865021 2783108 2902880 2672174 2584203
3838B584203j1665R102J37900j39226j24211J22491O3065O1784P783j95161N0388
$$ 2584203 2572538 2581640 2719540 2580314 2456103 2578594 2641659 2703443 2711226 2516065 2566453
3827B566453O7086L8858j41912Q3796j7707q6122J22693J70110o8987Q6334K4059
$$ 2566453 2633539 2672397 2530485 2614281 2596574 2510452 2633145 2803255 2734268 2820602 2844661
3816B844661j82332Q9776n5151j3479l0337l3539J6329j11785P8143o371j16983
$$ 2844661 2662329 2752105 2696954 2683475 2653138 2619599 2635928 2524143 2602286 2595915 2478932
3805B478932Q8636J46786J75560j44589p6123l2299L5661O9415j04749l3069j3177
$$ 2478932 2567568 2714354 2889914 2745325 2669202 2636903 2672564 2741979 2637230 2604161 2590984
3794B590984R2989k3402o5461J0055j25390j45697J84038j87592K00104J56557
$$ 2590984 2683973 2660571 2595110 2605165 2479775 2334078 2518116 2330524 2530628 2687185
3784B687185M9978K2874r144J55027n4003k0471k00453r792J04242J30903J18696
$$ 2687185 2737163 2760037 2750893 2905920 2851917 2831446 2630993 2621201 2725443 2856346 2975042
3773B975042K5788p3253Q2374J31832m4367P0671J90137o1074p3131N28K56828
$$ 2975042 3000830 2927577 3009951 3141783 3097416 3168087 3358224 3297150 3224019 3224547 3481375
3762C481375p6616L8153Q7095N729K11914l6747P4567Q6277j24835o5101J63515
$$ 3481375 3404759 3442912 3530007 3535736 3747650 3710903 3785470 3871747 3746912 3681811 3845326
3751C845326l5683J74403j2762j12726J00347j1288N7753Q0332M1069J97J21492
$$ 3845326 3809643 3984046 3971284 3858558 3958905 3947617 4005370 4085702 4126771 4126968 4248460
3740D248460J521k9342J93423J04079L0916n6945K8688k3034J05632R3109o5913
$$ 4248460 4249981 4220639 4414062 4518141 4549057 4492112 4520800 4497766 4603398 4696507 4630594
3729D630594K0758K68692r9803L8480p049m179M682N1427R7733p4192k45868O7097
$$ 4630594 4651352 4920044 4820241 4858721 4851672 4847493 4852175 4903602 5001335 4927143 4681275 4748372
3717D748372J35882p3933j02650k27811Q3961J2157L0316j32999j69205M0179
$$ 4748372 4884254 4810321 4707671 4479860 4563821 4575978 4606294 4473295 4304090 4344269
3707D344269l1507j49418o5570q4374j06809p72k23729n2891O7963q4938l7935
$$ 4344269 4312762 4163344 4097774 4013400 3906591 3905819 3682090 3629199 3697162 3612224 3574289
3696C574289j08585l4850O3357q4602j0268Q1452m031R974j67344q6043m5830
$$ 3574289 3465704 3430854 3494211 3409609 3399341 3480793 3476762 3486736 3319392 3233349 3187519
3685C187519l90m316R2219J32672r7208J11671K17006o5840O0827J92981k7919
$$ 3187519 3187129 3182813 3275032 3407704 3310496 3422167 3639173 3573333 3634160 3827141 3799222
3674C799222k6965Q6178J77606J39771O3401l5929J01062l2986J8673J30913Q6801
$$ 3799222 3772257 3858435 4036041 4175812 4239213 4203284 4304346 4271360 4290033 4420946 4507747
3663D507747L6516j21479m907J97043P6245P421J20184J05798J32309R0705K8849
$$ 4507747 4544263 4422784 4417877 4614920 4691165 4698586 4818770 4924568 5056877 5147582 5176431
3652E176431M1955M8325J06390K2113k08041Q0222J07409p186j73955Q7650j54640
$$ 5176431 5218386 5266711 5373101 5395214 5187173 5267395 5374804 5367618 5193663 5281313 5126673
3641E126673K0364p5480k5300j24229j26482k6751J40462p3455j32410o9184o3749
$$ 5126673 5147037 5071557 5046257 4922028 4795546 4768795 4909257 4835802 4703392 4634208 4570459
3630D570459J9804j32129j04434p4566M2962n6941j04925n9181j26946M5971k0693
$$ 4570459 4590263 4458134 4353700 4279134 4322096 4265155 4160230 4101049 3974103 4020074 3999381
3619C999381l8384q216k05337K3713l4959k10428L6771J8213K8621l8296l6958
$$ 3999381 3960997 3952781 3747444 3771157 3736198 3525770 3562541 3580754 3609375 3571079 3534121
3608C534121P6681R218Q7927Q3585n5603M6792K25349M4630p4546n1787J46922
$$ 3534121 3610802 3620020 3707947 3791532 3735929 3782721 4008070 4052700 3978154 3926367 4073289
3597D073289J15003Q7333K46081Q4645R6383P7599m4066K18657P0395L3624J62150
$$ 4073289 4188292 4275625 4521706 4606351 4702734 4780333 4736267 4954924 5025319 5058943 5221093
3586E221093J4692J55478J78602J1165J92402k3197J81238k049p2610J31872J79158
$$ 5221093 5235785 5391263 5569865 5581030 5773432 5750235 5931473 5929424 5856814 5988686 6167844
3575F167844R5776K21803O1115J9586O1927J75827k4582j6562P4610J2233p8575
$$ 6167844 6263620 6485423 6546538 6566124 6628051 6803878 6779296 6762734 6837344 6849577 6771002
3564F771002M5070M0549K6948J27236M2796l680r4067Q844r0374J47248J01657
$$ 6771002 6816072 6856621 6883569 7010805 7053601 7049921 6955854 6964698 6874324 7021572 7123229
3553G123229J13002m122J13541P3784M0413Q0872P5758m4522Q1405L8710K56761
$$ 7123229 7236231 7232109 7345650 7419434 7459847 7540719 7616477 7571955 7653360 7692070 7948831
3542G948831J89858K7148R0918Q9072P4250K60967J31986L09164K84208J73280
$$ 7948831 8138689 8165837 8256755 8345827 8420077 8681044 8813030 9122194 9406402 9579682
3532I579682M58654K65834L02801L35846O19560N30764O15660O24156P08376Q31024
$$ 9579682 10038336 10304170 10606971 10942817 11562377 12093141 12708801 13332957 14041333 14872357
3522A4872357R64078Q40009J025136J218815J416065J455949J424107J526252
$$ 14872357 15836435 16676444 17701580 18920395 20336460 21792409 23216516 24742768
3514B4742768J799891J921349K297812K332498K477327K820658L313647L519294
$$ 24742768 26542659 28464008 30761820 33094318 35571645 38392303 41705950 45225244
3506D5225244L873704M190750M456881M924290N210029N257786N434717N530252
$$ 45225244 49098948 53289698 57746579 62670869 67880898 73138684 78573401 84103653
3498H4103653N552268N648399N653675N229185M625072M554677M083504L474920
$$ 84103653 89655921 95304320 100957995 106187180 110812252 115366929 119450433 122925353
3490A22925353L092979K297960J140291K47163o36070j276406k219580k753022
$$ 122925353 126018332 128316292 129456583 129703746 129067676 127791270 125571690 122818668
3482A22818668l371950m092098m628961m828101n148569n479834n329392n503177
$$ 122818668 119446718 115354620 110725659 105897558 100748989 95269155 89939763 84436586
3474H4436586n453002n431333n231982m887249m732698m461954m095826l529528
$$ 84436586 78983584 73552251 68320269 63433020 58700322 54238368 50142542 46613014
3466D6613014l149534l053921k696101k486848k162986k030505j915134j642544
$$ 46613014 43463480 40409559 37713458 35226610 33063624 31033119 29117985 27475441
3458B7475441j494440j358723j329103j111048j235254r29823r73270r66516r04258
$$ 27475441 25981001 24622278 23293175 22182127 20946873 20017050 19043780 18077264 17173006
3449A7173006o50520p06344o97495n75781n09101n38262o05203l52734m06652
$$ 17173006 16522486 15816142 15118647 14542866 14033765 13495503 12890300 12537566 12130914
3440A2130914n93865l44407l41030m49157k44775m19340l20253l58609k08281
$$ 12130914 11537049 11192642 10851612 10402455 10157680 9738340 9418087 9059478 8851197
3431H851197k69728k82162k04741k50477j66676k87975l16110k91140j84183k12959
$$ 8851197 8581469 8299307 8094566 7844089 7677413 7389438 7073328 6782188 6598005 6385046
3421F385046j95345p8801j6788j77069k58649k61152m2017J1429k34115k15995
$$ 6385046 6189701 6110900 6094112 5917043 5658394 5397242 5355225 5366654 5132539 4916544
3411D916544q6105k7819j36652K038j10649k17627j340k36727q547M9525j45421
$$ 4916544 4830439 4802620 4665968 4668006 4557357 4339730 4338390 4101663 4093116 4142641 3997220
3400C997220q2123j70587j62447M2234p7011l5384m5809o6587n1236k4607q3593
$$ 3997220 3915097 3744510 3582063 3624297 3547286 3511902 3466093 3399506 3348270 3323663 3240070
3389C240070j82273J31598j33128j24559K2212o5181p0284k6833o3096n1516m2679
$$ 3240070 3057797 3189395 3056267 2931708 2953920 2888739 2818455 2791622 2728526 2677010 2634331
3378B634331l9337m889o957m0193j78221q625N1206k45126l1675l317K1104m9636
$$ 2634331 2594994 2590105 2583148 2542955 2364734 2356109 2407315 2162189 2130514 2127197 2148301 2098665
3366B098665l0151N0215j12961R9012l3905N1097m2363k6320k0833j19366j31503
$$ 2098665 2068514 2118729 2005768 2104780 2070875 2121972 2079609 2053289 2032456 1913090 1781587
3355A781587J61034P554Q2025j36277J4240R1614l461Q138j2690j2492j91204
$$ 1781587 1942621 1950175 2032200 1895923 1910163 2001777 1998316 2006454 1993764 1981272 1790068
3344A790068P6365o59k1307j36109M3110m2107M0981k2609j04121r8665k4335
$$ 1790068 1866433 1865774 1844467 1708358 1751468 1709361 1750342 1727733 1623612 1524947 1500612
3333A500612P7713l0501k7844L7026r0068r22R3255o1264m6119j5005N4494n0016
$$ 1500612 1578325 1547824 1519980 1557006 1466938 1466016 1559271 1498007 1451888 1436883 1491377 1441361
3321A441361J14017o0817j65698J00336P3522J673J50904p6132q4236L297Q279
$$ 1441361 1555378 1494561 1328863 1429199 1502721 1504394 1655298 1579166 1494930 1498227 1506506
3310A506506l225q1099R3210J8407l9249j4287m7877r1706J95752O5658j17870
$$ 1506506 1503281 1422182 1515392 1533799 1494550 1480263 1432386 1340680 1536432 1602090 1484220
3299A484220k8531l2700M9045K5896K1172j257k8584k9362J5574J22510j9374
$$ 1484220 1455689 1422989 1472034 1497930 1519102 1517845 1489261 1459899 1475473 1597983 1578609
3288A578609O1941j49264l3385j8559L8698K08985j11056m7123J75273j5834R0993
$$ 1578609 1640550 1491286 1457901 1439342 1478040 1687025 1575969 1528846 1704119 1688285 1779278
3277A779278K3912K9823j21273K03024J55535J80881R9913r554J85054J86482
$$ 1779278 1803190 1833013 1711740 1914764 2070299 2251180 2351093 2341539 2526593 2713075
3267B713075K0183N8221M0922J11784J45911O6734J75705M0031N9839K5627J47863
$$ 2713075 2733258 2791479 2832401 2944185 3090096 3156830 3332535 3372566 3432405 3458032 3605895
3256C605895J23932K649J75377O7445q8890J2716J24706O5389K9269R4936L1873
$$ 3605895 3729827 3732476 3907853 3975298 3886408 3899124 4023830 4089219 4118488 4213424 4245297
3245D245297j19892j6526J7643q1158j21400P7583q0906j17596n1333j51453M0838
$$ 4245297 4125405 4108879 4126522 4045364 3923964 4001547 3920641 3803045 3751712 3600259 3641097
3234C641097L8824m2526j07124N6720m9100q4714j56421O1179k92688j03368q6140
$$ 3641097 3679921 3637395 3530271 3586991 3537891 3453177 3296756 3357935 3065247 2961879 2875739
3223B875739Q3592j88261j73021R5677r1713M5259k42353o0178Q1266j18032J18334
$$ 2875739 2959331 2771070 2598049 2693726 2602013 2647272 2404919 2344741 2426007 2307975 2426309
3212B426309J92480N9554r1003N5838j1563L2652o967L45648J56337J22520K57486
$$ 2426309 2618789 2678343 2587340 2643178 2631615 2664267 2657300 3002948 3159285 3281805 3539291
3201C539291j30446j91905j03275o0320l85162j91938j83603m1020l6695k14638
$$ 3539291 3408845 3216940 3113665 3053345 2668183 2476245 2292642 2251622 2214927 2000289
3191B000289l11477L3001J8540j05934j22804K4885o2850N6825P3029k29244Q5174
$$ 2000289 1688812 1721813 1740353 1634419 1511615 1536500 1473650 1530475 1603504 1374260 1459434
3180A459434L857j8779q6446k6860J67810j9686n4836m0362R2302j30800K5100
$$ 1459434 1463291 1444512 1358066 1331206 1499016 1479330 1424494 1384132 1476434 1345634 1370734
3169A370734j14967q2052J0673p1450J07024r0064r2283J01322o0380o4780K794
$$ 1370734 1255767 1173715 1184388 1112938 1219962 1129898 1037615 1138937 1078557 1013777 1016571
3158A016571J35098n016j23801M9246k9965O8095k58630J7873J09631j37468Q1142
$$ 1016571 1151669 1146653 1022852 1072098 1042133 1110228 851598 869471 979102 841634 922776
3147I22776j5909J43894L5338k14365R8133o9403l0080L7085j05951M6656L3216
$$ 922776 906867 1050761 1086099 871734 969867 900464 870384 907469 801518 848174 881390
3136H81390j90010J60452M8496L7643n0654j5598m405R6601p7606Q479K2082n3118
$$ 881390 691380 851832 900328 937971 887317 871719 867314 963915 886309 894788 916870 863752
3124H63752j30637K60421J77240j98475J7760K0101m0104r9649J76103Q9499K5019
$$ 863752 733115 993536 1170776 972301 990061 1010162 970058 870409 1046512 1136011 1161030
3113A161030m9529j6812m8257J7295K09070r730o1621J06386p5974j13755L1736
$$ 1161030 1111501 1094689 1046432 1063727 1272797 1263067 1201446 1307832 1231858 1118103 1149839
3102A149839N7039L7075K2037k8017M8663J1084O5176O1802J73248j55148m3664
$$ 1149839 1206878 1243953 1265990 1237973 1286636 1297720 1362896 1424698 1597946 1442798 1399134
3091A399134M9368J31733J31023j16282O2206m66J9724J06491P1479J03226P0863
$$ 1399134 1448502 1580235 1711258 1594976 1657182 1656716 1676440 1782931 1854410 1957636 2028499
3080B028499o5807k0365k4023J66421J42798m0023M8397K187K717N5074N2536
$$ 2028499 1962692 1942327 1918304 2084725 2227523 2187500 2235897 2238084 2240801 2295875 2348411
3069B348411K05644J35551n2114L68M0627J14854O1174J12764L9001r489O2424
$$ 2348411 2554055 2689606 2637492 2637860 2678487 2793341 2854515 2967279 3006280 2996791 3059215
3058C059215L4548O3517J67422k8647J27319R2227J73164m6925O874J67842J0340
$$ 3059215 3093763 3157280 3324702 3296055 3423374 3515601 3688765 3641840 3648714 3816556 3826896
3047C826896J65635k5736J03502Q6956J44035J0101O3179J47714O076J35231K4013
$$ 3826896 3992531 3966795 4070297 4157253 4301288 4311389 4374568 4522282 4528358 4663589 4687602
3036D687602j16350J27054K0718Q2249O3245r1465N4043K3982M511N2852J0167
$$ 4687602 4571252 4698306 4719024 4801273 4864518 4773053 4827096 4851078 4855589 4908441 4918608
3025D918608k140J43778j64554Q3227K3212j47719O7372m3259j175r2912M2800
$$ 4918608 4916468 5060246 4895692 4978919 5002131 4854412 4921784 4878525 4877350 4784438 4827238
3014D827238Q4660l4729o4815l1583J62396J2523j3725j08800o4801j73090j01985
$$ 4827238 4911898 4877169 4812354 4780771 4943167 4955690 4941965 4833165 4768364 4595274 4493289
3003D493289j27843j73437J48385q3708K6304L407j04696K4199l7148l4642j85865
$$ 4493289 4365446 4192009 4340394 4256686 4282990 4286397 4181701 4205900 4168752 4134110 3948245
2992C948245N2093j08000q0191j404o2951K512j6443q4328n3039j8763p7210n597
$$ 3948245 4000338 3892338 3812147 3810743 3747792 3750304 3733861 3649533 3596494 3577731 3500521 3494924
2980C494924m5028k1448j7271k04297p6510j19j28500j40726J43847J67699j06761
$$ 3494924 3449896 3428448 3411177 3206880 3130370 3130251 3001751 2861025 3004872 3172571 3065810
2969C065810j39970m5824j26924Q735j55010j29851p7688J03475N6792L7466q5529
$$ 3065810 2925840 2880016 2753092 2761827 2606817 2476966 2399278 2502753 2559545 2597011 2511482
2958B511482k41900J01172l4784j89388K4457j7564p6432j14157j21026Q8584
$$ 2511482 2269582 2370754 2335970 2146582 2171039 2153475 2077043 1962886 1841860 1930444
2948A930444K4749J07886K3340q5299r9100J08573r3061l0358k0601J58041j92518
$$ 1930444 1955193 2063079 2086419 2001120 1902020 2010593 1917532 1887174 1866573 2024614 1832096
2937A832096O241o9057N0765J53787j2659k83419J46527J20479p2375Q7446k0212
$$ 1832096 1838337 1769280 1820045 1973832 1961173 1677754 1824281 1944760 1872385 1959831 1939619
2926A939619J27477q3311O1860J32395J7418j10821J31199K8612M155P534N3104
$$ 1939619 2067096 1983785 2045645 2178040 2195458 2084637 2215836 2244448 2248603 2256137 2309241
2915B309241N0146M3115K37316J4523o1687O1296J71081K01870P6036J66185J06285
$$ 2309241 2359387 2402502 2639818 2654341 2592654 2653950 2825031 3026901 3102937 3269122 3375407
2904C375407K00188K46653J96050J66897K85058L15089K45882K67680J0024J42303
$$ 3375407 3575595 3822248 4018298 4185195 4470253 4785342 5031224 5298904 5308928 5451231
2894E451231J89862J90228J22252J17045J80766K6385k8561Q0025P2177M5910
$$ 5451231 5641093 5831321 5953573 6070618 6251384 6277769 6249208 6329233 6401410 6447320
2884F447320o5881k6057j48927O6750k85117j97298r9282l2273k74368k05228
$$ 6447320 6381439 6355382 6206455 6273205 5988088 5790790 5691508 5659235 5384867 5179639
2874E179639j41308l25441j34865j79946j46597j09738j71221j58468n6535j12132
$$ 5179639 5038331 4712890 4578025 4398079 4251482 4141744 3970523 3812055 3755520 3643388
2864C643388k01266o5173j31220k28813N4315n019j33327j80878l6048l8192m5605
$$ 3643388 3442122 3376949 3245729 3016916 3071231 3066212 2932885 2752007 2715959 2677767 2632162
2853B632162j18427j16979K8433j05781n0198l8336M3182M4882o0978j32536j80571
$$ 2632162 2513735 2396756 2425189 2319408 2269210 2230874 2274056 2318938 2257960 2125424 1944853
2842A944853L0462M1956J90337j88070p6710n6790j3820j9832q059k0413l6330
$$ 1944853 1975315 2017271 2207608 2019538 1942828 1886038 1872218 1852386 1844327 1823914 1787584
2831A787584o0623L561r9653j3089N2076P4521k3K6064L3723L8882n5210M3188
$$ 1787584 1726961 1730522 1630869 1617780 1669856 1744377 1744354 1770418 1804141 1843023 1787813 1831001
2819A831001j01126M6848O977K3790N2516n6598M2916Q1104N6191J5324N1563
$$ 1831001 1729875 1776723 1783700 1807490 1860006 1803408 1846324 1927428 1983619 1998943 2050506
2808B050506j9149P7241J30664m0733K0404J09365J03466j8737J13979L7386j36661
$$ 2050506 2031357 2108598 2239262 2198529 2218933 2328298 2431764 2413027 2527006 2564392 2427731
2797B427731M6184K07227k868J23915J34040p2899P5698L1333o960n2103j3312
$$ 2427731 2473915 2681142 2678274 2802189 2936229 2863330 2939028 2970361 2963401 2911298 2897986
2786B897986J01194L1185M5324J09573N643R0306M0828M4856O4225K18097n8231
$$ 2897986 2999180 3030365 3075689 3185262 3190905 3281211 3322039 3366895 3431120 3649217 3590986
2775C590986J46163J04704J28455J17549L39491K20169q964L01552K29509K35762
$$ 3590986 3737149 3841853 3970308 4087857 4427348 4647517 4638553 4940105 5169614 5405376
2765E405376L47877K57937L32818L63456K56229M33429L65138M62454L93379M02858
$$ 5405376 5753253 6011190 6344008 6707464 6963693 7397122 7762260 8224714 8618093 9020951
2755I020951M43859K34602L73538K86722K62229J11927n7609O1966j67473j73998
$$ 9020951 9464810 9699412 10072950 10359672 10621901 10733828 10676219 10738185 10570712 10396714
2745A0396714k99478j36165j82098l69311l48500l19105k67359m23594m74314
$$ 10396714 10097236 9961071 9778973 9409662 9061162 8742057 8474698 8051104 7576790
2736G576790l67678k45512l93605k12974j32965l26737k38061k10697j66282k83768
$$ 7576790 7209112 6963600 6569995 6357021 6224056 5897319 5659258 5448561 5282279 4998511
2726D998511j91969k28882q6709j00660j66810q5779j47679j31103j47376L2206
$$ 4998511 4806542 4577660 4490951 4390291 4223481 4137702 3990023 3858920 3711544 3743750
2716C743750p4794O7252j97854k8301J17736l6132j32922J4672j03800J4676J73798
$$ 3743750 3668956 3736208 3538354 3510053 3627789 3591657 3458735 3473407 3369607 3384283 3558081
2705C558081j34315j9528J48029j6002j30951J3373p2929l0463N2742n8456J14588
$$ 3558081 3423766 3404238 3552267 3536265 3405314 3418687 3345758 3315295 3368037 3309581 3424169
2694C424169k7661j20127K6721M5889O4556J01299Q8357J08234N7117j03273J51482
$$ 3424169 3396508 3276381 3303102 3348991 3413547 3514846 3603203 3711437 3768554 3665281 3816763
2683C816763J13019J34044K18806K45030J47197K37275J15328K89298R7770K35159
$$ 3816763 3929782 4063826 4282632 4527662 4674859 4912134 5027462 5316760 5414530 5649689
2673E649689M13693Q3034M06712M24497M37962K99708N12443M34175N24576L48092
$$ 5649689 6063382 6146416 6553128 6977625 7415587 7715295 8227738 8661913 9186489 9534581
2663I534581N16284M73541M22542N14690L61584M25699J47472K7326R3171j14397
$$ 9534581 10050865 10524406 10946948 11461638 11823222 12248921 12396393 12423719 12516890 12402493
2653A2402493K37600o5478o3157k12764k30045l42797m07931k73894m22518n43149
$$ 12402493 12640093 12574615 12511458 12298694 12068649 11725852 11317921 11044027 10621509 10078360
2643A0078360p24950k65281l34233l11065l87595m66353n05584k78679k42673
$$ 10078360 9353410 9088129 8753896 8442831 8055236 7588883 7083299 6804620 6561947
2634F561947k87349k88912k62475k38695j14645k27971k42318q9209q1728j52835
$$ 6561947 6274598 5985686 5723211 5484516 5369871 5141900 4899582 4810373 4728645 4575810
2624D575810n9707n9893o5931l7091j78836j55400q1836l0807n4384k79761j09932
$$ 4575810 4516103 4456210 4390279 4353188 4174352 4018952 3937116 3906309 3851925 3572164 3462232
2613C462232K6760j96716j38012j6884l5396M4806j66458j0584n6381n894N8469
$$ 3462232 3488992 3292276 3154264 3137380 3101984 3146790 2980332 2969748 2913367 2907473 2965942
2602B965942O1140k65007L4430p5861r4645J32326N2441j7372j78927J07817K652
$$ 2965942 3027082 2762075 2796505 2720644 2625999 2758325 2810766 2793394 2614467 2722284 2724936
2591B724936k0575j29540R3156K7839p2261m3924Q090J44086j80837m6928j9945
$$ 2724936 2704361 2574821 2667977 2695816 2623555 2579631 2587721 2731807 2550970 2504042 2484097
2580B484097J2836P2009L1491M2180P8639Q9883J7908m3449K9524K9391J39606
$$ 2484097 2496933 2568942 2600433 2642613 2721252 2811135 2829043 2785594 2815118 2844509 2984115
2569B984115J19632N07K68692J25614Q3393J17754J80162J26851J83538N6640
$$ 2984115 3103747 3104254 3372946 3498560 3581953 3699707 3879869 4006720 4190258 4246898
2559D246898R8859K12420J08194Q9334J53921R0822J47272Q1783J6509L1220r3672
$$ 4246898 4345757 4558177 4666371 4755705 4909626 5000448 5147720 5229503 5246012 5277232 5183560
2548E183560J36886K01026j51402j7335q7169p057J19814J286j14415K9309j2693
$$ 5183560 5320446 5521472 5370070 5352735 5265566 5258509 5378323 5379609 5265194 5294503 5281810
2537E281810m6226J08346m5617j47860j28621J1043k28045j12353j41843k28593
$$ 5281810 5235584 5343930 5298313 5150453 5021832 5032875 4804830 4692477 4550634 4322041
2527D322041j69740j32452j49209k93130k30277j08679j09391q4786j46262k24861
$$ 4322041 4152301 4019849 3870640 3577510 3347233 3238554 3129163 3044377 2898115 2673254
2517B673254o1124n8944j36873j21043o9955j2935q575n0969k41999l3586L1580
$$ 2673254 2612130 2553186 2416313 2295270 2225315 2212380 2203805 2152836 1910837 1877251 1908831
2506A908831N5333k6118K4454j65078J543J7132j01895k4068P2545k2750L1444
$$ 1908831 1964164 1938046 1962500 1797422 1798965 1816097 1714202 1690134 1762679 1739929 1771373
2495A771373l7547K9994K04399j47547R1668j08404k08542L722l8706L4558O0062
$$ 1771373 1733826 1763820 1968219 1820672 1912340 1803936 1595394 1599116 1560410 1594968 1655030
2484A655030j54751r986J05128J3001j31639Q5510k2619k30439j38643M6289K1688
$$ 1655030 1500279 1490293 1595421 1608422 1476783 1562293 1539674 1309235 1170592 1216881 1238569
2473A238569J2665j9551j43176k9242n6229P4317L8613o8383q7152Q0709N3253
$$ 1238569 1251234 1231683 1088507 1059265 1003036 1077353 1115966 1047583 960431 1041140 1094393
2462A094393J863P1553q8737J6926r3395R7394M9420L6513j73762j72866k0127
$$ 1094393 1096256 1167809 1079072 1095998 1002603 1099997 1149417 1185930 1012168 839302 819175
2451H19175J86392O9903j00184j9525Q5794L7057m1826Q4449q9533p8249Q4244
$$ 819175 1005567 1075470 975286 955761 1041555 1078612 1036786 1121235 1031702 953453 1037697
2440A037697p6343J4604J29451q3212o0491O8547P819N8170j56201J40354M7911
$$ 1037697 961354 975958 1105409 1022197 961706 1030253 1038072 1096242 940041 1080395 1128306
2429A128306r941o793J48380Q8161k24349J00878l3294O6918j29530J92690P3284
$$ 1128306 1118365 1111572 1259952 1348113 1123764 1224642 1191348 1258266 1128736 1321426 1394710
2418A394710j08988J7022n8298m9757J68813n413m4016j8113P2727L2585N0531
$$ 1394710 1285722 1302744 1244446 1194689 1363502 1358089 1314073 1295960 1368687 1401272 1451803
2407A451803J42291P2359J15445Q4554L0795J38220L0133n4770J39089L7943j30769
$$ 1451803 1594094 1666453 1781898 1866452 1897247 2035467 2065600 2010830 2149919 2187862 2057093
2396B057093J01795J16367J69975J68418J31371K9884K14233J64461J84409K16443
$$ 2057093 2158888 2275255 2445230 2613648 2745019 2774903 2989136 3153597 3338006 3554449
2386C554449K08983L29321K72565L59153K50445K56677L32937L66624M35986M23198
$$ 3554449 3763432 4092753 4365318 4724471 4974916 5231593 5564530 5931154 6367140 6790338
2376F790338M42401O89581N64443M76671P05394P84965Q57061R72141J067202
$$ 6790338 7232739 7922320 8486763 8963434 9668828 10453793 11310854 12282995 13350197
2367A3350197J072593J350036J471679J587272J471617J485304J301367Q92534
$$ 13350197 14422790 15772826 17244505 18831777 20303394 21788698 23090065 23982599
2359B3982599L63783j70954m50211j018067j119089j318672j391443j165599j094934
$$ 23982599 24346382 24175428 23725217 22707150 21588061 20269389 18877946 17712347 16617413
2350A6617413j059369j040941q97243q74382j026048p19265p17848n64517o79936
$$ 16617413 15558044 14517103 13619860 12745478 11719430 11000165 10282317 9717800 9037864
2341I037864n20889n14308l39270n04324l96292k97258m00332l55486k30919k47554
$$ 9037864 8516975 8002667 7663397 7159073 6762781 6465523 6065191 5709705 5478786 5231232
2331E231232j53732k23348k06623k68728k72082k43239j93281j87224j71321j18175
$$ 5231232 5077500 4854152 4647529 4378801 4106719 3863480 3670199 3482975 3311654 3193479
2321C193479r6897n0311j48372K2818p7524m9898k02177j91294j22519Qr3499
$$ 3193479 3096582 3046271 2897899 2920717 2843193 2793295 2591118 2399824 2277305 2277313 2183814
2310B183814K9015p6246j4536j26674q5330p9233K9745j52438j12710m7547p7935
$$ 2183814 2212829 2136583 2122047 1995373 1910043 1830810 1860555 1708117 1595407 1547860 1469925
2299A469925p4589r444K2190r1744Q4598j9059j43081J68197r8189p9938j23613
$$ 1469925 1395336 1385892 1408082 1316338 1400936 1381877 1238796 1406993 1308804 1228866 1105253
2288A105253j29460N3991O4996R864o8725J08771j22272j00533r2553o1156J6173
$$ 1105253 975793 1029784 1094780 1104644 1035919 1144690 1022418 921885 829332 768176 784349
2277G84349J50746n6316m2025K2217J00344k05881l1390O045J61107M3310n0222
$$ 784349 935095 878779 836754 858971 959315 753434 722044 728089 889196 932506 882284
2266H82284j56385j64540l8687R3174n5715q0888N8678k6390J462j5381R7678
$$ 882284 725899 561359 522672 615846 560131 479243 537921 511531 512993 497612 595290
2255E95290L0116n0093l6092O5938m0433j78429J45483J12062r7398J6741j45988
$$ 595290 625406 575313 539221 605159 564726 386297 531780 643842 546444 563185 417197
2244D17197R4026R3013j23570m6887k3287l6626N5842o8184J1252j6646N8304
$$ 417197 511223 604236 480666 433779 410492 373866 429708 361524 372776 356130 414434
2233D14434j25666P6755O2981N329l4214m490p5312J33044J5369j37556J61974
$$ 414434 288768 365523 428504 433833 399619 395129 319817 452861 468230 330674 492648
2222D92648j23179p2001p566J70377K8273j97221q4765J4921p2864Q3785J8621
$$ 492648 369469 297468 289902 460279 488552 291331 206566 221487 148623 232408 251029
2211B51029P7686J66792j63960l4591M7304n736j1861k5630l4663J26545j14704
$$ 251029 328715 495507 331547 296956 344260 338524 326663 301033 266370 392915 278211
2200B78211J26330l477o1086j41909q6041L7761J84543L9436j72670J11354P2678
$$ 278211 404541 401064 339978 198069 112028 149789 334332 373768 201098 312452 385130
2189C85130q1188q7832M9253J08700P6604j0256j03711j29341l5555J93752j77731
$$ 385130 303942 216110 265363 374063 450667 440411 336700 207359 171804 365556 187825
2178A87825J4675j09994K7551J46802j9903P1084k36406J81399J9368J11310j26284
$$ 187825 202500 92506 120057 266859 246956 318040 81634 263033 282401 393711 267427
2167B67427r3765m1596K147K63177l5632j36533j42457n132J34018O6521J35843
$$ 267427 173662 132066 134213 397390 361758 225225 82768 77636 211654 278175 414018
2156D14018j2858j36126p2293n863N4465K6265l0404K0929r2328j7215O7006J79308
$$ 414018 401160 265034 192741 186878 241343 267608 237204 258133 165805 148590 215596 394904
2144C94904j23122J01628j06933m120j6463l844R5366l5323O547j19484J46302
$$ 394904 271782 373410 266477 262357 245894 242050 337416 302093 308640 189156 335458
2133C35458J9485q2391m1390J07335o3479j4938P217j33476J29388P7633r5925
$$ 335458 354943 272552 231162 338497 275018 260080 267297 133821 263209 340842 244917
2122B44917k1389N9777j9089q781m8084Q6825k0403n2201j43903J9852J13295
$$ 244917 223528 283305 264216 255435 207351 294176 273773 221572 77669 97521 210816
2111B10816M3002j12400J6735k7073q2793N1498Q4552m2584J2022l1931n8643
$$ 210816 253818 141418 158153 131080 48287 99785 184337 141753 153775 121844 63201
2100F3201l5764N4882J68920r7558L5943n400N0953R7138j94941n7039j3373J6730
$$ 63201 27437 82319 251239 153681 189624 184224 235177 332315 137374 80335 66962 83692
2088H3692J45845j1819o6418J01948j17132J0937O2337O6031P1604j35419j20874
$$ 83692 229537 217718 151300 253248 136116 147053 209390 275421 347025 211606 90732
2077I0732l5844J5784M71Q4007q6145m5217j17900Q2650J4459M8006k106M9585
$$ 90732 54888 70672 71143 155150 69005 23788 -94112 -11462 2997 51003 48897 98482
2065I8482k6342K1597P3523O5523k5259N5968p9800j44401Q3283q057j44474R2706
$$ 98482 72140 93737 167260 232783 207524 263492 183692 39291 122574 114517 -29957 62749
2053F2749N16J1431n0395O0160r3569l5460O2183J26421J1954j99559l2706J31306
$$ 62749 63265 74696 24301 84461 -9108 -44568 17615 144036 155990 -43569 -76275 55031
2041E5031k4860O3905J03587j62935j28819R8821n9380J8518P6975J34388O2939
$$ 55031 30171 94076 197663 34728 -94091 4730 -54650 -36132 40843 175231 238170
2030B38170r2169k0445r4084o9132K98341J50468l04700q9390N6144O0252j44553
$$ 238170 146001 125556 31472 -37660 260681 411149 106449 17059 73203 133455 -11098
2019a1098O4692J70733j68252K4434O6025k17096J31489R9302k8622j850k1186
$$ -11098 53594 224327 56075 80509 146534 -70562 60927 160229 131607 129757 108571
2008A08571j5736m1105j41492O4225J84365L4549k52024m4088L41252o5118j9202
$$ 108571 92835 51730 -89762 -25537 158828 193377 -58647 -102735 238517 173399 154197
1997A54197j87380p4204J11005L2515l928j01939K18179q8889L1835L9284K08444
$$ 154197 -33183 -107387 3618 36133 32205 -69734 148445 59556 91391 130675 339119
1986C39119j51463j79624J57080P5859k0309K8267j19425j43227J45125J12824
$$ 339119 187656 8032 165112 240971 220662 248929 129504 -13723 131402 244226
1976B44226J1559m2365j30505j6836p9736K8735O1436Q9372P7087l3957k1322
$$ 244226 255785 213420 82915 66079 -13657 15078 76514 165886 242973 209016 187694
1965A87694n0178j9376m4031n6674p4539n208j4208N5709N5183P2978J9443j7206
$$ 187694 137516 118140 74109 17435 -57104 -62312 -76520 -20811 34372 107350 126793 109587
1953A09587J2908j41882J65240p41Q9833j68670l7525j7143M1031P7252k2442
$$ 109587 122495 -19387 145853 145112 234945 66275 28750 11607 52638 129890 107448
1942A07448k6532j05317J29296J6636O9752k09647o5504Q596Q8868R8573k8377
$$ 107448 80916 -24401 104895 121531 191283 -18364 -83868 -75272 13596 112169 83792
1931H3792J2086j0592N0058k568j44696j7188L1596o0853m7565M9581Q8977k6175
$$ 83792 95878 85286 135344 132776 -11920 -29108 2488 -58365 -105930 -56349 32628 6453
1919F453Q8625J29627j04857j8611j20188m0958O7176p109L6768N858j6013J52037
$$ 6453 95078 224705 119848 101237 -18951 -59909 7267 158 36926 42784 26771 178808
1907A78808j82782k3733l82J15106j424p590J0653Q9420q1634n7745k1980J14471
$$ 178808 -3974 -27707 -28089 87017 85593 78003 88656 178076 96442 38697 16717 131188
1895A31188N7001n3458n2262l1068n2779J48078j87689J0288J75755j65515o7308
$$ 131188 188189 134731 82469 51401 -1378 146700 -40989 -30701 145054 -20461 -87769
1884h7769J8068J36914J2649L1554M9153n2462j46873J94415K0019o2730M2244
$$ -87769 -69701 67213 79862 111416 160569 108107 -38766 155649 175668 112938 155182
1873A55182j29108M8930m176j38626N3767K4567O7713p4935q6573R0864O5928
$$ 155182 26074 75004 70828 -67798 -14031 10536 78249 3314 -83259 7605 73533
1862G3533l0029P5516n2228L0575p6576R0675P304n3475N3188P2347n7429l6608
$$ 73533 43504 119020 66792 97367 20791 111466 118770 65295 118483 190830 133401 96793
1850I6793j06435L1845j06546J0514J61151O1340L5678j16249M7299J8895J1952
$$ 96793 -9642 22203 -84343 -73829 87322 148662 184340 68091 115390 134285 146237
1839A46237P3397n4644j02604L6444K6025q0243J5216M7617N5544J17866r0556
$$ 146237 219634 164990 62386 98830 124855 44612 59828 107445 162989 280855 190299
1828A90299o6513J112p2006J72011q9013n1629o3142M202J8824R9241M8236k3339
$$ 190299 123786 124898 52892 224903 135890 84261 21119 25321 44145 143386 191622 168283
1816A68283j7634P8235Q5186L4237k7018J265l0361M0450J27555R9228o191J5084
$$ 168283 150649 228884 314070 348307 321289 322554 292193 332643 460198 559426 553235 568319
1804E68319P4244N3936O5712J5875M7456J720J00859k16951J09788L14289J71672
$$ 568319 642563 696499 762211 778086 825542 827262 928121 711170 820958 1135247 1306919
1793A306919Q7960J02613K30510K38948J00859K86153J54503L86668N65225N42773
$$ 1306919 1394879 1497492 1728002 1966950 2067809 2353962 2508465 2895133 3460358 4003131
1783D003131Q95105Q09025L21538J11611l00654o27637o60319o15210o08007m20505
$$ 4003131 4898236 5707261 6028799 6140410 5839756 5212119 4551800 3936590 3328583 2908078
1773B908078j85987k20841l72068k51468j39703j66545j56595k12672q855j14887
$$ 2908078 2722091 2501250 2129182 1877714 1738011 1571466 1414871 1202199 1193344 1078457
1763A078457p0969K9782j86872j6305j33719k8025j60571K1169K0229k04853j4874
$$ 1078457 1007488 1037270 850398 834093 700374 672349 511778 532947 553176 348323 333449
1752C33449J48260j4298p8584j1137p3929Q6565j50984J02927k3303j0819K333
$$ 333449 481709 467411 388827 377690 303761 390326 239342 342269 318966 308147 310480
1741C10480q7662n2390J11726O2359o8648j7072p6969n2449Q4444J5971m1916
$$ 310480 222818 170428 282154 344513 275865 258793 181824 129375 213819 229790 187874
1730A87874K432J9091r9385M564P5966O3834l9074j4888J78511j11322j31741
$$ 187874 190306 209397 110012 114576 190542 254376 215302 200414 378925 267603 135862
1719A35862j76882N2189J75034j58727k02962M1422J48100l146Q8503m504l5632
$$ 135862 -41020 11169 186203 27476 -175486 -134064 14036 10890 99393 94889 59257
1708E9257n83k3273J21897j05077N8654j11579P2951J14157J6721j01809k2381
$$ 59257 58674 35401 157298 52221 110875 -704 72247 186404 203125 101316 78935
1697G8935K077j4147j28638J25597R8357o1155J3113q6354L2239j9435l6599l4166
$$ 78935 81012 66865 -61773 63824 162181 101026 114139 27785 60024 40589 3990 -30176
1685c0176l0324J60572Q2781j00976m0045k3509Q3849j05671k4872J31282j9209
$$ -30176 -60500 100072 182853 81877 41832 18323 102172 -3499 -28371 102911 83702
1674H3702q7040k00J27634o887j01639N8734P1870m7518m775J13721n2508j73955
$$ 83702 -3338 -3538 124096 117209 15570 74304 146174 98656 93881 207602 155094 -18861
1662a8861L8921M5578j08091Q4985O9286k4714r5518N1048J11992r7736j61509
$$ -18861 20060 65638 -42453 42532 111818 87104 -8414 42634 154626 56890 -104619
1651a04619J11260p0205J81658M2071j30224J04870m2520m4546l9079P7641L337
$$ -104619 6641 -63564 118094 160165 29941 134811 92291 47745 8666 86307 89644
1640H9644K9570J3300j84350m4881N4958K1353k4003O1278q5719M1555K3255p8881
$$ 89644 119214 132514 -51836 -96717 -41759 -20406 -44409 16869 -68850 -27295 -4040 -82921
1628h2921L5801P5416m2483R1593m9930L3447j03663m0674m5009J6331J16750
$$ -82921 -47120 28296 -14187 77406 27476 60923 -42740 -83414 -128423 -112092 4658
1617D658j5494M7808j71417r08J04403l5579M690M5052J7490O2382O8344r7307
$$ 4658 -10836 36972 -134445 -135353 -30950 -66529 -61839 -16787 703 63085 131429 34122
1605C4122m6258J21816l2637r1902Q5676L1885j10437j4259J03412J28260j83736
$$ 34122 -12136 109680 77043 -14859 70817 102702 -7735 -21994 81418 209678 25942
1594B5942R3289m0295o2822K2085k1392j4016j00579K0747j2569N0408K9950l5464
$$ 25942 119231 78936 16114 38199 16807 2791 -97788 -77041 -89610 -39202 -9252 -44716
1582d4716Q3951K9128J7429j489j19580K8583O3047l3721N1969j09563l131J2807
$$ -44716 39235 68363 85792 84303 -35277 -6694 56353 22632 74601 -34962 -38093 -25286
1570b5286Q6384p4561Q9310p0891m8890k9658j4105J29203L5250K7726p7847M7300
$$ -25286 61098 -13463 75847 4956 -43934 -73592 -87697 41506 76756 104482 26635 73935
1558G3935L3213m9593Q3651o1555j8882l2829n7160Q3354l7211m1735K0851N3596
$$ 73935 107148 57555 141206 79651 60769 27940 -29220 54134 16923 -24812 -3961 49635
1546D9635j6730l65j4267k9370O4718L5178n6482k6564o6713L8783l6690J17020
$$ 49635 32905 32540 18273 -11097 53621 88799 32317 5753 -60960 -22177 -58867 58153
1534E8153L3278q5882J44765N819p1582j9851j63243J07578N241m4778o4284P2373
$$ 58153 91431 5549 150314 156133 84551 64700 -98543 9035 14276 -30502 -94786 -22413
1522b2413j06821P4101N3995p7560J22917J43890p4793L5521j75706J29748j6132
$$ -22413 -129234 -55133 -1138 -78698 44219 188109 113316 148837 -26869 102879 86747
1511H6747K9708M8748j75756Q8114k10459P7977R2611m7457M3903O9478L0486
$$ 86747 116455 165203 -10553 77561 -132898 -54921 37690 -9767 34136 103614 134100
1500A34100q1830J45410j56756j70235J49545L3969L1589j46074l806J01950K6085
$$ 134100 52270 197680 40924 -129311 20234 54203 85792 -60282 -64088 37862 63947
1489F3947O0120l370j98017J2735P1229q42j40952J07205k1669q4688J6J22172
$$ 63947 124067 120697 -77320 -64585 6644 5802 -135150 -27945 -49614 -134302 -134286 -12114
1477a2114k8169q9668n3978J20811J5457J3995j16681j6171J60836l8970P0273
$$ -12114 -40283 -129951 -183929 -63118 -47661 -33666 -150347 -166518 -5682 -44652 25621
1466B5621n0882R972p0590J88302M8695q4519k9190k13060M2143K3891L5784J75449
$$ 25621 -25261 -15289 -85879 102423 151118 66599 37409 -175651 -133508 -109617 -73833 101616
1454A01616J20536k6236l4831K9356n9030k9235p0097r395K8560r6470J60464
$$ 101616 222152 195916 161085 190441 131411 102176 32079 22684 51244 -45226 115238
1443A15238l1536p6402l0257J23745k1118p5166n2114O4457l9579K9601k0725
$$ 115238 83702 7300 -22957 100788 79670 4504 -47610 16847 -22732 6869 -13856
1432a3856P0750O2956o5393j0694K4329L4712n5117O2474J9650q8375L6993K7022
$$ -13856 56894 119850 54457 43763 68092 102804 47687 110161 129811 41436 78429 105451
1420A05451r1054L3898J19092j7431j03270p491O9650k26051k9472Q0174L7734
$$ 105451 14397 48295 167387 149956 46686 39195 108845 -117206 -146678 -66504 -28770
1409b8770j3775l8461O3226k3733j7557J15579P725m1172J39206j52193j26725
$$ -28770 -42545 -81006 -17780 -41513 -59070 56509 64234 23062 162268 10075 -116650
1398a16650P2660J09562j02572k487k9239K4355j8782J06319n7317L268N7638
$$ -116650 -43990 65572 -37000 -39487 -68726 -44371 -63153 43166 -14151 -10883 46755
1387D6755l3035n8076J68683M3860j19180p4141n4169R7535l011j27599J38460
$$ 46755 13720 -44356 124327 168187 49007 -25134 -79303 18232 15221 -112378 26082
1376B6082M4235J08459j38079l3820J1548n8295j8678l313N1280l5201p676j95767
$$ 26082 70317 178776 40697 6877 18425 -39870 -58548 -61861 -10581 -45782 -53458 -249225
1364b49225l1886K31788N4918N3845o4365j43271J31627L0783J1795k24696N3788
$$ -249225 -281111 -49323 5595 59440 -4925 -148196 -16569 14214 26009 -198687 -144899
1353a44899K34022J6665n5533m0562n4096q6730n1398J43130Q6187p3339J78271
$$ -144899 89123 105788 50255 9693 -44403 -131133 -182531 -39401 46786 -26553 151718
1342A51718l6961j87210J0296J07676r1033R7014L3011L0424j66435j36201p2151
$$ 151718 114757 -72453 -62157 45519 -45514 51500 84511 114935 -51500 -187701 -259852
1331b59852Q7808N2224k3623M0440O13J11824m7809m7364J8034j731O6023J10010
$$ -259852 -172044 -119820 -143443 -103003 -102390 9434 -38375 -85739 -67705 -69436 -3413 106597
1319A06597j06153J5196J03340l0934K2531Q3198j83747p8009Q4780N2569J61122
$$ 106597 444 15640 118980 88046 110577 193775 10028 -67981 16799 69368 230490
1308B30490k11581m6910K00601j18092N805M1402j00582p1770M8979m2061o4050
$$ 230490 18909 -28001 172600 54508 60313 101715 1133 -70637 -21658 -63719 -127769
1297a27769J39168J38539K638M299q5114j06502J9338o320K9829N4533m5106j1266
$$ -127769 11399 149938 152576 156875 71761 -34741 -15403 -21723 8106 62639 17533 6267
1285F267j49266J10041n4093j7591K8547j9300P9492p157k2352l5235K09750j46795
$$ 6267 -142999 -32958 -87051 -104642 -76095 -95395 -15903 -23060 -45412 -80647 129103 -17692
1273a7692N9782Q2554j99427J20231p7969m8001J13950o6417p8000J40393J30498
$$ -17692 42090 124644 -74783 45448 -32521 -80522 33428 -32989 -110989 29404 159902
1262A59902j30643j05195P3837j37836R5604N3432j09463p2000J11099J00006
$$ 159902 29259 -75936 -2099 -139935 -44331 9101 -100362 -172362 -61263 38743
1252C8743q6899j42339J55532l7651j40934J65481K8043k2802O4156j39254J37085
$$ 38743 -48156 -190495 -34963 -72614 -213548 -48067 -20024 -42826 21330 -117924 19161
1241A9161O9554j63668q080J5838R9896O8187m264J6179j47706j7625R4082R9822
$$ 19161 88715 -74953 -83033 -67195 32701 100888 96624 112803 -34903 -52528 41554 141376
1229A41376k6352l7829k36391J10328J52704J37977k13633p3667K7076M8443J9709
$$ 141376 115024 77195 -159196 -48868 103836 241813 28180 -45487 -18411 30032 49741
1218D9741j07792J02110n7570J9004m796N8581k21596L5732j3718r91k0092R2907
$$ 49741 -58051 44059 -13511 5493 697 59278 -162318 -126586 -140304 -141295 -161387 -68480
1206f8480o1874m5982J78775m562j23638K92827K0192j21661J35556k19765j58526
$$ -68480 -130354 -176336 2439 -2123 -125761 167066 187258 65597 201153 -18612 -177138
1195a77138J54434N7169K8016r2107J41599j17997O2068K3277m7889J14365j8162
$$ -177138 -22704 34465 62481 -29626 111973 -6024 56044 79321 31432 145797 127635
1184A27635n5226L9684q7801O8218j6288q1051M5906K8262K0126k5521R5789j45096
$$ 127635 72409 112093 24292 92510 76222 -4829 41077 69339 89465 63944 159733 14637
1172A4637k6792n9142O9652O251Q36q0083M1157l7394J40871k0177k12811J89106
$$ 14637 -12155 -71297 -1645 4606 5442 -74641 -33484 -70878 69993 49816 -162995 26111
1160B6111q1034q2404R1227n4139l4242J26134j7049J25850J8474P2913r7028
$$ 26111 -54923 -137327 -46100 -100239 -134481 -8347 -25396 100454 118928 191841 94813
1149I4813j44755o4032L1192J6130o7410l5840j0590O8280J48711K9959k7956
$$ 94813 -49942 -113974 -82782 -66652 -134062 -169902 -180492 -112212 36499 66458 38502
1138C8502m3470N1229L8023j21994M0347l5833n6822O0745J24696j51327J77764
$$ 38502 -4968 46261 84284 -37710 2637 -33196 -90018 -29273 95423 -55904 121860
1127A21860j60283J9603p6866J22026P292k7040K0253M3900l8824J2570Q1351
$$ 121860 -38423 -18820 -95686 26340 33632 6592 26845 70745 31921 44491 125842
1116A25842j05934L5725J7982l2449j27273P2911L0068k3900j08206P3152n0065
$$ 125842 19908 55633 73615 41166 -86107 -13196 16872 -7028 -115234 -42082 -92147
1105i2147K10745n7725j14149M9115M6054k7517r2204j42770M3312J40566j3332
$$ -92147 118598 60873 -53276 -4161 41893 14376 -77828 -220598 -177286 -36720 -50052
1094e0052N8302j38189M4668J65802j40460p2198K15859k542q5772k1490j5227
$$ -50052 8250 -129939 -85271 80531 -59929 -132127 83732 81190 -4582 -26072 -41299
1083d1299K05307k82849J5310p6104r0281J70810J19022j5430o6726J40469n4343
$$ -41299 164008 -118841 -103531 -179635 -269916 -99106 19916 4486 -62240 78229 23886
1072B3886j45485Q3929J3557R6500j26450K6105Q694r3364K457o9625J08413m603
$$ 23886 -121599 -37670 -24113 72387 -54063 -27958 -19264 -112628 -110171 -179796 -71383 -75986
1060g5986O8648j3808l7723J64289L0562j11491r195q5900M7780l0443L8525K9962
$$ -75986 -7338 -21146 -58869 105420 135982 24491 15296 -70604 -22824 -53267 -14742 15220
1048A5220r6929j9110l8414M0192l4038J18083Q6498P7449q4580K91p445l5941
$$ 15220 -81709 -100819 -139233 -99041 -133079 -14996 71502 148951 64371 64662 57217 21276
1036B1276l179p556j574l6469O8268j6498O543n9503P6201j5797k6103K0614J13260
$$ 21276 18097 10541 8967 -27502 40766 24268 30811 -28692 47509 31712 5609 26223 139483
1023A39483n87j77999j8346J82768j02625j32141M3552r954j6829M0203p4697
$$ 139483 138896 -39103 -57449 125319 22694 -109447 -65895 -75849 -92678 -52475 -127172
1012a27172L8699L2456M5320L8198r339j47241m2318R9327K13653j34368j05507
$$ -127172 -88473 -56017 -10697 27501 18162 -129079 -171397 -72070 141583 7215 -98292
1001i8292J20210j04973m1337J39169j37294Q1459N1282j56238J43901n0560n9752
$$ -98292 21918 -83055 -124392 14777 -122517 -41058 10224 -146014 -2113 -52673 -112425
990a12425J69901J882j34601p1840N9233P78M3197o7789J80318n7721k2086J6324
$$ -112425 57476 59358 -75243 -147083 -87850 -87072 -43875 -111664 68654 10933 -11153 5171
978E171K5228J54674o5356j09324J2551L6885j2332L9643J677L251j13959M1835
$$ 5171 30399 185073 119717 10393 22944 59829 47497 87140 88817 92068 -21891 19944
966A9944N7708j03621J6146r4826k1020J45957R7659Q5491r9785j96261J6923
$$ 19944 77652 -25969 -9823 -104649 -125669 20288 117947 203438 103653 -92608 -75685
955g5685J99613j95373r3261P7610L869R6781l137q7275K2771J4815P6211K8745
$$ -75685 123928 -71445 -164706 -87096 -83227 13554 10417 -76858 -54087 -39272 36939 65684
943F5684n0094L6401J08672p7287k45135P1436j5539k9134P7973q2841Q0264M2289
$$ 65684 15590 51991 160663 83376 -161759 -90323 -105862 -134996 -57023 -139864 -59600 -17311
$$ [...]
##END NTUPLES=NMR SPECTRUM
##END=
