##TITLE=1H_CG-1208-2x
 CDCl3
 8 sc, 
 1.8.2024
##JCAMPDX= 6.0         $$ Bruker NMR JCAMP-DX V2.0
##DATA TYPE= NMR SPECTRUM
##DATA CLASS= NTUPLES
##ORIGIN= UXNMR, Bruker Analytische Messtechnik GmbH
##OWNER= root
$$ XWIN-NMR		Version 3.5
$$ Thu Aug  1 14:22:34 2024 Russian Standard Time (UT+4h)  she@DPX200
##.OBSERVE FREQUENCY= 200.1315
##.OBSERVE NUCLEUS= ^1H
##.ACQUISITION MODE= SIMULTANEOUS
##.ACQUISITION SCHEME= undefined
##.AVERAGES= 8
##.DIGITISER RES= 18
##SPECTROMETER/DATA SYSTEM= spect
##.PULSE SEQUENCE= zg30
##.SOLVENT NAME= DMSO
##.SHIFT REFERENCE= (INTERNAL, DMSO, 0, 21.4895)
##AUDIT TRAIL= $$ (NUMBER, WHEN, WHO, WHERE, WHAT)
$$ ##TITLE= Audit trail, XWIN-NMR		Version 3.5
$$ ##JCAMPDX= 5.01
$$ ##ORIGIN= Bruker BioSpin GmbH
$$ ##OWNER= she
$$ F:/spectra/data/she/nmr/H-F/1/pdata/1/auditp.txt
$$ ##AUDIT TRAIL=  $$ (NUMBER, WHEN, WHO, WHERE, WHAT)
(   1,<2024-08-01 14:20:25.73 +0400>,<she>,<DPX200>,
      <created by zg, POWCHK disabled, PULCHK disabled
       configuration hash MD5:
       00 E9 B6 7A A2 85 ED C7 34 08 36 98 17 FE 4E 26
       data hash MD5: 16K
       6A 4F 96 26 30 67 99 CC 73 A9 E5 C7 8E 9A 1F C8>)
(   2,<2024-08-01 14:21:07.32 +0400>,<she>,<DPX200>,
      <Start of raw data processing
       efp BC_mod = 2 LB = 0.24 FT_mod = 6 PKNL = 1 PHC0 = -25635.86 PHC1 = 10.38749 SI = 16K 
       data hash MD5: 16K
       5C 02 4A 61 D4 07 62 30 6F BD 0D 22 D9 DB 1D 90>)
(   3,<2024-08-01 14:21:24.89 +0400>,<she>,<DPX200>,
      <pk PHC0 = -2.307561 PHC1 = 0.4 
       data hash MD5: 16K
       9E 63 DC 2D 89 66 12 AD DB 33 39 A6 0A 7D F3 79>)
(   4,<2024-08-01 14:21:28.70 +0400>,<she>,<DPX200>,
      <abs ABSG = 5 
       data hash MD5: 16K
       59 2D E5 92 1B 6A 4C 8F 34 A7 A4 5B A6 65 72 5A>)
$$ ##END=
$$ 
$$ hash MD5
$$ 43 27 E8 51 6B AC 75 66 92 C1 99 AD 5A EB 3B 37
##$RELAX= 
##$RELAX= 
##$RELAX= 
##$RELAX= 
##$RELAX= 
##$RELAX= 
$$ Bruker specific parameters
$$ --------------------------
##$DU= <F:/spectra>
##$EXPNO= 1
##$NAME= <H-F>
##$PROCNO= 1
##$TYPE= <nmr>
##$USER= <she>
##$AMP= (0..31)
100 100 100 100 100 100 100 100 100 100 100 100 100 100 100 100 100 100 
100 100 100 100 100 100 100 100 100 100 100 100 100 100 
##$AQSEQ= 0
##$AQ_mod= 1
##$AUNM= <au_zg>
##$AUTOPOS= <>
##$BF1= 200.13
##$BF2= 200.13
##$BF3= 200.13
##$BF4= 200.13
##$BF5= 200.13
##$BF6= 200.13
##$BF7= 200.13
##$BF8= 200.13
##$BYTORDA= 1
##$CFDGTYP= 0
##$CFRGTYP= 5
##$CHEMSTR= <none>
##$CNST= (0..31)
1 1 145 1 1 1 1 1 1 1 1 1 1 1 1 1 1 1 1 1 1 1 1 1 1 1 1 1 1 1 1 1 
##$CPDPRG= <>
##$CPDPRG1= <>
##$CPDPRG2= <>
##$CPDPRG3= <>
##$CPDPRG4= <mlev>
##$CPDPRG5= <mlev>
##$CPDPRG6= <mlev>
##$CPDPRG7= <mlev>
##$CPDPRG8= <mlev>
##$CPDPRGB= <>
##$CPDPRGT= <>
##$D= (0..31)
0 1.2 0 0 0 0 0 0 0 0.06 0 0.03 0 0 0 0 0.0002 0 0 0 0 0 0 0 0 0 0 0 0 
0 0 0 
##$DATE= 1722507625
##$DBL= (0..7)
120 120 120 120 120 120 120 120 
##$DBP= (0..7)
150 150 150 150 150 150 150 150 
##$DBP07= 0
##$DBPNAM0= <>
##$DBPNAM1= <>
##$DBPNAM2= <>
##$DBPNAM3= <>
##$DBPNAM4= <>
##$DBPNAM5= <>
$$ [...]
##$SUBNAM3= <"">
##$SUBNAM4= <"">
##$SUBNAM5= <"">
##$SUBNAM6= <"">
##$SUBNAM7= <"">
##$SUBNAM8= <"">
##$SUBNAM9= <"">
##$SW= 24.0689530833862
##$SWIBOX= (0..15)
0 0 2 0 0 0 0 0 0 0 0 0 0 0 0 0 
##$SW_h= 4816.95568400771
##$TD= 16384
##$TD0= 1
##$TE= 0
##$TE2= 300
##$TE3= 300
##$TEG= 300
##$TL= (0..7)
0 120 120 120 120 120 120 120 
##$TP= (0..7)
150 150 150 150 150 150 150 150 
##$TP07= 0
##$TPNAME0= <>
##$TPNAME1= <>
##$TPNAME2= <>
##$TPNAME3= <>
##$TPNAME4= <>
##$TPNAME5= <>
##$TPNAME6= <>
##$TPNAME7= <>
##$TPOAL= (0..7)
0.5 0.5 0.5 0.5 0.5 0.5 0.5 0.5 
##$TPOFFS= (0..7)
0 0 0 0 0 0 0 0 
##$TUNHIN= 0
##$TUNHOUT= 0
##$TUNXOUT= 0
##$USERA1= <user>
##$USERA2= <user>
##$USERA3= <user>
##$USERA4= <user>
##$USERA5= <user>
##$V9= 5
##$VALIST= <valist>
##$VCLIST= <CCCCCCCCCCCCCCC>
##$VD= 0
##$VDLIST= <DDDDDDDDDDDDDDD>
##$VPLIST= <PPPPPPPPPPPPPPP>
##$VTLIST= <TTTTTTTTTTTTTTT>
##$WBST= 1024
##$WBSW= 4
##$XGAIN= (0..3)
0 0 0 0 
##$XL= 0
##$YL= 0
##$YMAX_a= 168714
##$YMIN_a= -171431
##$ZGOPTNS= <>
##$ZL1= 120
##$ZL2= 120
##$ZL3= 120
##$ZL4= 120
##$ABSF1= 21.98605
##$ABSF2= -2.083143
##$ABSG= 5
##$ABSL= 3
##$ALPHA= 0
##$AQORDER= 0
##$ASSFAC= 0
##$ASSFACI= 0
##$ASSFACX= 0
##$ASSWID= 0
##$AUNMP= <proc_1d>
##$AZFE= 0.1
##$AZFW= 0.1
##$BCFW= 0
##$BC_mod= 2
##$BYTORDP= 0
##$COROFFS= 0
##$CY= -3
##$DATMOD= 1
##$DC= 0
##$DFILT= <>
##$DTYPP= 0
##$F1P= 0
##$F2P= 0
##$FCOR= 1
##$FTSIZE= 16384
##$FT_mod= 6
##$GAMMA= 0
##$GB= 0
##$INTBC= 1
##$INTSCL= 3.70164e-10
##$ISEN= 128
##$LB= 0.24
##$LEV0= 0
##$LPBIN= 0
##$MAXI= 10000
##$MC2= 0
##$MEAN= 0
##$ME_mod= 0
##$MI= 1.114404
##$NCOEF= 0
##$NC_proc= -6
##$NLEV= 6
##$NOISF1= 3.799351
##$NOISF2= 2.8
##$NSP= 0
##$NTH_PI= 0
##$NZP= 0
##$OFFSET= 21.4895
##$PC= 1
##$PHC0= -25638.17
##$PHC1= 10.78749
##$PH_mod= 1
##$PKNL= yes
##$PPARMOD= 0
##$PSCAL= 0
##$PSIGN= 0
##$REVERSE= no
##$SF= 200.129607792106
##$SI= 16384
##$SIGF1= 3
##$SIGF2= 2
##$SINO= 5.538805
##$SIOLD= 16384
##$SREGLST= <1H.CDCl3>
##$SSB= 0
##$STSI= 16384
##$STSR= 0
##$SW_p= 4816.95568400771
##$SYMM= 0
##$S_DEV= 0
##$TDeff= 16384
##$TDoff= 0
##$TI= <>
##$TILT= no
##$TM1= 0
##$TM2= 0
##$TOPLEV= 0
##$USERP1= <user>
##$USERP2= <user>
##$USERP3= <user>
##$USERP4= <user>
##$USERP5= <user>
##$WDW= 1
##$XDIM= 16384
##$YMAX_p= 335418442
##$YMIN_p= -912299
$$ End of Bruker specific parameters
$$ ---------------------------------
##NTUPLES= NMR SPECTRUM
##VAR_NAME=  FREQUENCY,     SPECTRUM/REAL,   SPECTRUM/IMAG
##SYMBOL=    X,             R,               I
##VAR_TYPE=  INDEPENDENT,   DEPENDENT,       DEPENDENT
##VAR_FORM=  AFFN,          ASDF,            ASDF
##VAR_DIM=   16384,         16384,           16384
##UNITS=     HZ,            ARBITRARY UNITS, ARBITRARY UNITS
##FACTOR=    0.29402158847633, 1,            1
##FIRST=     4300.68521580967, 0,            0
##LAST=      -516.270468198042, 0,           0
##MIN=       -516.270468198042, -912299,     0
##MAX=       4300.68521580967, 335418442,    0
$$ Real data points
##PAGE= N=1
##DATA TABLE= (X++(R..R)), XYDATA
$$ [...]
9822 -110121 -37984 -112101 -73823 -27483 -65821 -50800 -111409 -152867 68472 -23777 -187187
9811 -187187 -64990 -31423 -72809 -147122 -114014 12923 19231 42543 -45027 -117220 -41298
9800 -41298 2507 52999 54303 52150 -32455 -26786 -34461 131618 -59534 -97583 -34400 26685
9788 26685 41279 -20983 -39196 -33035 -37785 -4726 61385 -51258 9159 37980 -48010 -101292
9776 -101292 11346 158889 -1317 -40397 -24916 234 90881 -75979 -95963 -25457 64089
9765 64089 15021 -84966 -135002 -98943 -115191 -180320 -263130 -65664 71549 -136884 -37330
9754 -37330 48723 46690 12277 90077 57184 173905 110222 -2440 -27689 -18991 -5667 64423
9742 64423 14894 -84716 -29600 -79916 15446 34550 -13864 -48572 102344 535 -69358
9731 -69358 36643 -75617 -96176 -86370 -136206 37414 -104597 -171717 -11057 4155 -166604
9720 -166604 -159792 -142450 -129701 -21622 -83827 112382 107065 8332 38275 -4182 93993 44197
9708 44197 -55410 35282 -96540 -202956 -44352 70274 -3712 -117544 -177243 10703 -75967
9697 -75967 9868 -22300 -76184 -162944 -96024 30018 -55698 -26137 -31092 -67244 -90831 -95214
9685 -95214 52023 13507 -64606 -90931 -40998 48861 915 2927 -126542 -34877 42555 898
9673 898 31122 -32579 86139 32666 -3560 -42561 -117557 -111396 61642 74402 56508 9491
9661 9491 -80758 -165799 -304560 -89214 -206225 -128612 -10911 134109 169195 1411 11531
9650 11531 -131861 -204469 -6328 22972 -29021 -28188 -125769 -78098 -24119 16999 24384 59658
9638 59658 -79473 -122059 -62106 -51317 -63549 -173330 -92570 11055 7065 -55041 -42146
9627 -42146 -21181 39597 65046 13538 -83295 112013 256622 37406 -33834 44125 -75961
9616 -75961 7109 26869 168082 102855 557 -23919 -48855 -76260 110523 92973 -15646
9605 -15646 -143984 -8425 -124391 -138586 18354 -66076 -143410 -84752 -166691 -40776 -168723
9594 -168723 -143708 -63559 -68989 -63677 -47163 -65322 -133256 2647 -27240 -47235 -62774 -51075
9582 -51075 -134693 -208224 -184966 -107239 -95172 -26237 -4950 -64896 6666 78065 59790 -53006
9570 -53006 -66179 -74629 -131772 -85667 -272038 -159909 -198838 -181306 -65454 -131211 -47829
9559 -47829 -117338 27497 61407 -3091 -50676 41179 84570 3982 52765 -38206 42649 55586
9547 55586 -9591 -81702 -126612 -56582 -77268 -182990 -129268 -18961 43259 -85409 4592
9536 4592 -67221 -75128 -101285 -58232 -220006 -82329 -108544 39694 28755 -77133 -295452
9525 -295452 -174534 -96100 -143692 28383 57865 -11308 22530 46691 -47252 -5560 -135008
9514 -135008 -112237 -80832 21677 -59412 14826 -120956 -139482 -101232 -146080 -194849 -201418
9503 -201418 -145297 -26853 22345 -84122 -64008 -47082 -102849 70982 186340 232776 181490
9492 181490 93293 141255 19881 25798 -223166 -303494 -173935 39962 98617 -21803 -40488
9481 -40488 67916 224751 -5603 -7896 -13991 -87937 -24055 -87651 -97525 11291 -39652 22645
9469 22645 155901 12961 155243 82922 22909 -60433 30817 90104 -10548 -88900 57849
9458 57849 63561 104921 126669 72266 64002 -136687 -181018 -115633 -15572 39050 44527 100120
9446 100120 96371 42437 -1824 -18930 -75253 -115203 -134060 -90663 -84439 -58850 56216 9164
9434 9164 -113034 -71730 91906 77927 88597 -156043 -216965 -96887 45376 -34513 -84404
9423 -84404 -152087 -243349 -128453 -44019 -137120 31014 15999 88749 -13675 -46828 -37327
9412 -37327 -57534 -79562 -37630 -73360 -109266 97836 55348 88136 -34919 -117024 -98362
9401 -98362 -56278 -29950 -62525 17349 27276 -25433 6863 -70193 -33365 1597 139856 52819
9389 52819 -93918 25080 -21610 -125098 -99347 -142206 -73513 -87996 -33505 -67394 -165580
9378 -165580 -34335 14106 144985 21780 68228 15318 -34763 -14906 65486 150064 -51001
9367 -51001 -27725 -13593 -82212 -103209 34019 79188 -56045 -79261 -44699 49757 51766 7964
9355 7964 -54221 108216 57758 -28373 -23353 29471 -19761 34457 -13550 31186 -15582 -87236
9343 -87236 -52629 12439 -26716 -86311 73379 94702 48672 -53661 -86910 -42486 -56113
9332 -56113 -11809 -65985 -14627 -25925 -49546 2221 -11460 -110244 -143977 58286 114542 62733
9320 62733 -176930 -40816 140378 139805 -16289 35436 45570 158559 59326 5630 84769
9309 84769 115824 58434 -37649 133294 -68431 16344 75178 -15071 -73383 -4151 -86197
9298 -86197 -179275 -131148 -11771 54780 -63932 -140554 -6489 97193 -53220 180670 82831
9287 82831 50252 164699 128495 -80507 -133372 -64994 -138035 -70344 -201524 -136292 -188700
9276 -188700 -70401 926 -177800 -334073 -160958 -122466 -44667 -35297 -229146 -182474 -112964
9265 -112964 -17096 -26091 -1444 -44787 -44165 -19559 -84885 -213027 -156636 -65069 -41096 -175856
9253 -175856 -204046 -117528 -11393 -166350 -164215 38890 103554 -44173 -24585 87260 60890
9242 60890 -114490 6648 -44538 -49992 -41521 -63385 -113978 -189647 64347 -3030 -60728 65740
9230 65740 -6794 40177 3742 68561 67474 -87276 -74327 68950 142546 100584 54726 64102
9218 64102 46096 -106297 -42649 -71081 -79079 13180 25446 -123225 -48207 49461 -62548
9207 -62548 53322 118263 150144 33738 -60867 -165287 -65219 29489 82270 62352 30510
9196 30510 -62004 -71040 94002 -27159 -116578 -90887 -182307 21183 -8939 -116166 -23884
9185 -23884 -35301 -118037 -86052 -209106 -31378 -36686 36691 80309 64589 46651 -136285
9174 -136285 -44396 669 61271 -38779 132489 -81790 -94507 21708 -245453 -175209 4563
9163 4563 -145933 -13354 -17345 -84073 -65755 -26536 189284 68967 10641 81203 145318
9152 145318 132343 83848 118851 -57569 41159 -11862 -167328 15196 152030 31371 -22
9141 -22 -109636 48610 91715 78567 -8071 -5277 -76807 -6831 32490 101819 -25725 -94436
9129 -94436 -28708 -96075 3312 139776 179747 133730 209906 156299 126409 226832 129930
9118 129930 159520 103186 68663 167883 187682 104268 62665 113227 129735 358392 326306
9107 326306 213552 207115 148568 213573 199563 159273 133708 110299 185745 139090 66164 65360
9095 65360 139309 7678 7135 124813 35067 27223 131954 317575 228994 275428 231535 245942
9083 245942 214960 232273 218368 144126 289048 314168 374619 283762 163474 148412 260573
9072 260573 425493 323718 259260 236273 257220 165411 207264 252797 161751 242749 216256
9061 216256 241201 76312 258609 313180 278216 263670 71657 102648 174492 216932 177499
9050 177499 78986 135666 206276 133629 141533 140379 154024 125471 123393 71788 16934 -6616
9038 -6616 87959 103812 204355 172836 93208 -65450 78574 -3567 11924 183371 64579
9027 64579 100779 42868 83680 38242 93211 76601 99275 31327 73453 13792 -174 -47143
9015 -47143 -36530 53256 -9536 -79807 96266 143245 87565 201743 258401 167043 22483
9004 22483 57196 151096 32360 149174 84922 23730 142870 58275 24827 27741 11232
8993 11232 71458 15703 54847 -96322 76710 12635 -137664 -134532 -5219 -46702 -50687
8982 -50687 81996 78535 -62042 34263 48571 65842 51370 8497 -106136 -149956 -62221
8971 -62221 -127665 -175359 47487 126274 67360 5261 -28551 -82037 -13957 55212 14828 15213
8959 15213 92509 -8473 -130400 -153058 -63455 -4641 -66641 58866 -149870 -208385 -186247
8948 -186247 -78012 -57981 -83504 -17768 -6890 175087 -20693 -201172 -188351 -77862 -94448
8937 -94448 -115330 -37952 -133904 -86268 -82707 -26521 -47353 -20469 3503 152842 126472 93944
8925 93944 141185 114305 72002 13201 -30683 -29156 -139460 -83737 -128185 -28762 -60878 -85774
8913 -85774 38504 4157 -59359 -27064 -29467 82667 56285 159641 113709 42658 -57238
8902 -57238 -102947 -67373 30127 -42825 -43981 20686 -38703 -64805 -18512 -1505 -9425 -114077
8890 -114077 -138662 -185277 -89218 -54431 -46775 -105997 10164 70413 -22160 -117535 48777
8879 48777 -79 -26227 19016 36634 174686 88206 -66936 49240 115164 -15630 49652
8868 49652 63367 -10309 -71798 75706 6751 -76449 -124729 85738 61834 34158 -77557
8857 -77557 -34636 75072 -27343 50310 116830 -117388 -182097 -2058 -151134 -121137 -33567
8846 -33567 44281 15236 27292 -70313 -69019 67444 -40045 -38995 21175 59376 -23681 -129854
8834 -129854 57419 -53528 -8695 -103101 -242174 -65964 71316 106438 14816 155053
8824 155053 84861 -177303 -49988 79450 -24542 -4249 74073 7781 -125817 11989
8814 11989 59681 70666 1329 62104 192498 138255 -118122 -118960 -85703 -32368 -112414 18002
8802 18002 -103520 -72328 92189 4714 -2435 -53559 -51540 92121 -63292 -194218 -277035
8791 -277035 -279849 -167571 -134978 -23099 -39897 -118106 -158638 -118732 29623 -28754 -12266
8780 -12266 90732 55920 -105942 -47953 -13470 -101419 -99619 -36254 35757 72781 -22618 -115938
8768 -115938 -25358 -27302 117452 140678 102446 85385 157448 86382 45082 66115 -44779
8757 -44779 -150501 -108551 -33622 165976 65642 55459 -34894 -26669 20594 -220951 -195255
8746 -195255 -266977 -175732 -156902 -147952 -44718 20405 10432 -37264 -150955 1262 -48812
8735 -48812 -64075 17936 -24511 -143503 48013 46071 -100724 692 26167 -50437 15755
8724 15755 -34948 -95318 -36163 -46899 -72376 -108055 -136003 -121253 -216863 -102162 15830
8713 15830 82155 81380 -25733 -174747 -38812 67418 -111883 -8973 -71638 -119619 -64814
8702 -64814 27511 13580 -9386 -18294 12142 -11810 -51241 -75356 40355 100883 78709 -40102
8690 -40102 -162526 -177713 -47222 -122819 -197545 -238414 -160420 -106330 -123740 -232809 -151796
8679 -151796 -34728 139077 42845 165478 81170 -64646 33725 -95993 -118130 -159168 -69079
8668 -69079 -32943 51042 -33111 2928 81433 78258 101164 41828 -81566 -65162 -25659 -18620
8656 -18620 -61347 50973 -41661 -157951 -141332 -100126 -21050 -152587 -166817 -85542 -111573
8645 -111573 -74479 -1681 -65078 22413 -20692 -116569 51644 6576 45540 -104310 -175491
8634 -175491 -63036 -156033 -155051 -96329 164812 71009 4563 -120751 -50407 -116412 -65374
8623 -65374 -136201 -56400 115182 70243 80519 -33213 -38428 38270 -82456 -152418 -155771 -182054
8611 -182054 -92009 -73759 -55918 -140904 -58144 4686 -91872 -40616 -48671 -136253 72137 24755
8599 24755 -19409 156827 -37495 -85311 24520 24426 238342 83287 42829 112322 -25382
8588 -25382 -193722 -116664 -17820 -178379 -139297 -180085 -56253 -126643 4395 -193603 -79698
8577 -79698 -74142 -127763 -39632 -24749 -68558 -60046 -70084 -70467 -20781 2559 138136 -35347
8565 -35347 -152052 -135298 -115796 -228737 -212711 -152328 62701 106166 74423 45552 53247
8554 53247 -115543 -803 27320 -117979 -100212 21729 -42970 -70694 51549 54264 19853
8543 19853 -14178 -58952 61158 -26058 -103281 53751 23271 -36659 -75358 -201299 -136132
8532 -136132 -120037 -60248 -59945 -120367 -83770 35797 45736 -28441 -147666 27981 -70743 56407
8520 56407 -8525 -58596 -58281 -33110 -55488 -69209 -59068 -205145 -128172 -44431 -24539 26714
8508 26714 61248 103576 15797 25333 50741 92344 3702 -7338 128464 125994 46557 -38910
8496 -38910 50039 57968 -5234 73391 29477 46298 -13182 -141421 -85189 -242675 -22458
8485 -22458 36686 -149082 -182214 -102466 -144663 -56181 -46356 -28930 -70235 -33206 -68163 17720
8473 17720 -30996 -79295 -75005 7336 22663 4502 -76896 -77805 -171706 -126236 -134171 -174981 -36650
8460 -36650 -71282 -155254 -7326 93478 45372 -57167 28320 1904 -24290 19403 -2213
8449 -2213 -303 23867 -67344 -163339 -8114 -23672 -14930 -77699 37414 66578 1976 -11252
8437 -11252 17521 5337 85649 39036 20207 32970 -62287 -158707 -49880 110604 -94425
8426 -94425 72592 1613 -55545 71443 21644 -17032 -127871 -94696 -64285 32963 -97942
8415 -97942 43215 -14663 -20097 -52584 -129587 -1084 130032 -1845 -106344 34430 43501
8404 43501 74844 104646 28730 35336 39533 46689 19306 -60722 -36343 -6762 110850 175864
8392 175864 81727 91650 49863 -24449 -69740 -87479 63170 112013 86401 -28276 -22932 -160889
8380 -160889 -119544 -36614 62364 -126712 -77884 -118244 21210 80137 -75881 -86398 -57974
8369 -57974 -31124 -125025 6490 -108213 -94817 -133923 -147995 -63538 -97352 -164280 -53134
8358 -53134 12752 -120044 -35644 -6792 -44952 -11584 -21055 7846 44245 159469 87391 1871
8346 1871 74086 -76013 -78946 4694 -84437 -76340 -173828 -69656 -42047 -30260 41492 -33961
8334 -33961 19650 -226975 -32910 67305 -64496 95151 -27744 -82258 -134351 -139664 -123278
8323 -123278 -164434 -60082 -148063 -78973 -803 -23249 10451 -104912 -62976 -97812 -71526
8312 -71526 4121 102368 -26454 -32133 61341 -60060 -133472 -42813 43341 59886 -19300 -174059
8300 -174059 -203624 -125009 58015 -1372 -20565 -129745 57988 6498 -166414 -101520 -46439
8289 -46439 -109094 -165484 -78778 154219 80588 -40913 -37262 -110108 -32447 1513 -66792 8677
8277 8677 -37293 -75126 71535 102639 54795 62851 42735 77914 143037 118711 88516 13256
8265 13256 146748 -8966 1425 -38396 -98870 -155391 -50084 -21845 -35484 -18732 -77891
8254 -77891 -122996 16581 -34347 -95500 -123107 -29589 -166713 -207186 -217340 -195778 -8027
8243 -8027 -142455 -147053 3423 75713 -12725 -137637 -38396 -84577 -55192 -47123 -25547 -131787
8231 -131787 -137387 3169 98610 123423 45624 -83659 -52340 -101459 -23054 71317 102256
8220 102256 48589 -110404 -190185 -110008 -18827 -147815 -106817 -177597 -159376 -91936 149873
8209 149873 -69086 -54953 -44819 212412 88423 -35197 -84143 -11639 -107316 -60844 -148133
8198 -148133 -195887 -230977 -24391 -268989 -161668 -732078 -912299 471768 149412 111951
8188 111951 156852 102875 90386 -8526 16898 21016 -10980 -67376 -82382 -64624 85762 88255
8176 88255 35375 140857 61383 53133 -66678 84119 51936 -93860 -47571 22720 -94011
8165 -94011 140213 63890 16900 15520 53057 51678 -64841 -18322 48640 27940 -163291 20593
8153 20593 77872 110767 89983 17821 -57723 -99562 -97712 -40199 20475 67701 -79140 -149995
8141 -149995 -40390 23553 17521 -13850 -176291 -44007 -30745 -18116 7154 69215 153181
8130 153181 26818 35318 57192 73067 29326 -33468 -37495 -13117 1813 -10585 30554 43292
8118 43292 -72568 8498 60090 73474 2742 25891 -32369 8135 11078 4938 -37236 -25379
8106 -25379 -98500 -55896 4049 1087 20521 -20331 2988 -142661 -184860 -45232 88632
8095 88632 -53572 -31756 -42421 -72173 -68292 27307 -17753 -23865 32269 107726 43103 -31140
8083 -31140 -5378 -78465 -6918 39240 3100 54382 -30543 113375 57179 110394 83129 99995
8071 99995 -10690 22867 115636 150244 49907 40201 -41593 21860 185462 117891 105608
8060 105608 43470 9242 81242 109970 70685 202616 121161 41774 -63747 23947 107505
8049 107505 -4190 6557 22056 24489 167998 167926 96832 70248 244493 181941 42305 73950
8037 73950 168264 115194 57962 31799 75164 77851 47929 86226 -15965 -15299 5904 -124705
8025 -124705 70400 95145 65364 29077 10030 23076 140758 64708 9197 54870 33725
8014 33725 29501 173908 12119 -59510 155478 208033 227196 122807 -89177 2585 -38999
8003 -38999 58099 91057 -2673 84810 -19703 134274 235236 121245 54393 36623 -5811
7992 -5811 -18935 -100051 10312 46993 -21619 29742 103894 94751 85331 125017 56429 -120562
7980 -120562 -22578 56486 67666 59499 -13485 -9066 122737 108418 153464 43679 35045 175988
7968 175988 272381 153057 150212 135706 61207 167659 28276 168604 51567 35855 38324
7957 38324 187316 120549 109370 78702 -18443 -13040 92375 32672 127175 112407 96718 159488
7945 159488 32882 105264 85839 236831 60847 22742 15532 156017 114733 218393 132181
7934 132181 350321 202833 168229 205507 -4918 12365 17039 137212 -66966 -42698 -1337
7923 -1337 197853 121750 60448 55812 -5327 -16301 127065 358905 200549 76788 19337
7912 19337 -92910 -73001 42521 43170 190132 159558 109064 138263 71641 201353 239266
7901 239266 343191 304694 295341 235505 7457 -11219 -97851 -24299 145907 16388 93164
7890 93164 175887 210421 213799 128246 186994 242560 145192 146642 325738 192817 129893 208642
7878 208642 224605 242943 247154 195379 156941 363452 305749 175722 216914 296469 311839
7867 311839 483573 498844 360287 327023 301286 328723 260625 292839 350509 414290 311359
7856 311359 347512 401426 314667 383797 320587 310567 322521 149125 243440 378814 377962 447836
7844 447836 557628 398764 447390 491901 473490 510367 555615 441960 350377 484855 480247
7833 480247 320233 378662 476723 472422 480170 535130 478745 450542 328132 366388 530207
7822 530207 596371 575817 581768 633599 720192 788712 681339 660019 560850 562310 536889 689811
7810 689811 682741 717883 712817 658174 527976 654089 801752 789395 813520 897519 958682
7799 958682 998603 914892 905993 897892 771444 929216 1012681 1166984 1191911 1096315 1199487
7788 1199487 1146889 1027869 1119163 1218787 1181067 1224372 1289609 1310194 1319051 1314899 1400629 1477690
7776 1477690 1548748 1403219 1509538 1671621 1704657 1642263 1709863 1824557 1745458 1720183 1815579
7765 1815579 1731524 1593677 1830307 1999074 1959298 1909256 1898323 2014718 2229304 2142740
7755 2142740 2079322 2165687 2251916 2350790 2291248 2287496 2478512 2465486 2459987 2473462 2373746 2422207
7743 2422207 2494235 2494344 2588438 2709555 2625017 2621717 2731297 2774836 2924790 2854804 2960651
7732 2960651 2971610 3015812 3003463 3104643 3064616 3233653 3461459 3428818 3462717 3585415 3454303
7721 3454303 3476016 3507696 3575061 3787435 3684440 3805252 3891313 3916133 3951076 4019965 4071072
7710 4071072 4103432 4102823 4304903 4308565 4410644 4346455 4270330 4264170 4473236 4542170 4495657 4459464
7698 4459464 4500226 4369616 4377382 4359738 4344382 4400753 4501281 4560456 4417169 4371941 4323840
7687 4323840 4266548 4214508 4284681 4398168 4287334 4256794 4165648 4058128 4060023 4039320 3943267
7676 3943267 3905004 3841930 3783992 3775222 3704293 3649400 3550246 3484344 3377271 3161898 2999451
7665 2999451 2978210 2974170 2936088 2877828 2960365 2761531 2652688 2534728 2414211 2294400 2154193
7654 2154193 2050524 2069325 1936594 1835342 1862935 1694845 1739654 1598383 1427350 1376479
7644 1376479 1350585 1422652 1386697 1191102 1204985 1254626 1022985 1121417 1061847 978990 942499
7633 942499 1012980 1019907 856543 880876 842907 801746 811098 765987 774443 768685 698930 687321
7621 687321 646577 583383 572846 585981 669511 601696 662982 474972 487299 582318 401987
7610 401987 396313 363624 447282 468632 393494 423218 481657 283883 285624 321782 466315 441736
7598 441736 323958 368956 431046 406860 359192 306975 307750 296902 209310 342450 164820
7587 164820 207370 201028 166813 172170 275809 166236 194581 309037 137870 267935 209653
7576 209653 162663 174412 248141 291649 252308 230155 239800 279554 270769 268719 257473 101998
7564 101998 37255 96097 176636 242020 265080 208163 143994 136384 100774 137349 238469 201949
7552 201949 141811 190601 119121 106189 102280 29708 124197 138079 113929 182136 300569 425845
7540 425845 303430 159479 205332 186988 75432 -17228 246146 196987 145952 166395 194821
7529 194821 237334 137621 49188 171571 161198 99764 113495 95909 95753 159060 280159 213184
7517 213184 103591 55707 -40808 17863 136715 -10683 46728 78122 29746 26210 200442
7506 200442 89028 138543 202719 166793 17637 38041 36734 63226 109988 132927 162894
7495 162894 79286 118358 63950 5833 -11346 48496 207057 84348 -64507 154490 111006
7484 111006 270907 114672 156461 60539 156715 289044 246856 201497 192460 310998 91496
7473 91496 38244 22640 117285 251721 196458 117212 23177 116603 58619 123792 215264 137660
7461 137660 159483 214282 130172 193050 227399 182497 234544 198871 215709 145573 244381 271278
7449 271278 389251 347889 352741 335695 418522 363844 424383 577887 657016 745860 769830
7438 769830 665282 767642 885631 924617 1200946 1435049 1617494 1896277 2224150 2188654
7428 2188654 1827172 1851491 1592830 1345870 1172449 946372 833857 653090 562461 436930
7418 436930 370799 352472 285586 216718 246787 268902 260379 236993 103725 70975 141892 229337
7406 229337 270162 236298 243576 208281 129828 132876 239278 84457 14327 -20590 106090
7395 106090 126394 135618 89586 142742 23798 36428 -18170 -182075 -147303 -23136 67234
7384 67234 38053 20525 44245 106913 78775 61756 173699 154788 113693 39739 -47903 117165
7372 117165 179500 118143 77744 32666 110098 148406 122399 -31433 -35140 -44060 24296 168719
7360 168719 116553 67063 -12331 -29340 -27675 26175 -100849 -5052 24892 1013 94185 187213
7348 187213 273691 99798 86245 171146 58661 41375 16511 96612 -31765 -43055 41432
7337 41432 175668 266853 201267 277812 186660 241374 156640 200961 75870 57636 95970
7326 95970 57947 158373 190148 145528 140260 218010 264409 371411 229675 353785 246459
7315 246459 224591 223604 293500 383108 311570 123058 112317 44677 11642 247776 241345 128371
7303 128371 284930 254917 368937 368394 371675 390020 327631 302308 350088 335766 398309 413258
7291 413258 412984 529907 567138 501480 376376 323814 303706 462156 416748 360239 235956
7280 235956 268319 289085 353009 152565 230994 380581 266830 332925 394209 299685 318470
7269 318470 272032 249804 284589 176884 165750 145023 131706 258473 279403 149658 370984
7258 370984 395962 185888 75178 122427 207856 235623 208899 212997 228587 294441 347288
7247 347288 334180 310371 355496 150670 127498 260124 178910 188103 258240 243438 151560
7236 151560 128901 -40668 119983 202951 193158 131879 161500 298479 220818 93028 123444
7225 123444 108193 5752 -65425 154444 68860 -73235 103989 140862 37657 62049 -22762
7214 -22762 706 -3599 109305 167685 199860 155321 85110 197589 101040 5564 76464 144377
7202 144377 111632 172287 217059 17463 -438 -34271 -64579 -28778 100091 7882 -50
7191 -50 -92679 -90476 47437 116849 -56067 -95572 45294 -20045 -65221 -7095 1484 64743
7179 64743 4403 -78603 -38983 31918 86914 40208 97373 126392 -2791 102047 71855
7168 71855 -128981 -120625 10259 91068 -73491 -33225 40289 137574 24196 46305 144787
7157 144787 84294 37575 1302 -69573 67097 -78173 -76333 49726 -6182 -26247 145822
7146 145822 70928 -26221 -24872 4066 21840 56417 82467 51720 138832 -7674 32061 -12092
7134 -12092 -27443 92454 -20220 -29685 36189 179798 103708 87952 -108257 4762 52964
7123 52964 36109 43009 94126 118704 228622 103527 11730 87777 79201 81069 125440 -22389
7111 -22389 -149747 8961 67599 55988 82355 -63214 564 82488 27632 45076 142680
7100 142680 138977 79783 -25749 19560 -99798 -27291 23885 26534 -23300 32138 66402 104652
7088 104652 101085 15051 -32603 56049 106819 182832 155446 -11803 147193 88808 23225
7077 23225 97914 182413 168690 127027 260916 146302 167771 156581 94120 102916 -5373
7066 -5373 71617 28446 11609 179860 268466 154687 159944 42706 216266 87713 169612
7055 169612 80949 115669 97226 202374 210126 167976 122910 99789 277980 84627 -34910
7044 -34910 100329 264706 194318 109897 130115 193649 194402 104621 96590 -2928 45039 57302
7032 57302 189644 244182 202560 207010 129246 59637 96106 116186 104890 198870 161655 57446
7020 57446 77303 47034 100563 169832 187226 124108 123241 207689 160992 84933 207710 168722
7008 168722 203734 235581 352133 243015 254633 155628 168793 222292 358042 234609 324589
6997 324589 358624 258779 329908 380916 409843 377579 292101 332929 317770 245160 182731 136816
6985 136816 265248 287721 290804 231050 157555 139017 134020 154512 281883 271093 416452
6974 416452 442869 571329 501816 502474 593185 652348 557867 429007 438176 505913 270951 254527
6962 254527 365251 380838 329838 321166 320507 294192 379142 253869 227668 375730 323283 254372
6950 254372 415566 387261 385719 279060 299610 310144 352160 220786 337399 437277 290873
6939 290873 380089 455994 478688 236900 203601 39775 225959 133319 71114 212284 211424
6928 211424 416686 485527 348785 477356 393034 399763 405508 430047 331153 304201 314919
6917 314919 275630 222977 362411 493823 427136 385115 315023 327532 379740 343160 167057
6906 167057 432530 494355 265255 306635 302728 308937 231694 338103 449091 529343 493268
6895 493268 369443 343488 404022 437798 387946 361507 334965 338208 392036 356315 503615
6884 503615 400220 312435 462632 573683 538641 451662 541267 596313 467979 455504 568339
6873 568339 595564 540096 520274 632943 656204 697276 626206 608528 821715 674148 773197
6862 773197 827106 763176 817554 1011324 919860 830074 789564 962101 865473 745475 993110
6851 993110 891439 890214 1038894 1127782 1030652 1158724 1151032 1069793 1046068 1194887 1231389
6840 1231389 1175361 1196090 1210509 1362682 1513267 1599615 1513898 1425924 1649577 1756227 1936456
6829 1936456 1938104 2042893 2014799 2151020 2388189 2484598 2432868 2486416 2698660 2893062 3038779
6818 3038779 3279669 3553283 3766293 3952831 4386120 4351787 4330466 4350994 4227107 4245851
6808 4245851 4038085 3763060 3624596 3510342 3583854 3513598 3553475 3545225 3624990 3682980 3680806
6797 3680806 3866978 3989942 4262707 4608597 4791616 5199415 5563868 5892633 6402471 6778925
6787 6778925 6884781 7189884 7362433 7381173 7362965 7372669 7270176 7186467 6873376 6481868
6777 6481868 6117293 5788329 5403955 5110242 4811968 4572937 4397918 4155884 4116493 3803207
6767 3803207 3857954 3879438 3913289 4137366 4153629 4248116 4325420 4418823 4705346 4902233 4944946
6756 4944946 5061350 5067694 5175211 5033951 4767489 4693024 4200020 4185625 3871133 3497016
6746 3497016 3208029 2897162 2648411 2586076 2501032 2416434 2277764 2234711 2113779 2037761
6736 2037761 1867885 2050454 1968145 1826849 1783160 1760331 1768786 1753963 1837069 1716633 1666974
6725 1666974 1537929 1612946 1754468 1734395 1666299 1482807 1468285 1492849 1333602 1361368 1406964
6714 1406964 1381733 1281111 1346451 1428803 1352541 1276069 1280523 1147731 1158851 1124692 1266193
6703 1266193 1299215 1315847 1213843 1075380 1266972 1242833 1248057 1220191 1095552 1188326 1214757
6692 1214757 1180966 1239813 1220293 1267196 1376202 1331050 1285635 1161646 1077512 1270439 1293359
6681 1293359 1111094 1159526 1348760 1298637 1128806 1165691 1066670 1016359 1118589 1242123
6671 1242123 1278764 1142431 1305066 1228887 1273868 1116503 1216069 1267321 1405686 1290848
6661 1290848 1248346 1342814 1440854 1587217 1555197 1540831 1419454 1500397 1415308 1341120 1310106
6650 1310106 1413830 1490151 1584398 1566263 1602438 1664156 1569485 1409862 1535231 1556150 1556353
6639 1556353 1411601 1340742 1314221 1328286 1346711 1267377 1229753 1161035 1367850 1381440 1434415
6628 1434415 1464493 1350710 1387882 1570588 1425661 1357873 1528018 1540424 1467074 1634147
6618 1634147 1828615 1656308 1705395 1660742 1537699 1550928 1573575 1316934 1235487 1321785 1239973
6607 1239973 1232401 1252057 1247722 1313758 1167332 1022306 1195284 1236741 1219113 1376077 1289314
6596 1289314 1265905 1375290 1429223 1337702 1364898 1510293 1521708 1553071 1554261 1684780 1735627
6585 1735627 1796230 2038966 2157628 2220377 2246342 2305006 2366981 2377251 2362983 2294992 2265994
6574 2265994 2280261 2309245 2426803 2389046 2331173 2418250 2390431 2562339 2548023 2694566 2848261
6563 2848261 3079426 3047432 3327024 3490844 3654844 3777888 3877074 4149773 4305672 4202799
6553 4202799 3933629 3811992 3592180 3547658 3316785 3366294 3126420 3168226 3100370 2763774
6543 2763774 2749819 2919349 3170997 3221097 3222475 3320324 3334801 3536904 3605293 3792218 4041193
6532 4041193 4184670 4271378 4295167 4368999 4392746 4471704 4541176 4365208 4433038 4581919 4575743
6521 4575743 4649720 4497227 4553576 4495570 4376615 4270760 4185315 3857879 3602685 3351881
6511 3351881 3214649 3065887 2948814 2882156 2956570 3105307 2960088 2918802 3048593 3190576
6501 3190576 3281898 3537991 3621458 3882326 3918136 4073503 4118101 4118659 4026042 3872722 3749189
6490 3749189 3337397 3144082 3027940 2676534 2488198 2387751 2308491 2159784 2055974 1896132
6480 1896132 1871539 1977187 1910440 1818115 1744899 1836329 2031714 2003547 1986803 1940544 1893472
6469 1893472 1829534 1732471 1731371 1624150 1616544 1375331 1244312 1251187 1229527 1112553 1068395
6458 1068395 960628 882731 934301 904414 894317 853625 834492 806461 726336 610972 570064
6447 570064 560430 577387 692314 639092 450871 578208 563323 640805 634632 650947 570441
6436 570441 481477 501353 429152 457430 385239 508903 464376 501788 346874 366108 226904
6425 226904 308700 264073 246594 325380 344700 413228 417067 431390 424849 394035 427203 224169
6413 224169 238864 289069 243794 225044 364786 495689 338124 378230 397188 296670 299160
6402 299160 236750 179238 332382 234265 329031 474245 393456 354189 305020 367209 353790
6391 353790 239241 339675 365742 338152 180133 158430 537995 438953 338629 409976 271356
6380 271356 330568 225709 314051 254573 276264 245141 221701 315477 275806 363993 442830
6369 442830 317054 203962 171744 266849 306949 393541 230228 191504 197976 220487 241591
6358 241591 297853 311696 277171 333374 455203 488251 295273 212724 325390 384613 310349
6347 310349 290403 386264 399322 329282 359150 445761 643153 564257 575347 595464 461319
6336 461319 449753 526621 342025 533289 560437 450690 531762 705325 764865 683530 708972
6325 708972 723565 821520 820628 840170 828151 753771 830921 900245 878628 1015313 988948 902809
6313 902809 855864 621924 700532 800538 738201 754438 785084 782655 684304 762887 880041
6302 880041 759119 865891 709273 677821 736962 695189 859753 813250 785144 769552 823576
6291 823576 798129 1026814 1023366 845853 721378 681975 683252 567686 622859 436731 437953
6280 437953 485214 482514 323181 339841 384073 351226 391554 245752 223477 363857 383361
6269 383361 304036 362830 395849 379025 238278 45968 201534 198255 188870 261020 288330
6258 288330 176926 123382 175376 143938 167977 240871 319084 208929 200728 245570 239089 176478
6246 176478 266387 132323 188326 100121 123422 136554 141074 148247 26293 103528 64709 206714
6234 206714 244209 103550 28711 -22679 55933 -13991 67727 82841 37684 69036 55061
6223 55061 43587 -13882 18812 118576 120389 -48422 127613 218081 159423 78259 -4377 28814
6211 28814 78579 118899 43880 158798 132223 104631 51209 -58066 5805 152194 166239
6200 166239 76876 -13099 2169 138127 170915 25656 64755 134189 36662 31114 -95374
6189 -95374 -27463 -7857 -23626 71684 148731 191179 152215 -49873 -116886 41848 49528 101441
6177 101441 76808 121386 92125 -1944 -9676 11268 -38560 -27573 -19956 105898 15252 8976
6165 8976 19865 76629 170071 190536 21895 -35738 113575 -113 -39457 37768 -44999
6154 -44999 -22197 32238 57275 17028 -102229 -51986 12841 -40410 -32949 39185 -104628 -11270
6142 -11270 172156 52002 -28366 -82513 -70802 -105104 -114041 -58888 -93579 47403 64243
6131 64243 84720 53598 50454 54047 -73485 -93803 -107989 -21272 -32160 -138956 -23660 -93472
6119 -93472 -91823 -137905 -140493 -74233 75329 -109693 -55196 -35363 14935 59218 9240 -117893
6107 -117893 14342 6731 -95157 -18720 41969 -103276 -175774 -41173 -53441 -152652 65775
6096 65775 -10644 -105212 -91075 -75132 -131161 -99886 -163720 24465 23110 60577 63001 -24835
6084 -24835 -80002 -123060 59538 146554 64534 72077 150822 149576 45743 71262 -20055 -49520
6072 -49520 55374 -18211 -9372 -96952 91165 -66562 -23210 -25167 31923 51275 -66829
6061 -66829 -23735 31904 -8301 -43663 -104543 -54671 -109774 -62242 33905 -38430 103289 81406
6049 81406 -103940 -123070 -199183 131779 100748 12812 -128652 -80014 -88644 35140 11959
6038 11959 69287 -54833 -30790 22748 25268 159919 3557 77536 174789 109862 -14995
6027 -14995 51788 85054 204151 18723 -67270 12591 14628 -39392 29445 -62346 -67550 -40752
6015 -40752 43786 -74062 -112751 -142688 -74553 64257 -26900 18357 -3083 -5756 -55256 84146
6003 84146 53410 43979 -42583 27789 -37978 -25049 23006 14141 5656 64608 47660 204251
5991 204251 -9397 -47105 -114622 -216245 -102784 54996 37 -71056 -66395 -50270 -43296
5980 -43296 -48465 -162886 -82146 -77685 -117919 -8050 -69123 42659 -83940 -49693 -89556
5969 -89556 -157506 -106343 69630 -23004 58631 -29748 15435 47422 133945 28388 -60644
5958 -60644 -156673 -96999 -151793 -244639 -100858 -105312 -75086 -146818 -9513 95488 -49629
5947 -49629 -131785 -145852 -108926 -96794 -25089 -59439 31992 -58781 -16468 -17516 -155997 -125378
5935 -125378 -243453 -115042 -154981 -49177 -110525 -63294 3473 10313 76167 22724 -45979
5924 -45979 35538 7743 -114115 -125898 -111561 -127778 -96803 -89414 -35489 68883 101444 28180
5912 28180 -2394 -78449 -19336 -77964 -17072 -15853 -108226 -131321 -213586 -182039 -103840 12215
5900 12215 -103848 65269 48786 -95718 -50902 -42760 -36023 100197 43770 40807 -74151
5889 -74151 -57149 -74967 -20835 -139781 -175371 -71179 -74384 -182649 -41418 71519 -150614
5878 -150614 -96473 -14280 -66475 -90913 -115844 -56626 -64649 -191580 -128897 -101860 -32538 -109945
5866 -109945 -7858 51058 22840 147697 33355 86591 -18406 -118642 -145175 -40583
5856 -40583 236 29272 -64379 -141564 -95027 -165359 -116003 -44974 -99521 22638 -11134 23947
5844 23947 -22326 5387 -133912 17682 130439 31900 589 77228 10839 32982 -9612
5833 -9612 78137 -34967 -143425 19253 -128166 45644 128425 -39694 -30326 -116656 -207037
5822 -207037 -194413 -107506 21208 -126797 -51872 -37686 -53948 -45247 -89914 -204110 -55946
5811 -55946 -67178 -154018 7973 13715 -51543 -77893 -159778 -60289 -53395 54409 11661 47072
5799 47072 -16308 48005 -87069 -59951 17188 25168 -15565 40865 -105723 -31326 -138909
5788 -138909 5020 93454 4571 87772 -59036 -79242 66409 51796 -58458 23900 214104
5777 214104 223091 28018 -62618 -41302 25749 -42958 53525 83825 36473 46816 -8990 -115072
5765 -115072 -71736 -122882 -52113 -37532 -79906 -4814 19597 139443 37914 57316 1598
5754 1598 -115325 -176258 -166443 -132783 -9242 -39674 22472 88322 23946 159248 -27266
5743 -27266 -69000 -16349 -112598 -95471 -152077 -65797 58808 120892 -6280 5298 -75349
5732 -75349 -4075 -68213 19755 130003 122794 12761 100655 1121 8737 91894 152766 125862
5720 125862 5904 28178 -30953 902 -49884 136163 -42743 -59417 85022 -40125 -12909
5709 -12909 -132 -21309 -13722 -151451 -52673 63663 82898 -50390 43368 71852 290346
5698 290346 2201 23535 -62246 -142777 -175848 5776 21948 -135102 -44987 -12039 47121
5687 47121 22650 -43332 -98339 -85867 86956 84382 -46305 -14184 42180 -8790 -35824 9602
5675 9602 101074 160557 50327 92667 21233 12114 98377 -39053 58694 -36052 22938 10718
5663 10718 -84580 -58938 -50294 6235 35240 -25732 45394 156882 65095 16253 -69284 -18507
5651 -18507 79944 12881 81033 109430 -15176 -138179 -136485 -139130 120063 -59882 -109981
5640 -109981 -104379 -98027 -44682 -27031 -580 68800 4890 -96582 -63560 -66863 116078 71805
5628 71805 77809 15427 20635 -86932 58436 -99915 -113763 -192843 -151459 -94257 42908
5617 42908 -79036 -16904 5509 -80581 -53928 78221 82638 87444 17060 -37384 -29797 -170805
5605 -170805 10062 92365 148764 110364 -64185 -144600 -54649 -38997 -100422 -106159 -64666
5594 -64666 48571 47247 -77796 -35170 42433 -64967 573 180230 14580 9051 -18816
5583 -18816 14895 40277 176949 65946 31122 141471 84545 62042 53542 -113461 -37049
5572 -37049 -61884 -16213 -26381 3343 18269 -46574 34047 -43252 -28132 -59600 -54192 53032
5560 53032 50619 -103002 -41388 -66516 -113649 -73884 -90224 -124582 77551 272 -21661 108712
5548 108712 -24356 -46831 60157 -82229 -68326 -80656 -131955 -12146 670 -41158 14306
5537 14306 -114261 3438 9892 36974 -10434 -151857 -175379 -142205 -123394 -111970 -105102 102824
5525 102824 31025 -161781 -278821 -131670 13880 -152445 -72551 87784 -78761 16652
5515 16652 -15910 -133007 -79189 4164 -28990 -107483 -51925 16020 134593 99572 -15090
5504 -15090 -36581 -162154 -130176 -109150 -56428 19157 -47564 148243 30120 -26101 -13647
5493 -13647 -105555 77956 198847 153360 78665 -45473 46040 -92062 -99926 -176923 62190
5482 62190 62052 2977 -125084 -13445 83970 -9060 -120781 -96245 -93175 -142137 -63613 -104176
5470 -104176 -67833 -67516 8944 9258 -51975 124792 148793 100226 100557 30704 -4098 -63589 -76708
5457 -76708 -115368 -67925 -108733 -98681 -60202 -14430 -56637 38387 31947 -33892 96022 101840
5445 101840 77927 -34090 -32742 117169 -58959 -222169 -34698 3688 -90955 -50594 -68104
5434 -68104 -98668 26810 46690 97486 223706 57417 -93614 -71090 -30351 -143717 -131428
5423 -131428 -56373 -3704 49533 8304 888 53674 146181 -38461 55432 9606 1367 519
5411 519 -51861 11431 -18466 -90281 -14863 27205 112779 194565 60173 -436 28464 41831
5399 41831 67043 25477 -15657 -113179 53731 -401 -5031 29116 -115656 25391 26387 19336
5387 19336 83660 52057 11063 -106070 -39136 39662 -58613 102439 57910 8834 79034
5376 79034 38227 -50884 87205 237411 182739 70791 10395 -73954 -129929 39400 169
5365 169 -53680 -28332 -119167 -46321 -123567 -46698 -63158 -41383 2934 103112 48540 1138
5353 1138 18412 50664 61283 82580 -15655 -59358 203887 283165 184026 59480 93072 49927
5341 49927 -105572 -57055 112730 131019 64184 121369 47351 -70558 -131618 -101698 -86763
5330 -86763 -148554 -85481 -71002 42638 85631 -103337 100954 113685 19603 138906 95907
5319 95907 191499 115008 41821 14719 100131 192082 -36407 -40166 51391 160541 67380 41232
5307 41232 156858 79093 -29598 -91481 4264 67445 -82295 -235609 -145747 -158666 -137240
5296 -137240 -39579 45425 -113607 -32721 -33083 22780 -41402 -14271 6874 -161282 -86328 36344
5284 36344 51107 5359 -70327 -51734 33560 -46627 -32651 32485 89345 29674 93514 -66461
5272 -66461 -86467 -93349 10562 54983 41708 118581 -62289 1068 -32261 -113515 -30524 -68324
5260 -68324 -9210 53746 -83662 -246764 24957 7533 58546 40790 108882 49187 96604
5249 96604 76997 -98802 33196 85227 15866 38568 65650 42791 32250 -8102 43964
5238 43964 64174 -59690 -90259 -66220 -135210 56984 6071 34320 134875 136500 -1562
5227 -1562 -49487 -7366 96898 141622 58763 40394 113363 24886 -24453 17476 -75647 52054
5215 52054 60070 76881 145569 128590 163529 121259 109896 56595 170831 96484 60823 15473
5203 15473 52176 65672 22356 124851 60237 -13423 98684 44021 125798 118781 -45166
5192 -45166 -32407 116898 143533 137581 208456 167485 91025 103329 48203 154045 70334 70382
5180 70382 51580 -32781 12091 240576 241348 -5861 115181 14635 54509 19466 170691
5169 170691 187255 96137 225101 128206 93853 209511 164934 128133 132029 95940 33004
5158 33004 5176 42904 124241 134203 136625 10375 115033 123078 -41760 67795 69031 87187
5146 87187 54550 26212 148295 134636 392 48886 31619 78358 -8326 29254 38479 81098
5134 81098 114544 123543 127310 94637 72126 46817 163186 269443 244899 227370 139692 -4404
5122 -4404 167659 177787 78406 159206 140505 6868 85870 153188 138671 48106 64385 110573
5110 110573 51744 13710 201834 127695 90394 118519 174657 181734 190817 156584 178806 219007
5098 219007 124656 128133 97164 179693 130059 200832 220993 24272 6905 127351 85151
5087 85151 60136 138878 122419 225412 222064 174988 91070 96643 258419 207832 198433 211975
5075 211975 79902 249676 352567 220063 356765 310831 271079 115576 -5887 85412
5065 85412 235119 252388 263244 184993 41292 74389 48852 18301 69811 163446 204875
5054 204875 189531 122382 214729 -23829 60714 110648 37459 62093 47686 -15566 58293
5043 58293 154942 179525 253218 246510 192670 65282 189973 160407 72261 46130 156240
5032 156240 245253 289014 129961 58088 180324 283676 246313 258118 199787 186898 286205
5021 286205 234661 199215 236727 118408 47846 135605 109522 156317 213226 306109 115335
5010 115335 39656 106193 134146 72181 156870 270148 207007 180564 215283 154785 175750
4999 175750 223062 171935 196262 194973 21764 -18988 152576 316018 271811 220515 260185
4988 260185 229199 269486 248845 78685 -22119 26579 56267 100030 110740 122152 153285
4977 153285 318703 209508 -24688 76275 265370 267877 358526 227587 13119 148886
4967 148886 253180 391909 404636 339170 263478 153014 202494 343567 307382 208711 268039
4956 268039 377697 314870 277184 250457 222867 291501 361665 326170 181003 220188 328133
4945 328133 332488 310941 316241 331594 197855 136648 360240 199539 232567 321665 194771
4934 194771 284027 328691 137029 214769 336649 160914 212771 327056 265188 216872 276357
4923 276357 386202 400719 413417 315701 303563 331088 414455 274721 314087 461797 435630
4912 435630 454891 367761 420593 317219 359479 452340 463774 565188 598398 421708 355784
4901 355784 483503 499675 486835 535357 409805 505989 578119 555333 561337 474233 537073
4890 537073 644256 524872 370024 465913 541910 551620 367651 501333 514727 429050 327054
4879 327054 349196 308172 321000 413226 421307 568052 584204 463359 342891 444223 411681
4868 411681 363215 257715 352534 499085 508968 524371 389785 376165 339865 350195 399438
4857 399438 334619 347021 270615 266810 280153 221888 205089 245806 255033 266483 356911 365849
4845 365849 448353 394501 297949 347293 429517 403044 372955 336331 295421 252730 178114 148169
4833 148169 286948 460869 449913 471091 418801 383411 331062 393948 351838 374576 418425
4822 418425 585525 555973 395351 387812 267694 364106 468663 501637 503337 506850 676590
4811 676590 681828 632328 539243 471509 440390 511935 474735 378634 370516 394937 424618 502912
4799 502912 485370 409069 573027 507396 590019 569168 456922 514447 545619 540074 553144
4788 553144 567921 540575 576539 493421 470434 483207 469648 472988 520272 485071 483373 354324
4776 354324 362245 501127 534107 578907 504833 430359 571686 499416 625910 611366 466636
4765 466636 519013 543135 616954 507836 594914 791644 750436 725849 642997 728607 894133
4754 894133 661231 592194 627068 610695 521221 569172 682696 671130 632498 641288 623542
4743 623542 684187 745950 773752 733653 735790 827062 845533 869002 851582 901522 934013 930836
4731 930836 912512 905011 779307 936212 1034974 812438 674152 821645 905728 850619 912496
4720 912496 943177 1075170 974739 924354 1146781 925574 898017 1031361 1034778 1077300 1124089
4709 1124089 1157533 1311195 1411321 1382275 1357593 1341817 1312820 1378057 1512689 1495803 1453942
4698 1453942 1408728 1680351 1715946 1619338 1788850 2020285 1855609 1980879 1976998 1988996 2129199
4687 2129199 2188957 2197902 2389915 2509666 2567043 2670441 2909173 2920402 3173028 3358003
4677 3358003 3520298 3764986 3864405 4161471 4439617 4572764 4714236 4896437 5205113 5236136
4667 5236136 5301405 5433090 5531983 5622520 5679428 5869040 5982962 6034447 6299263 6515098
4657 6515098 6733605 7000741 7110369 7472869 7630385 7859342 7959761 8063415 8102809 8062873
4647 8062873 7728229 7490152 7315252 7276184 7125158 6936467 6620272 6481303 6549436 6364787
4637 6364787 6154249 6222315 6224819 6061853 6144218 5926082 5720709 5699882 5508655 5310161
4627 5310161 5029188 4721772 4446326 4292525 4264687 3941132 3698810 3493124 3571284 3568259
4617 3568259 3360406 3225762 3080603 2930126 2689865 2903537 2855553 2635542 2428550 2435575
4607 2435575 2487735 2425872 2344592 2382140 2464290 2293898 2125241 2165801 2177766 2049904 2041265
4596 2041265 2001828 1861136 1812142 1728501 1855514 1888320 1747747 1695952 1519582 1527000 1735538
4585 1735538 1696461 1714758 1730847 1684403 1653993 1645138 1538527 1429637 1374860 1498081 1370009
4574 1370009 1319399 1412619 1373546 1396604 1359940 1284127 1372877 1437916 1266092 1293168 1337617
4563 1337617 1246254 1131784 1108599 1057043 1246899 1193749 1202746 1242954 1421542 1307423 1213878
4552 1213878 1188546 1276252 1178502 1020526 1059934 1141091 1061862 1173576 1307951 1145207 1013578
4541 1013578 1149007 1096223 1240129 1189306 960403 1041332 1013682 1034161 980663 1119384 1010915
4530 1010915 1034667 914848 1076455 1039763 930989 827308 941332 993729 987209 862632
4520 862632 915569 1000774 976601 1057333 1224181 1151649 918355 985770 1021749 1057885 1056231
4509 1056231 986734 1054999 1022626 1086993 1083207 1166756 1153514 1116705 1159117 1200180 1240968 990915
4497 990915 1089313 1070541 1075251 1084594 1125965 1128166 1214525 1200645 1074947 1090812 1179117 1136939
4485 1136939 1044880 1202158 1221560 1239275 1325087 1244041 1109745 1155639 1347300 1421788 1426862
4474 1426862 1408573 1474101 1419136 1423868 1437366 1613822 1681359 1820165 1872206 1828999 1812490
4463 1812490 1868672 1882046 1902793 2106520 2062696 2294338 2496371 2434861 2503183 2431088 2526950
4452 2526950 2558762 2723103 2666994 2607552 2617792 2636804 2560821 2699257 2553380 2475346 2443557
4441 2443557 2283175 2360390 2328729 2260822 2269609 2464302 2530613 2760780 2685555 2693850 2610979
4430 2610979 2841130 2942320 3067574 2890942 2808128 2822435 2697263 2639263 2720220 2563156
4420 2563156 2433496 2403426 2205768 2308941 2189006 2121785 2016997 1976291 1900628 1821910
4410 1821910 1756396 1735918 1894513 1894428 1653905 1651647 1699588 1660141 1562149 1722449 1664712 1670996
4398 1670996 1663719 1628833 1588859 1667810 1723881 1668567 1748954 1572694 1580163 1718359 1593261
4387 1593261 1546703 1460948 1577116 1639847 1701477 1908420 1701888 1824070 1832991 1578332 1640913
4376 1640913 1620637 1582215 1689168 1707470 1725437 1852545 1819102 1766814 1884684 1835484 1732836
4365 1732836 1873447 1843437 1663913 1797825 1819519 1830439 1787576 1826655 1963134 2092887
4355 2092887 2225440 2232880 2140617 2026444 2157346 2152987 2009133 2080838 2086432 2203039 2005407
4344 2005407 1894197 1915058 2086126 2204253 2355634 2370921 2242600 2351025 2414209 2491313
4334 2491313 2523888 2616488 2502884 2440120 2655350 2597401 2711692 2617255 2682598 2786788 2957020
4323 2957020 3030815 2956892 3049526 3073739 3181392 3423348 3540204 3644660 3669877 3626756 3760962
4312 3760962 3852749 3771502 3982410 4053965 4116251 4284635 4324306 4538288 4627294 4901250 4940539
4301 4940539 4968958 5188056 5420795 5641052 5917351 6015014 6275232 6602269 6937096 7260751
4291 7260751 7638216 7939927 8063559 8257892 8467296 8657811 8685859 8880970 9117257 9144242
4281 9144242 9263034 9508640 9659748 9797690 10073321 10381542 10581931 10865635 11156712 11266080
4271 11266080 11579640 11827018 11721047 11614676 11527574 11390941 11106249 10850802 10764898 10445473
4261 10445473 10286355 10098705 9927094 9845106 9869336 9693922 9844326 9823798 9739340 9732689
4251 9732689 9701719 9649721 9584526 9510421 9401638 9373563 9243674 9128441 9120350 8990185 8971009
4240 8971009 8798630 8860471 8895925 8843880 8893410 9021242 9257130 9488945 9524833 9736151
4230 9736151 9976056 10026533 10213706 10411716 10529584 10577340 10841722 10844378 10837308 10827864 10902820
4219 10902820 10724112 10929262 10985275 11107150 11268496 11318909 11292362 11493209 11753476 11844743
4209 11844743 12057728 12028442 12032446 12078762 11985393 11758847 11657527 11330424 11110959 10965030
4199 10965030 10750906 10528936 10301481 10222489 10006021 9836131 9695857 9601655 9465651 9477461
4189 9477461 9347889 9199685 9035016 8881165 8575904 8269263 8000284 7861689 7761290 7674764
4179 7674764 7330161 7181798 7060813 7052454 7139187 6980656 7220483 7044336 6859748 6956637
4169 6956637 7017313 7010441 7102967 7090566 7126518 7274209 7227118 7248137 7369794 7438384 7362503
4158 7362503 7439498 7386030 7478535 7597587 7758117 7841555 8009070 8138366 8102466 8331865
4148 8331865 8479924 8638254 8787023 8985936 9176502 9295958 9581652 9828931 10073644 10229983
4138 10229983 10423265 10636581 10714340 10992321 11307489 11494043 11701363 11996838 12221680 12435269
4128 12435269 12670343 13056754 13352928 13561406 13825952 14216891 14767078 15178880 15623117
4119 15623117 16148121 16675331 17247026 17715556 18388311 19074501 19782531 20406560 21189312
4110 21189312 21752946 22654800 23485866 24047117 24807509 25743116 26645109 27680574 28454840
4101 28454840 29507421 30678833 31889101 33109314 34205759 35563356 37210882 38775084
4093 38775084 40691366 42661150 44799019 47159595 49795124 52755317 56010361 59387133
4085 59387133 63124871 67415416 71976631 76940903 82402885 88330335 94885234 102143129
4077 102143129 110251613 119274607 129113642 140123766 152249353 165867673 181302517
4070 181302517 198891136 219166369 242001043 266828636 292274699 315023064 330854617
4063 330854617 335418442 328016501 310356333 286096447 258868930 231902870 206224867
4056 206224867 182966319 162338095 144606122 129008471 115551727 104137162 94214498
4049 94214498 85708663 78260085 71749964 66107005 61161885 56716550 52742951 49268834
4041 49268834 45961984 43075517 40606050 38228730 36031617 34211984 32463445 30915668
4033 30915668 29333389 27875929 26587356 25357424 24074024 22749612 21792971 21026603
4025 21026603 20019835 19078715 18205792 17373414 16647346 16002085 15291469 14667637 14083460
4016 14083460 13525303 13075881 12715727 12247070 11767182 11338469 10845070 10464663 10242454
4007 10242454 9990167 9780073 9392220 8963024 8807574 8437110 8273304 7943547 7849686 7596480
3997 7596480 7218002 6879742 6758122 6700640 6513641 6235552 6015136 6000062 5814519 5556768
3987 5556768 5508308 5454400 5289284 5048030 5158669 5047486 4890851 4719233 4452588 4375198
3977 4375198 4457257 4312237 4254141 4232593 4264019 4036151 4013975 3908869 3801928 3763267 3570059
3966 3570059 3565842 3486710 3389893 3335957 3309351 3281228 3227351 3355419 3219307 3233306 3060166
3955 3060166 2922568 2867141 3007985 3043500 2934665 2897002 2905061 3095918 2998431 2895176 2687906
3944 2687906 2643688 2603174 2548736 2481509 2413302 2296345 2286720 2332256 2349983 2211169 2063309
3933 2063309 2077084 1977517 1883071 1964925 1949815 1782162 1780948 1854851 1899464 1830119 1872699
3922 1872699 1941510 1817457 1853719 1905694 1882657 1835583 1951585 1901259 1966946 1690910 1718448
3911 1718448 1781855 1652519 1700954 1744619 1724052 1573609 1589321 1731613 1703916 1636223 1547586
3900 1547586 1543327 1583836 1675500 1487000 1482764 1519854 1614145 1583387 1534003 1659348 1718016
3889 1718016 1589387 1579413 1595125 1458612 1554480 1505234 1571599 1544034 1469112 1376550 1555677
3878 1555677 1535980 1425524 1427307 1409871 1452249 1544721 1502799 1623744 1558858 1566975 1560175 1562172
3866 1562172 1532929 1334325 1521523 1577414 1775096 1708074 1567322 1555566 1430551 1719792
3856 1719792 1723138 1677375 1634233 1587173 1663274 1609736 1551601 1663344 1652293 1676693 1779224
3845 1779224 1824323 1721210 1687456 1690163 1722386 1851724 1700130 1724771 1831919 1885151 1703051
3834 1703051 1654935 1675966 1663214 1781340 1876520 1809167 1894518 1820505 1795126 1993810 1943536
3823 1943536 1785197 1895390 1772255 1998263 1995608 2000958 1952458 1910424 1950995 2066019 2047786
3812 2047786 1937931 1865464 1989341 1994122 1929540 1988026 1946535 2030778 1962811 1968815 1812830
3801 1812830 1875889 1788883 1910519 1999156 1895204 1945186 1880265 1841834 1920051 1863725 1922124
3790 1922124 2004538 1904455 1934705 2096530 2000819 1972524 2110736 2154268 2098596 2120948 2012987
3779 2012987 2041293 2034203 2064300 2230028 2196290 2128172 2245016 2168366 2221916 2189509 2103957
3768 2103957 2219474 2243154 2238036 2193303 2165766 2271452 2431414 2304412 2270417 2282552 2273344
3757 2273344 2422038 2416765 2542652 2441742 2530448 2629445 2623124 2797234 2851138 2707262 2780122
3746 2780122 2875520 2979789 3067017 2954836 2955925 3039133 3120120 3171368 3188739 3350288 3445528
3735 3445528 3593725 3607213 3703678 3777083 3848503 3932023 3976845 4135283 4220472 4347315 4451664
3724 4451664 4505121 4470050 4523690 4806020 4996486 4952512 5159347 5238862 5235620 5331692 5670459
3713 5670459 5680870 5940473 6031125 6255008 6270466 6344756 6414195 6479454 6538149 6672881 6858691
3702 6858691 6984548 7108609 7086739 7128116 7327646 7360996 7358169 7428243 7423778 7555796 7370984
3691 7370984 7481364 7658202 7666812 7605021 7643494 7624754 7683712 7706823 7688508 7633359 7618704
3680 7618704 7428634 7374676 7441422 7439115 7366638 7384908 7385471 7397408 7370563 7284509 7289436 7115400
3668 7115400 7078128 7236236 7152108 7161472 7149277 7021598 7086514 7163356 7154481 7306582 7332201
3657 7332201 7229766 7291986 7250556 7419317 7445058 7576285 7694302 7850992 8026944 8027865 8103280
3646 8103280 8246523 8402162 8465733 8591246 8624260 8678502 8856675 8951233 8993344 9041786 9193101
3635 9193101 9339514 9452635 9578483 9646792 9869741 10090078 10041878 10019494 10309547 10416553
3625 10416553 10320130 10270174 10251846 10196271 10119073 10015109 9863697 9635012 9428329 9272395
3615 9272395 9243122 9074110 8972150 8846468 8822818 8809152 8635612 8479868 8441335 8289464
3605 8289464 8019325 7949119 7909501 7827593 7509027 7399643 7151374 6995258 6735195 6660533
3595 6660533 6540012 6356711 6300163 6382324 6189281 6117505 5946161 5885017 5836525 5694158
3585 5694158 5708724 5786618 5606619 5572308 5673530 5741706 5677080 5849993 6075732 6144750 6121351
3574 6121351 6106159 6237364 6376097 6561558 6667194 6862120 7010408 7167725 7129867 7334391
3564 7334391 7371013 7431901 7520455 7625903 7714912 7785378 7916448 8054934 8226509 8521305
3554 8521305 8539028 8727717 9050891 9277007 9390164 9693356 9797774 9749011 9857238 10069903
3544 10069903 10218047 10372672 10184729 10180599 10124026 9957343 10066936 9977195 9891925 9916943
3534 9916943 9748403 9879877 9692838 9620288 9631534 9547935 9439216 9427320 9343647 9470763
3524 9470763 9559869 9331129 9334035 9231077 9290517 9301845 9212050 9200675 9399085 9420892 9305980
3513 9305980 9390478 9410804 9545491 9666897 9756763 9871178 9824231 10133768 10381278 10441782
3503 10441782 10484807 10774906 10887054 11143050 11517889 11907327 12149027 12597475 13091672 13541456
3493 13541456 14044025 14526227 15168541 15869766 16692425 17512755 18557216 19649249 20951373
3484 20951373 22319313 23784131 25553110 27593231 29901798 32488044 35254586 38280018
3476 38280018 41454258 44751199 47788060 50856308 53968427 57175533 60332996 63083093
3468 63083093 65417597 67204834 68696767 70216319 71623503 72114026 71589049 70157167
3460 70157167 68330064 66370799 64140191 61699985 58854493 55315835 51657141 48026907
3452 48026907 44714990 41354931 38067506 34724871 31385618 28082906 25324769 22772387
3444 22772387 20714064 18696877 17018661 15551776 14319380 13151311 12223551 11456393
3436 11456393 10748706 9984178 9287665 8789377 8289740 8038606 7569283 7271562 6879756
3427 6879756 6605576 6303648 6003078 5734726 5483998 5234910 4914843 4752027 4745976 4440795
3417 4440795 4198480 4131981 3958621 3849565 3774832 3558241 3473464 3412553 3311660 3130925
3407 3130925 2984889 2901757 2866541 2877467 2736357 2666663 2695452 2582287 2544835 2463037 2488696
3396 2488696 2680756 2553320 2449005 2422694 2317234 2193917 2149003 2057358 1963510 1967419 1995142
3385 1995142 1883162 1789886 1764348 1802848 1721251 1680741 1702060 1631701 1795931 1661974 1618149
3374 1618149 1510278 1580799 1571833 1514291 1572915 1461212 1295926 1417169 1360630 1274768 1320652
3363 1320652 1281856 1352579 1331264 1201252 1352781 1379762 1385656 1316735 1355385 1333005 1295805
3352 1295805 1166394 1278437 1287805 1380720 1391491 1295131 1209313 1146788 1150161 970399 1158316
3341 1158316 1192387 1097548 1144747 1135912 1247725 1336659 1204374 1174575 1113413 1228483 1126891
3330 1126891 964693 1049857 1142716 1053804 1109811 1085023 1105714 1091312 1137109 1210961 1236997
3319 1236997 1224981 1221457 1144929 1158288 1254799 1169564 1261927 1199590 1091794 1171058 1236632
3308 1236632 1234618 1179893 1106475 1342952 1458253 1398692 1433509 1374167 1262772 1282116 1465003
3297 1465003 1453661 1537059 1419662 1355914 1497756 1591655 1495368 1718485 1764013 1662641 1693351
3286 1693351 1827603 1903141 1733544 1674509 1714516 1843909 1904671 1972963 1986765 1994351 1998038
3275 1998038 1922796 1996106 2021533 1968040 2129860 2105013 2112793 2024243 2102643 2119988 2060128
3264 2060128 2264594 2214085 2257343 2372874 2287997 2351169 2307350 2362261 2383669 2454811 2558086
3253 2558086 2674574 2646531 2747136 2782208 2952188 2972011 2937313 3213591 3270695 3428328
3243 3428328 3607455 3834309 3817024 3961500 4127189 4263617 4367947 4559727 4694583 4773583
3233 4773583 4880744 5113540 5265447 5512746 5605825 5739888 5985566 6169324 6275768 6250354
3223 6250354 6406442 6585493 6557481 6717935 6640755 6609369 6593535 6567472 6708809 6625497 6661928
3212 6661928 6755687 6720289 6701309 6755432 6619995 6674333 6739046 6608405 6625310 6581259 6616525
3201 6616525 6812538 6981573 6903843 6944749 7021819 7072591 7270352 7577138 7716583 7941931
3191 7941931 8265831 8615590 9161107 9576894 9954943 10617632 11482073 12422375 13617789
3182 13617789 15261965 17530344 20565212 24269514 26540156 26314592 24176118 21040999
3174 21040999 18136384 15368852 13069416 11280326 9546882 8418126 7522376 6744791
3166 6744791 6116212 5585932 5148530 4666103 4270749 4170480 3961671 3711719 3514148 3260400
3156 3260400 3159244 3217052 3047569 2811507 2734201 2832312 2751622 2625283 2498593 2444343
3146 2444343 2450630 2264385 2211734 2197169 2140969 2171735 2087196 2117533 1915945 1886563 1962567
3135 1962567 1898477 1744487 1707375 1697337 1721924 1632568 1660840 1649718 1790767 1868653 1640564
3124 1640564 1673952 1684860 1611230 1745705 1748232 1746054 1672242 1559601 1639965 1663453 1786432
3113 1786432 1795185 1735713 1717314 1642557 1658002 1633071 1634154 1877895 1835091 1808209 1830318 1871919
3101 1871919 1845402 1855621 1823610 1699283 1804300 1926454 1872555 1931448 2059816 2111070 2075727
3090 2075727 1988979 1923062 2105598 2178012 2244200 2222517 2333751 2418204 2424394 2218872 2244688
3079 2244688 2383487 2593744 2813105 2903990 2957160 2821883 2914461 2922540 2996232 3286337 3421650
3068 3421650 3391038 3332459 3523330 3629062 3825951 3927361 3972134 4078176 4004115 4163911
3058 4163911 4360143 4587375 4640230 4814059 4933972 4998156 5206483 5195912 5316535 5482122
3048 5482122 5544403 5628927 5602148 5933051 6127494 6218890 6396985 6545461 6819405 6801815
3038 6801815 7071178 7182349 7208271 7317682 7372146 7566187 7706530 7806492 7762057 8064476
3028 8064476 8159231 8110450 8286667 8640583 8664291 8907294 9138021 9216196 9411684 9597384
3018 9597384 9786221 9898516 10134919 10221484 10354158 10562664 10764608 10653651 10908172 11055362
3008 11055362 11139150 11357447 11404155 11521014 11714955 11800195 11836336 12009911 12133314 12049568
2998 12049568 12223681 12416899 12575470 12576861 12480120 12647219 12705922 12845495 12577909 12377503
2988 12377503 12490010 12453982 12300483 12227772 12184650 12069041 12016100 12010578 11832835 11726247
2978 11726247 11462092 11154278 11094312 11037386 10754763 10643899 10462634 10308576 10383244 10274423
2968 10274423 10272131 10056160 9951378 9949562 9816323 9817857 9781549 9646700 9675285 9589065 9454835
2957 9454835 9441145 9420197 9373086 9259537 9302546 9258011 9033961 8977344 9047363 9168443 9067711
2946 9067711 8957275 8758390 8703614 8643102 8599418 8366099 8255443 8112614 8147089 8114090
2936 8114090 7807007 7696696 7423681 7311353 7242252 7172873 6978381 6926145 6850188 6733323
2926 6733323 6608385 6627545 6430389 6340022 6120725 6010606 6107933 6121374 5938356 5990094
2916 5990094 5915561 5791998 5838708 5746097 5711461 5555393 5640036 5679149 5627509 5475226 5469912
2905 5469912 5729939 5683153 5653495 5669048 5711978 5896001 5915454 5891409 5836235 6023853 6176811
2894 6176811 6284147 6537318 6706137 6817920 7095808 7280854 7427653 7669281 7904538 8138899
2884 8138899 8494154 8980515 9381408 9813985 10312274 10728821 11079166 11489139 11936975 12346708
2874 12346708 12500368 12844891 13134181 13239304 13379013 13434608 13663085 13672514 13791793 13715067
2864 13715067 13578955 13472517 13105015 12776271 12278316 12099875 11698642 11330418 11029976
2855 11029976 10664347 10224647 9728294 9450468 9212433 8788609 8372556 8271511 8007689
2846 8007689 7734253 7415062 7184032 6986409 6884893 6635300 6615630 6361955 6137686 5906606
2836 5906606 5769602 5744084 5458248 5310255 5183836 5111882 5051234 4890665 4793924 4702207
2826 4702207 4649250 4566952 4453123 4362012 4297705 4285694 4195800 4000182 4158538 4239730 4180241
2815 4180241 4085728 4207301 4153372 4065980 3986288 4069515 4041502 3907449 4034356 4084822 4073056
2804 4073056 4079436 4111657 4293882 4233559 4011857 4235725 4229012 4277448 4209285 4461140 4521224
2793 4521224 4734338 4629017 4705899 4827167 4913080 4981437 5271024 5401499 5511519 5508267
2783 5508267 5653872 5887793 5897612 6048355 6258368 6402938 6459815 6570496 6724759 6730081
2773 6730081 6773572 6966791 6933847 7087395 7224037 7213403 7317867 7486953 7697521 7730029
2763 7730029 7827094 8030978 8307119 8535019 8916376 9095127 9317132 9754177 10032937 10253337
2753 10253337 10639261 11162581 11570341 12031258 12414591 13045798 13683276 14443134 15095384
2744 15095384 15777917 16480993 17162788 17690331 18334435 18829240 19411487 19789076 20120095
2735 20120095 20256984 20359981 20403688 20236257 20226889 19928137 19652332 19275452 18741882 18156465
2725 18156465 17554001 16949009 16246940 15676325 14900504 14309275 13831265 13202825 12833332
2716 12833332 12177437 11589538 11069388 10588618 10175862 9814263 9455385 9113176 8800709
2707 8800709 8611313 8382250 7929522 7811027 7736042 7529193 7342042 7268007 7203914 7106991
2697 7106991 6929887 6924408 6702212 6647979 6817324 6820992 6736420 6806066 6879546 6696158 6588174
2686 6588174 6456390 6407086 6432699 6336663 6497661 6479362 6447077 6305435 6248410 6329652 6422446
2675 6422446 6413335 6478396 6531455 6524701 6710599 6843250 6963121 7000897 7046963 7167923 7347684
2664 7347684 7658225 7784703 7958114 8368233 8590419 9027737 9390864 9668466 10096316 10580968
2654 10580968 11030900 11260640 11532910 11748877 12068077 12548734 13025258 13534843 14013171
2645 14013171 14616571 15058716 15715770 16390380 16911157 17622689 18303905 18916992 19717998
2636 19717998 20492228 21157109 21864840 22383717 22830862 23127309 23323556 23467277 23620395
2627 23620395 23638853 23600273 23557253 23461647 22936294 22597118 22114962 21532279 20947203 20052515
2617 20052515 19344834 18457660 17668837 16946104 16196474 15493983 14977322 14434452 13728519
2608 13728519 13100818 12676388 12140249 11826529 11290966 10797317 10452882 10155867 9808061
2599 9808061 9516101 9011141 8599241 8365005 8202015 7979429 7524693 7411879 7246465 7074346
2589 7074346 6760374 6487730 6507268 6161190 6075642 6107979 5921696 5791163 5527114 5609269
2579 5609269 5545889 5506003 5458249 5376449 5380622 5234846 5243621 5121692 5227968 5229846 5176116
2568 5176116 5300673 5315445 5186114 5175102 5195613 5212186 5128452 5249830 5222267 5052697 5004836
2557 5004836 5253728 5260772 5298993 5180409 5181985 5354363 5424199 5605341 5706832 5742024 5797704
2546 5797704 6003033 6115292 6346770 6463522 6651998 6849617 6943681 7021548 7232205 7416868
2536 7416868 7524612 7654032 7804903 8013601 8181932 8321143 8772836 8953908 9102344 9443047
2526 9443047 9553212 9757981 10039685 10092650 10162246 10277882 10334469 10489988 10474301 10424303
2516 10424303 10405588 10411006 10489005 10388533 10342190 10276326 10099259 9990455 9899625 9726524 9548587
2505 9548587 9313764 8890531 8523343 8191655 7953462 7622701 7221167 7075916 6832364 6550621
2495 6550621 6250742 5960021 5817175 5619983 5442989 5198883 5013152 4848654 4742360 4656082
2485 4656082 4443135 4296970 4118370 4036051 4074110 3837197 3681165 3709146 3751202 3656014
2475 3656014 3435958 3507126 3469188 3431874 3350398 3455077 3368105 3341681 3252240 3397357 3365814
2464 3365814 3269240 3137974 3052749 3026834 2936688 2975861 2816040 2768251 2744778 2632773 2684157
2453 2684157 2651417 2615045 2463536 2395363 2353864 2403951 2462286 2404852 2280121 2316570 2189651
2442 2189651 2248269 2221360 2240617 2130937 2206056 2231037 2159914 2041628 2093848 2077488 2023244
2431 2023244 2247836 2154750 2192162 2129613 2128934 1997673 1982944 2094305 2227449 2140338 2211216
2420 2211216 2150072 2255193 2238707 2175459 2184045 2320189 2440009 2475253 2538356 2578883 2576700
2409 2576700 2539047 2544523 2652662 2810629 2850077 2894946 2890534 2969562 3101413 3000546 2965539
2398 2965539 3173084 3290159 3392605 3468100 3405419 3426649 3523358 3591151 3681551 3930264 4024252
2387 4024252 4124656 4062216 4210156 4308564 4559450 4647192 4834458 5052393 5224708 5463262
2377 5463262 5569360 5845571 5999827 6304686 6639839 6854408 7192924 7581928 7899231 8292807
2367 8292807 8739271 9285314 9901364 10493250 11103622 11884080 12610655 13520923 14502689 15272225
2357 15272225 15830170 16291934 16532745 16586326 16841253 17092121 17290370 17753539 18463411 19346854
2347 19346854 20299899 21336282 22489547 23841548 25506418 27337619 29304018 31770200
2339 31770200 34200510 36777274 39590865 42099344 44431739 45792218 46265576 45411890
2331 45411890 43835213 41792332 39467322 37116055 34897462 32913270 31041171 29369069
2323 29369069 27850966 26629015 25443163 24402545 23490419 22369560 21294903 20149634
2315 20149634 18998852 18002242 16988068 15960908 15037254 14149480 13422503 12532109 11891784
2306 11891784 11149843 10499517 9931710 9386424 9056081 8569403 8204406 7605402 7112655
2297 7112655 6824752 6579896 6386144 6124605 5847808 5576238 5145486 4884317 4673239 4493601
2287 4493601 4346900 4211501 4059080 3788754 3759540 3671156 3587564 3414393 3239362 3069964
2277 3069964 2972114 2857138 2857402 2645065 2418033 2332540 2389088 2219676 2085557 2168082 1918347
2266 1918347 2031809 2102485 1949688 1847836 1775923 1511665 1631771 1606662 1700703 1533734
2256 1533734 1498184 1417050 1419919 1378966 1298893 1274815 1335689 1207671 1186790 1177246 1284749
2245 1284749 1195133 1219458 1100439 993781 991631 1049250 1008018 906895 1027874 926883 852868
2234 852868 719099 772594 713391 713876 670646 557638 632516 797186 793840 681492 694406
2223 694406 724686 745065 570948 466417 602899 650115 484087 481266 489866 565895 542772
2212 542772 717805 638672 503150 352473 448177 531024 538042 544860 382880 636824 560097
2201 560097 379030 382499 238159 287087 443373 271130 376460 284278 270883 317493 419835
2190 419835 439710 427837 265944 477821 377472 327166 395382 254323 384868 376249 344252
2179 344252 399344 319852 261675 217296 327126 379002 261251 300924 354427 425176 356324
2168 356324 225950 247071 164918 180359 324916 346220 213030 231553 385626 291900 240498
2157 240498 199893 150078 193223 284049 360216 161815 186044 191749 218991 207465 264642 318058
2145 318058 379662 270261 153553 172516 250104 165108 172317 153770 139889 292099 426512
2134 426512 248043 185206 173528 204787 274355 239324 311302 286609 312007 319135 365728 180220
2122 180220 92697 291429 308757 381590 350229 345997 315303 214349 119517 252036 350694
2111 350694 159932 240804 259474 269188 256042 175587 343078 377808 135303 215266 82935
2100 82935 99639 37115 140117 218909 175632 65173 -45915 -10148 53650 109772 174028
2089 174028 233756 125186 -59395 17745 166558 89434 -72740 -24055 17947 82465 109837
2078 109837 73334 -37807 -175905 -16032 87337 68035 100899 110114 -10390 -36409 171857
2067 171857 214711 218183 152444 115512 234345 153855 87897 -5458 -72145 491 -87174 22101
2055 22101 128000 45349 62213 161399 -148051 -42627 112089 69264 199890 98376 100478
2044 100478 191047 96691 87293 -13678 -36749 45294 16141 130857 80566 70511 83338
2033 83338 79063 61845 70778 8111 83300 -116615 -180148 -69101 36612 69170 -62693
2022 -62693 107741 34134 36477 31595 46040 54458 15835 150975 60173 106426 77713 56305
2010 56305 37070 72721 64419 25153 103764 116826 53145 140786 29068 8041 138672 76940
1998 76940 -14177 58529 46717 61043 -45668 4996 13422 -95696 8915 52849 29983
1987 29983 64541 162205 -2715 -49627 -78683 42968 -15897 31490 65970 26375 77357
1976 77357 72979 93083 -155077 -14532 -41129 71937 -44074 59226 134566 -34728 151026
1965 151026 103022 47973 6484 111622 43708 17576 37745 12461 449 -73688 -15841
1954 -15841 193313 13849 47877 19450 162836 184193 33374 69069 -1706 172630 120245
1943 120245 28315 53304 7872 -19639 103034 136290 157326 38132 96319 115432 92150
1932 92150 188125 195292 176482 -20220 16868 134630 166039 210770 271479 52278 -1657
1921 -1657 -31936 -63760 28640 58517 59694 -302 -115268 -172533 -66509 107944 -117288
1910 -117288 -54376 90645 68223 -42879 112286 179882 -20838 -36089 34499 8714 -17847
1899 -17847 164175 54843 100807 207482 149160 -60290 -61129 -27957 56618 47 -150462
1888 -150462 -120818 -132487 -79045 -33238 108958 80348 16016 6628 22754 73287 126670 -60349
1876 -60349 -24419 -83415 -207977 -280866 -150891 -89372 -7129 -9250 37255 164179 115863
1865 115863 88314 -1489 -14321 -64500 -14111 -67876 -26584 73666 59719 75753 190003
1854 190003 46080 -48344 9697 18331 72650 118162 -11386 -66798 -35835 102859 -7428
1843 -7428 3114 -18492 -5496 73938 54585 -76819 -72237 126466 65722 -92164 40083
1832 40083 38786 14782 186866 191743 83201 80154 82935 120701 84878 64810 62377 161356
1820 161356 81032 265486 245333 60009 151475 131137 27659 100973 -694 -98276 -108245
1809 -108245 -66022 -125145 -100288 -8016 18146 -11068 -72103 -9529 52725 185172 161471
1798 161471 154738 188869 75107 162071 29033 10751 125598 -51779 148897 149364 54050
1787 54050 190332 178026 303285 248153 229657 139735 214272 323533 382567 369547 349791
1776 349791 589239 645467 612712 471341 644473 464982 651689 802501 1029941 1065744
1766 1065744 963382 1007483 1174919 1369248 1681437 1867454 2162653 2600742 3148635 3400202
1756 3400202 3478072 2950677 2617172 2304221 1882533 1572176 1373934 1168362 994285 833932
1746 833932 685693 582711 524214 541176 271477 347159 288813 368183 286212 283569 269866
1735 269866 351428 301543 112535 94346 50902 51568 62421 42284 289986 341628 203288
1724 203288 55918 50078 196170 124355 1245 10467 109123 77375 172682 196549 128454
1713 128454 169762 84405 -102469 -39429 103556 108474 117528 -53267 -163446 -46525 -103066
1702 -103066 10844 100883 -17783 51065 23743 -11515 -6901 146962 32897 -86585 11174
1691 11174 14361 20166 70930 30907 -78919 -60690 -166361 -96052 206079 140136 233622 104054
1679 104054 -119804 16844 64853 31268 90982 112598 -42434 -14813 74106 -39988 -30391
1668 -30391 -162074 -162407 -119542 -87920 -28969 -14062 -6828 -33005 41840 -24348 -18234 36336
1656 36336 39519 -82797 -213206 -2821 -39447 11704 -32235 -57921 78750 96284 1507
1645 1507 -199376 -99784 -235489 -111998 -67837 -37664 94642 80389 -150067 -118635 11049
1634 11049 -226187 -234373 -86765 -101368 -7897 1116 -3109 4141 -33489 3194 68982 49032
1622 49032 -21038 -8027 69242 144382 124968 58652 -6158 -82417 -51985 -145569 -186365 -67654
1610 -67654 106283 45999 -10167 -17039 -37238 -26460 51059 138229 53423 -128663 -68999 12653
1598 12653 198393 58183 -129800 -41704 124828 63578 -9888 56640 -98179 -30199 -28229
1587 -28229 101733 -52851 -18157 -104761 147566 59006 -150452 -97047 -927 141850 81391
1576 81391 81939 41749 -131887 32043 68553 9188 -1600 -84337 -13720 35187 30474 68293
1564 68293 -19835 -64218 77698 -43160 32481 87677 -55183 -133279 -21268 -30018 19831
1553 19831 -49838 -76514 16981 39056 -37021 75950 57524 -21601 39338 -119272 -120042 -97094
1541 -97094 43284 145503 -113619 -182926 -23456 -34387 179396 174869 -62764 -105849 -143328
1530 -143328 48634 175491 51068 -116812 -135496 92342 -68456 43942 80277 100316
1520 100316 81350 100874 4976 102741 1618 -28983 -66295 -170422 51981 -4050 -122294
1509 -122294 -33301 164007 -121141 -125654 -9679 -14619 -71542 -62790 -61093 -75395 -86940 7960
1497 7960 -104785 -96237 -53956 12650 -22947 -45692 -50411 9130 33520 44358 59103 134951
1485 134951 -107412 -65285 56026 -73725 -110068 -117132 -55492 -19267 92028 13240 -57363
1474 -57363 -44500 73570 140100 16379 -93006 -167449 -59792 -59819 -14591 33457 33703 -15003
1462 -15003 -88819 -5324 60517 -54182 -70112 -80681 -78949 17016 54492 95385 14831 -168605
1450 -168605 -140691 -17727 -70285 -305717 -193139 -76388 -66594 24527 63659 -70057 -213859
1439 -213859 -10892 -120501 -113824 -122626 71503 186755 46255 -104544 20285 101478 -2030
1428 -2030 -42380 35288 -98958 -170367 8266 -117661 -157756 -67858 -129304 -104964 -26468
1417 -26468 21971 27159 -126536 -229134 -125535 -29339 -113033 34594 61515 -49136 -85804
1406 -85804 21613 37548 -19900 -32089 -998 73634 2006 23765 -26675 41650 -49607 -10625
1394 -10625 41231 -69971 -147063 -47921 -29660 -77963 -76098 -29693 2781 -25721 -81495 91153
1382 91153 199890 68117 -21993 -33300 -3891 -23846 -112861 -73523 31266 5294 -72590
1371 -72590 -109916 -168624 -206948 -113222 21929 -18970 98287 64490 -33177 -86409 -115146
1360 -115146 47110 47241 -98717 -190001 50602 35185 -21925 -49888 118847 31262 26908
1349 26908 104631 28804 -79339 -80130 -25134 -24229 3812 -36674 45576 78271 47571 -22423
1337 -22423 -20721 -19838 -54717 -1428 37608 123592 123669 64845 65828 40303 -28897 -110327 -36437
1324 -36437 30642 -16548 46645 58690 84266 55311 53773 -48471 -37741 -18735 -9393 76543
1312 76543 86764 -44171 15850 -94485 61059 19045 49738 84573 -7289 -40663 -143987
1301 -143987 643 97947 -47435 -2787 11118 -72065 160418 191567 129855 25013 71941
1290 71941 -63795 82515 35110 92496 66545 81923 22193 -63492 -42905 -138191 -174158
1279 -174158 -10591 58040 -82659 -53791 38777 12783 -45729 -71406 -44168 -128677 -148464
1268 -148464 -40084 -47593 -16042 67803 64494 38786 -161117 -34351 28126 -177870 -85664
1257 -85664 -8811 17532 72169 49981 133697 64329 -51413 167783 39174 65837 -105021
1246 -105021 -165519 82364 22637 17262 25073 41898 -7051 -128504 -94631 84170 31110
1235 31110 42689 146830 142450 206599 44965 42953 90540 -10151 97439 25599 -49605
1224 -49605 -99227 -120861 68193 109191 23465 45965 -37601 9835 63704 -72921 -36303
1213 -36303 -70069 43242 86261 1431 -93456 -87505 -26240 -212014 -120514 -20404 -128343
1202 -128343 26987 60547 -184274 28983 13004 -120424 131235 125540 -90841 -8008 55584
1191 55584 31449 11647 -13975 -68808 -24599 110674 5770 -188301 -61574 -57914 -99692
1180 -99692 -80994 -52553 -130998 1958 -10610 113420 168509 36757 196586 71747 -164432
1169 -164432 -151159 -8432 -93791 -15719 -5038 -64148 -104322 -176499 -294783 -247215 -207989
1158 -207989 -136976 -82420 -48792 -133989 -69076 -74809 -36944 -102285 -163311 -94770 -77190 -5830
1146 -5830 87971 -72194 -147392 -93365 -165249 -112675 16127 -23913 46729 -60851 4875
1135 4875 -89223 110028 127413 65573 43436 -60343 -138899 -115158 -251572 -271069 -9317
1124 -9317 -274 -96519 20730 -47184 -110073 -129582 66647 176763 -12231 58369 -104230
1113 -104230 -104202 -62114 139471 -66706 -49277 -93536 -56302 138965 136710 37359 -24384 56979
1101 56979 -56472 69448 155107 79146 84525 18097 16259 47772 -49446 -13694 27093 -50734
1089 -50734 -101596 -147142 -84419 -177172 -26063 -6702 27987 -13964 103026 132569 -86818
1078 -86818 -186849 1819 54430 148069 56011 -108 5725 11401 -59308 -84340 -54617 -117397
1066 -117397 -206382 -139013 -64112 1023 -60844 26308 -43474 -8920 183273 59007 32648
1055 32648 -49634 15863 76174 106937 -13389 -143744 -24758 65939 58259 -9826 16114
1044 16114 6929 -24438 116506 13628 -16131 -123974 -57714 45872 -6462 10752 -40524
1033 -40524 -159326 -1532 12059 42539 -68891 -75135 -40236 -72422 -86912 -122770 -49854
1022 -49854 46261 -10493 -29928 -201559 -107767 22296 -39607 117940 70025 29186 64540
1011 64540 102241 31013 30618 135020 40880 28014 -17746 1215 102699 34386 15867 23644
999 23644 45917 76403 79654 95802 43205 92520 45270 -39350 12904 -66090 -34521 -101284
987 -101284 -44975 54582 47977 -49938 26051 -124875 -167930 -129327 -134720 28744 -9560 -37995
975 -37995 -71157 16152 78027 -6666 -76770 -144280 -320687 -153837 -11054 -112859 -170140
964 -170140 -95003 -54345 19650 -20964 -56330 9514 11621 31978 -46939 95158 40389 12102
952 12102 63814 33869 114432 8875 12995 21026 19750 52720 -17938 22017 -114235 8788
940 8788 83170 31844 -138540 -103350 129839 -73285 -31348 71864 21882 -99197 -55272
929 -55272 78682 -40866 -54323 -14964 -28132 -18728 -195107 -284224 -94568 -132844 -83606
918 -83606 35258 -41324 -88764 -26288 62088 665 -20784 -39670 14372 68134 -56332 -120654
906 -120654 122199 145053 150405 122226 59276 49571 -120123 -66931 -20690 -9697 14585 1430
894 1430 27989 128507 100596 101669 31249 11718 146810 171486 190443 108030 128975 138337
882 138337 46191 -83608 85765 3676 15771 111427 66458 128747 46364 -18298 -44516
871 -44516 36515 223531 113876 -6876 -90050 -115439 37565 -130495 -36458 72618 -11733
860 -11733 -1326 -8551 42868 24729 40425 86170 107829 148527 105508 -143421 -177831 -65786
848 -65786 -38667 -131491 -135017 37735 3117 26403 76572 -12636 10433 162459 79554 151112
836 151112 124372 8718 114189 26298 13628 -1961 -86471 -201524 22189 -23196 -36347
825 -36347 118739 -15409 715 -41201 -44020 -57235 68467 108898 232959 48161 6744
814 6744 70457 -23329 39197 6048 -97859 16134 130873 -43420 -74690 -111218 -105837 -13276
802 -13276 -95111 -23696 107069 66673 -51186 -12461 -114480 -110683 -67685 5044 3358 104651
790 104651 33224 -100603 -6613 -151707 -17060 51793 122779 14324 138586 115944 75659
779 75659 -22264 -101543 -73022 -108310 -54552 -104961 -213097 -53862 40328 -17895 -67074 4098
767 4098 -143202 -45671 114558 -15843 21965 52797 172084 39020 -10151 -69368 -85374
756 -85374 -105621 -148537 -15124 125904 118297 212304 112252 -87361 12939 9692 -205517
745 -205517 -232674 -46180 52883 -71979 132244 39370 -24512 -162 147440 162820 -6112
734 -6112 -45735 -183310 7682 -73456 61156 -4416 -125419 -27402 -51575 -80042 94270
723 94270 5275 -135563 33205 14236 33909 58819 -69901 -105786 -79090 -72859 -8860 -127676
711 -127676 -47507 34457 171405 151531 152256 164269 69694 -9527 56654 -21174 -33939 23397
699 23397 34795 117008 79340 -131928 -55446 -82051 -106707 51122 -26914 6269 -51664 -125542
687 -125542 -148987 61255 -26594 -96452 -56509 4595 -120397 -87912 75661 57248 129498
676 129498 129986 35788 -65600 -77011 -102199 -43820 -65792 -185328 -42072 -30708 -166770
665 -166770 -126092 -181793 -86524 -1719 70072 -21440 82147 49702 4646 6349 63176 -96093
653 -96093 -108468 -5690 -79677 -60383 -31475 112886 20775 153740 104354 140875 178717
642 178717 201188 145364 53739 60135 -22960 -65453 15642 49448 94549 -90781 -93311 -8169
630 -8169 82347 140804 8158 -14678 -32141 38464 -30235 -3836 29901 -42169 -55401 118243
618 118243 196097 1014 -53924 -109833 -80710 33674 28693 135689 75122 -49714 42410
607 42410 -25252 104710 80523 -83620 -116874 -100753 -180600 -94993 33437 23300 49654
596 49654 -2923 -84768 61423 149074 158217 129840 105388 95313 108527 85324 54483 60630
584 60630 15957 -30749 -30666 -21552 -32594 -87470 -37664 -111480 -81630 36047 -29671 50749 38486
571 38486 -35788 -2888 102739 132651 98206 -67683 52742 50797 -10429 29085 101102 30700
559 30700 25302 49731 73878 67712 11956 7161 -57348 9520 -8868 106677 80297 10068
547 10068 -47494 -74660 -256189 -86959 -11309 -50166 92020 120227 186286 -10507 -106905
536 -106905 -45586 46851 105101 -88922 1971 8440 -132237 -81142 -71806 -13767 -12744 -42305
524 -42305 -17000 49420 39071 122928 -15931 -32467 58993 69101 48899 52238 82754 123786
512 123786 19990 9541 44254 90897 145029 28008 50494 7584 -114182 -29857 98947
501 98947 -2660 -41226 6126 -127785 -64439 13568 -28792 -96204 -24517 -58006 60576
490 60576 -11451 13261 2002 117671 160577 35985 -74283 -49304 76786 -34986 -80709
479 -80709 -38700 -44212 -22077 133331 75107 -84468 -21592 5440 -49315 -12022 113439 -23144
467 -23144 -99317 29379 106444 238756 46184 -72624 87737 23372 100325 104170 -45655
456 -45655 62195 215790 71469 -62078 -33636 -63139 -95415 79158 17153 76613 225204
445 225204 6372 -12476 7233 41842 12996 67323 65279 -48220 61768 103139 64354
434 64354 107348 -32101 -22787 -110157 -96284 -116295 -135436 20061 -26281 -47904 -83899 30318
422 30318 -882 -78153 -14793 -37971 143054 246 24624 53605 87274 150612 32864
411 32864 43024 -3996 37178 80046 161473 195851 114771 -131 88732 62502 95573 97914
399 97914 86616 -32936 124138 228609 108837 98939 84345 204379 105815 9914 -34954
388 -34954 12184 6968 83805 -16362 95170 92664 113053 -10153 -15305 52217 103712 25888
376 25888 38074 96418 90580 174912 211449 213232 201121 55394 175004 -112732 -101258 83519
364 83519 35646 126710 28071 -88688 48044 -4731 112754 37429 34316 46165 17688 -61279
352 -61279 -36267 22946 23627 55583 204789 174242 35744 105764 -5642 5952 64680 118013
340 118013 41731 -14979 7352 -8401 82353 67677 16900 29010 152897 316751 105755
329 105755 155718 84864 113726 39966 149962 168969 289327 129803 128810 57789 100031 -27256
317 -27256 33383 158088 -36931 -50850 109985 66209 134443 -30843 -117612 -20550 -50301
306 -50301 -133790 -75709 54585 109947 147339 311951 231045 228294 146654 205453 339376 121606
294 121606 45816 82680 122315 216945 200605 81258 255985 151110 98633 91285 82015 115857
282 115857 106740 77051 119787 249767 37434 -53710 188594 52794 39985 46213 45674 108773
270 108773 269316 284328 20570 20069 113777 251505 67690 83353 83099 84869 192725 37147
258 37147 -573 115725 79221 30190 36934 21689 30629 48970 105533 77368 47762 14991
246 14991 85827 -76313 33665 201668 134601 -61161 61924 257736 144791 140649 164043
235 164043 -16872 99039 78696 39157 33646 64314 -7251 143002 240323 117144 131480
224 131480 185168 126643 110072 135483 154517 171019 93552 98126 4608 139960 87898 7584
212 7584 -29716 20265 153580 171821 163692 102799 15213 74822 98513 172449 159127 20970
200 20970 -72918 44985 126001 -49730 -12333 -10952 81149 178595 69046 -169418 -168392 32675
188 32675 120454 81862 5750 63801 34754 150959 130223 44885 95840 61425 40369 102430
176 102430 160636 138370 16290 14364 5274 43824 212609 258032 102842 170556 270939
165 270939 123861 81332 38402 25631 28967 89569 98174 123301 67646 13655 53588 70796
153 70796 104185 141199 150769 29955 -489 34484 95466 42860 -73334 152365 79142 149702
141 149702 218588 213892 187856 118377 80705 76777 220750 174376 237686 117841 -57503 66933
129 66933 14730 -14762 -1149 72269 43439 90380 117357 81094 101683 134319 131974 106197
117 106197 149066 94981 133364 195897 70524 25556 81208 89488 195814 195046 33050 109697
105 109697 104519 211775 65433 43755 116582 -11068 54778 58279 48408 64775 17106 61019
93 61019 142322 854 99346 47351 58181 139661 67064 72657 97471 113103 151610 88621
81 88621 172500 122763 144035 158668 93262 148481 142880 141729 139025 54540 106864 72155 124009
68 124009 130333 107568 98934 103151 205104 141471 81833 184615 131860 71283 120690 55076
56 55076 -16683 115263 105642 57400 128910 135125 85741 28482 76747 126402 171680 68918
44 68918 220297 284550 216741 127656 41386 108803 117356 161872 138570 86955 82188 141047
32 141047 123114 185156 140860 24460 -13954 33806 26707 16835 9287 26054 30509 72816 143894
19 143894 47029 72786 187138 175118 100633 84261 128661 91380 73363 -26589 94809 110563
7 110563 172005 119677 10612 133145 119080 105245 233163
0 233163
$$ Imaginary data points
##PAGE= N=2
##DATA TABLE= (X++(I..I)), XYDATA
16383 -964063 -851596 -888194 -924371 -899558 -759217 -803056 -770617 -788641 -752521 -785417 -782514
16372 -782514 -731728 -797144 -861845 -750665 -711217 -684675 -742538 -709559 -716419 -743364 -668026
16361 -668026 -553374 -645917 -626365 -592655 -540979 -547417 -526008 -598392 -699218 -601999 -477694
16350 -477694 -488438 -482856 -570096 -530946 -447386 -386666 -477815 -591110 -520465 -496974 -504496 -495852
16338 -495852 -453614 -461134 -356031 -335561 -372033 -372186 -356387 -238386 -209705 -306807 -311552 -352053
16326 -352053 -434032 -392616 -344254 -314984 -233002 -327900 -232629 -195046 -219819 -213748 -206607 -240481
16314 -240481 -169331 -243396 -166971 -145322 -210228 -230635 -107982 -196490 -135877 -130142 -234567
16303 -234567 -83290 -91959 -84522 -19509 -133341 -129986 -174109 -121103 -81901 24224 -23491
16292 -23491 24606 -31212 -4376 -18594 38944 17672 31832 95472 -45117 -9381 18681
16281 18681 1710 115885 149792 97971 76929 52606 57327 63446 47397 -10841 136879 182256
16269 182256 99911 197635 163937 264851 138079 55437 128665 -39783 45820 92233 94492
16258 94492 182031 222699 177492 263494 190809 191608 164412 214686 197620 306200 287909 231422
16246 231422 284284 243157 327438 323716 178343 218584 332533 208211 251380 244424 352128
16235 352128 456968 416326 430631 408845 296825 269768 348957 455114 345093 302663 355497
16224 355497 288255 275401 378640 433855 439343 451600 474749 502538 315337 414345 369305
16213 369305 407203 451329 437282 539196 456662 288079 368227 481052 543017 407524 381756
16202 381756 418587 458096 451312 444217 451228 535752 508694 589832 496533 463616 409378 541080
16190 541080 548148 606006 494850 544100 644716 571520 534359 493980 538452 495628 500049
16179 500049 529349 545455 447229 583380 636472 617782 478757 495437 540730 665203 663385
16168 663385 676888 630092 587503 627823 629815 571797 570353 625768 634958 661479 631472 614120
16156 614120 692229 734851 560633 570896 694290 686812 648897 557564 539958 708869 714429
16145 714429 545301 691561 810891 661091 690620 619169 705026 606409 559521 607459 572230
16134 572230 636812 615153 682908 763334 761999 768388 830243 823299 770695 779895 774970 708195
16122 708195 842791 860086 710228 719122 730579 650668 813696 794984 808612 715462 658882
16111 658882 617416 699874 730672 738666 758083 625654 647144 663053 708558 783542 720409
16100 720409 768030 817560 763376 838499 775275 700347 863836 841367 752317 746187 740026 626977
16088 626977 728926 685793 853223 675731 615484 861539 839091 724202 775827 832786
16078 832786 791048 747257 819219 605241 682783 733090 711734 795560 830446 832049 803392
16067 803392 837857 853072 697910 594675 630371 747810 774693 746782 732232 662709 850215
16056 850215 715314 774304 855539 878550 760223 601183 781750 779535 868468 709156 771492
16045 771492 831339 683857 735076 780569 784734 812814 893106 779121 725135 716984 882846
16034 882846 769840 789023 636838 670613 726392 831899 676474 606457 656226 747093 837938
16023 837938 755008 791156 854951 829472 775607 784960 775142 728794 724591 663374 648995 683966
16011 683966 619836 848342 809348 784801 786125 789300 834625 709655 795112 736748 801271
16000 801271 606845 748281 689639 764705 766760 885119 941789 843449 637748 700742 829095
15989 829095 804574 745793 879544 873252 832063 797665 748159 674511 703444 816473 817576
15978 817576 816266 635398 781018 648230 605430 729408 757516 812908 809380 853762 684605
15967 684605 748687 746901 753448 845299 733383 774363 751436 917269 980284 897806 910817
15956 910817 866738 871205 960240 910308 997974 1020941 1057725 826850 816804 632714 654095
15945 654095 774936 905059 751706 842601 821839 734206 683862 708841 747765 847652 847504
15934 847504 804143 705731 731410 776755 806961 843106 841333 710071 706309 799946 710730 740209
15922 740209 773939 668387 686405 806042 702708 703815 832883 901766 787310 716569 775395
15911 775395 705348 791056 751678 844613 797080 766971 876551 802896 847386 721877 758350
15900 758350 749327 888225 825045 729989 651449 711713 753971 640303 615202 823541 826859
15889 826859 911373 983282 848907 937876 831221 646094 656983 537918 736296 651838
15879 651838 796448 830382 788577 689855 740599 751267 719897 802840 803350 791651 747596 749518
15867 749518 754623 730972 793697 795715 866110 755544 611020 590213 651772 748038 742053 750829
15855 750829 926833 880797 694195 764083 873973 915838 740354 857201 819570 701911
15845 701911 722470 781072 656427 767584 820145 891871 851243 951225 906851 900698 801579
15834 801579 803328 627185 798733 811330 811494 728987 745452 790294 728341 621918 605727
15823 605727 711439 868838 867133 673782 769738 887779 837038 813963 831539 766325 789299
15812 789299 878102 838882 714974 791996 771362 762987 704296 772797 664265 741285 864814
15801 864814 755982 582837 619618 765961 737024 526239 664441 746152 807978 792461
15791 792461 874257 907207 817950 715263 661534 679740 731286 812870 736267 594059 823010
15780 823010 863117 831836 888159 734832 773592 759603 712162 801342 832132 726665 702452
15769 702452 765831 756057 682645 770200 766083 770681 769132 771203 914969 760292 736219 539514
15757 539514 650174 811659 708203 656588 697891 798359 810524 748854 644382 836808
15747 836808 783929 833009 792556 811178 847299 823608 767863 797879 796626 886983 863144 702347
15735 702347 800124 769252 695777 773534 829159 879831 816818 795072 944949 880625 863894
15724 863894 828297 718169 735865 768351 806472 808387 806690 824908 826891 850670 743056 766547
15712 766547 915917 833823 778533 748685 841280 797921 617666 772608 730333 685529 788923
15701 788923 801036 896133 823191 733347 916090 892853 763253 763631 766968 777206 962251
15690 962251 802310 831479 870350 985166 942037 776213 812735 739017 726307 811010 787755
15679 787755 695689 789325 860644 820340 746400 772723 884400 781263 588768 632352 591717
15668 591717 598599 692486 831088 900271 782945 810840 963489 828621 797250 942754 929174
15657 929174 785602 766593 785376 843478 835433 699203 592267 617322 647505 698193 836889
15646 836889 866527 866386 755034 767312 661778 677873 748538 793015 707983 682878 630505
15635 630505 815700 736239 738437 781471 747343 706341 723993 751493 718147 680020 606592
15624 606592 718122 700557 763419 634975 689601 723313 861362 817288 820692 824278 676322
15613 676322 717646 873792 840684 825250 1103012 913479 871189 735798 882148 826571
15603 826571 753902 780764 687021 618505 694005 850695 822522 826922 777884 743826 728044
15592 728044 857279 727897 781635 757847 833854 649560 806088 692197 736061 738900 758859
15581 758859 857487 842046 900821 770613 713175 789442 786395 805315 661811 746490 742127
15570 742127 759444 806874 697909 585560 702958 692129 773276 796927 861014 749790 865911
15559 865911 949423 918639 887875 888068 816281 780902 635162 592434 740661 793375 898050
15548 898050 908955 909583 839357 814404 822323 772851 710530 702145 761920 788533 795358 836099
15536 836099 795073 735630 729209 755011 726093 879560 822325 811389 828362 962494 1003957
15525 1003957 817726 733719 913683 873373 881808 747055 898095 949627 965264 1000905 806548
15514 806548 830773 909794 755838 917880 951224 725259 783819 790128 729017 788067 798510
15503 798510 801517 705038 913753 884431 862338 818692 824195 899721 777081 911384 1050106
15492 1050106 824535 830296 779111 680704 702760 852676 947374 820967 838185 916959 756669
15481 756669 751083 869630 867571 699007 827469 732544 745122 891067 864110 823131 844038
15470 844038 805464 843574 838836 837743 919503 946354 1014337 928187 931901 750079 752238 915135
15458 915135 854493 769045 653105 621133 692147 803298 882710 804593 779524 888459 966388
15447 966388 1027194 897476 863549 834874 869328 869847 916068 1032691 921168 836835 792499
15436 792499 735329 830901 653328 634256 639936 635302 605175 653033 852334 805779 932001
15425 932001 933898 842744 968535 794651 753358 794164 659778 801559 796734 925055 897546
15414 897546 862856 979083 1016011 936670 853979 740249 803969 766904 860150 840167 859579
15403 859579 847145 922989 741177 726226 794548 771278 658863 609922 575988 686964 798603
15392 798603 798918 761908 644324 631868 786612 754300 940646 919086 789700 859251 835523
15381 835523 757445 746850 811386 645911 816604 838990 852200 841752 860541 834754 658698
15370 658698 591625 783607 794567 784945 751360 832975 847441 814495 850595 729589 890334
15359 890334 843505 838044 818159 819062 796562 930770 741869 616955 737144 898732 712293
15348 712293 676804 759942 822394 911616 775835 731534 787710 831675 1021994 1004800 889589
15337 889589 709234 676064 879039 809378 753565 789393 753513 836340 848193 820318 826443
15326 826443 807003 843602 873456 866712 856250 764556 804615 875186 783475 776297 655987 778124
15314 778124 774319 790809 766623 683610 788191 837274 623766 713505 803079 817613 778747
15303 778747 753185 661360 635563 564971 663424 787250 652288 692508 543565 587191 721209
15292 721209 653901 589141 762777 798004 899747 782455 728570 765720 744419 779930 866352
15281 866352 904217 760968 761206 762911 664638 761621 961051 838073 885406 753780 772098
15270 772098 824263 814109 825143 868008 827327 901480 1083321 927516 878598 912593 794766
15259 794766 829949 787680 825242 763974 720995 874833 881319 916051 921929 812533 807640 942202
15247 942202 828713 714621 845953 850670 743634 789918 875520 797423 752181 850515 839649
15236 839649 660522 705066 719741 793669 851834 828641 780818 815775 679549 754098 783861
15225 783861 818229 898344 875067 769173 720632 670630 775033 659545 813087 799686 835247
15214 835247 924173 936716 915936 782130 834458 830349 763639 747756 787389 661891 615882
15203 615882 911436 988482 974183 832379 722762 872477 788139 897058 831165 1004237
15193 1004237 922800 882563 998486 1059920 986972 772111 771142 778339 758442 849599 858582 727886
15181 727886 737516 695604 788920 783306 815182 807455 878877 813446 725116 856335 848465 800293
15169 800293 851228 759299 729780 962935 883410 946459 878491 840780 829591 885720 914902
15158 914902 861106 838677 831229 730384 858012 844221 864566 834384 759038 733118 862067
15147 862067 842740 878536 887830 737920 736993 806394 767005 681338 750082 775843 734128 758396
15135 758396 765490 815575 923507 937273 950518 1082421 982608 848017 742586 839164 762997
15124 762997 731478 781757 754096 981863 836481 782053 799827 963865 912398 771241 872585
15113 872585 849222 884623 919898 1029046 991142 913187 724534 732979 725964 856028 915006
15102 915006 851806 781466 673506 761439 859933 840866 643549 623507 815325 771066 751104
15091 751104 899241 790580 674088 791002 887748 914664 763880 796924 827133 808600
15081 808600 903037 743190 678336 678482 817924 877181 786938 851876 759665 792465 776909
15070 776909 851575 795955 589750 716545 693928 705007 789729 790486 803496 948265 941960
15059 941960 897467 861737 969306 944797 883796 890716 849069 824346 716782 739056 803988
15048 803988 776159 825306 785679 775299 795843 900349 848095 764760 732964 717354 785066
15037 785066 782188 743679 661205 699439 720024 889955 811435 847699 904889 911376 913928 864752
15025 864752 978479 866228 871632 930015 891170 761161 850882 961685 990902 968382 858320
15014 858320 855798 907783 880757 801945 756739 866181 843398 904525 965331 962181 926942 855345
15002 855345 936327 938689 950360 1013794 908999 941982 739195 694144 659694 730845 876229
14991 876229 843688 702284 699693 889364 881331 866884 843281 943931 761550 732646 928971
14980 928971 860877 921867 779790 764932 686900 789450 778349 821529 862207 759584 901115
14969 901115 926802 715255 854436 885244 927335 917959 721935 722342 786415 728930 672015
14958 672015 709740 874774 702741 649728 909835 889989 984183 895058 876713 885895 871479
14947 871479 878748 761516 769321 905631 1080510 1072118 955864 954983 971071 738761 783441
14936 783441 951501 817331 809190 791535 857366 863620 1038500 930929 760955 696484 906057
14925 906057 973188 958272 854506 947253 897168 865370 846861 761539 699223 660276 882998
14914 882998 924114 780080 786721 897155 918741 690303 752340 837103 835076 795142 832626
14903 832626 921118 892202 1029325 1001011 907797 859966 831094 862421 946179 909986 857905
14892 857905 934702 975728 853671 839741 866367 741899 752748 792786 866055 753209 750515
14881 750515 800550 725123 893991 770928 743310 859387 853185 927646 847371 843202 913730
14870 913730 848441 809163 836683 800795 782377 860793 792812 780847 914809 992291 926215
$$ [...]
##END NTUPLES=NMR SPECTRUM
##END=
