##TITLE=1H_CG-1207
 CDCl3
 8 sc, 
 24.7.2024
##JCAMPDX= 6.0         $$ Bruker NMR JCAMP-DX V2.0
##DATA TYPE= NMR SPECTRUM
##DATA CLASS= NTUPLES
##ORIGIN= UXNMR, Bruker Analytische Messtechnik GmbH
##OWNER= root
$$ XWIN-NMR		Version 3.5
$$ Wed Jul 24 14:04:58 2024 Russian Standard Time (UT+4h)  she@DPX200
##.OBSERVE FREQUENCY= 200.1313
##.OBSERVE NUCLEUS= ^1H
##.ACQUISITION MODE= SIMULTANEOUS
##.ACQUISITION SCHEME= undefined
##.AVERAGES= 8
##.DIGITISER RES= 18
##SPECTROMETER/DATA SYSTEM= spect
##.PULSE SEQUENCE= zg30
##.SOLVENT NAME= D2O
##.SHIFT REFERENCE= (INTERNAL, D2O, 0, 19.471)
##AUDIT TRAIL= $$ (NUMBER, WHEN, WHO, WHERE, WHAT)
$$ ##TITLE= Audit trail, XWIN-NMR		Version 3.5
$$ ##JCAMPDX= 5.01
$$ ##ORIGIN= Bruker BioSpin GmbH
$$ ##OWNER= she
$$ F:/spectra/data/she/nmr/H-F/1/pdata/1/auditp.txt
$$ ##AUDIT TRAIL=  $$ (NUMBER, WHEN, WHO, WHERE, WHAT)
(   1,<2024-07-24 14:03:26.89 +0400>,<she>,<DPX200>,
      <created by zg, POWCHK disabled, PULCHK disabled
       configuration hash MD5:
       00 E9 B6 7A A2 85 ED C7 34 08 36 98 17 FE 4E 26
       data hash MD5: 16K
       4A 1F A5 D0 8F 5E E3 BB 19 39 89 2A 2C 24 18 60>)
(   2,<2024-07-24 14:03:31.03 +0400>,<she>,<DPX200>,
      <Start of raw data processing
       efp BC_mod = 2 LB = 0.24 FT_mod = 6 PKNL = 1 PHC0 = -25636.05 PHC1 = 11.78749 SI = 16K 
       data hash MD5: 16K
       9B 0D E4 ED D3 B4 4D DC 79 55 45 68 80 35 3F 26>)
(   3,<2024-07-24 14:03:55.01 +0400>,<she>,<DPX200>,
      <pk PHC0 = -0.1838827 PHC1 = 1.2 
       data hash MD5: 16K
       1E A7 71 66 AC B7 BB 23 38 D1 FF 44 05 53 64 C2>)
(   4,<2024-07-24 14:03:59.00 +0400>,<she>,<DPX200>,
      <abs ABSG = 5 
       data hash MD5: 16K
       1E 43 2F 3A 4D E6 84 5D E1 09 B7 40 47 5B 4A 29>)
$$ ##END=
$$ 
$$ hash MD5
$$ 33 DB 2F 6D 79 78 C4 8F 53 96 15 4B 1F CC 8D BC
##$RELAX= 
##$RELAX= 
##$RELAX= 
##$RELAX= 
##$RELAX= 
##$RELAX= 
$$ Bruker specific parameters
$$ --------------------------
##$DU= <F:/spectra>
##$EXPNO= 1
##$NAME= <H-F>
##$PROCNO= 1
##$TYPE= <nmr>
##$USER= <she>
##$AMP= (0..31)
100 100 100 100 100 100 100 100 100 100 100 100 100 100 100 100 100 100 
100 100 100 100 100 100 100 100 100 100 100 100 100 100 
##$AQSEQ= 0
##$AQ_mod= 1
##$AUNM= <au_zg>
##$AUTOPOS= <>
##$BF1= 200.13
##$BF2= 200.13
##$BF3= 200.13
##$BF4= 200.13
##$BF5= 200.13
##$BF6= 200.13
##$BF7= 200.13
##$BF8= 200.13
##$BYTORDA= 1
##$CFDGTYP= 0
##$CFRGTYP= 5
##$CHEMSTR= <none>
##$CNST= (0..31)
1 1 145 1 1 1 1 1 1 1 1 1 1 1 1 1 1 1 1 1 1 1 1 1 1 1 1 1 1 1 1 1 
##$CPDPRG= <>
##$CPDPRG1= <>
##$CPDPRG2= <>
##$CPDPRG3= <>
##$CPDPRG4= <mlev>
##$CPDPRG5= <mlev>
##$CPDPRG6= <mlev>
##$CPDPRG7= <mlev>
##$CPDPRG8= <mlev>
##$CPDPRGB= <>
##$CPDPRGT= <>
##$D= (0..31)
0 1.2 0 0 0 0 0 0 0 0.06 0 0.03 0 0 0 0 0.0002 0 0 0 0 0 0 0 0 0 0 0 0 
0 0 0 
##$DATE= 1721815406
##$DBL= (0..7)
120 120 120 120 120 120 120 120 
##$DBP= (0..7)
150 150 150 150 150 150 150 150 
##$DBP07= 0
##$DBPNAM0= <>
##$DBPNAM1= <>
##$DBPNAM2= <>
##$DBPNAM3= <>
##$DBPNAM4= <>
##$DBPNAM5= <>
$$ [...]
##$SUBNAM3= <"">
##$SUBNAM4= <"">
##$SUBNAM5= <"">
##$SUBNAM6= <"">
##$SUBNAM7= <"">
##$SUBNAM8= <"">
##$SUBNAM9= <"">
##$SW= 24.0689771365484
##$SWIBOX= (0..15)
0 0 2 0 0 0 0 0 0 0 0 0 0 0 0 0 
##$SW_h= 4816.95568400771
##$TD= 16384
##$TD0= 1
##$TE= 0
##$TE2= 300
##$TE3= 300
##$TEG= 300
##$TL= (0..7)
0 120 120 120 120 120 120 120 
##$TP= (0..7)
150 150 150 150 150 150 150 150 
##$TP07= 0
##$TPNAME0= <>
##$TPNAME1= <>
##$TPNAME2= <>
##$TPNAME3= <>
##$TPNAME4= <>
##$TPNAME5= <>
##$TPNAME6= <>
##$TPNAME7= <>
##$TPOAL= (0..7)
0.5 0.5 0.5 0.5 0.5 0.5 0.5 0.5 
##$TPOFFS= (0..7)
0 0 0 0 0 0 0 0 
##$TUNHIN= 0
##$TUNHOUT= 0
##$TUNXOUT= 0
##$USERA1= <user>
##$USERA2= <user>
##$USERA3= <user>
##$USERA4= <user>
##$USERA5= <user>
##$V9= 5
##$VALIST= <valist>
##$VCLIST= <CCCCCCCCCCCCCCC>
##$VD= 0
##$VDLIST= <DDDDDDDDDDDDDDD>
##$VPLIST= <PPPPPPPPPPPPPPP>
##$VTLIST= <TTTTTTTTTTTTTTT>
##$WBST= 1024
##$WBSW= 4
##$XGAIN= (0..3)
0 0 0 0 
##$XL= 0
##$YL= 0
##$YMAX_a= 423911
##$YMIN_a= -355332
##$ZGOPTNS= <>
##$ZL1= 120
##$ZL2= 120
##$ZL3= 120
##$ZL4= 120
##$ABSF1= 19.46805
##$ABSF2= -4.601107
##$ABSG= 5
##$ABSL= 3
##$ALPHA= 0
##$AQORDER= 0
##$ASSFAC= 0
##$ASSFACI= 0
##$ASSFACX= 0
##$ASSWID= 0
##$AUNMP= <proc_1d>
##$AZFE= 0.1
##$AZFW= 0.1
##$BCFW= 0
##$BC_mod= 2
##$BYTORDP= 0
##$COROFFS= 0
##$CY= -3
##$DATMOD= 1
##$DC= 0
##$DFILT= <>
##$DTYPP= 0
##$F1P= 0
##$F2P= 0
##$FCOR= 1
##$FTSIZE= 16384
##$FT_mod= 6
##$GAMMA= 0
##$GB= 0
##$INTBC= 1
##$INTSCL= 3.70164e-10
##$ISEN= 128
##$LB= 0.24
##$LEV0= 0
##$LPBIN= 0
##$MAXI= 10000
##$MC2= 0
##$MEAN= 0
##$ME_mod= 0
##$MI= 1.114404
##$NCOEF= 0
##$NC_proc= -6
##$NLEV= 6
##$NOISF1= 3.799351
##$NOISF2= 2.8
##$NSP= 0
##$NTH_PI= 0
##$NZP= 0
##$OFFSET= 19.47098
##$PC= 1
##$PHC0= -25636.23
##$PHC1= 12.98749
##$PH_mod= 1
##$PKNL= yes
##$PPARMOD= 0
##$PSCAL= 0
##$PSIGN= 0
##$REVERSE= no
##$SF= 200.129811754503
##$SI= 16384
##$SIGF1= 3
##$SIGF2= 2
##$SINO= 5.538805
##$SIOLD= 16384
##$SREGLST= <1H.CDCl3>
##$SSB= 0
##$STSI= 16384
##$STSR= 0
##$SW_p= 4816.95568400771
##$SYMM= 0
##$S_DEV= 0
##$TDeff= 16384
##$TDoff= 0
##$TI= <>
##$TILT= no
##$TM1= 0
##$TM2= 0
##$TOPLEV= 0
##$USERP1= <user>
##$USERP2= <user>
##$USERP3= <user>
##$USERP4= <user>
##$USERP5= <user>
##$WDW= 1
##$XDIM= 16384
##$YMAX_p= 397289096
##$YMIN_p= -526887
$$ End of Bruker specific parameters
$$ ---------------------------------
##NTUPLES= NMR SPECTRUM
##VAR_NAME=  FREQUENCY,     SPECTRUM/REAL,   SPECTRUM/IMAG
##SYMBOL=    X,             R,               I
##VAR_TYPE=  INDEPENDENT,   DEPENDENT,       DEPENDENT
##VAR_FORM=  AFFN,          ASDF,            ASDF
##VAR_DIM=   16384,         16384,           16384
##UNITS=     HZ,            ARBITRARY UNITS, ARBITRARY UNITS
##FACTOR=    0.29402158847633, 1,            1
##FIRST=     3896.72350014587, 0,            0
##LAST=      -920.232183861836, 0,           0
##MIN=       -920.232183861836, -526887,     0
##MAX=       3896.72350014587, 397289096,    0
$$ Real data points
##PAGE= N=1
##DATA TABLE= (X++(R..R)), XYDATA
$$ [...]
$$ plain form
6452 -41860 -214143 -236711 -210747 -100766 89691 251756 257626 266677 243217 54159 72257
6441 72257 -44795 -64471 -41951 -134959 -7376 142703 132734 143851 332502 301119 162438
6430 162438 249677 270595 223294 69330 31114 22394 -46908 -58471 -134280 -87715 1763 190465
6418 190465 166610 500419 799913 656952 456643 270562 90515 23542 74645 41396
6408 41396 166518 323519 462788 503147 563325 534722 482494 464243 374846 93944 167941
6397 167941 281071 439151 334118 196819 329830 260336 378088 584969 622262 478984
6387 478984 510391 351334 233325 201751 10602 -63378 195471 353069 354242 481912 618320
6376 618320 677541 549285 397709 161679 37500 -48192 107430 176966 151011 302533
$$ packed form
6452d1860j72283k2568K5964J09981J90457J62065N870R051k3460j89058J8098
6441G2257j17052j9676K2520r3008J27583J50079r969J1117J88651l1383j38681
6430A62438Q7239K0918m7301j53964l8216q720o9302j1563p5809M6565Q9478J88702
6418A90465k3855L33809K99494j42961k00309j86081j80047o6973N1103l3249
6408D1396J25122J57001J39269M0359O0178k8603n2228j8251q9397k80902P3997
6397A67941J13130J58080j05033j37299J33011o9494J17752K06881L7293j43278
6387D78984L1407j59057j18009l1574j91149p3980K58849J57598J173J27670J36408
6376F18320N9221j28256j51576k36030j24179q5692J55622O9536k5955J51522
$$ plain form
6366 302533 402418 206494 220888 284074 179566 149044 231208 316415 457616 303805 154766
6355 154766 233870 80069 -31446 190981 224792 276113 494475 566046 582945 456814 232408
6344 232408 97844 -47494 -232299 -288135 -13346 375559 484538 654423 712793 654983
6334 654983 571310 394166 158889 -87877 -165399 4983 175884 273741 519480 460806
6324 460806 428293 556650 532818 522794 531468 395933 265639 311726 299348 147401 125997
6313 125997 220621 321054 446342 430972 669900 574959 550127 365348 213472 95440
6303 95440 174858 155801 139909 238806 515457 538289 604270 637443 494914 405018 420825
6292 420825 297191 253134 167889 -78929 -174258 8945 172721 238225 313293 456946 671116
$$ packed form
6366C02533R9885j95924J4394O3186j04508l0522Q2164Q5207J41201j53811j49039
6355A54766P9104j53801j11515K22427L3811N1321K18362P1571J6899j26131k24406
6344B32408j34564j45338j84805n5836K74789L88905J08979J69885N8370n7810
6334F54983q3673j77144k35277k46766p7522J70382J70901R7857K45739n8674
6324D60806l2513J28357k3832j0024Q674j35535j30294M6087j2378j51947k1404
6313A25997R4624J00433J25288j5370K38928r4941k4832j84779j51876j18032
6303I5440P9418j9057j5892R8897K76651K2832O5981L3173j42529q9896J5807
6292D20825j23634m4057q5245k46818r5329J83203J63776O5504P5068J43653K14170
$$ plain form
6281 671116 461889 431530 417071 112797 94079 -77718 -103764 -3516 75142 306161 488907
6270 488907 572705 505864 495138 347788 202105 25711 39034 146678 154559 199309 396261
6259 396261 388241 524299 582517 461998 458881 467754 503752 597890 496746 327866 207904
6248 207904 73209 -1239 205826 237239 478752 668480 751187 915741 812525 492783
6238 492783 330104 224727 51526 206273 118363 254546 424536 688996 786731 792854
6228 792854 839186 689902 587323 449103 253997 241204 324211 345802 442359 611652 748366
6217 748366 942957 1079807 998786 890052 732055 578676 527759 498505 494060 635808 764612
6206 764612 1013734 1049235 1228977 1128836 1104315 1079763 1021928 1022067 936990 992899 1076406
$$ packed form
6281F71116k09227l0359j4459l04274j8718j71797k6046J00248P8658K31019J82746
6270D88907Q3798o6841j0726j47350j45683j76394J3323J07644P881M4750J96952
6259C96261q020J36058N8218j20519l117Q873L5998R4138j01144j68880j19962
6248B07904j34695p4448K07065L1413K41513J89728Q2707J64554j03216l19742
6238D92783j62679j05377j73201J54747q7910J36183J69990K64460R7735O123
6228G92854M6332j49284j02579j38220j95106j2793Q3007K1591R6557J69293J36714
6217G48366J94591J36850q1021j08734j57997j53379n0917k9254m445J41748J28804
6206G64612K49122L5501J79742j00141k4521k4552n7835J39q5077N5909Q3507
$$ plain form
6195 1076406 1076417 1029454 971584 1062971 1218479 1471626 1630907 1699818 1653134 1579472 1145102
6184 1145102 776642 747750 630782 835134 1097079 1317670 1838508 2178475 2349359 2324693
6174 2324693 1988980 1688064 1436818 1255917 1143964 1044980 957392 1021109 1107367 1136774
6164 1136774 1421174 1551769 1572020 1514551 1350561 1355173 1303995 1143221 956588 921789 950858
6153 950858 1034896 1302563 1304923 1453720 1495126 1486392 1450059 1243553 931355 808949 774060
6142 774060 680514 622503 695304 885199 1009966 1215308 1221784 1297491 1402254 1104796 904692
6131 904692 662896 343555 450796 511990 846845 1136186 1204503 1331973 1478912 1505505
6121 1505505 1299323 1087845 786767 685819 607679 658695 720576 730975 985555 1092700
$$ packed form
6195A076406J1m6963n7870R1387J55508K53147J59281O8911m6684p3662m34370
6184A145102l68460k8892j16968K04352K61945K20591N20838L39967J70884k4666
6174B324693l35713l00916k51246j80901j11953r8984q7588O3717Q6258K9407
6164A136774K84400J30595K0251n7469j63990M612n1178j60774j86633l4799K9069
6153I50858Q4038K67667K360J48797M1406q734l6333k06506l12198j22406l4889
6142G74060r3546n8011P2801J89895J24767K05342O476P5707J04763k97458k00104
6131I04692k41796l19341J07241O1194L34855K89341O8317J27470J46939K6593
6121A505505k06182k11478l01078j00948p8140N1016O1881J0399K54580J07145
$$ plain form
6111 1092700 1351522 1445202 1463257 1421667 1419240 1230519 1120215 825865 687551 708830 850078
6100 850078 1023853 1095432 1312170 1584247 1758155 1682108 1498135 1241295 1013360 818668
6090 818668 757895 811257 805740 1104649 1514023 1859093 1958219 1899315 1749567 1553189 1298187
6079 1298187 1034765 934801 1075695 1175120 1302052 1376131 1744231 1900330 1756451 1938333
6069 1938333 1980019 1715217 1687585 1620250 1511059 1389479 1363768 1413357 1473069 1733440 1878359
6058 1878359 2022598 2178968 2306110 2217555 2128815 2148290 2028091 1861809 1826535 1892973
6048 1892973 2012587 2256654 2511337 2676164 2894316 2986083 2836229 2684415 2656063 2647398
6038 2647398 2663329 2927580 3294170 3430768 3848584 4151651 4165464 4331627 4528133 4749366
$$ packed form
6111A092700K58822R3680J8055m1590k427j88721j10304k94350j38314K1279J41248
6100H50078J73775P1579K16738K72077J73908p6047j83973k56840k27935j94692
6090H18668o0773N3362n517K98909M09374L45070R9126n8904j49748j96378k55002
6079A298187k63422r9964J40894R9425J26932P4079L68100J56099j43879J81882
6069A938333M1686k64802k7632o7335j09191j21580k5711M9589N9712K60371J44919
6058A878359J44239J56370J27142q8555q8740J9475j20199j66282l5274O6438
6048A892973J19614K44067K54683J64827K18152R1767j49854j51814k8352q665
6038B647398J5931K64251L66590J36598M17816L03067J3813J66163J96506K21233
$$ plain form
6028 4749366 4792321 4885855 4827258 5016290 5156976 5403727 5668250 6121724 6658041 7022089
6018 7022089 7580356 8078955 8580375 9187428 9661498 9955814 10327230 10685471 11177540 11917126
6008 11917126 12726403 13788257 14693317 15817174 16945287 18044602 19570918 21382911
6000 21382911 23812967 26557207 29986715 33785520 37114343 38905223 38986421 37685184
5992 37685184 35876785 33980957 32447173 31431817 30980274 30962011 31136562 31941241 33262609
5983 33262609 35393995 38532291 42562067 47873363 54120368 60954572 67182418 70016834
5975 70016834 67612893 61696305 54792644 48611579 43461845 39543076 36467314 34489158
5967 34489158 32759563 31832949 31250316 31038693 31498244 32543082 34190490 36612908 39597093
$$ packed form
6028D749366M2955R3534n8597J89032J40686K46751K64523M53474N36317L64048
6018G022089N58267M98599N01420O07053M74070K94316L71416L58241M92069P39586
6008A1917126Q09277J061854R05060J123857J128113J099315J526316J811993
6000B1382911K430056K744240L429508L798805L328823J790880Q1198j301237
5992C7685184j808399j895828j533784j015356m51543j8263J74551Q04679J321368
5983C3262609K131386L138296M029776N311296O247005O834204O227846K834416
5975G0016834k403941n916588o903661o181065n149734l918769l075762j978156
5967C4489158j729595r26614n82633k11623M59551J044838J647408K422418K984185
$$ plain form
5958 39597093 42051859 42388094 40410490 37040853 33225019 29723737 26360092 23581361
5950 23581361 21371955 19362396 17509403 16092117 14958374 13979610 13342688 12760317 12371984
5941 12371984 12025011 11724687 11493407 11129879 10902109 10594467 10264364 10216554 10123608 10217812
5931 10217812 10370176 10658885 10989839 11389816 11781155 11856344 11595240 11177033 10561001 9861338
5921 9861338 9440485 9068372 9048071 8885739 8724670 8765825 8922237 9107824 9591862 9971231
5911 9971231 10349864 10856408 11541518 12178363 13095212 13905448 14296498 13730592 12755555 11695112
5901 11695112 10960704 10018690 9219447 8519114 7795454 7256735 6899388 6695723 6620631 6781879
5891 6781879 7119946 7557802 7840836 8261351 8614560 8932043 9219208 8885064 8239504 7643329
$$ packed form
5958C9597093K454766L36235j977604l369637l815834l501282l363645k778731
5950B3581361k209406k009559j852993j417286j133743r78764o36922n82371l88333
5941A2371984l46973l00324k31280l63528k27770l07642l30103m7810r2946R4204
5931A0217812J52364K88709L30954L99977L91339P5189k61104m18207o16032o99663
5921I861338m20853l72113k0301j62332j61069M1155J56412J85587M84038L79369
5911I971231L78633N06544O85110O36845R16849Q10236L91050n65906r75037j060443
5901A1695112p34408r42014p99243p00333p23660n38719l57347k03665p5092J61248
5891F781879L38067M37856K83034M20515L53209L17483K87165l34144o45560n96175
$$ plain form
5881 7643329 6766438 6140091 5588096 5168835 4871076 4586799 4500181 4371284 4447251 4302915
5871 4302915 4054606 3730786 3528999 3615983 3432235 3528381 3541947 3504243 3546437 3543055 3410732
5860 3410732 3184836 2948962 2719595 2635619 2493960 2432948 2526740 2612285 2446509 2487447
5850 2487447 2613504 2893559 3205678 3331339 3426803 3379941 3056949 2592516 2365801 2133943
5840 2133943 1990031 1788655 1948938 2219371 2360651 2341098 2441747 2365677 2110366 1915324
5830 1915324 1801170 1907065 1920440 2281883 2471589 2532345 2502666 2252924 2267353 2226586
5820 2226586 2130827 2045841 1802505 1696390 1540933 1465471 1285752 1360721 1503820 1627982
5810 1627982 1936582 2274909 2378205 2347416 2298515 1940206 1653542 1497353 1390260 1537322
$$ packed form
5881G643329q76891o26347n51995m19261k97759k84277q6618j28897P5967j44336
5871D302915k48309l23820k01787Q6984j83748R6146J3566l7704M2194l382j32323
5860C410732k25896k35874k29367q3976j41659o1012R3792Q5545j65776M0938
5850B487447J26057K80055L12119J25661R5464m6862l22992m64433k26715k31858
5840B133943j43912k01376J60283K70433J41280j9553J00649p6070k55311j95042
5830A915324j14154J05895J3375L61443J89706O0756k9679k49742J4429m0767
5820B226586r5759q4986k43336j06115j55457p5462j79719P4969J43099J24162
5810A627982L08600L38327J03296l0789m8901l58309k86664j56189j07093J47062
$$ plain form
5800 1537322 1766671 1826348 1808129 1999203 2192618 2021729 1971840 1885303 1630084 1606472
5790 1606472 1628429 1517202 1507679 1618161 1887600 2129870 2143221 2200213 2231150 2131500 2010629
5779 2010629 1832223 1659644 1730573 1711127 1723274 1715802 2027897 2013666 2148305 2270045 2407310
5768 2407310 2499804 2432886 2324055 2043543 1909236 1994384 2087256 2130001 2549804 2807129
5758 2807129 2997645 3174652 3137369 3072132 2974954 2909331 2977229 3019664 3146755 3246397 3352575
5747 3352575 3437448 3455644 3526304 3768826 3970105 4018191 3775910 3734041 3497121 3378266
5737 3378266 3299987 3461604 3610726 4012509 4522122 4651830 4604440 4591199 4333496 3998105
5727 3998105 3774930 3779962 3718749 3660807 3721168 3736549 3840888 3935748 3910219 4009102 3992895
$$ packed form
5800A537322K29349N9677j8219J91074J93415j70889m9889q6537k55219k3612
5790A606472K1957j11227r523J10482K69439K42270J3351N6992L0937r9650j20871
5779B010629j78406j72579P0929j9446J2147p472L12095j4231J34639J21740J37265
5768B407310R2494o6918j08831k80512j34307Q5148R2872M2745M19803K57325
5758B807129J90516J77007l7283o5237r7178o5623O7898M2435J27091R9642J06178
5747C352575Q4873J8196P0660K42522K01279M8086k42281m1869k36920j18855
5737C378266p8279J61617J49122M01783N09613J29708m7390j3241k57703l35391
5727C998105k23175N032o1213n7942O0361J5381J04339R4860k5529R8883j6207
$$ plain form
5716 3992895 4037567 4044938 3839840 3675113 3440231 3239671 3287587 3374438 3710655 3870214
5706 3870214 4226179 4326632 4120395 4106383 3912470 3874287 3907980 3789403 3825069 3901437
5696 3901437 4060296 4413396 4619557 4859550 4942103 5044531 5191544 5165785 5325082 5221865
5686 5221865 5220557 5214499 5503587 6160658 6619976 7080228 7586824 7965992 8099631 8556305
5676 8556305 8717597 8471047 8606786 8649527 8933067 9476496 10088164 10738697 11364103 11897150
5666 11897150 12132606 12404566 12764180 13247098 13705615 14371645 15241439 15999207 16994958
5657 16994958 18237207 19582703 20821767 21789458 22781363 23923629 25198426 26755869
5649 26755869 28957756 31445952 34857591 39015691 43420406 47156899 48878246 47555339
$$ packed form
5716C992895M4672P371k05098j64727k34882k00560M7916Q6851L36217J59559
5706C870214L55965J00453k06237j4012j93913l8183L3693j18577L5666P6368
5696C901437J58859L53100K06161K39993Q2553J02428J47013k5759J59297j03217
5686E221865j308o058K89088O57071M59318M60252N06596L79168J33639M56674
5676H556305J61292k46550J35739M2741K83540N43429O11668O50533O25406N33047
5666A1897150K35456K71960L59614M82918M58517O66030Q69794P57768R95751
5657A6994958J242249J345496J239064R67691R91905J142266J274797J557443
5649B6755869K201887K488196L411639M158100M404715L736493J721347j322907
$$ plain form
5641 47555339 44670838 41623980 39097596 37121822 36078039 35633439 35602027 35676850 36381354
5632 36381354 37788175 40089140 43231039 47380306 52522793 59448331 66915154 72213545
5624 72213545 72338534 67230846 60059109 53218951 47254658 42338484 38521847 35500765
5616 35500765 33192910 31496394 30139267 29087733 28968557 29265221 30276806 31800342
5608 31800342 33986577 36551510 38402977 38381377 36223982 32937650 29371627 26078310
5600 26078310 23336627 20881568 19014015 17363109 16124303 15135461 14442978 13922505 13329547
5591 13329547 12951450 12599967 12198528 11862551 11623282 11300855 11051502 10971327 11005582 11006521
5581 11006521 11304882 11298664 11535062 11780229 11777493 11973653 12087235 12293795 12672703 13260974
$$ packed form
5641D7555339k884501l046858k526384j975774j043783m44600l1412P4823P04504
5632C6381354J406821K300965L141899M149267N142487O925538P466823N298391
5624G2213545J24989n107688p171737o840158n964293m916174l816637l021082
5616C5500765k307855j696516j357127j051534j19176K96664J011585J523536
5608C1800342K186235K564933J851467k1600k157395l286332l566023l293317
5600B6078310k741683k455059j867553j650906j238806r88842o92483n20473n92958
5591A3329547l78097l51483m01439l35977k39269l22427k49353q0175L4255R39
5581A1006521K98361o218K36398K45167k736J96160J13582K06560L78908N88271
$$ plain form
5571 13260974 13983393 14553625 14923569 14875035 14727953 14611652 14572232 14421248 14148910 13833378
5561 13833378 13551795 13267344 13380638 13687739 13939060 14571376 15309636 16205283 17263255
5552 17263255 18659900 20114056 21379309 21476755 20744785 19783700 18925044 18507596 18139381
5543 18139381 17849936 17845920 17833902 17928667 17805448 17984505 18012380 18191857 18573369 19280506
5533 19280506 20281561 21551663 22954678 24566462 25973832 27197425 28443891 29641955
5525 29641955 31460486 33918060 36947804 40365074 43635102 45391081 45297249 44027669
5517 44027669 42446364 41163933 40430286 40099040 40143929 40349220 40913898 42141361 44021361
5508 44021361 46720226 50602742 55469550 60175044 63885102 65626997 65181229 63044003
$$ packed form
5571A3260974P22419N70232L69944m8534j47082j16301l9420j50984k72338l15532
5561A3833378k81583k84451J13294L07101K51321O32316P38260Q95647J057972
5552A7263255J396645J454156J265253R7446p31970r61085q58656m17448l68215
5543A8139381k89445m016j2018R4765j23219J79057K7875J79477L81512P07137
5533A9280506J001055J270102J403015J611784J407370J223593J246466J198064
5525B9641955J818531K457574L029744L417270L270028J755979r3832j269580
5517D4027669j581305j282431p33647l31246M4889K05291N64678J227463J880000
5508D4021361K698865L882516M866808M705494L710058J741895m45768k137226
$$ plain form
5500 63044003 59765409 55734927 51157976 46909334 43662930 41311947 39939941 39118705
5492 39118705 38539526 38179017 38489113 39378928 40827028 42652875 44513042 44684400 42405773
5483 42405773 38896518 35165017 31609611 28445111 25834050 23628223 21821475 20117995
5475 20117995 18376433 16902438 15533087 14314943 13238644 12348142 11650178 11130119 10681237
5466 10681237 10348928 10098618 9792340 9245547 8620577 8224874 7777600 7318668 6932998
5457 6932998 6739831 6554998 6486536 6414153 6350830 6484692 6333152 6239029 5902484 5600545
5447 5600545 5339386 4975164 4777132 4571745 4540987 4516191 4534350 4362090 4229347 4210696
5437 4210696 4186488 3898219 3627902 3294940 3081857 3101122 3215161 3117478 3229361 3337050
$$ packed form
5500F3044003l278594m030482m576951m248642l246404k350983j372006q21236
5492C9118705n79179l60509L10096Q89815J448100J825847J860167J71358k278627
5483D2405773l509255l731501l555406l164500k611061k205827j806748j703480
5475B0117995j741562j473995j369351j218144j076299q90502o97964n20059m48882
5466A0681237l32309k50310l06278n46793o24970l95703m47274m58932l85670
5457F932998j93167j84833o8462p2383o3323J33862j51540r4123l36545l01939
5447E600545k61159l64222j98032k05387l0758k4796J8159j72260j32743j8651
5437D210696k4208k88269k70317l32962k13083J9265J14039r7683J11883J07689
$$ plain form
5427 3337050 3453995 3369804 3397167 3248318 3040460 2808608 2639465 2484991 2490864 2547602
5417 2547602 2590839 2566673 2828692 2926171 2916785 2715391 2542120 2456304 2233287 2293088 2262059
5406 2262059 2287236 2307967 2565694 2754030 2728634 2799116 2730484 2662846 2576016 2285466 2285802
5395 2285802 2324908 2373268 2644141 2629937 2840259 3102210 3148796 3081828 2785746 2721008 2582073
5384 2582073 2546545 2504910 2386928 2156702 2337000 2578540 2748044 2692673 2722622 2918186
5374 2918186 2913805 2910218 2791666 2769933 2699988 3045459 3519150 3941530 4332161 4304830 4176950
5363 4176950 3850779 3385996 2960439 2778697 2489012 2414939 2119383 2051337 2156218 2408843
5353 2408843 2533695 2607898 2767248 2772796 2680559 2575901 2560676 2491525 2831547 3171811 3518712
$$ packed form
5427C337050J16945q4191K7363j48849k07858k31852j69143j54474N873N6738
5417B547602M3237k4166K62019R7479r386k01394j73271q5816k23017N9801l1029
5406B262059K5177K0731K57727J88336k5396P0482o8632o7638q6830k90550L36
5395B285802L9106M8360K70873j4204K10322K61951M6586o6968k96082o4738j38935
5384B582073l5528m1635j17982k30226J80298K41540J69504n5371K9949J95564
5374B918186m381l587j18552k1733o9945L45471M73691M22380L90631k7331j27880
5363D176950l26171m64783m25557j81742k89685p4073k95556o8046J04881K52625
5353B408843J24852P4203J59350N548r2237j04658j5225o9151L40022L40264L46901
$$ plain form
5342 3518712 3774247 4065888 3996540 3652691 3431329 3032303 2768234 2445070 2119227 2061857
5332 2061857 2008463 2112079 2097232 2294970 2623586 2752252 2636706 2668491 2631278 2481732
5322 2481732 2294966 2474036 2375763 2504668 2746602 2866732 2881687 3047440 3066364 2855041
5312 2855041 2669063 2491162 2117828 1945934 2073889 2060816 2188460 2267714 2762234 2904043
5302 2904043 2926149 2941332 2801284 2735959 2758950 2620517 2444996 2438142 2329004 2487120 2687372
5291 2687372 2741116 2992603 2812150 2704062 2552518 2331047 2130612 2060911 2099996 2208563
5281 2208563 2444265 2589044 2707825 2872659 2941151 2753342 2727047 2679778 2345101 2251205
5271 2251205 1894397 1766341 1823481 1956470 2284895 2511751 2584200 2641850 2441488 2116203
$$ packed form
5342C518712K55535K91641o9348l43849k21362l99026k64069l23164l25843n7370
5332B061857n3394J03616j4847J97738L28616J28666j15546L1785l7213j49546
5322B481732j86766J79070r8273J28905K41934J20130J4955J65753J8924k11323
5312B855041j85978j77901l73334j71894J27955j3073J27644P9254M94520J41809
5302B904043K2106J5183j40048o5325K2991j38433j75521o854j09138J58116K00252
5291B687372N3744K51487j80453j08088j51544k21471k00435o9701L9085J08567
5281B208563K35702J44779J18781J64834O8492j87809k6295m7269l34677r3896
5271B251205l56808j28056N7140J32989L28425K26856P2449N7650k00362l25285
$$ plain form
5261 2116203 1734735 1576040 1532688 1553958 1821134 2125013 2329679 2542728 2669773 2508888
5251 2508888 2241722 1859171 1570754 1417351 1356932 1412855 1396776 1637150 1881495 2159327
5241 2159327 2167130 2044407 1956565 1542314 1453897 1283571 1130669 1136999 1163419 1528879 1687490
5230 1687490 1872340 2044934 2029946 2085852 1878366 1523688 1148049 931212 1112498 1150045
5220 1150045 1268432 1635271 1827268 2234250 2331922 2284787 2113737 1854164 1603756 1373695
5210 1373695 1234837 1283973 1529428 1831134 2201211 2369187 2458835 2395221 2220742 1941093
5200 1941093 1758420 1633208 1651509 1790611 1768220 2018892 2261231 2474633 2460082 2417680
5190 2417680 2247097 2169924 1895243 1701037 1618040 1629265 1798445 2091600 2315936 2596586
$$ packed form
5261B116203l81468j58695m3352K1270K67176L03879K04666K13049J27045j60885
5251B508888k67166l82551k88417j53403o0419N5923j6079K40374K44345K77832
5241B159327P803j22723q7842m14251q8417j70326j52902O330K6420L65460J58611
5230A687490J84850J72594j4988N5906k07486l54678l75639k16837J81286L7547
5220A150045J18387L66839J91997M06982R7672m7135j71050k59573k50408k30061
5210A373695j38858M9136K45455L01706L70077J67976Q9648o3614j74479k79649
5200A941093j82673j25212J8301J39102k2391K50672K42339K13402j4551m2402
5190B417680j70583p7173k74681j94206q2997J1225J69180K93155K24336K80650
$$ plain form
5180 2596586 2591929 2626581 2700992 2548374 2194014 2036307 1969116 1939410 2061585 2111211 2396795
5169 2396795 2596167 2665443 2774623 2675123 2507888 2271053 1944806 1797245 1849777 2059530
5159 2059530 2304109 2651899 2822049 3031716 3088053 3006326 2885614 2829811 2468824 2570404
5149 2570404 2578726 2686653 2802995 3222121 3517065 3949811 4293993 4486033 4757436 4610715
5139 4610715 4436726 4003796 3618259 3641131 3665254 3648044 3867900 3881073 4050810 3930222
5129 3930222 3565557 3467714 3184972 3004323 3102672 3265680 3366390 3603981 3794402 3888512
5119 3888512 3932146 3806539 3603322 3340252 3219758 2986043 3035062 3043451 3217436 3324843
5109 3324843 3490203 3646926 3692667 3646609 3702075 3681474 3462340 3285515 3187992 3202742 3351464
$$ packed form
5180B596586m657L4652P4411j52618l54360j57707o7191k9706J22175M9626K85584
5169B396795J99372O9276J09180r9500j67235k36835l26247j47561N2532K09753
5159B059530K44579L47790J70150K09667N6337q1727j20712n5803l60987J01580
5149B570404Q322J07927J16342M19126K94944M32746L44182J92040K71403j46721
5139D610715j73989m32930l85537K2872K4123j7210K19856J3173J69737j20588
5129C930222l64665r7843k82742j80649R8349J63008J00710K37591J90421R4110
5119C888512M3634j25607k03217k63070j20494k33715M9019Q389J73985J07407
5109C324843J65360J56723M5741m6058N5466k0601k19134j76825r7523J4750J48722
$$ plain form
5098 3351464 3527099 3721902 3983412 4186348 4187030 3950549 3823801 3608185 3469662 3460769
5088 3460769 3481330 3799862 3925078 4217238 4273706 4362253 4442456 4438651 4230022 4006421 4012362
5077 4012362 4205158 4221229 4275514 4489189 4806857 4824801 5105414 5300432 5241410 5225888
5067 5225888 5191953 5111102 4979126 5231043 5421544 5941916 6427403 6695173 6805880 6923633
5057 6923633 6954598 7104832 7251911 7417113 7612871 7910502 8313597 9063223 9728101 10527948
5047 10527948 11378102 12505658 13762438 14308014 13970517 13266571 12792449 12334469 12107996
5038 12107996 12257637 12572920 12781205 13092852 13495509 13735764 14074392 14334182 14694719
5029 14694719 15307686 16020358 17038641 18245884 19179040 20353354 21420921 22568795 23785572
$$ packed form
5098C351464J75635J94803K61510K02936O82k36481j26748k15616j38523q893
5088C460769K0561L18532J25216K92160N6468Q8547Q0203l805k08629k23601N941
5077D012362J92796J6071N4285K13675L17668J7944K80613J95018n9022j5522
5067E225888l3935q0851j31976K51917J90501N20372M85487K67770J10707J17753
5057F923633L0965J50234J47079J65202J95758K97631M03095P49626O64878P99847
5047A0527948Q50154J127556J256780N45576l37497p03946m74122m57980k26473
5038A2107996J49641L15283K08285L11647M02657K40255L38628K59790L60537
5029A4694719O12967P12672J018283J207243R33156J174314J067567J147874J216777
$$ plain form
5020 23785572 25022009 26393028 27949035 29717055 31902388 34190497 36871903 39871202
5012 39871202 43019924 46236810 49271345 51748391 54019731 55901058 57640201 59416930
5004 59416930 61242124 63352244 65476040 67884940 70452634 73543029 76541789 79519270
4996 79519270 82309764 84942322 87378558 89448275 91440163 93510472 95722878 97380136
4988 97380136 98675147 99880340 100699191 101227525 101349132 100998590 100690805 100345708 99830856
4979 99830856 99328705 99027293 98593720 97786628 96786061 95629771 94059940 92058696 89671484
4970 89671484 87346581 85101783 82970909 81213013 79619942 77849812 76132029 74040819
4962 74040819 71640914 68995403 65925991 62761073 59403986 55973769 52585633 49752285
$$ packed form
5020B3785572J236437J371019J556007J768020K185333K288109K681406K999299
5012C9871202L148722L216886L034535K477046K271340J881327J739143J776729
5004E9416930J825194K110120K123796K408900K567694L090395K998760K977481
4996G9519270K790494K632558K436236K069717J991888K070309K212406J657258
4988I7380136J295011J205193Q18851N28334J21607l50542l07785l45097n14852
4979I9830856n02151l01412m33573q07092j000567j156290j569831k001244k387212
4970H9671484k324903k244798k130874j757896j593071j770130j717783k091210
4962G4040819k399905k645511l069412l164918l357087l430217l388136k833348
$$ plain form
4954 49752285 46918132 44510638 42463023 40595250 38820038 36968718 35318121 33721969
4946 33721969 32028346 30779268 29486391 28484700 27832131 27237348 26693300 26066158 25534108
4937 25534108 25046190 24677028 24355318 24324539 24443565 24826374 25331932 26222837 27238652
4928 27238652 27877306 28454559 28559448 28904056 29117837 29329575 30041440 30989925 32003457
4919 32003457 33371616 35111563 37117714 39538161 42443719 45806185 49663725 53660850
4911 53660850 56865259 58410839 57878557 56290328 54684711 53203651 51871785 51134627
4903 51134627 50813897 50513036 50357289 50659984 51891423 54166412 57179954 60598000 63667990
4894 63667990 66048551 67841378 67804807 65784496 62221941 57636270 53188719 49388915
$$ packed form
4954D9752285k834153k407494k047615j867773j775212j851320j650597j596152
4946C3721969j693623j249078j292877j001691o52569n94783n44048o27142n32050
4937B5534108m87918l69162l21710l0779J19026L82809N05558Q90905J015815
4928B7238652O38654N77253J04889L44608K13781K11738P11865R48485J013532
4919C2003457J368159J739947K006151K420447K905558L362466L857540L997125
4911E3660850L204409J545580n32282j588229j605617j481060j331866p37158
4903E1134627l20730l00861j55747L02695J231439K274989L013542L418046L069990
4894F3667990K380561J792827l6571k020311l562555m585671m447551l799804
$$ plain form
4886 49388915 46384341 44187046 42519198 41498099 40568798 39899317 39762390 39885489 40808785
4877 40808785 41909642 42693008 42214382 39950170 36687018 33156231 29885698 27137955
4869 27137955 24766821 22530047 20469893 18668857 17129830 15825064 14659753 14064714
4861 14064714 13685412 13251685 13009540 12641591 12294946 11778817 11306208 10671365 10053095
4852 10053095 9677692 9182420 8835424 8454323 8501048 8430965 8295595 8027088 7577239 6992397
4842 6992397 6702728 6250954 5966175 6010529 5810314 6085718 6240551 6246289 6190018 5959699
4832 5959699 5497427 5283905 4882520 4502594 4293180 4095224 4120275 4443566 4528547 4379084
4822 4379084 4420769 4252179 4082488 3777932 3436494 3254736 3071363 3181326 3340917 3538973
$$ packed form
4886D9388915l004574k197295j667848j021099r29301o69481j36927J23099R23296
4877D0808785J100857P83366m78626k264212l263152l530787l270533k747743
4869B7137955k371134k236774k060154j801036j539027j304766j165311n95039
4861A4064714l79302m33727k42145l67949l46645n16129m72609o34843o18270
4852A0053095l75403m95272l46996l81101M6725p0083j35370k68507m49849n84842
4842F992397k89669m51774k84779M4354k00215K75404J54833N738n6271k30319
4832E959699m62272k13522m01385l79926k09414j97956K5051L23291Q4981j49463
4822D379084M1685j68590j69691l04556l41438j81758j83373J09963J59591J98056
$$ plain form
4812 3538973 3623132 3812973 3822957 3619435 3233938 3051713 2831840 2700485 2633670 2648672
4802 2648672 2822184 3119936 3238729 3171256 3140063 2980102 2757916 2601963 2429718 2414027
4792 2414027 2377165 2419438 2603993 2834375 3003707 3011507 3193337 2849027 2527160 2387504
4782 2387504 2321412 2262859 2463597 2553177 2849228 3031568 3122222 3078965 2962493 2873351 2668396
4771 2668396 2436858 2357642 2300422 2371369 2472264 2744480 2913216 2849924 2827703 2622216
4761 2622216 2506908 2406888 2219476 2168045 2207365 2523509 2476019 2647617 2655674 2861866
4751 2861866 2865405 2634194 2458213 2350571 2179867 2027572 2044754 2230228 2414857 2619730
4741 2619730 2649725 2736853 2598440 2330489 2082020 1955842 1709744 1664097 1842428 1970696
$$ packed form
4812C538973Q4159J89841R984k03522l85497j82225k19873j31355o6815J5002
4802B648672J73512K97752J18793o7473l1193j59961k22186j55953j72245j5691
4792B414027l6862M2273J84555K30382J69332P800J81830l44310l21867j39656
4782B387504o6092n8553K00738Q9580K96051J82340R0654m3257j16472q9142k04955
4771B668396k31538p9216n7220P0947J00895K72216J68736o3292k2221k05487
4761B622216j15308j00020j87412n1431L9320L16144m7490J71598Q057K06192
4751B861866L539k31211j75981j07642j70704j52295J7182J85474J84629K04873
4741B619730K9995Q7128j38413k67951k48469j26178k46098m5647J78331J28268
$$ plain form
4731 1970696 2250688 2261985 2435910 2358948 2308237 1914586 1743914 1708489 1595953 1548008
4721 1548008 1831693 2115509 2420427 2485930 2429886 2379356 2032052 1851180 1647126 1661370
4711 1661370 1713119 1773155 2043206 2434702 2528342 2561602 2689285 2484927 2196277 1915419
4701 1915419 1849497 1904023 2000544 2212310 2571184 2574604 2738430 2784913 2596207 2250267 2085268
4690 2085268 1914154 1932845 2088237 2362206 2578265 3005637 3269135 3136039 3067209 2913661
4680 2913661 2666836 2481042 2341086 2444915 2576033 2919153 3169680 3297309 3333049 3235076
4670 3235076 3174443 3048326 2881753 2867084 2799167 2901903 3236929 3450519 3687153 3729433
4660 3729433 3749279 3551832 3345519 3123524 2992392 3011197 2896974 3113095 3578474 3931451
$$ packed form
4731A970696K79992J1297J73925p6962n0711l93651j70672l5425j12536m7945
4721A548008K83685K83816L04918O5503n6044n0530l47304j80872k04054J4244
4711A661370N1749O0036K70051L91496R3640L3260J27683k04358k88650k80858
4701A915419o5922N4526R6521K11766L58874L420J63826M6483j88706l45940j64999
4690B085268j71114J8691J55392K73969K16059M27372K63498j33096o8830j53548
4680B913661k46825j85794j39956J03829J31118L43120K50527J27629L5740r7973
4670C235076o0633j26117j66573j4669o7917J02736L35026K13590K36634M2280
4660C729433J9846j97447k06313k21995j31132J8805j14223K16121M65379L52977
$$ plain form
4650 3931451 4049402 4025542 3898674 3802410 3529757 3231858 3031796 3276669 3439626 3659238
4640 3659238 3826379 4019733 4179038 4260438 3967101 3579451 3430800 3348808 3411952 3503497
4630 3503497 3924437 4080220 4248139 4393521 4590292 4648536 4150238 4007538 4001297 3891281
4620 3891281 4029013 4271095 4684101 4910813 5056952 5108528 5167668 4853770 4796688 4689197
4610 4689197 4683845 4921703 5165912 5656586 6042771 6357423 6478987 6601869 6812066 6810952
4600 6810952 6683626 6629025 6696047 6783405 7096825 7548612 7936537 8352387 8550056 8740952
4590 8740952 8679097 8871261 9173868 9638492 10272370 10573247 10971387 11422100 11808661 12198227
4580 12198227 12634715 12982828 13443447 14086122 14748155 15180987 15632416 15842749 16001759
$$ packed form
4650C931451J17951k3860j26868r6264k72653k97899k00062K44873J62957K19612
4640C659238J67141J93354J59305Q1400k93337l87650j48651q1992O3144R1545
4630C503497M20940J55783J67919J45382J96771N8244m98298j42700o241j10016
4620C891281J37732K42082M13006K26712J46139N1576N9140l13898n7082j07491
4610D689197n352K37858K44209M90674L86185L14652J21564J22882K10197j114
4600F810952j27326n4601O7022Q7358L13420M51787L87925M15850J97669J90896
4590H740952o1855J92164L02607M64624O33878L00877L98140M50713L86561L89566
4580A2198227M36488L48113M60619O42675O62033M32832M51429K10333J59010
$$ plain form
4571 16001759 16252477 16729184 17008517 17622517 18221468 19055903 19625848 19858086 19871302 19801716
4561 19801716 19790755 19843518 19809684 20126947 20600518 21181892 21912071 22349279 22781606 23266239
4551 23266239 23557265 23678983 23823082 23867263 23924692 24225648 24560179 25315232 26014468 27099314
4541 27099314 28431125 29449719 30089879 30300414 29981542 29384668 29163708 28925633 29308476
4532 29308476 29832549 30800705 32289690 33391790 33723776 33096553 31775619 30409625 29196202
4523 29196202 28380342 27803823 27829519 28004188 28344138 28582511 28226416 27287922 25973647
4514 25973647 24461198 23064744 21886130 21029579 20330090 19969467 19733834 19581638 19162457
4505 19162457 18582856 18038057 17215264 16545313 15818091 15255138 14850949 14582157 14600828 14697929
$$ packed form
4571A6001759K50718M76707K79333O14000N98951Q34435N69945K32238J3216o9586
4561A9801716j0961N2763l3834L17263M73571N81374P30179M37208M32327M84633
4551B3266239K91026J21718J44099M4181N7429L00956L34531P55053O99236J084846
4541B7099314J331811J018594O40160K10535l18872n96874k20960k38075L82843
4532B9308476N24073R68156J488985J102100L31986o27223j320934j365994j213423
4523B9196202q15860n76519K5696J74669L39950K38373l56095r38494j314275
4514B5973647j512449j396454j178614q56551o99489l60623k35633j52196m19181
4505A9162457n79601n44799q22793o69951p27222n62953m04189k68792J8671R7101
$$ plain form
4495 14697929 14883276 15247948 15369908 15385810 15444663 15373247 15310904 15483177 15661726 16102049
4485 16102049 16633327 17185016 18135480 18814292 19237812 19300713 19484477 19836209 20167022 20661812
4475 20661812 21384087 22192175 23201420 24210960 24925772 25471736 26117038 26660823 27094740
4466 27094740 27557519 28214751 29104398 30095286 31128283 32309420 33340687 34279886 35240194
4457 35240194 36151051 37267715 38412340 39505374 40557158 41374172 42306788 43179402 43872196
4448 43872196 44648780 45476358 46069649 46562709 47229600 47974471 48647682 49288746 50007287
4439 50007287 50768912 51861073 53154881 54567534 56435661 58639350 60625867 62507834
4431 62507834 64212027 65847120 67503385 68915031 69929296 70949456 71822003 72078601
$$ packed form
4495A4697929J85347L64672J21960J5902N8853p1416o2343J72273J78549M40323
4485A6102049N31278N51689R50464O78812M23520O2901J83764L51732L30813M94790
4475B0661812P22275Q08088J009245J009540P14812N45964O45302N43785M33917
4466B7094740M62779O57232Q89647R90888J032997J181137J031267R39199R60308
4457C5240194R10857J116664J144625J093034J051784Q17014R32616Q72614O92794
4448D3872196P76584Q27578N93291M93060O66891P44871O73211O41064P18541
4439E0007287P61625J092161J293808J412653J868127K203689J986517J881967
4431F2507834J704193J635093J656265J411646J014265J020160Q72547K56598
$$ plain form
4423 72078601 71939341 71779790 71860435 71776516 71707595 71710024 71670880 71696774 71568443 71571858 71566472
4412 71566472 71867873 72450191 73188400 73996701 74758755 75117882 74933764 74823415 74288890
4403 74288890 73357307 72137031 70755907 69654764 68245698 66451598 64303305 62261753
4395 62261753 60574023 59064067 57796121 56872047 56151164 55554069 54921179 54421488 53796074
4386 53796074 53090148 52566404 51771875 50944241 49920394 49021653 48224149 47459368 46701399
4377 46701399 45662269 44180081 42647959 41065216 39423728 38037232 36584959 35324187
4369 35324187 34106506 32919802 32026458 31280646 30647366 29896498 29359490 28635291 27665742
4360 27665742 26832285 25916280 24958395 24174101 23637235 23041523 22277712 21636517 21046948
$$ packed form
4423G2078601j39260j59551Q0645q3919o8921K429l9144K5894j28331L415n386
4412G1566472L01401N82318P38209Q08301P62054L59127j84118j10349n34525
4403G4288890r31583j220276j381124j101143j409066j794100k148293k041552
4395F2261753j687730j509956j267946r24074p20883n97095o32890m99691o25414
4386E3796074p05926n23744p94529q27634j023847q98741p97504p64781p57969
4377D6701399j039130j482188j532122j582743j641488j386496j452273j260772
4369C5324187j217681j186704q93344p45812o33280p50868n37008p24199r69549
4360B7665742q33457r16005r57885p84294n36866n95712p63811o41195n89569
$$ plain form
4351 21046948 20340699 19456010 18433855 17429219 16701241 15984085 15502766 15302592 14827332
4342 14827332 14620869 14110749 13442980 12902162 12292318 11575435 11211857 10960044 10584561
4333 10584561 10561363 10530361 10241036 9968843 9649247 9247492 8753908 8340888 8072994 8068882
4323 8068882 8127036 8205158 8245191 8131083 8005506 7748626 7349690 7057157 6724664 6719977
4313 6719977 6789778 6894685 7085219 7116429 7129216 6911692 6917134 6749680 6413813 6239185
4303 6239185 6147416 6344800 6570810 6678026 6656107 6524185 6434371 6200274 6056295 5929253
4293 5929253 5799170 5917453 6183469 6375925 6468465 6331079 6153969 5975668 5620972 5424793
4283 5424793 5509197 5555835 5747307 5998055 6110732 6217623 6142534 6009869 5842306 5693959
$$ packed form
4351B1046948p06249q84689j022155j004636p27978p17156m81319k00174m75260
4342A4827332k06463n10120o67769n40818o09844p16883l63578k51813l75483
4333A0584561k3198l1002k89325k72193l19596m01755m93584m13020k67894m112
4323H068882N8154P8122M0033j14108j25577k56880l98936k92533l32493m687
4313F719977O9801J04907J90534L1210J2787k17524N442j67454l35867j74628
4303F239185r1769J97384K26010J07216k1919j31922q9814k34097j43979j27042
4293E929253j30083J18283K66016J92456R2540j37386j77110j78301l54696j96179
4283E424793Q4404M6638J91472K50748J12677J06891p5089j32665j67563j48347
$$ plain form
4273 5693959 5460035 5464358 5756287 5892784 6059047 6115168 6048597 6002295 5982156 5839161 5563594
4262 5563594 5642396 5737193 5689521 5888588 6213962 6385661 6373233 6240167 6062291 5857106
4252 5857106 5807040 5922205 5882258 5923075 6260993 6574583 6549558 6550721 6340729 6178962 5949897
4241 5949897 5832892 5844875 6017025 6220686 6447716 6535997 6456093 6453955 6175442 6057960
4231 6057960 5901864 6004374 6144333 6300041 6551083 6692912 6815256 6891548 6889284 6773584
4221 6773584 6556161 6507529 6692753 6950959 7226996 7454279 7451787 7483275 7539480 7476818 7249813
4210 7249813 7451266 7673554 7797751 8093881 8495352 8567541 8567677 8574060 8617330 8474516 8412638
4199 8412638 8564451 8587968 8813345 8855795 9101231 9082130 9117348 9114210 9088341 9047837 9175854
$$ packed form
4273E693959k33924M323K91929J36497J66263N6121o6571m6302k0139j42995k75567
4262E563594P8802R4797m7672J99067L25374J71699j2428j33066j77876k05185
4252E857106n0066J15165l9947M0817L37918L13590k5025J163k09992j61767k29065
4241E949897j17005J1983J72150K03661K27030Q8281p9904k138k78513j17482
4231F057960j56096J02510J39959J55708K51042J41829J22344P6292k264j15700
4221F773584k17423m8632J85224K58206K76037K27283k492L1488N6205o2662k27005
4210G249813K01453K22288J24197K96130M01471P2189J36O383M3270j42814o1878
4199H412638J51813K3517K25377M2450K45436j9101L5218l138k5869m0504J28017
$$ plain form
4188 9175854 9310812 9520650 9632134 10029197 10080645 9891395 10016623 9980084 9961888 9863952
4178 9863952 9982522 10265324 10565208 10878055 11146927 11249009 11353588 11440127 11376381 11633887
4168 11633887 11745719 11949280 12498923 12782190 12883508 13063104 12944847 12904776 12907873 12761868
4158 12761868 12915664 13176761 13515737 13898813 14110679 14282297 14381104 14202144 14073556 14018994
4148 14018994 14128643 14268311 14561090 14818472 14967087 15110541 15258350 15249486 15320883 15582435
4138 15582435 15595353 15995669 16516426 16925846 17434764 17709112 17950713 18337039 18550074 18893257
4128 18893257 19253201 19776292 20349580 20992117 21472127 21889494 22424185 22818031 23242163
4119 23242163 23700704 24343734 24865316 25623877 26127014 26869174 27591580 28252107 28887946
$$ packed form
4188I175854J34958K09838J11484L97063N1448j89250J25228l6539j8196r7936
4178I863952J18570K82802K99884L12847K68872J02082J04579Q6539o3746K57506
4168A1633887J11832K03561N49643K83267J01318J79596j18257m0071L097j46005
4158A2761868J53796K61097L38976L83076K11866J71618R8807j78960j28588n4562
4148A4018994J09649J39668K92779K57382J48615J43454J47809q864P1397K61552
4138A5582435J2918M00316N20757M09420N08918K74348K41601L86326K13035L43183
4128A8893257L59944N23091N73288O42537M80010M17367N34691L93846M24132
4119B3242163M58541O43030N21582P58561N03137P42160P22406O60527O35839
$$ plain form
4110 28887946 29533199 30480761 31346275 32246571 33324712 34554917 35869403 37223644 38685153
4101 38685153 40251498 42030985 44175431 46795454 49685094 52878116 56106908 58910967
4093 58910967 61016021 62603784 63358186 63675733 63565411 63435373 63552422 63878478 64495977
4084 64495977 65170820 65434639 65433554 64815784 63683746 62158109 60073560 57869942 55573924
4075 55573924 53293862 51278278 49500515 47835103 46381477 45166281 44053583 43210589
4067 43210589 42600123 41879578 41447507 40830223 40388575 39925743 39328188 38860793 38441608
4058 38441608 38105648 37730953 37594038 37541281 37273506 37107099 36913383 36561945 36189469 35942256
4048 35942256 35744780 35781659 35809862 35718621 35549868 35587938 35702186 35780483 35753112 35692993 35936529
$$ packed form
4110B8887946O45253R47562Q65514R00296J078141J230205J314486J354241J461509
4101C8685153J566345J779487K144446K620023K889640L193022L228792K804059
4093E8910967K105054J587763P54402L17547j10322j30038J17049L26056O17499
4084F4495977O74843K63819j085o17770j132038j525637k084549k203618k296018
4075E5573924k280062k015584j777763j665412j453626j215196j112698q42994
4067D3210589o10466p20545m32071o17284m41648m62832n97555m67395m19185
4058C8441608l35960l74695j36915n2757k67775j66407j93716l51438l72476k47213
4048C5942256j97476L6879K8203r1241j68753L8070J14248P8297k7371o0119K43536
$$ plain form
4037 35936529 36273949 36624253 37029783 37328870 37833406 38251419 38948968 39526123 39904346
4028 39904346 40574384 41348843 42157348 43223175 44197301 45108859 46273406 47532849 48698149
4019 48698149 49954405 51372459 52986282 54555387 56339464 58280693 60362104 62829499
4011 62829499 65509996 68344331 71528332 74901722 78708226 82867969 87193166 92198437
4003 92198437 97857684 104389335 111767991 120219039 129184125 138144569 147066512 155492634
3995 155492634 163351133 170302528 176685013 183246630 189872923 196874542 203868298 210362132
3987 210362132 215585476 219354896 221241058 221210840 219900337 217889505 215768798 214537497
3979 214537497 214129870 214740190 216577402 219578402 223373871 226974327 229890631 231611702
$$ packed form
4037C5936529L37420L50304M05530K99087N04536M18013O97549N77155L78223
4028C9904346O70038P74459Q08505J065827R74126R11558J164547J259443J165300
4019D8698149J256256J418054J613823J569105J784077J941229K081411K467395
4011F2829499K680497K834335L184001L373390L806504M159743M325197N005271
4003I2198437N659247O531651P378656Q451048Q965086Q960444Q921943Q426122
3995A55492634P858499O951395O382485O561617O626293P001619O993756O493834
3987B10362132N223344L769420J886162l0218j310503k010832k120707j231301
3979B14537497m07627O10320J837212L001000L795469L600456K916304J721071
$$ plain form
3971 231611702 231595558 229473069 225644738 220781358 215771241 211532975 208957256 207940459
3963 207940459 207899246 208405821 208408929 207189103 204148573 199416489 192699051 184735011 176512717
3954 176512717 168977570 162612900 157026557 151987591 147064487 142534478 137606483 131750417
3946 131750417 125115331 118981836 113892323 109328383 105310190 101724620 98152052 94762566
3938 94762566 91299015 87435233 83538622 79377958 75173828 71240259 67825447 64808346
3930 64808346 62496219 61137923 60861187 59895994 57628413 54269065 51041169 48689281
3922 48689281 46671630 45164623 44126980 43689208 43175198 43023002 42944741 42828230 41967905
3913 41967905 40955414 40398182 39976428 39688966 39610765 39669298 39641436 39646165 39684528 39629332
$$ packed form
3971B31611702j6144k122489l828331m863380n010117m238266k575719j016797
3963B07940459m1213N06575L108j219826l040530m732084o717438p964040q222294
3954A76512717p535147o364670n586343n038966m923104m530009m927995n856066
3946A31750417o635086o133495n089513m563940m018193l585570l572568l389486
3938I4762566l463551l863782l896611m160664m204130l933569l414812l017101
3930F4808346k312127j358296k76736r65193k267581l359348l227896k351888
3922D8689281k017651j507007j037643m37772n14010j52196p8261j16511q60325
3913D1967905j012491n57232m21754k87462p8201N8533k7862M729L8363n5196
$$ plain form
3903 39629332 39742319 39940740 40277809 40534963 40732566 40873956 40935263 41342360 42108290 42908441
3893 42908441 43301908 43932940 44572271 45407276 46542126 47833807 49389618 51284427 53323131
3884 53323131 55779239 58039793 60262863 62049176 63172274 64255420 65057553 65696239
3876 65696239 66599919 67830294 69281185 70525663 71823451 73254399 74685798 76108008
3868 76108008 77331175 78235946 78587042 78923318 78635630 77956860 76880040 75398271 73859871
3859 73859871 72736765 72411418 72852240 74009394 75697308 77945311 80959563 84814864
3851 84814864 89452255 95070824 101955251 110051813 118796323 127908487 136619682 144428211
3843 144428211 150741019 155382949 158229266 158602084 156995530 153271182 147992532 141703751
$$ packed form
3903C9629332J12987J98421L37069K57154J97603J41390O1307M07097P65930Q00151
3893D2908441L93467O31032O39331Q35005J134850J291681J555811J894809K038704
3884E3323131K456108K260554K223070J786313J123098J083146Q02133O38686
3876F5696239R03680J230375J450891J244478J297788J430948J431399J422210
3868G6108008J223167R04771L51096L36276k87688o78770j076820j481769j538400
3859G3859871j123106l25347M40822J157154J687914K248003L014252L855301
3851H4814864M637391N618569O884427Q096562Q744510R112164Q711195P808529
3843A44428211O312808M641930K846317L72818j606554l724348n278650o288781
$$ plain form
3835 141703751 134740826 127863060 121422677 115451142 110130942 105327255 100923543 96689093
3827 96689093 93002040 89931250 87787139 86508559 86136801 86664858 87601129 88928744 90198158
3818 90198158 91207643 92225714 93011645 93383734 93484779 92596759 90735084 87590168 83349079
3809 83349079 78579383 73436492 68333945 63771595 59771286 56018617 52286489 48742892
3801 48742892 45620050 42636908 40498266 38840947 37927419 37454741 36798222 35906058 34932428
3792 34932428 34005439 33312429 33076148 33302262 33422993 33353163 33056073 32457685 31992662 31647064
3782 31647064 31968559 32860297 33957189 34956333 35731170 35849194 35723834 35478890 35458591
3773 35458591 35739819 35866062 35630104 34884174 33658585 31817940 30361960 29321802 28611415
$$ packed form
3835A41703751o962925o877766o440383n971535n320200m803687m403712m234450
3827I6689093l687053l070790k144111j278580l71758N28057R36271J327615J269414
3818I0198158J009485J018071P85931L72089J01045q88020j861675l144916m241089
3809H3349079m769696n142891n102547m562350m000309l752669l732128l543597
3801D8742892l122842k983142k138642j657319r13528m72678o56519q92164r73630
3792C4932428r26989o93010k36281K26114J20731o9830k97090n98388m65023l45598
3782C1647064L21495Q91738J096892R99144P74837J18024j25360k44944k0299
3773C5458591K81228J26243k35958p45930j225589j840645j455980j040158p10387
$$ plain form
3764 28611415 28243373 27839742 27310322 26410457 25399960 24496750 24107772 24266878 24728811
3755 24728811 24964674 24636118 23888536 23358070 23233700 23297614 24035784 24913799 25308857 25273006
3745 25273006 24977895 24880395 25106747 25847892 27024677 28137688 28896476 29435262 29876437
3736 29876437 30847642 32347223 34222035 36153239 37835060 38715694 39222329 39585539 39968497
3727 39968497 40324758 40904736 41622590 41942462 42123140 42603551 43587071 45066751 46889333
3718 46889333 49012463 51124290 53228406 55601251 58505031 62017480 66030018 70299240
3710 70299240 74730571 79578160 84943601 90669873 96855343 103158585 109199972 115318068
3702 115318068 122595407 132430610 145661399 164045631 191242509 226154652 252874164
$$ packed form
3764B8611415l68042m03631n29420q99865j010497r03210l88978J59106M61933
3755B4728811K35863l28556p47582n30466j24370O3914P38170Q78015L95058l5851
3745B5273006k95111r7500K26352P41145J176785J113011P58788N38786M41175
3736B9876437R71205J499581J874812J931204J681821Q80634N06635L63210L82958
3727C9968497L56261N79978P17854L19872J80678M80411R83520J479680J822582
3718D6889333K123130K111827K104116K372845K903780L512449M012538M269222
3710G0299240M431331M847589N365441N726272O185470O303242O041387O118096
3702A15318068P277339R835203J3230789J8384232K7196878L4912143K6719512
$$ plain form
3695 252874164 251351532 226463735 198299676 175868978 159533346 148379834 141479181
3688 141479181 137017057 133926988 132401884 133135004 136168504 141200076 147862198 155775592
3680 155775592 165926281 179236256 196507028 218658205 246424216 281684521 325361457
3673 325361457 370610632 397289096 387215344 348187949 301305887 257968441 221067571
3666 221067571 190700726 166375330 146522282 129733198 115329473 103273350 93275211
3659 93275211 84922523 78056174 72317704 67246603 63146631 59899745 57281219 54658433
3651 54658433 51797182 48559668 45335034 42350275 39830653 37483991 35365275 33511922
3643 33511922 31800129 30193560 28601170 27259265 26003987 24661947 23555995 22526364
$$ packed form
3695B52874164j522632k4887797k8164059k2430698j6335632j1153512o900653
3688A41479181m462124l090069j525104P33120L033500N031572O662122P913394
3680A55775592J0150689J3309975J7270772K2151177K7766011L5260305M3676936
3673C25361457M5249175K6678464j0073752l9027395m6882062m3337446l6900870
3666B21067571l0366845k4325396j9853048j6789084j4403725j2056123r998139
3659I3275211q352688o866349n738470n071101m099972l246886k618526k622786
3651E4658433k861251l237514l224634k984759k519622k346662k118716j853353
3643C3511922j711793j606569j592390j341905j255278j342040j105952j029631
$$ plain form
3635 22526364 21655239 20766080 19882892 19266480 18419180 17701698 17018733 16466378 15899425
3626 15899425 15262999 14757796 14215864 13917037 13322603 12854585 12470229 12184641 11708045
3617 11708045 11336840 10981804 10654162 10195622 9800676 9704424 9419447 9110601 8851058 8604090
3607 8604090 8359787 8174525 7846495 7985348 7712635 7542005 7367046 7264426 7129454 6830878
3597 6830878 6709218 6611718 6451819 6207903 6068239 5939922 5776425 5658661 5476828 5278453
3587 5278453 5184272 4917939 4822757 4906405 4803093 4687200 4690454 4650495 4436267 4210436 4143807
3576 4143807 4120941 4102367 4019776 3942691 3798508 3768159 3638047 3557637 3395981 3398257 3505181
3565 3505181 3410183 3307841 3168448 3286537 3211136 3259357 3260407 3116124 2857770 2778073 2852945
$$ packed form
3635B2526364q71125q89159q83188o16412q47300p17482o82965n52355n66953
3626A5899425o36426n05203n41932k98827n94434m68018l84356k85588m76596
3617A1708045l71205l55036l27642m58540l94946r6252k84977l08846k59543k46968
3607H604090k44303j85262l28030J38853k72713j70630j74959j02620j34972k98576
3597F830878j21660r7500j59899k43916j39664j28317j63497j17764j81833j98375
3587E278453r4181k66333r5182Q3648j03312j15893L254l9959k14228k25831o6629
3576D143807k2866j8574q2591p7085j44183l0349j30112q0410j61656K276J06924
3565C505181r4998j02342j39393J18089p5401M8221J050j44283k58354p9697P4872
$$ plain form
3554 2852945 2814052 2839196 2757561 2862651 2873890 2761416 2697474 2588619 2718208 2622791 2535269
3543 2535269 2562582 2575794 2524655 2565144 2617566 2584684 2498624 2387337 2404404 2377653 2463484
3532 2463484 2396115 2257948 2229331 2254616 2203690 2053423 1987264 2010661 1896425 1906094 2000126
3521 2000126 1984281 1798254 1772586 1762994 1761607 1524562 1640756 1649841 1534541 1665872 1683562
3510 1683562 1628992 1614702 1742129 1792885 1783839 1741442 1733772 1676172 1624823 1466802 1536635
3499 1536635 1569720 1671648 1596510 1449590 1550280 1734934 1724342 1657545 1805267 1962841
3489 1962841 1814972 1720443 1721779 1906349 2127956 2394916 2390490 2277479 1998209 1787605
3479 1787605 1681518 1668459 1523667 1560162 1602011 1494451 1417920 1491558 1578423 1653722 1736359
$$ packed form
3554B852945l8893K5144q1635J05090J1239j12474o3942j08855J29589r5417q7522
3543B535269K7313J3212n1139M0489N2422l2882q6060j11287J7067k6751Q5831
3532B463484o7369j38167k8617K5285n0926j50267o6159K3397j14236R669R4032
3521B000126j5845j86027k5668r592j387k37045J16194R085j15300J31331J7690
3510A683562n4570j4290J27427N0756r046m2397p670n7600n1349j58021O9833
3499A536635L3085J01928p5138j46920J00690J84654j0592o6797J47722J57574
3489A962841j47869r4529J336J84570K21607K66960m426j13011k79270k10604
3479A787605j06087j3059j44792L6495M1849j07560p6531P3638Q6865P5299Q2637
$$ plain form
3468 1736359 1539207 1712818 1858975 1938203 2043895 2306986 2367312 2408724 2603474 2668473
3458 2668473 2410268 2192652 1928690 1797082 1776665 1625274 1635818 1413692 1172631 1159796
3448 1159796 1133565 1074566 961849 1062148 1040605 1072403 945184 770430 713030 606282
3438 606282 623688 671886 722535 694222 754997 851840 817673 714370 768838 721339 764254
3427 764254 668971 690225 764506 694627 505309 508440 481809 420428 532481 533912 493403 582882
3415 582882 416854 478328 617740 583747 515422 511031 480403 503090 555006 440555 393004
3404 393004 241440 324199 343032 242758 280353 166973 156711 162947 181410 282157 251326
3393 251326 267387 311952 424194 381231 370563 468281 318055 213322 462132 268336 219318
$$ packed form
3468A736359j97152J73611J46157P9228J05692K63091O0326M1412J94750O4999
3458B668473k58205k17616k63962j31608k0417j51391J0544k22126k41061j2835
3448A159796k6231n8999j12717J00299k1543L1798j27219j74754n7400j06748
3438F06282J7406M8198N0649k8313O0775R6843l4167j03303N4468m7499M2915
3427G64254r5283K1254P4281o9879j89318L131k6631o1381J12053J431m0509Q9479
3415E82882j66028O1474J39412l3993o8325m391l0628K2687N1916j14451m7551
3404C93004j51564Q2759J8833j00274L7595j13380j0262O236J8463J00747l0831
3393B51326J6061M4565J12242m2963j0668R7718j50226j04733K48810j93796m9018
$$ plain form
3382 219318 299869 305988 457626 400641 340811 231032 189859 127937 290176 352203 363627
3371 363627 368695 211914 380318 448748 306567 22304 157532 261010 238683 74860
3361 74860 96311 155669 227058 116314 150702 236277 139559 -6171 33011 207304 387849
3350 387849 316249 405626 220501 256875 179486 226003 345907 332611 236474 190744 253754
3339 253754 135868 278792 181957 192192 226222 180214 342132 523115 537589 417514 205170
3328 205170 271163 259069 182021 281027 183741 147691 158809 88802 150021 171547 151810 107704
3316 107704 148672 104171 155949 208012 90000 126610 81397 -8530 86029 140996 117686
3305 117686 184934 109471 53730 128731 144922 273577 150271 171603 103260 43322 -23130
$$ packed form
3382B19318Q0551O119J51638n6985n9830j09779m1173o1922J62239O2027J1424
3371C63627N068j56781J68404O8430j42181k84263J35228J03478k2327j63823
3361G4860K1451N9358P1389j10744L4388Q5575r6718j45730L9182J74293J80545
3350C87849p1600Q9377j85125L6374p7389M6517J19904j3296r6137m5730O3010
3339B53754j17886J42924r6835J0235L4030m6008J61918J80983J4474j20075k12344
3328B05170O5993j2094p7048R9006r7286l6050J1118p0007O1219K1526j9737m4106
3316A07704M0968m4501N1778N2063j18012L6610m5213q9927R4559N4967k3310
3305A17686O7248p5463n5741P5001J6191J28655j23306K1332o8343n9938o6452
$$ plain form
3294 -23130 -30265 -67152 -75179 -16713 146532 96361 -24690 79831 -5630 27119 128289
3283 128289 -30747 45576 221633 145629 130400 138708 -85405 8454 -13841 36992 38315
3272 38315 142032 109837 -17119 71967 50364 -11818 57581 54637 179852 161967 67681
3261 67681 145750 51710 -98921 -137119 -64497 61637 256543 167050 87153 -8383 -76401
3250 -76401 -65288 64404 104111 43281 68346 56685 13594 131869 148638 94855 118675
3239 118675 239219 373967 291237 320373 127335 -3773 -17984 179163 156982 71956 1198
3228 1198 37308 93032 10315 -106959 115418 326809 268148 222964 246325 181185 194993
3217 194993 182090 79010 211942 94915 294799 186045 119646 116839 204443 333974 310631
$$ packed form
3294b3130p135l6887q027N8466J63245n0171j21051J04521q5461L2749J01170
3283A28289j59036P6323J76057p6004j5229Q308k24113R3859k2295N0833J323
3272C8315J03717l2195j26956Q9086k1603o2182O9399k944J25215j7885r4286
3261F7681P8069r4040j50631l8198P2622J26134J94906q9493p9897r5536o8018
3250g6401J1113J29692L9707o0830K5065j1661m3091J18275J6769n3783K3820
3239A18675J20544J34748q2730K9136j93038j31108j4211J97147k2181q5026p0758
3228A198L6110N5724q2717j17274K22377K11391n8661m5184K3361o5140J3808
3217A94993j2903j03080J32932j17027J99884j08754o6399k807Q7604J29531k3343
$$ plain form
3206 310631 317934 210145 180971 15713 256560 237206 216000 278722 276993 209290 156777
3195 156777 198696 67895 213687 345186 411079 319840 306223 360096 404027 490665 410164
3184 410164 337455 453063 460480 419368 405938 413135 505496 658023 677350 786497 935697
3173 935697 911164 862468 1031198 1136153 1401401 1591366 1473942 1440912 1687465 1661125
3163 1661125 1603120 1698547 1806596 1904697 1912076 1950844 2129805 2162762 2331384 2502663 2688490
3152 2688490 2761808 2916212 3289788 3479192 3942925 4232952 4573363 4990833 5329942 5962653
3142 5962653 6800512 7462618 7856331 8289871 9018884 10383090 12055325 14540476 17450360
3133 17450360 21468079 28329155 35422061 33932512 27088938 21649025 17340525 14102330
$$ packed form
3206C10631P303j07789k9174j65258K40847j9354k1206O2722j729o7703n2513
3195A56777M1919j30801J45792J31499O5893r1239j3617N3873M3931Q6638q0501
3184D10164p2709J15608P417m1112j3430P197R2361J52527J9327J09147J49200
3173I35697k4533m8696J68730J04955K65248J89965j17424l3030K46553k6340
3163A661125n8005R5427J08049R8101P379L8768J78961L2957J68622J71279J85827
3152B688490P3318J54404L73576J89404M63733K90027L40411M17470L39109O32711
3142E962653Q37859O62106L93713M33540P29013J364206J672235K485151K909884
3133A7450360M017719O861076P092906j489549o843574n439913m308500l238195
$$ plain form
3125 14102330 11449032 9695261 8411174 7286595 6511229 6040190 5435973 4808253 4211282
3116 4211282 3871532 3322377 3100442 2831139 2421814 2446252 2328747 2084487 1891073 1810889
3106 1810889 1856701 1605847 1458611 1341855 1265983 1093298 1007662 1026407 1037049 1063595 1031611
3095 1031611 910366 830485 866628 739937 816500 757475 715809 785306 825501 826309 640673
3084 640673 645724 458916 451650 496763 528204 539161 404719 384320 282012 117687 260127
3073 260127 254646 314147 294042 289235 217021 265455 277531 300422 384104 196107 142590 145747
3061 145747 183143 216400 249576 319232 178483 140939 242761 229375 105891 56589 246074
3050 246074 163640 112002 171702 146213 159435 214485 138617 90887 -20687 147303 2155
$$ packed form
3125A4102330k653298j753771j284087j124579p75366m71039o04217o27720n96971
3116D211282l39750n49155k21935k69303m09325K4438j17505k44260j93414q0184
3106A810889M5812k50854j47236j16756p5872j72685q5636J8745J0642K6546l1984
3095A031611j21245p9881L6143j26691P6563n9025m1666O9497M0195Q08j85636
3084F40673N051j86808p266M5113L1441J0957j34442k0399j02308j64325J42440
3073B60127n481N9501k0105m807p2214M8434J2076K2891Q3682j87997n3517L157
3061A45747L7396L3257L3176O9656j40749l7544J01822j3386j23484m9302J89485
3050B46074q2434n1638N9700k5489J3222N5050p5868m7730j11574J67990j45148
$$ plain form
3039 2155 34272 52320 17605 24808 46164 99462 -34580 13695 -7882 -12563 7078 17453
3027 17453 6840 -25647 3026 114970 83042 -105930 -92616 -117290 -17883 -66419 -34803
3016 -34803 -81425 -16276 80518 -15636 -8408 -28553 10050 -17924 -73878 -230411 -47166 -56452
3004 -56452 -150897 -213630 -123553 30055 -108736 -214503 -40204 -160643 -93336 -125829 -99311
2993 -99311 -65582 -81233 -33672 -80084 -134228 -94739 -123678 -84253 -76282 -66732 -60837 -61917 -71347
2980 -71347 4914 -51375 -192472 -283075 -35062 6280 -193206 -126890 -90197 -108094 -187338
2969 -187338 -135930 -211075 -18717 33280 -103856 -183973 -152644 -180517 -134969 -100182 -29968
2958 -29968 89178 -54918 48317 9171 -15882 -9323 -54857 -156021 -127811 45667 -13039
$$ packed form
3039B155L2117J8048l4715P203K1356N3298j34042M8275k1577m681J9641J0375
3027A7453j0613l2487K8673J11944l1928j88972J3314k4674R9407m8536L1616
3016c4803m6622O5149R6794r6154P228k0145L8603k7974n5954j56533J83245r286
3004e6452r4445o2733R0077J53608j38791j05767J74299j20439O7307l2493K6518
2993i9311L3729j5651M7561m6412n4144L9489k8939L9425P971R550N895j080r430
2980g1347P6261n6289j41097r0603K48013M1342j99486O6316L6693j7897p9244
2969a87338N1408p5145J92358N1997j37136q0117L1329k7873M5548L4787P0214
2958b9968J19146j44096J03235l9146k5053O559m5534j01164K8210J73478n8706
$$ plain form
2947 -13039 -84043 -69241 -126226 -91320 -160689 -66070 42590 -121303 -63882 -83145 -84032 -83731
2935 -83731 46779 133506 -4791 90861 87414 20364 98253 64805 74112 48888 -39355 -58419
2923 -58419 3021 37487 -58574 -123687 -19179 38942 -83008 -60699 1971 -74693 -105225
2912 -105225 -82961 46316 -88643 22897 -6601 43894 -24890 -164557 -296542 -169328
2902 -169328 -48132 -23023 17640 -45328 -5325 12243 -107912 -9031 -75165 -35216 -16058
2891 -16058 -2222 41615 34887 -23602 -27820 -66675 -98503 -15319 -185509 -50085 -55984 -15954
2879 -15954 165933 135000 75231 41184 16224 -31843 -87403 -130347 13975 20080 -126256
2868 -126256 -108474 -77670 -75954 -174626 -109968 -34197 -60172 -119883 32943 -52788 -116032 6734
$$ packed form
2947a3039p1004J4802n6985L4906o9369R4619J08660j63893N7421j9263q87L01
2935h3731J30510Q6727j38297R5652l447o7050P7889l3448R307k5224q8243j9064
2923e8419O1440L4466r6061o5113J04508N8121j21950K2309O2670p6664l0532
2912a05225K2264J29277j34959J11540k9498N0495o8784j39667j31985J27214
2902a69328J21196K5109M0663o2968M0003J7568j20155R8881o6134L9949J9158
2891a6058J3836M3837o728n8489m218l8855l1828Q3184j70190J35424n899M0030
2879a5954J81887l0933n9769l4047k4960m8067n5560m2944J44322O105j46336
2868a26256J7782L0804J716r8672O4658P5771k5975n9711J52826q5731o3244J22766
$$ plain form
2856 6734 -55083 -125857 -145976 -75302 -222944 -65673 -102582 -97813 -106142 -172728 -139509 -198746
2844 -198746 -248526 -145940 -74002 -145092 -121134 -81639 33725 -78312 -67122 -145803 -168208
2833 -168208 -295328 -275554 -194947 -242338 -235892 -114585 -91402 -80075 -171757 -73519 -187482
2822 -187482 -68272 -22546 -164064 -88825 -60789 -138578 -151826 -83298 -163104 -140132 -219342
2811 -219342 -169858 -121835 -41874 -73368 24862 12927 -86986 -72239 -63168 -178375 -60832
2800 -60832 -60674 -104004 -88561 -188536 -142793 -144638 -124185 9114 -39866 -129955 -133027 -109023
2788 -109023 -164209 -233284 -362618 -244179 -190955 -151538 -232940 -52079 66067 -88069 116873
2777 116873 31803 -15019 -179136 -72072 -21194 -203083 -167055 -124092 -165499 -12744 -42197
$$ packed form
2856F734o1817p0774k0119P0674j47642J57271l6909M769q329o6586L3219n9237
2844a98746m9780J02586P1938p1090K3958L9495J15364j12037J1190p8681k2405
2833a68208j27120J9774Q0607m7391O446J21307K3183J1327r1682R8238j13963
2822a87482J19210M5726j41518P5239K8036p7789j3248O8528p9806K2972p9210
2811b19342M9484M8023P9961l1494R8230j1935r9913J4747R071j15207J17543
2800f0832J58m3330J5443r9975M5743j845K0453J33299m8980r0089l072K4004
2788a09023n5186o9075j29334J18439N3224L9417q1402J80861J18146j54136K04942
2777A16873q5070m6822j64117J07064N0878j81889L6028M2963m1407J52755k9453
$$ plain form
2766 -42197 -136421 -151937 -118904 -111565 -206444 -93565 -98071 -72767 5525 -1350 51628 -67867
2754 -67867 -70660 -122738 -123012 -119674 -57655 -28170 -72830 -109603 -74182 -58607 -72713 -129818 -56266
2741 -56266 -48571 -29942 -242371 -90449 -207181 -170659 -154763 -42772 12883 -142198 -192039
2730 -192039 -54295 -91843 -68074 -5728 -101794 -77361 -118619 15266 -29600 -129688 -86261
2719 -86261 -187612 -173171 -110960 -87939 -52079 -169884 -22951 -192673 -192869 -174790 -52375
2708 -52375 10026 -17424 -101697 147118 156135 49369 -95713 -136816 -216441 -113352 -157607
2697 -157607 -200745 -18425 -85806 -228000 -189729 -249054 86338 -42859 -130970 -98769 -144249
2686 -144249 -236097 -246671 59382 -145574 -105767 -30444 -208286 -255887 -58245 -80782 -51389
$$ packed form
2766d2197r4224j5516L3033P339r4879J12879m506K5304P8292o875N2978j19495
2754f7867k793n2078k74L338O2019K9485m4660l6773L5421J5575j4106n7105P3552
2741e6266P695J8629k12429J51922j16732L6522J5896J11991N5655j55081m9841
2730a92039J37744l7548K3769O2346r6066K4433m1258J33885m4866j00088M3427
2719h6261j01351J4441O2211K3021L5860j17805J46933j69722j96J8079J22415
2708e2375O2401k7450q4273K48815R017j06766j45082m1103p9625J03089m4255
2697a57607m3138J82320o7381j42194L8271n9325L35392j29197q8111L2201m5480
2686a44249r1848j0574L06053k04956L9807P5323j77842m7601J97642k2537K9393
$$ plain form
2675 -51389 2807 -49365 -129379 -80795 -264740 -215814 -75037 -26654 -86685 -169954 -241608
2664 -241608 -212085 -104187 -239788 -121490 -28248 -26227 -87717 -106535 -92545 -108470 -127265
2653 -127265 -102432 -87998 59104 -43677 -56246 -28351 -4381 17564 -99080 -89364 -21811
2642 -21811 -123331 -112721 -190506 -223937 -198544 -144799 -52883 -36946 -29252 -89423 -26089 34430
2630 34430 69108 -39573 -230676 -108358 27039 -145532 -163017 -242016 -305024 -282710 -267864
2619 -267864 -212391 -140612 -43246 -123528 -200952 -17115 -64786 -38792 -40991 -36042 -115575 -87098
2607 -87098 166624 96967 -145263 -191008 -156588 -155516 -294747 -270203 -143621 -95661 -38796
2596 -38796 -195333 -283584 -128744 48132 -29088 80999 77031 -18027 -163948 -137413 -21080
$$ packed form
2675e1389N4196n2172q0014M8584j83945M8926J40777M8383o0031q3269p1654
2664b41608K9523J07898j35601J18298R3242K021o1490j8818J3990j5925j8795
2653a27265K4833J4434J47102j02781j2569K7895K3970K1945j16644R716O7553
2642b1811j01520J0610p7785l3431K5393N3745R1916J5937P694o0171O3334O0519
2630C4430L4678j08681j91103J22318J35397j72571j7485p8999o3008K2314J4846
2619b67864N5473P1779R7366q0282p7424J83837m7671K5994k199M949p9533K8477
2607h7098K53722o9657k42230m5745L4420J072j39231K4544J26582M7960N6865
2596c8796j56537q8251J54840J76876p7220J10087l968r5058j45921K6535J16333
$$ plain form
2585 -21080 -45583 -35838 8260 -66618 -210102 -148064 -233588 -156622 -158677 -93275 -160630 -211427
2573 -211427 -71856 -56142 -37993 39802 -99894 -162443 -34539 21641 -152383 -149957 -260419
2562 -260419 -178181 -103133 -294857 -55170 -88516 -136452 -54848 32074 -159549 -90341 -84835
2551 -84835 -170270 48259 -52094 -137647 -138193 -100224 -31169 11519 -73668 -74809 -12235 -92586
2539 -92586 -98587 -10386 -77331 -77925 -76131 -140020 78738 71761 155113 23831 -103698 22826
2527 22826 -20462 -24585 -145696 -40348 -28333 -142608 -179422 -123929 -80258 -25158 -96721
2516 -96721 -113251 117776 1277 64889 -21094 -39754 -41994 -72664 5651 -168877 -150244
2505 -150244 -189642 -69805 -64019 -38619 -130681 26061 -121704 -106344 31401 -114110 -164878
$$ packed form
2585b1080k4503R745M4098p4878j43484O2038q5524P6966k055O5402o7355n0797
2573b11427J39571J5714J8149P7795j39696o2549J27904N6180j74024K426j10462
2562b60419Q2238P5048j91724K39687l3346m7936Q1604Q6922j91623O9208N506
2551h4835q5435K18529j00353q5553n46L7969O9055M2688q5187j141O2574q0351
2539i2586o001Q8201o6945n94J794o3889K18758o977Q3352j31282j27529J26524
2527B2826m3288m123j21111J05348J2015j14275l6814N5493M3671N5100p1563
2516i6721j6530K31027j16499O3612q5983j8660k240l0670P8315j74528J8633
2505a50244l9398J19837N786K5400r2062J56742j47765J5360J37745j45511n0768
$$ plain form
2494 -164878 58489 17920 -181747 -108824 -134251 -147998 -150710 -74061 -20879 -19653 -123960
2483 -123960 -93219 -30445 116141 6383 -211608 40 -58938 -129182 -93908 -115777 -243358
2472 -243358 -198167 -212717 -185311 -68262 -137785 -27587 -57115 -67858 -167173 -167340 -138783 -88985
2460 -88985 -93549 -3947 -107087 -27213 -38597 15737 -48710 47586 -29960 -3163 78237 19125
2448 19125 -22123 -50969 61776 -14350 -127123 -118905 -131188 -184966 -128921 -105540 -158742 -222108
2436 -222108 -246521 -155790 -81138 -124173 -104580 -52297 -92193 -50964 -99911 -74232 -48978 -187363
2424 -187363 -80287 -25298 1439 42134 76226 77216 30004 -83904 -7636 -167766 -233648
2413 -233648 -35955 -72789 -75251 -39597 -50772 -57847 -144992 -215123 -261434 -70387 -109391 -74814
$$ packed form
2494a64878K23367m0569j99667P2923k5427j3747k712P6649N3182J226j04307
2483a23960L0741O2774J46586j09758k17991K11648n8978p0244L5274k1869j27581
2472b43358M5191j4550K7406J17049o9523J10198k9528j0743r9315j67K8557M9798
2460h8985m564Q9602j03140P9874j1384N4334o4447R6296p7546K6797Q1400n9112
2448A9125m1248k8846J12745p6126j12773Q218j2283n3778N6045K3381n3202o3366
2436b22108k4413R0731P4652m3035J9593N2283l9896M1229m8947K5679K5254j38385
2424a87363J07076N4989K6737M0695L4092R90m7212j13908P6268j60130o5882
2413b33648J97693l6834k462L5654j1175p075q7145p0131m6311J91047l9004L4577
$$ plain form
2401 -74814 -3920 -31452 5801 -9104 -151072 -164864 -171308 -231798 -165960 -29323 -14971 -154886
2389 -154886 -124581 -153572 -14603 137733 85812 11917 1232 56784 27874 -22847 -48216
2378 -48216 -153774 -85555 -79361 -72867 -106154 -154938 -116745 -75921 84639 16848 -46180 -22212
2366 -22212 -164504 20641 -9751 -128003 -227355 -280198 -2359 120658 86021 -144777 -171511
2355 -171511 -146211 -62656 -65435 -36248 -53688 -131422 -126621 -161695 -108199 -19142 55080 81687
2343 81687 58803 -176812 -13783 87912 54920 25689 -7918 63395 -86697 -287351 -146938
2332 -146938 60685 -102455 -193679 -111897 56665 43765 56474 138696 56036 25630 -40232
2321 -40232 -198837 -101156 36431 -143605 -169947 -101231 -118600 -180928 -283852 -179235 -40973
$$ packed form
2401g4814P0894k7532L7253j4905j41968j3792o444o0490O5838J36637J4352j39915
2389a54886L0305k8991J38969J52336n1921p3895j0685N5552k8910n0721k5369
2378d8216j05558O8219O194O494l3287m8784L8193M0824J60560o7791o3028K3968
2366b2212j42292J85145l0392j18252r9352n2843K77839J23017l4637k30798k6734
2355a71511K5300Q3555k779K9187j7440p7734M801l5074N3496Q9057P4222K6607
2343H1687k2884k35615J63029J01695l2992k9231l3607P1313j50092k00654J40413
2332a46938K07623j63140r1224Q1782J68562j2900J2709Q2222q2660l0406o5862
2321d0232j58605R7681J37587j80036k6342O8716j7369o2328j02924J04617J38262
$$ plain form
2310 -40973 11957 -2396 -47690 -81964 -105762 -100896 -52772 -138660 -142164 -205861 -216613 -113506
2298 -113506 -133892 -212859 -112153 -127334 -40774 -24738 -33765 -118304 -74119 39529 39974 31966
2286 31966 -99014 -72494 63145 -96921 -137583 -100933 -163878 -137034 -104358 -43725 -143762
2275 -143762 -102114 -67915 53757 190703 -14533 -174430 -148934 -94570 -214092 -73796
2265 -73796 75570 -158730 -188433 -265172 -104830 2647 -140028 -195332 -49195 -141177 -65005
2254 -65005 -59147 39135 77913 -30327 -88920 -139920 -38208 20045 23410 -41880 -89761 48627
2242 48627 23957 -26492 -45973 -63933 -64584 -100931 -223523 -142196 -5455 -182022 27388
2231 27388 176954 117019 75193 88143 -47870 -92300 2539 -57423 -192590 -207662 -48819
$$ packed form
2310d0973N2930j4353m5294l4274k3798M866M8124q5888l504o3697j0752J03107
2298a13506k0386p8967J00706j5181Q6560J6036r027q4539M4185J13648M45q008
2286C1966j30980K6520J35639j60066m0662L6650o2945K6844L2676O0633j00037
2275a43762M1648L4199J21672J36946k05236j59897K5496N4364j19522J40296
2265g3796J49366k34300k9703p6739J60342J07477j42675n5304J46137r1982P6172
2254f5005N858R8282L8778j08240n8593n1000J01712N8253L365o5290m7881J38388
2242D8627k4670n0449j9481j7960o51l6347j22592Q1327J36741j76567K09410
2231B7388J49566n9935m1826J2950j36013m4430R4839n9962j35167j5072J58843
$$ plain form
2220 -48819 -14210 33194 30763 -58557 -103635 -53200 -72082 -56238 25718 -70447 53691 121177
2208 121177 -50580 -31556 -170826 -166431 -168150 -61051 -109886 39745 61601 19487 73006
2197 73006 -110676 -119050 20128 -75870 -49936 152157 103871 37221 48606 26006 -40127
2186 -40127 -116616 -120202 -27153 -246412 -151010 -171717 -241005 -223381 -146755 63734 2536 -153194
2174 -153194 -137119 -173470 -29398 6745 11603 135983 -38729 -181765 -29692 -79926 -107100
2163 -107100 56842 112034 -24138 -107051 -104876 -64855 44375 43074 -87380 -19734 5476
2152 5476 -89825 -179105 -45066 -54463 -206022 -57773 -26825 -14702 -110495 -107380 -25624 -54248
2140 -54248 7233 -64554 -67419 92507 131684 -2229 52858 66589 -47253 -98466 56341
$$ packed form
2220d8819L4609M7404k431q9320m5078N0435j8882J5844Q1956r6165J24138O7486
2208A21177j71757J9024j39270M395j719J07099m8835J49631K1856m2114N3519
2197G3006j83682q374J39178r5998K5934K02093m8286o6650J1385k2600o6133
2186d0127p6489l586R3049k19259R5402k0707o9288J7624P6626K10489o1198j55730
2174a53194J6075l6351J44072L6143M858J24380j74712j43036J52073n0234k7174
2163a07100J63942N5192j36172q2913K175M0021J09230j301j30454O7646K5210
2152E476r5301q9280J34039r397j51559J48249L0948J2123r5793L115Q1756k8624
2140e4248O1481p1787k865J59926L9177j33913N5087J3731j13842n1213J54807
$$ plain form
2129 56341 137573 64866 -119439 -93496 -2319 -13695 -69716 -92914 -89783 -189895 -185780 53958
2117 53958 48803 52354 65280 -98969 -82826 28053 -2283 59213 -102935 -91471 -56419 -5464
2105 -5464 77381 -101417 -60556 -142625 -161473 -36490 -148604 -7130 154694 204899 48013
2094 48013 83710 128477 93106 18085 53925 -8900 -134899 -84343 -97739 -11160 -47067 64819
2082 64819 50895 -122325 -97354 -53458 -2511 88512 42841 34594 -79586 -24512 -167209
2071 -167209 -45460 -71564 -114983 -28069 -14454 21404 80938 21079 102712 -69255 147906
2060 147906 140996 13736 62285 41541 -112193 -94545 -157275 -210362 -142115 -137675 -9212
2049 -9212 -69424 -72562 36813 -114186 18186 201069 185020 141585 -14181 -39858 31960
$$ packed form
2129E6341Q1232p2707j84305K5943R1177j1376n6021k3198L131j00112M115K39738
2117E3958n155L551J2926j64249J6143J10879l0336O1496j62148J1464L5052N0955
2105e464Q2845j78798M0861q2069j8848J24983j12114J41474J61824N0205j56886
2094D8013L5697M4767l5371p5021L5840o2825j25999N0556j3396Q6579l5907J11886
2082F4819j3924j73220K4971M3896N0947R1023m5671q247j14180N5074j42697
2071a67209J21749k6104m3419Q6914J3615L5858N9534n9859Q1633j71967K17161
2060A47906o910j27260M8549k0744j53734J7648o2730n3087O8247M440J28463
2049i212o0212l138J09375j50999J32372J82883j6049m3435j55766k5677P1818
$$ plain form
2038 31960 32983 87480 42624 8659 44636 -22138 -142856 -85270 -78794 -260452 -134423 -49485
2026 -49485 -107778 -16691 15855 -26205 44160 17410 -122796 -251726 -112603 -24031 18868
2015 18868 18854 -109152 -83917 -35814 56480 18485 84538 54817 49125 31314 -72618 -47028
2003 -47028 6240 -192884 -6315 2073 -166896 -47088 -196373 -124054 39636 -18082 -66420
1992 -66420 -88816 -98776 -38653 60429 198494 39660 -112939 -107528 -149472 -176771 -92571 -81082
1980 -81082 -50987 -16561 87976 -73758 -152804 -155612 -195565 -158582 -159287 -180765 -43697 -78941
1968 -78941 -60225 -226092 -231524 -108524 -36269 -36594 -145230 -54316 -14987 -166917 -33956
1957 -33956 -214797 -92010 4935 -83309 -119224 157546 71202 -43305 -49104 -112976 -50990
$$ packed form
2038C1960J023N4497m4856l3965L5977o6774j20718N7586O476j81658J26029Q4938
2026d9485n8293R1087L2546m2060P0365k6750j40206j28930J39123Q8572M2899
2015A8868j4j28006K5235M8103R2294l7995O6053k9721n692j7811j03932K5590
2003d7028N3268j99124J86569Q388j68969J19808j49285P2319J63690n7718m8338
1992f6420k2396r960O0123R9082J38065j58834j52599N411m1944k7299Q4200J1489
1980h1082L0095L4426J04537j61734p9046k808l9953L6983p05k1478J37068l5244
1968g8941J8716j65867n432J23000P2255l25j08636R0914L9329j51930J32961
1957c3956j80841J22787R6945q8244l5915K76770q6344j14507n799o3872O1986
$$ plain form
1946 -50990 -26207 -116409 -158039 39644 63898 -72866 117 42161 -35972 -18309 -117450
1935 -117450 -96001 6636 -134408 -110018 12239 51153 -152681 -134057 -99491 -119010 -29198
1924 -29198 -32836 -146257 -27760 3695 -197995 -114759 -190904 -111872 57752 13006 -149465
1913 -149465 -93030 82173 45375 -54080 118128 109316 35944 -71250 -17599 -2894 -86208
1902 -86208 -76095 -45463 -16881 10110 27030 128855 22797 -74790 -74494 -21230 22033 17033
1890 17033 -138163 -39659 -51812 -96882 67716 42454 -157138 -158707 -105671 -30970 12768
1879 12768 -18054 -150365 -164526 -58430 -97281 -117547 13805 95959 95285 76813 21537 -99767
1867 -99767 -167712 -75185 -95632 -131276 -12270 -4309 290 13390 -105996 -83847 -179255 454
$$ packed form
1946e0990K4783r0202m1630J97683K4254j36764P2983M2044p8133J7663r9141
1935a17450K1449J02637j41044K4390J22257L8914k03834J8624L4566j9519Q9812
1924b9198l638j13421J18497L1455k01690Q3236p6145P9032J69624m4746j62471
1913a49465N6435J75203l6798r9455J72208q812p3372j07194N3651J4705q3314
1902h6208J0113L0632K8582K6991J6920J01825j06058r7587K96N3264M3263n000
1890A7033j55196R8504j2153m5070J64598k5262j99592j569N3036P4701M3738
1879A2768l0822j32311j4161J06096l8851k0266J31352Q2154o74j8472n5276j21304
1867i9767o7945R2527k0447l5644J19006P961M599J3100j19386K2149r5408J79709
$$ plain form
1855 454 -1414 -30077 -30129 -134802 -10802 -129190 -81765 -57844 -79545 -67859 -33696 -4395
1843 -4395 -29086 -94246 -57426 -47221 55751 6760 -95379 -45584 -124177 -179468 -137852 -90422
1831 -90422 115627 -10230 76977 34360 65016 -2026 -126815 -36445 -70486 -112567 20678
1820 20678 -78660 -183003 -123549 -99690 -137747 -153948 -120505 -153726 -104847 -68218 42880
1809 42880 -91790 -48269 9111 -29375 -58536 -25040 -146618 -95525 46519 162687 124730
1798 124730 125836 25995 -56824 145780 158828 46025 34391 -34527 -92658 18879 4937
1787 4937 -28685 -93297 -56726 -57365 -129438 -121563 -228263 -155746 -142333 -225886 -159779 30578
1775 30578 19272 -93516 -82392 -95651 -135370 -67691 -205201 -216669 -175625 -26153 -35811
$$ packed form
1855D54j868k8663n2j04673J24000j18388M7425K3921k1701J1686L4163K9301
1843d395k4691o5160L6820J0205J02972m8991j02139M9795p8593n5291M1616M7430
1831i0422K06049j25857Q7207m2617L0656o7042j24789R0370l4041m2081J33245
1820B0678r9338j04343N9454K3859l8057j6201L3443l3221M8879L6629J11098
1809D2880j34670M3521N7380l8486k9161L3496j21578N1093J42044J16168l7957
1798A24730J106r9841q2819K02604J3048j12803j1634o8918n8131J11537j3942
1787D937l3622o4612L6571o39p2073P875j06700P2517J3413q3553O6107J90357
1775C0578j1306j12788J1124j3259l9719O7679j37510j1468M1044J49472r658
$$ plain form
1764 -35811 -121225 28634 -67643 61255 207121 72317 52706 -38213 -52995 -53455 29605
1753 29605 -11425 -156087 -110179 -121261 -136339 -44099 -39766 -3967 -112811 -143430 -38606
1742 -38606 -46821 -74375 -34769 -142103 15522 236074 120699 39758 28029 -8348 -159946
1731 -159946 -47913 -45489 -3106 -8160 65490 192244 -18281 -171399 -53497 -47757 -96702
1720 -96702 -70195 113062 45159 68799 -45861 -83902 104338 38928 -161964 -221405 -48766
1709 -48766 -8773 8732 13756 16913 -8228 -11952 86690 24421 17544 -73370 -30410 -90462 6476
1696 6476 -17460 -64295 -35060 -55895 -78352 -82419 -79926 -263921 -62482 -134949 82675 -86373
1684 -86373 -39039 -135429 -236463 -42136 34565 -12940 12256 -123972 -102813 -24338 -26656
$$ packed form
1764c5811q5414J49859r6277J28898J45866j34804j9611r0919j4782m60Q3060
1753B9605m1030j44662M5908j1082j5078R2240M333L5799j08844l0619J04824
1742c8606q215k7554L9606j07334J57625K20552j15375q0941j1729l6377j51598
1731a59946J12033K424M2383n054P3650J26754k10525j53118J17902N740m8945
1720i6702K6507J83257o7903K3640j14660l8041J88240o5410k00892n9441J72639
1709d8766L9993J7505N024L157k5141l724R8642o2269o877r0914M2960o0052R6938
1696F476k3936m6835K9235k0835k2457m067K493j83995K01439p2467K17624j69048
1684h6373M7334r6390j01034J94327P6701m7505K5196j36228K1159P8475k318
$$ plain form
1673 -26656 -104230 -79595 11362 115885 80013 51303 70407 -55851 36800 129315 -42547
1662 -42547 -84183 213651 75156 65169 71515 -29779 -45653 -56457 -68497 -121589 -1114
1651 -1114 -59726 16833 104282 -56644 -12760 74218 -3210 37780 113892 91501 92414 -108831
1639 -108831 -153022 26933 6160 -11853 117300 46584 -99887 -211982 38908 -37612 -67913
1628 -67913 -156454 -221942 -72153 -36605 -51301 49015 86768 -73105 -73659 528 35541 8315
1616 8315 -8095 81162 -34354 -44068 -110432 -155533 -172566 -169739 -92346 31895 151551 122379
1604 122379 131038 -29004 34921 87041 -7117 -10434 39919 30433 3409 -86605 -89114 -76215
1592 -76215 -101274 114135 98006 -30590 73018 100921 55708 37902 79959 86819 32625
$$ packed form
1673b6656p7574K4635R0957J04523l5872k8710J9104j26258R2651R2515j71862
1662d2547m1636K97834j38495r987O346j01294j5874j0804j2040n3092J20475
1651a114n8612P6559Q7449j60926M3884Q6978p7428M0990P6112k2391R13k01245
1639a08831m4191J79955k0773j8013J29153p0716j46471j12095K50890p6520l0301
1628f7913q8541o5488J49789L5548j4696J00316L7753j59873n54P4187L5013k7226
1616H315j6410Q9257j15516r714o6364m5101j7033K827P7393J24241J19656k9172
1604A22379Q659j60042O3925N2120r4158l317N0353r486k7024r0014k509J2899
1592g6215k5059K15409j6129j28596J03608K7903m5213j7806M2057O860n4194
$$ plain form
1581 32625 116701 -54889 -36693 54209 -12323 -21164 -30750 -47053 -62921 -109457 61735 37040
1569 37040 66733 71368 45669 92471 85811 -126796 -179215 5682 88697 36564 150732 -31520
1557 -31520 -78327 -104035 -148760 -140195 22668 206043 65203 27964 30929 160472 150976 69694
1545 69694 18972 56897 -24921 -16439 43766 -66550 -76656 -22945 -59270 -1177 -69743 -15888
1533 -15888 -94145 36159 52262 69025 40348 15744 40802 29103 187510 99054 20157
1522 20157 -22608 14112 102512 14467 -156967 -243893 -120190 -106942 -114738 -242659 -111032
1511 -111032 -19723 -120527 47726 37684 -9047 -13977 -66284 10565 18289 -26386 -45069 -9454
1499 -9454 -48 -151417 -133276 -26384 30011 127991 106923 25169 25342 192598 42253 53468
$$ packed form
1581C2625Q4076j71590J8196R0902o6532q841r586j6303j5868m6536J71192k4695
1569C7040K9693M635k5699M6802o660k12607n2419J84897Q3015n2133J14168j82252
1557c1520m6807k5708m4725Q565J62863J83375j40840l7239K965J29543r496q1282
1545F9694n0722L7925q1818Q482O0205j10316j0106N3711l6325N8093o8566N3855
1533a5888p8257J30304J6103J6763k8677k4604K5058j1699J58407q8456p8897
1522B0157m2765L6720Q8400q8045j71434q6926J23703J3248p796j27921J31627
1511a11032R1309j00804J68253j0042m6731m930n2307P6849P724m4675j8683L5615
1499i454R406j51369J8141J06892N6395R7980k1068q1754J73J67256j50345J1215
$$ plain form
1487 53468 122795 142821 31346 -97774 -104349 80055 103031 75700 11231 -60776 -45621
1476 -45621 -32704 141955 -68723 -26979 -34855 -34577 103754 172581 88405 53744 86438 6720
1464 6720 -38943 -143169 -22309 -50911 -22194 -29335 64874 83344 32338 -16085 73581 -51604
1452 -51604 -71646 40295 27387 87737 24670 -74885 -182998 -138813 -79804 -63577 -208115
1441 -208115 52763 121516 25349 34987 58761 11096 60205 12560 -45230 -49209 1741 62142
1429 62142 110555 -18325 -107831 122441 138976 47117 83640 -110474 -98037 -110724 14686
1418 14686 139901 121899 53760 -26756 -41348 -24018 202680 135536 81793 -63651 -11816
1407 -11816 -22915 -167115 -131908 -16016 5580 -98463 -147614 -180042 -25675 -100423 -109443
$$ packed form
1487E3468O9327K0026j11475j29120o575J84404K2976k7331o4469p2007J5155
1476d5621J2917J74659k10678M1744p876K78J38331O8827q4176l4661L2694p9718
1464F720m5663j04226J20860k8602K8717p141R4209J8470n1006m8423Q9666j25185
1452e1604k0042J11941j2908O0350o3067r9555j08113M4185N9009J6227j44538
1441b08115K60878O8753r6167R638K3774m7665M9109m7645n7790l979N0950O0401
1429F2142M8413j28880q9506K30272J6535r1859L6523j94114J2437j2687J25410
1418A4686J25215j8002o8139q0516j4592J7330K26698o7144n3743j45444N1835
1407a1816j1099j44200L5207J15892K1596j04043m9151l2428J54367p4748r020
$$ plain form
1396 -109443 11269 -61354 -49998 -68876 107296 55520 110019 -46614 -6696 -12763 -53330
1385 -53330 37231 6099 61329 -46027 -77097 -169806 -91355 24051 -67917 14361 -54255
1374 -54255 -48735 145008 61682 96286 6931 8269 -103597 -106766 15305 48759 71667 -67073
1362 -67073 -117720 -29225 31831 -92991 6811 34730 -40003 85417 115595 131740 -44085
1351 -44085 -85441 -22901 108185 75505 -25762 -188152 -164597 -251251 -72168 95282 -74661
1340 -74661 105823 137815 128544 153156 139621 188499 -6831 -68146 -107944 -15445 -4268 -36641
1328 -36641 35058 -80119 -77549 27409 123125 170016 85698 -25389 120525 98286 32350
1317 32350 -10686 -15211 27514 19517 24697 20417 -24721 -70544 -105714 1493 -41049 -107594
$$ packed form
1396a09443J20712p2623J1356j8878J76172n1776N4499j56633L9918o067m0567
1385e3330R0561l1132N5230j07356l1070r2709P8451J15406r1968Q2278o8616
1374e4255N520J93743q3326L4604q9355J338j11866l169J22071L3454K2908j38740
1362f7073n0647Q8495O1056j24822R9802K7919p4733J25420L0178J6145j75825
1351d4085m1356O2540J31086l2680j01267j62390K3555q6654J79083J67450j69943
1340g4661J80484L1992r271K4612j3535M8878j95330o1315l9798R2499J1177l2373
1328c6641P1699j15177K570J04958R5716M6891q4318j11087J45914k2239o5936
1317C2350m3036m525M2725p997N180m280m5138m5823l5170J07207m2542o6545
$$ plain form
1305 -107594 -166952 45710 68387 -95857 66368 70771 39363 149856 115724 194971 359229
1294 359229 100870 -34623 12413 39372 -27879 -204711 -105410 -71596 -75386 -106459 -55139
1283 -55139 5515 103706 91678 30538 41530 47295 101189 -18562 -3650 -15185 90486 147049
1271 147049 351928 115986 60265 48609 -206307 -186498 1739 56428 90670 80063 44418
1260 44418 -119796 -142881 91424 136456 -56551 32135 98918 -12759 14449 -39149 -27676
1249 -27676 -50480 2319 -9190 56188 63301 206811 130216 11889 20046 -31575 33754 81573
1237 81573 -5498 26780 -29061 -40299 651 73234 -80919 50560 202715 146284 -5139
1226 -5139 39871 -75993 -113514 132120 182274 157920 107405 99170 -13662 87992 105441
$$ packed form
1305a07594n9358K12662K2677j64244J62225M403l1408J10493l4132P9247J64258
1294C59229k58359j35493M7036K6959o7251j76832R9301L3814l790l1073N1320
1283e5139O0654R8191j2028o1140J0992N765N3894j19751J4912j1535J05671N6563
1271A47049K04879k35942n5721j1656k54916J9809J88237N4689L4242j0607l5645
1260D4418j64214k3085K34305M5032j93007Q8686O6783j11677K7208n3598J1473
1249b7676k2804N2799j1509O5378P113J43510p6595j18327Q157n1621O5329M7819
1237H1573q7071L2278n5841j1238M0950P2583j54153J31479J52155n6431j51423
1226e139M5010j15864l7521K45634N0154k4354n0515q235j12832J01654J7449
$$ plain form
1215 105441 -54590 -103923 9432 -20964 -47081 2181 -29636 -8207 7866 143113 66546
1204 66546 -27595 38907 123161 -8827 -78940 18569 -31476 82099 2712 -117163 -56216
1193 -56216 -66032 -40329 -84105 -29089 -92864 49845 52906 51188 173868 92316 143960 112975
1181 112975 214923 163196 107480 -35128 -68560 113565 146152 27048 -61609 -48363 16468
1170 16468 99733 139642 20191 -62032 3654 65335 140413 89304 99282 109284 25368 53778
1158 53778 86244 74263 -18539 61491 81891 45892 -124996 -75682 -34386 -51234 103146
1147 103146 141086 222078 202293 118893 54940 164295 68728 -2283 11788 -36116 -45565 -21678
1135 -21678 -50122 114561 93929 49851 -12815 -41407 55809 12116 121340 174579 51167
$$ packed form
1215A05441j60031m9333J13355l0396k6117M9262l1817K1429J6073J35247p6567
1204F6546r4141O6502Q4254j31988p0113R7509n0045J13575p9387j19875O0947
1193e6216r816K5703m3776N5016o3775J42709L061j718J22680q1552N1644l0985
1181A12975J01948n1727n5716j42608l3432J82125L2587j19104q8657J3246O4831
1170A6468Q3265L9909j19451q2223O5686O1681P5078n1109R978J0002q3916K8410
1158E3778L2466j1981r2802Q0030K0400l5999j70888M9314M1296j6848J54380
1147A03146L7940Q0992j9785q3400o3953J09355r5567p1011J4071m7904r449K3887
1135b1678k8444J64683k0632m4078o2666k8592R7216m3693J09224N3239j23412
$$ plain form
1124 51167 41361 18633 -58485 -35212 46717 133183 -6113 19202 66123 -39663 17605 99651
1112 99651 76409 -143466 -67053 -11038 -54928 83372 123516 147965 19166 -7278 103316
1101 103316 -1696 -91534 25555 4050 23698 -124588 -109035 -54710 37545 -11236 119854
1090 119854 161900 205578 134102 -29005 1830 29090 -94630 68974 51011 -49764 -33181
1079 -33181 90831 49869 -38436 8334 9841 27996 -282 537 -103884 -152710 -51067 37056
1067 37056 -24790 4253 14873 67527 9833 -2117 -27262 -8875 9351 -125094 -62836 -16944
1055 -16944 -122473 -8040 -17989 12239 43219 49241 203537 -16639 -82487 -139313 -77036
1044 -77036 77919 -51266 18966 -110604 -117446 -115394 -31279 -10073 53636 -30533 -78007 -29252
$$ packed form
1124E1167r806k2728p7118K3273Q1929Q6466j39296K5315M6921j05786N7268Q2046
1112I9651k3242k19875P6413N6015m3890J38300M0144K4449j28799k6444J10594
1101A03316j05012q9838J17089k1505J9648j48286J5553N4325R2255m8781J31090
1090A19854M2046M3678p1476j63107L0835K7260j23720J63604j7963j00775J6583
1079c3181J24012m0962q8305M6770J507J8155k8278Q19j04421m8826J01643Q8123
1067C7056o1846K9043J0620N2654n7694j1950k5145J8387J8226j34445O2258M5892
1055a6944j05529J14433r949L0228L0980O022J54296k20176o5848n6826O2277
1044g7036J54955j29185P0232j29570o842K052Q4115K1206O3709q4169m7474M8755
$$ plain form
1032 -29252 49205 7236 37452 -48458 124522 101502 19423 12359 -27937 -68880 15687 -114339
1020 -114339 54569 41111 -42673 18706 -99493 -14664 -72524 -15523 81920 50961 24073
1009 24073 97290 90500 87971 -44862 -66979 53026 -103799 -104295 -23261 -158165 -28896 73819
997 73819 49799 -114698 -86070 54202 143929 10939 -29929 54397 131844 -46016 177420
986 177420 65825 30062 57262 38435 29859 21588 -86832 25745 54940 -47864 30187
975 30187 79804 152781 139987 -55079 46862 -169 116162 191042 -20723 58554 133220
964 133220 133717 8226 5535 18741 42876 -121480 12930 42184 16664 82042 -40926 -46568
952 -46568 -51692 14640 21102 -5792 -23580 -15281 -7173 9243 45766 45326 -44561 -23055 11321
$$ packed form
1032b9252P8457m1969L0216q5910J72980k3020q2079p064m0296m0943Q4567j30026
1020a14339J68908j3458q3784O1379j18199Q4829n7860N7001R7443l0959k6888
1009B4073P3217o790k529j32833k2117J20005j56825m96Q1034j34904J29269J02715
997G3819k4020j64497K8628J40272Q9727j32990m0868Q4326P7447j77860K23436
986A77420j11595l5763K7200j8827q576q271j08420J12577K9195j02804P8051
975C0187M9617P2977j2794j95066J01941m7031J16331P4880k11765P9277P4666
964A33220M97j25491k691J3206K4135j64356J34410K9254k5520O5378j22968n642
952d6568n124O6332O462k6894j7788Q299Q108J6416L6523m40q9887K1506L4376
$$ plain form
939 11321 -65070 32450 152883 181671 28596 39015 14798 24393 78168 250816 97993
928 97993 8728 -64962 -50052 51623 102256 -78603 -42028 -43373 92368 82471 106676 104395
916 104395 182964 219566 153674 197219 9279 4918 156387 24583 -19606 16925 89217
905 89217 70616 -18173 -87297 -15878 -31699 -54666 95306 191258 194322 163032 77023 28601
893 28601 54542 -19863 -12647 27310 -109177 -75598 -148003 -39130 58333 -40766 68958 -36888
881 -36888 -5000 20322 173023 91513 48899 53407 36946 -59360 129178 3060 100128 65443
869 65443 132457 88350 -83588 -155786 51705 13731 -38795 193080 50957 -57920 87975
858 87975 243864 76189 27458 122541 16687 -44050 -19182 -84811 -46216 24436 7500
$$ packed form
939A1321p6391R7520J20433K8788j53075J0419k4217R595N3775J72648j52823
928I7993q9265p3690J4910J01675N0633j80859L6575j345J35741r897K4205k281
916A04395P8569L6602o5892M3545j87940m361J51469j31804m4189L6531P2292
905H9217j8601q8789o9124P1419j5821k2967J49972R5952L064l1290q6009m8422
893B8601K5941p4405P216L9957j36487L3579p2405J08873R7463r9099J09724j05846
881c6888L1888K5322J52701q1510m2614M508j6461r6306J88538j26118R7068l4685
869F5443O7014m4107j71938p2198K07491l7974n2526K31875j42123j08877J45895
858H7975J55889j67675m8731R5083j05854o0737K4868o5629L8595P0652j6936
$$ plain form
847 7500 978 42847 85431 103626 29224 177712 -5402 -11059 33322 52715 -104844 -230330
835 -230330 -143254 -131099 57408 9177 112351 124022 -10318 -140930 -79168 -144246 16562
824 16562 71716 99000 35386 168471 -9624 -286856 -114757 911 103202 117424 109935
813 109935 68714 -7856 12625 40192 -126141 21537 13309 -6529 103229 49672 66057
802 66057 165502 36754 127721 136780 54837 8238 -26141 -51267 -65113 -22333 -36561 -135935
790 -135935 -144594 -119853 47502 58500 50410 43034 42863 120865 186102 77881 80016 61923 76067
777 76067 154249 43487 83616 -9013 -117553 4687 145084 -16602 -96490 -101619 -17136
766 -17136 16092 36125 65088 -16343 140417 -113988 -168117 -145779 7753 -19840 -196676
$$ packed form
847G500o522M1869M2584J8195p4402J48488j83114n657M4381J9393j57559j25486
835b30330Q7076J2155J88507m8231J03174J1671j34340j30612O1762o5078J60808
824A6562N5154K7284o3614J33085j78095k77232J72099J15668J02291J4222p489
813A09935m1221p6570K0481K7567j66333J47678q228j9838J09758n3557J6385
802F6057R9445j28748R0967R059q1943m6599l4379k5126j3846M2780j4228r9374
790a35935q659K4741J67355J0998q090p376j71P8002O5237j08221K135j8093J4144
777G6067P8182j10762M0129r2629j08540J22240J40397j61686p9888n129Q4483
766a7136L3228K0033K8963q1431J56760k54405n4129K2338J53532k7593j76836
$$ plain form
755 -196676 -87231 -94911 -104249 993 -42158 11504 -70991 -40751 129503 130999 155752 63506
743 63506 95528 5155 -48991 -147 95462 190077 208805 92287 48634 102426 2287 51996
731 51996 118778 73641 118266 -36287 85462 107086 98319 12228 26042 179441 45585
720 45585 -55732 -121356 -129197 -122478 10146 -9664 99122 164459 -9875 -8580 40197 122640
708 122640 90291 172964 41207 162061 57731 -132236 -124879 119033 203246 209663 158728
697 158728 -79002 -16938 -102532 23074 14706 -32958 31959 123215 103615 5237 -58517 48133
685 48133 116261 105913 139121 183489 57242 71970 100149 117011 -48162 -119467 -57765 -100605
673 -100605 -10957 8695 129071 11947 -48769 117825 13752 58383 77757 25379 44252
$$ packed form
755a96676J09445p680r338J05242m3151N3662q2495L0240J70254J496K4753r2246
743F3506L2022r0373n4146M8844R5609R4615J8728j16518m3653N3792j00139M9709
731E1996O6782m5137M4625j54553J21749K1624q767q6091J3814J53399j33856
720D5585j01317o5624p841O719J32624j9810J08786O5337j74334J295M8777Q2443
708A22640l2349Q2673j31757J20854j04330j89967P357K43912Q4213O417n0935
697A58728k37730O2064q5594J25606q368m7664O4917R1256j9600r8378o3754J06650
685D8133O8128j0348L3208M4368j26247J4728K8179J6862j65173p1305O1702m2840
673a00605Q9648J9652J20376j17124o0716J66594j04073M4631J9374n2378J8873
$$ plain form
662 44252 -14134 -25782 47559 124118 62643 112902 10832 23694 91659 108920 70868 125415
650 125415 141539 181132 48358 -58220 116722 50108 -47443 -73298 -149904 -68810 -1411
639 -1411 45451 -24915 73832 156469 105394 8955 11137 136564 75444 65912 73638 -26119 104848
626 104848 85836 59030 -87125 15852 -4528 -23590 1432 8783 69831 -128349 -93346
615 -93346 29510 84058 -23811 99004 107311 98041 -124479 -62192 -21856 30244 -65309 -2137
603 -2137 50001 206316 71207 2538 26860 102628 19884 40701 107898 174305 116486 6416
591 6416 77011 130983 155373 107899 11582 -112812 -20193 -63702 -93720 -106619 29205 16202
579 16202 76493 54992 28184 -73566 86410 112827 16155 7372 -78566 -22987 58529 -102360
$$ packed form
662D4252n8386j1648P3341P6559o1475N0259j02070J2862O7965J7261l8052N4547
650A25415J6124L9593j32774j06578J74942o6614r7551k5855p6606Q1094O7399
639a411M6862p0366R8747Q2637n1075r6439K182J25427o1120r532P726r9757J30967
626A04848j9012k6806j46155J02977k0380j9062K5022P351O1048j98180L5003
615i3346J22856N4548j07869J22815Q307r270k22520O2287M0336N2100r5553O3172
603b137N2138J56315j35109o8669K4322P5768q2744K0817O7197O6407n7819j10070
591F416P0595N3972K4390m7474r6317j24394R2619m3509l0018j2899J35824j3003
579A6202O0291k1501k6808j01750J59976K6417r6672q783q5938N5579Q1516j60889
$$ plain form
567 -102360 -154463 -48518 -18434 108159 71538 73987 79397 76865 179667 193939 206667 164491
555 164491 15250 47197 92511 171338 21515 -147760 -140638 -43801 -143626 -220220 -162143
544 -162143 -140480 -64464 -1940 -60500 -52674 103210 177060 172651 50776 95303 -72423 18611
532 18611 128446 35231 88458 125358 -38923 -163280 -75904 49622 52458 119538 124082 196197
520 196197 305420 301194 302415 76870 66113 167054 72798 96638 82149 52718 10002 206508
508 206508 98162 235808 159468 147224 28825 -58536 -6285 -36145 -16392 89497 19768
497 19768 67843 79738 54523 -49765 -125938 -4823 99822 42154 73209 39314 25750
486 25750 15108 10777 85153 55168 98119 -3980 6075 -111039 105263 15238 134477
$$ packed form
567a02360n2103J05945L0084J26593l6621K449N410k532J02802J4272J2728m2176
555A64491j49241L1947M5314P8827j49823j69275P122R6837r9825p6594N8077
544a62143K1663P6016O2524n8560P826J55884P3850m409j21875M4527j67726R1034
532A8611J09835r3215N3227L6900j64281j24357Q7376J25526K836O7080M544P2115
520A96197J09223m226J221k25545j0757J00941r4256K3840j4489k9431m2716J96506
508B06508j08346J37646p6340j2244j18399q7361N2251k9860J9753J05889o9729
497A9768M8075J1895k5215j04288p6173J21115J04645n7668L1055l3895j3564
486B5750j0642m331P4376k9985M2951j02099J0055j17114K16302r0025J19239
$$ plain form
475 134477 294929 214138 201490 250648 202205 38338 -7261 42515 -53113 99076 -7440
464 -7440 49308 -29665 -56835 -90861 9542 35952 104229 125647 126101 212935 106476 30170
452 30170 92365 -124380 115659 112321 85051 120571 52185 47541 18847 78411 62394 34134
440 34134 20332 137397 143637 114622 140573 75732 24611 93020 26399 -9581 1153 130821
428 130821 103490 4590 56615 207321 57206 -24508 93491 128110 95259 3910 -120351
417 -120351 10299 -74416 58165 132454 138223 -4844 -12312 54274 -80862 -125598 -55415
406 -55415 32554 -22458 76945 168753 -55042 14548 -56854 -47975 73491 36275 33388 -76593
394 -76593 -63453 -92242 -12581 -11209 -97691 -36814 -24133 -112092 29935 139163 -68143 -100746
$$ packed form
475A34477J60452q0791j2648M9158m8443j63867m5599M9776r5628J52189j06516
464g440N6748p8973k7170l4026J00403K6410O8277K1418M54Q6834j06459p6306
452C0170O2195k16745K40039l338k7270L5520o8386m644k8694N9564j6017k8260
440C4134j3802J17065O240k9015K5951o4841n1121O8409o6621l5980J0734J29668
428A30821k7331r8900N2025J50706j50115q1714J17999L4619l2851r1349j24261
417a20351J30650q4715J32581P4289N769j43067p468O6586j35136m4736P0183
406e5415Q7969n5012R9403R1808k23795O9590p1402Q879J21466l7216k887j09981
394g6593J3140k8789P9661J372q6482O0877J2681q7959J42027J09228k07306l2603
$$ [...]
##END NTUPLES=NMR SPECTRUM
##END=
