##TITLE=1H_CG-1207-x
 CDCl3
 8 sc, 
 1.8.2024
##JCAMPDX= 6.0         $$ Bruker NMR JCAMP-DX V2.0
##DATA TYPE= NMR SPECTRUM
##DATA CLASS= NTUPLES
##ORIGIN= UXNMR, Bruker Analytische Messtechnik GmbH
##OWNER= root
$$ XWIN-NMR		Version 3.5
$$ Thu Aug  1 14:17:07 2024 Russian Standard Time (UT+4h)  she@DPX200
##.OBSERVE FREQUENCY= 200.1315
##.OBSERVE NUCLEUS= ^1H
##.ACQUISITION MODE= SIMULTANEOUS
##.ACQUISITION SCHEME= undefined
##.AVERAGES= 8
##.DIGITISER RES= 18
##SPECTROMETER/DATA SYSTEM= spect
##.PULSE SEQUENCE= zg30
##.SOLVENT NAME= DMSO
##.SHIFT REFERENCE= (INTERNAL, DMSO, 0, 21.9861)
##AUDIT TRAIL= $$ (NUMBER, WHEN, WHO, WHERE, WHAT)
$$ ##TITLE= Audit trail, XWIN-NMR		Version 3.5
$$ ##JCAMPDX= 5.01
$$ ##ORIGIN= Bruker BioSpin GmbH
$$ ##OWNER= she
$$ F:/spectra/data/she/nmr/H-F/1/pdata/1/auditp.txt
$$ ##AUDIT TRAIL=  $$ (NUMBER, WHEN, WHO, WHERE, WHAT)
(   1,<2024-08-01 14:16:00.67 +0400>,<she>,<DPX200>,
      <created by zg, POWCHK disabled, PULCHK disabled
       configuration hash MD5:
       00 E9 B6 7A A2 85 ED C7 34 08 36 98 17 FE 4E 26
       data hash MD5: 16K
       F4 28 AC F3 9D 96 92 BD 50 B7 8C FD 52 86 81 42>)
(   2,<2024-08-01 14:16:03.92 +0400>,<she>,<DPX200>,
      <Start of raw data processing
       efp BC_mod = 2 LB = 0.24 FT_mod = 6 PKNL = 1 PHC0 = -25641.44 PHC1 = 12.18749 SI = 16K 
       data hash MD5: 16K
       D2 28 2A 4B 19 B0 E8 07 26 17 23 3E 86 B3 D0 EC>)
(   3,<2024-08-01 14:16:24.43 +0400>,<she>,<DPX200>,
      <pk PHC0 = 5.578677 PHC1 = -1.8 
       data hash MD5: 16K
       F2 D9 80 17 E5 42 4A F1 AD 5C AC 5C 26 19 39 EF>)
$$ ##END=
$$ 
$$ hash MD5
$$ 6F 20 33 BB 34 3E 21 71 87 AC 96 D7 EA BF D9 A1
##$RELAX= 
##$RELAX= 
##$RELAX= 
##$RELAX= 
##$RELAX= 
##$RELAX= 
$$ Bruker specific parameters
$$ --------------------------
##$DU= <F:/spectra>
##$EXPNO= 1
##$NAME= <H-F>
##$PROCNO= 1
##$TYPE= <nmr>
##$USER= <she>
##$AMP= (0..31)
100 100 100 100 100 100 100 100 100 100 100 100 100 100 100 100 100 100 
100 100 100 100 100 100 100 100 100 100 100 100 100 100 
##$AQSEQ= 0
##$AQ_mod= 1
##$AUNM= <au_zg>
##$AUTOPOS= <>
##$BF1= 200.13
##$BF2= 200.13
##$BF3= 200.13
##$BF4= 200.13
##$BF5= 200.13
##$BF6= 200.13
##$BF7= 200.13
##$BF8= 200.13
##$BYTORDA= 1
##$CFDGTYP= 0
##$CFRGTYP= 5
##$CHEMSTR= <none>
##$CNST= (0..31)
1 1 145 1 1 1 1 1 1 1 1 1 1 1 1 1 1 1 1 1 1 1 1 1 1 1 1 1 1 1 1 1 
##$CPDPRG= <>
##$CPDPRG1= <>
##$CPDPRG2= <>
##$CPDPRG3= <>
##$CPDPRG4= <mlev>
##$CPDPRG5= <mlev>
##$CPDPRG6= <mlev>
##$CPDPRG7= <mlev>
##$CPDPRG8= <mlev>
##$CPDPRGB= <>
##$CPDPRGT= <>
##$D= (0..31)
0 1.2 0 0 0 0 0 0 0 0.06 0 0.03 0 0 0 0 0.0002 0 0 0 0 0 0 0 0 0 0 0 0 
0 0 0 
##$DATE= 1722507360
##$DBL= (0..7)
120 120 120 120 120 120 120 120 
##$DBP= (0..7)
150 150 150 150 150 150 150 150 
##$DBP07= 0
##$DBPNAM0= <>
##$DBPNAM1= <>
##$DBPNAM2= <>
##$DBPNAM3= <>
##$DBPNAM4= <>
##$DBPNAM5= <>
##$DBPNAM6= <>
##$DBPNAM7= <>
##$DBPOAL= (0..7)
0.5 0.5 0.5 0.5 0.5 0.5 0.5 0.5 
##$DBPOFFS= (0..7)
0 0 0 0 0 0 0 0 
##$DE= 6
##$DECBNUC= <off>
##$DECIM= 24
$$ [...]
##$SUBNAM2= <"">
##$SUBNAM3= <"">
##$SUBNAM4= <"">
##$SUBNAM5= <"">
##$SUBNAM6= <"">
##$SUBNAM7= <"">
##$SUBNAM8= <"">
##$SUBNAM9= <"">
##$SW= 24.0689530833862
##$SWIBOX= (0..15)
0 0 2 0 0 0 0 0 0 0 0 0 0 0 0 0 
##$SW_h= 4816.95568400771
##$TD= 16384
##$TD0= 1
##$TE= 0
##$TE2= 300
##$TE3= 300
##$TEG= 300
##$TL= (0..7)
0 120 120 120 120 120 120 120 
##$TP= (0..7)
150 150 150 150 150 150 150 150 
##$TP07= 0
##$TPNAME0= <>
##$TPNAME1= <>
##$TPNAME2= <>
##$TPNAME3= <>
##$TPNAME4= <>
##$TPNAME5= <>
##$TPNAME6= <>
##$TPNAME7= <>
##$TPOAL= (0..7)
0.5 0.5 0.5 0.5 0.5 0.5 0.5 0.5 
##$TPOFFS= (0..7)
0 0 0 0 0 0 0 0 
##$TUNHIN= 0
##$TUNHOUT= 0
##$TUNXOUT= 0
##$USERA1= <user>
##$USERA2= <user>
##$USERA3= <user>
##$USERA4= <user>
##$USERA5= <user>
##$V9= 5
##$VALIST= <valist>
##$VCLIST= <CCCCCCCCCCCCCCC>
##$VD= 0
##$VDLIST= <DDDDDDDDDDDDDDD>
##$VPLIST= <PPPPPPPPPPPPPPP>
##$VTLIST= <TTTTTTTTTTTTTTT>
##$WBST= 1024
##$WBSW= 4
##$XGAIN= (0..3)
0 0 0 0 
##$XL= 0
##$YL= 0
##$YMAX_a= 570798
##$YMIN_a= -458173
##$ZGOPTNS= <>
##$ZL1= 120
##$ZL2= 120
##$ZL3= 120
##$ZL4= 120
##$ABSF1= 0
##$ABSF2= 0
##$ABSG= 0
##$ABSL= 0
##$ALPHA= 0
##$AQORDER= 0
##$ASSFAC= 0
##$ASSFACI= 0
##$ASSFACX= 0
##$ASSWID= 0
##$AUNMP= <proc_1d>
##$AZFE= 0.1
##$AZFW= 0.1
##$BCFW= 0
##$BC_mod= 2
##$BYTORDP= 0
##$COROFFS= 0
##$CY= -3
##$DATMOD= 1
##$DC= 0
##$DFILT= <>
##$DTYPP= 0
##$F1P= 0
##$F2P= 0
##$FCOR= 1
##$FTSIZE= 16384
##$FT_mod= 6
##$GAMMA= 0
##$GB= 0
##$INTBC= 1
##$INTSCL= 3.70164e-10
##$ISEN= 128
##$LB= 0.24
##$LEV0= 0
##$LPBIN= 0
##$MAXI= 10000
##$MC2= 0
##$MEAN= 0
##$ME_mod= 0
##$MI= 1.114404
##$NCOEF= 0
##$NC_proc= -7
##$NLEV= 6
##$NOISF1= 3.799351
##$NOISF2= 2.8
##$NSP= 0
##$NTH_PI= 0
##$NZP= 0
##$OFFSET= 21.98606
##$PC= 1
##$PHC0= -25635.86
##$PHC1= 10.38749
##$PH_mod= 1
##$PKNL= yes
##$PPARMOD= 0
##$PSCAL= 0
##$PSIGN= 0
##$REVERSE= no
##$SF= 200.129508420084
##$SI= 16384
##$SIGF1= 3
##$SIGF2= 2
##$SINO= 5.538805
##$SIOLD= 16384
##$SREGLST= <1H.CDCl3>
##$SSB= 0
##$STSI= 16384
##$STSR= 0
##$SW_p= 4816.95568400771
##$SYMM= 0
##$S_DEV= 0
##$TDeff= 16384
##$TDoff= 0
##$TI= <>
##$TILT= no
##$TM1= 0
##$TM2= 0
##$TOPLEV= 0
##$USERP1= <user>
##$USERP2= <user>
##$USERP3= <user>
##$USERP4= <user>
##$USERP5= <user>
##$WDW= 1
##$XDIM= 16384
##$YMAX_p= 288832745
##$YMIN_p= -4113533
$$ End of Bruker specific parameters
$$ ---------------------------------
##NTUPLES= NMR SPECTRUM
##VAR_NAME=  FREQUENCY,     SPECTRUM/REAL,   SPECTRUM/IMAG
##SYMBOL=    X,             R,               I
##VAR_TYPE=  INDEPENDENT,   DEPENDENT,       DEPENDENT
##VAR_FORM=  AFFN,          ASDF,            ASDF
##VAR_DIM=   16384,         16384,           16384
##UNITS=     HZ,            ARBITRARY UNITS, ARBITRARY UNITS
##FACTOR=    0.29402158847633, 1,            1
##FIRST=     4400.05921755797, 0,            0
##LAST=      -416.896466449735, 0,           0
##MIN=       -416.896466449735, -4113533,    0
##MAX=       4400.05921755797, 288832745,    0
$$ Real data points
##PAGE= N=1
##DATA TABLE= (X++(R..R)), XYDATA
$$ [...]
4650C233974J65539j46492J35418n1796O7262r4698K15826l20543J23035m7596
4640C279929p3214O379O0076J53965k6467O9737r785q3184K99539J12124k26325
4629C562774j84203l6259J22669K42261L4636k25599j60138J28661L55407l05011
4619C535198J54265Q7448O8016N8182J06417k42732o7724m4225M6527J44938K33560
4608D079870j62470J99108k3422J55465k63033q8975K2843m6152K09682K90K19461
4597D302667l15893L98656j67389j15498L1488L39941j75499p7738j40907L04688
4587D384516L5074p560p3429l47172K75330l7898J81498j6174K44795j81923K11963
4576D669020P144j21810R255K16849j16707q3118J97242M33662k34392j29592
$$ plain form
4650 3233974 3399513 3253021 3388439 3336643 3403905 3309207 3525033 3204490 3327525 3279929
4640 3279929 3206715 3213094 3273170 3427135 3400668 3470405 3460620 3377436 3676975 3789099 3562774
4629 3562774 3378571 3342312 3464981 3707242 3741878 3516279 3356141 3484802 3840209 3535198
4619 3535198 3689463 3776911 3844927 3903109 4009526 3766794 3699070 3654845 3701372 3846310 4079870
4608 4079870 3917400 4116508 4093086 4248551 3985518 3896543 3919386 3873234 4082916 4083206 4302667
4597 4302667 3986774 4385430 4218041 4102543 4134031 4473972 4298473 4220735 4079828 4384516
4587 4384516 4419590 4412030 4338601 3991429 4266759 4228861 4410359 4394185 4638980 4457057 4669020
4576 4669020 4676164 4554354 4563609 4780458 4663751 4580633 4777875 5211537 4977145 4847553
4566D847553m1426j68914P8704K80078L9998n9451J32573K2883o9826J49918K34387
4555E446477j82946j72388J17393J50442K01698J64145l87854R359j4278J3439
4545E345487J65617j76214J98063J63012j92094K18790K81040K7417k30233J30597
4535E931482J75581o0162n7498J71964J15801k55528j44972K03561K74243j71044
4525F183428j06768k09128R6325K56223P9034N8780k69335J02598o6067L73820
4515F498910l8090J27544j04305j69518K23831J06902q2452Q217n0372L03929
4505F824596k2537j94732J11711J58415j06520j28141N463J28836M8279j9111
4495F806259r657L2569M46394j7598k41716r4597J49988K98367j10766p5964M93241
$$ plain form
4566 4847553 4806127 4637213 4715917 4995995 5035993 4976542 5109115 5131998 5062172 5212090 5446477
4555 5446477 5263531 5091143 5208536 5358978 5560676 5724821 5336967 5346326 5332048 5345487
4545 5345487 5511104 5334890 5532953 5695965 5503871 5722661 6003701 6031118 5800885 5931482
4535 5931482 6107063 6046901 5989403 6161367 6277168 6021640 5876668 6080229 6354472 6183428
4525 6183428 6076660 5867532 5963857 6220080 6299114 6357894 6088559 6191157 6125090 6498910
4515 6498910 6460820 6588364 6484059 6314541 6538372 6645274 6562822 6571039 6520667 6824596
4505 6824596 6802059 6607327 6719038 6877453 6770933 6642792 6648255 6777091 6825370 6806259
4495 6806259 6796602 6829171 7275565 7257967 7016251 6921654 7071642 7370009 7259243 7183279 7676520
4484G676520l87597n6173K99984L38133r6365L8567j27374k07812M02088j7268
4474G862703l7432N067J53349J73521r5561J04651J36716J41179o3320K9896k9456
4463H381313j91609j15052J83374K00541j8016L32406J85452m1198l17536K02443
4453H802118L85240j56951M21325M3235o8095k7708j11771L22492j66251J66767
4443I610401Q2438J26666j01765J82681l7707J63452J07410K9872L53330j2882
4433A0503896J46135p5121m0886J46565L20010j31147N4135j78269J52851K61641
4423A1159810N2616o5546M19921K40616J30181J88911k19770J59288R1668K26526
4413A2384221Q0335M9891L17190j17898L69265L8236P3618K1996K14271j31538
$$ plain form
4484 7676520 7288923 7232750 7532734 7870867 7774502 7813069 7685695 7477883 7879971 7862703
4474 7862703 7825271 7830338 7983687 8157208 8061647 8166298 8303014 8444193 8380873 8410769 8381313
4463 8381313 8189704 8074652 8258026 8458567 8440551 8772957 8958409 8917211 8599675 8802118
4453 8802118 9187358 9030407 9451732 9494967 9426872 9399164 9287393 9609885 9443634 9610401
4443 9610401 9692839 9819505 9717740 9900421 9862714 10026166 10133576 10163448 10516778 10503896
4433 10503896 10650031 10574910 10534024 10680589 11000599 10869452 10923587 10745318 10898169 11159810
4423 11159810 11212426 11146880 11566801 11807417 11937598 12126509 11906739 12066027 12157695 12384221
4413 12384221 12464556 12514447 12831637 12713739 13083004 13121240 13194858 13216854 13431125 13299587
4403A3299587K52442O26011j90563j11094K87341J67948Q364M74665J06128j88847
4393A4731982L07726J7977M44878K12247l30970M43674j3318J81383K30752J91337
4383A6417668N7029N24767J84349K3895K00646J76228M87186J91611j14362J45688
4373A8294705L03181K76448J71613K12987K02424J97657K34341j9799R9063O62270
4363B0634890J60097k14089K97226L13850M86488K17887L39709J91080J76548
4354B2603686J64979J24704K97564P5903O94012O73033M16823R2974L97598K89658
4344B5830934M70704j30913Q9307M02976P3672O75846L00337Q8717N09632K32500
4334B8543712K04876M76203L61956P44862J73693R7297N24440J53954J13225O06956
$$ plain form
4403 13299587 13552029 14178040 13987477 13876383 14163724 14331672 14340036 14814701 14920829 14731982
4393 14731982 15039708 15057685 15502563 15714810 15383840 15827514 15814196 15995579 16226331 16417668
4383 16417668 16474697 16999464 17183813 17207708 17408354 17584582 18071768 18263379 18149017 18294705
4373 18294705 18597886 18874334 19045947 19258934 19461358 19659015 19893356 19873557 19972620 20634890
4363 20634890 20794987 20580898 20878124 21191974 21678462 21896349 22236058 22427138 22603686
4354 22603686 22768665 22893369 23190933 23266836 23960848 24633881 25050704 25143678 25541276 25830934
4344 25830934 26301638 26170725 26260032 26663008 26736680 27412526 27712863 27801580 28311212 28543712
4334 28543712 28748588 29224791 29586747 30331609 30505302 30602599 31127039 31280993 31394218 32001174
4324C2001174L95537M00479M91303N30776L89064J37350L94829K87496K43778
4315C5271786J28668L97421L30008M55310O19719L67165K55780N29477O13246
4306C8968580J90784K94166O77392J28108K90889M07026N5803K79404K41653J05824
4296D1639629K77105K50418m7337K80322L91100J62550J56657K52471j76582L46243
4286D3532576K18930O9809J46825J55023R2933q2611R5085J01105L08172l53962
4276D4283885l8363l03891l3794k55142k69545j78935j15213J12544k08394l75908
4266D2617244j00619j6076o4373p6744j25393j33098l0703j5031j1703k72896
4256D1770608m42172l15989l64503k70979l91563k43735q0340j69286l04722l34352
$$ plain form
4324 32001174 32396711 32797190 33288493 33819269 34208333 34345683 34740512 35028008 35271786
4315 35271786 35400454 35797875 36127883 36583193 37202912 37570077 37825857 38355334 38968580
4306 38968580 39159364 39453530 40130922 40259030 40549919 40956945 41012748 41292152 41533805 41639629
4296 41639629 41916734 42167152 42119815 42400137 42791237 42953787 43110444 43362915 43186333 43532576
4286 43532576 43751506 43821315 43968140 44123163 44216096 44133485 44228570 44329675 44637847 44283885
4276 44283885 44245522 43941631 43907837 43652695 43383150 43204215 43089002 43201546 42993152 42617244
4266 42617244 42516625 42500549 42436176 42359432 42234039 42100941 42070238 42055207 42043504 41770608
4256 41770608 41328436 41012447 40647944 40376965 39985402 39741667 39661327 39492041 39187319 38852967
4246C8852967R7429l40151k65098R0785k58145j403j77294j57561j19419K33675
4236C7955785P2044k34853j52889Q6083k13312J98475r9191j04020l9618K89399
4226C7757903q8956N4126J39992J69742L07769N29392L1829N14806J68315J15860
4216C9700778M20057O27273K05665O219M72594N34114M7432K16427L88461q754
4206D2610266l3190L01292O9030J34497N05814K0014M48554M09593N32703P8707
4196D5077280N82347K89631L4080l943K50428n8736m15669j91143k53474m56859
4186D4853942j68161k88377m33377k75347n94447n38000m63346K26l32104k86163
4176D1474846k84988m71680l06732q1358m02582l30525n86933o65050k49689m36004
$$ plain form
4246 38852967 38950396 38610245 38345147 38435932 38177787 38176384 37999090 37841529 37722110 37955785
4236 37955785 38027829 37792976 37640087 37726170 37512858 37711333 37612142 37508122 37468504 37757903
4226 37757903 37668947 37723073 37863065 38032807 38340576 38869968 38901797 39416603 39584918 39700778
4216 39700778 40120835 40748108 40953773 40959992 41432586 41966700 42014132 42230559 42619020 42610266
4206 42610266 42577076 42878368 42947398 43081895 43587709 43607723 44056277 44465870 44998573 45077280
4196 45077280 45659627 45949258 45983338 45979395 46229823 46171087 45755418 45564275 45310801 44853942
4186 44853942 44685781 44397404 43964027 43688680 43094233 42556233 42092887 42093113 41761009 41474846
4176 41474846 41189858 40718178 40411446 40330088 39927506 39596981 39010048 38344998 38095309 37659305
4166C7659305n2916q18595l05324m22669p15881p4106l61913k33091l42387l61359
4156C3971064K11485j45140j25993l56679k55367J54405K8966m02055k49019j87109
4146C2644558l87624K78382j97798k32806J9609r8247K59789k1077n7802M710
4136C2211694j67095l4510N0966m7495p3551R4049Q2747K63099r4071j47418j9167
4125C2119248P9187O9662K98803l5230k0707K11210o5544J19533K8085J0932N806
4114C2820985L62026J40353J15178K7942K55232M59656J08256j84139J47991j4848
4104C4238632L84803L59775J2350K50945K7753N3431p4353m7477K12622N83199
4094C6001680M25595P787K29866P4019J05711K06688N07847j75683K69792K88114
$$ plain form
4166 37659305 37606389 36787794 36482470 36059801 35343920 35269814 34907901 34674810 34332423 33971064
4156 33971064 34182549 34037409 33911416 33554737 33299370 33453775 33482741 33080686 32831667 32644558
4146 32644558 32256934 32535316 32337518 32104712 32124321 32026074 32285863 32264786 32206984 32211694
4136 32211694 32044599 32010089 32061055 32013560 31940009 32034058 32116805 32379904 32285833 32138415 32119248
4125 32119248 32198435 32268097 32566900 32531670 32510963 32722173 32656629 32776162 32804247 32815179 32820985
4114 32820985 33183011 33323364 33438542 33466484 33721716 34181372 34289628 34105489 34253480 34238632
4104 34238632 34623435 34983210 34995560 35246505 35274258 35327689 35253336 35205859 35418481 36001680
4094 36001680 36427275 36435062 36664928 36738947 36844658 37051346 37559193 37383510 37653302 37941416
4084C7941416K70088K91330M8614N24522J06110k8554K5272K77081M04630L12816
4074D0173325M49427P6055k54003J36592L31356L90476L50580j18067M26734J16297
4064D2078772M5953K84296j9787L73818L35918K83689l1142Q9466M65111K9287
4054D3935381K10063K42595p1098K57961O0366K38071P6369k319R3198J05736
4044D5146323K66159J36251J65637J91794K18286m4749J11270J16486N2776L60225
4034D6720458J54315l03721K03892K45148j94799K05073j9659l4533M8682J58970
4024D7183826k94608N0072K19095j4545K06607k18923K5716k48879j91495K72750
4014D6989616J15025j22586k46475J30948m76408J85303J86026J3656K6750k88774
$$ plain form
4084 37941416 38211504 38502834 38551448 39075970 39182080 39153526 39178798 39455879 39860509 40173325
4074 40173325 40622752 40698807 40444804 40581396 40912752 41303228 41653808 41535741 41962475 42078772
4064 42078772 42124725 42409021 42389234 42763052 43098970 43382659 43351517 43440983 43906094 43935381
4054 43935381 44145444 44388039 44316941 44574902 44635268 44873339 44949708 44947389 45040587 45146323
4044 45146323 45412482 45548733 45714370 45906164 46124450 46079701 46190971 46307457 46360233 46720458
4034 46720458 46874773 46571052 46774944 47020092 46825293 47030366 47010707 46976174 47024856 47183826
4024 47183826 46889218 46939290 47158385 47143840 47350447 47131524 47157240 46908361 46716866 46989616
4014 46989616 47104641 46982055 46735580 46866528 46390120 46575423 46761449 46775105 46801855 46513081
4004D6513081o62p7048l26466k85659K89580p2611l58166k5754k47831K09248
3994D5617712k01142j39482j8107r8154k86053k27050k712O6338l71765k09772
3984D4129813K1412j57101k11806P7842l11700R4515Q7314m02314j11158K955
3974D3219772j9569k03134k04059j5523J59909l3651o2875j30687k69537J12470
3964D2553116k53970P0010l17759n74242j38526m5515k54344p8528l52480j66105
3954D0441657L7679k99646k50908j86558M9175j78331k15860p0307L1970k43689
3944C9115182k43718l21914k66196k81536k52081m16592j00709k59994j84345
3935C6788097l24865k07429m76543k02778k37659k72981k72210m45338M8940j90299
$$ plain form
4004 46513081 46512419 46435371 46108905 45823246 46112826 46040215 45682049 45656295 45408464 45617712
3994 45617712 45416570 45277088 45258981 45160827 44874774 44647724 44645012 44711350 44339585 44129813
3984 44129813 44151225 43994124 43782318 43860160 43548460 43642975 43730289 43327975 43216817 43219772
3974 43219772 43200203 42997069 42793010 42777487 42937396 42903745 42840870 42710183 42440646 42553116
3964 42553116 42299146 42369156 42051397 41477155 41338629 41293114 41038770 40960242 40607762 40441657
3954 40441657 40479336 40179690 39928782 39742224 39791399 39613068 39397208 39326901 39358871 39115182
3944 39115182 38871464 38549550 38283354 38001818 37749737 37333145 37232436 36972442 36788097
3935 36788097 36463232 36255803 35779260 35576482 35338823 35065842 34793632 34348294 34397234 34206935
3925C4206935l47637p6273m52971N419m26893o0148k01713j64901k33807k19806
3915C2028205k97097K806k55069l34719k43634l49283N0958j47050M5800l43060
3905C0157857m54621J80817m4036k67897K5753l51230k92433k32508k8904L65237
3895B9058035k0226k42439M3104R3225r5568k8766K11997j15499R1500j26571
3885B8868792Q7055M03697Q2834j54493m3766L44885k78633J44266L66945J39942
3875B9961524J4984M37548K88153N7494L36533L94904N09198M17011P78284r1091
3865C3104542L85078N58232K51482K99482M49625O79240M81967M08138K81679
3856C6899465P7524J48597K59947J16741L72866J34281J33687K41927J72445N5933
$$ plain form
3925 34206935 33859298 33783025 33330054 33335473 32908580 32848432 32646719 32481818 32248011 32028205
3915 32028205 31731108 31733914 31478845 31144126 30900492 30551209 30602167 30455117 30500917 30157857
3905 30157857 29703236 29884053 29840017 29572120 29597873 29246643 28954210 28721702 28692798 29058035
3895 29058035 29037809 28795370 28838474 28931699 28836131 28807365 29019362 28903863 28995363 28868792
3885 28868792 28955847 29359544 29442378 29287885 29244119 29589004 29310371 29454637 29821582 29961524
3875 29961524 29976508 30414056 30702209 30759703 31096236 31491140 32000338 32417349 33195633 33104542
3865 33104542 33489620 34047852 34299334 34598816 35048441 35727681 36209648 36617786 36899465
3856 36899465 36976989 37125586 37385533 37502274 37875140 38009421 38143108 38385035 38557480 38613413
3846C8613413K43121L52948J91927N35497L70791K73866q7852l28751m887K2507
3836D0182580r321l81519p89965p77512J37813m78638m25597n03784o90093l13734
3826C5950230n38904m44325l11851j45453m11886l89840k90614o05140m17717
3817C2394500l71610m46971k03107p32370n26342l88421l95156l67799o32463
3808B8330261l04653q7021j87309l34442m2301J08986k08451L2197L6506P4936
3798B7418709M8832K34619M39797L15474Q526J32564M90044l58309j39702l27038
3788B8263516o75364n97081o06588m83302l98719m79571o24766r4061l09489j98033
3778B3796542j551m14126j67957J36479p2940K49895m15991j08598m6328N7324
$$ plain form
3846 38613413 38856534 39209482 39401409 39936906 40307697 40581563 40493711 40164960 40160073 40182580
3836 40182580 40173259 39791740 39001775 38224263 38362076 37883438 37457841 36954057 36263964 35950230
3826 35950230 35411326 34967001 34655150 34509697 34097811 33707971 33417357 32812217 32394500
3817 32394500 32022890 31575919 31372812 30640442 30114100 29725679 29330523 28962724 28330261
3808 28330261 28025608 27938587 27751278 27416836 27374535 27483521 27275070 27307267 27343773 27418709
3798 27418709 27467541 27702160 28141957 28457431 28465957 28598521 29088565 28730256 28590554 28263516
3788 28263516 27588152 26991071 26384483 25901181 25502462 25022891 24398125 24304064 23994575 23796542
3778 23796542 23794991 23380865 23212908 23349387 23276447 23526342 23110351 23001753 22955425 23012749
3768B3012749m43211K3835K72846l20916k84144l70714l54607k02805n93147j87290
3758B0552596l96766m11386j94380k79895k31053j36410j05414j34827R8230l77445
3748A8383250j60706j47533k01400j75960k92143J34940j18508P8433j26936n9090
3738A7314347l39105k26473l56977k7099J62591p37397j1194k40916L1000j33789
3728A5434988k16517P7016l40567l69587J14091k6573j81430k11419p3197K92727
3718A4499532k97011l74360l33359L42198k08860K5384k2982r411K14928j02679
3708A3733380k00273k86050k73164Q4713J72101j87623J97663l23485R7950j14421
3698A2900791J12914J5011J25088P7437m25026k10090K09890j65889R3996K1026
$$ plain form
3768 23012749 22569538 22593373 22866219 22545303 22261159 21890445 21535838 21333033 20739886 20552596
3758 20552596 20155830 19744444 19550064 19270169 19039116 18902706 18797292 18662465 18760695 18383250
3748 18383250 18222544 18075011 17873611 17697651 17405508 17540448 17421940 17500373 17373437 17314347
3738 17314347 16975242 16748769 16391792 16364693 16527284 15789887 15778693 15537777 15568777 15434988
3728 15434988 15218471 15295487 14954920 14585333 14699424 14672851 14491421 14280002 14206805 14499532
3718 14499532 14202521 13828161 13494802 13837000 13628140 13653524 13630542 13621131 13836059 13733380
3708 13733380 13533107 13247057 12973893 13058606 13230707 13043084 13240747 12917262 13015212 12900791
3698 12900791 13013705 13028716 13153804 13231241 12806215 12596125 12806015 12640126 12734122 12755148
3688A2755148K38043j73229L30012J29073K09168k1881O1246J45520Q9001O8769
3678A3830870j27784K92598j83987N8450k76289J31702Q8000J0369L5045k44675
3668A3614299O4587M39431K22266o6321K89834j62599K29125R7637K09649L1879
3658A4969787M1671K16441J37649K90421J66373m50442k19707k42717n7933K83961
3648A5135504m432J35168N8975k80975j35312R3100L00260j68995J55573j70621
3638A5118245j18048r5156O171K41554O825L88715L2475l73870k86563J40619
3628A5060967l5958l7637o17268j46967Q8864K7133N8571O7857j49431j58402
3618A4157729J00482k05176j20403M0840N932m6120l0561k81332k59918K35375
$$ plain form
3688 12755148 12993191 12819962 13149974 13279047 13488215 13466334 13527580 13673100 13762101 13830870
3678 13830870 13703086 13995684 13811697 13870147 13593858 13725560 13813560 13823929 13858974 13614299
3668 13614299 13678886 14118317 14340583 14274262 14564096 14401497 14630622 14728259 14937908 14969787
3658 14969787 15011458 15227899 15365548 15655969 15822342 15371900 15152193 14909476 14851543 15135504
3648 15135504 15131072 15266240 15325215 15044240 14908928 15002028 15302288 15133293 15288866 15118245
3638 15118245 15000197 14905041 14911212 15152766 15159591 15548306 15580781 15206911 14920348 15060967
3628 15060967 15025009 14987372 14370104 14223137 14312001 14339134 14397705 14465562 14316131 14157729
3618 14157729 14258211 14053035 13932632 13973472 13979404 13933284 13902723 13621391 13361473 13596848
3608A3596848L73441k19853j49362Q638j95527k45108L4738k41308k18116M40614
3598A3185005J09401o2614m74506J43558J7793Q8182o0378k0526k71343L25112
3588A2979684K02225J14674r7062k04984m0433J86467k66932M4755J46559n246
3578A3059707o7096K17076q1970K38670j14512J56913J38019K0229J7358k88662
3568A3295732Q3107r2285J78257R7656K01399q9645k57455J25910J02481l5348
3558A3609809M8964K2163l2069j47721K58645r4078O87K33681Q8603O2646O7834
3547A4119164j71137j59058j91826L42020O4365K18858K08796q2696r5912K19858
3537A4472432J95044k35683J18364J70553J32802j73370j97473J82086L25018
$$ plain form
3608 13596848 13970289 13750436 13601074 13609712 13414185 13169077 13203815 12962507 12744391 13185005
3598 13185005 13294406 13231792 12757286 12900844 12918637 13006819 12946441 12925915 12654572 12979684
3588 12979684 13181909 13296583 13199521 12994537 12954104 13140571 12873639 12918394 13064953 13059707
3578 13059707 12992611 13209687 13127717 13366387 13251875 13408788 13546807 13567036 13584394 13295732
3568 13295732 13378839 13286554 13464811 13562467 13763866 13674221 13416766 13542676 13645157 13609809
3558 13609809 13658773 13680936 13648867 13501146 13759791 13665713 13666400 13900081 13988684 14051330 14119164
3547 14119164 13948027 13788969 13597143 13939163 14003528 14222386 14431182 14348486 14252574 14472432
3537 14472432 14667476 14431793 14550157 14720710 14853512 14680142 14482669 14664755 14989773
3528A4989773m4535J10817R8550Q9048J46647J18855j04524O1094M10213j45319
3518A5730619j8197M6633J28859L5190J86106r751J38897K80456j6827k69694
3508A6232291l2708M6371M25412J9761J07571K18009j48327o1741j2941J93794
3498A6987492L41267Q7393J58217M75794j57121K35644k65717j17030L87372K12563
3488A8345874O2906J04376P762N0487J69302R8091L46665J86194O3840m5698L07354
3477A9697153M2565K64703J35671j20998L97312L80925j26960o8245R3205O7664
3467B0762995J87234K89555o9789K22178Q21K14599J40357M17342r8554J44365
3457B2211103L77327P7314K7498J19431J82439p279L16808L45569K45170K54641
$$ plain form
3528 14989773 14945238 15056055 15154605 15243653 15390300 15509155 15404631 15465725 15875938 15730619
3518 15730619 15712422 15759055 15887914 15923104 16109210 16099459 16238356 16518812 16501985 16232291
3508 16232291 16199583 16245954 16671366 16691127 16798698 17016707 16868380 16806639 16793698 16987492
3498 16987492 17328759 17416152 17574369 18050163 17893042 18128686 17862969 17745939 18133311 18345874
3488 18345874 18408780 18513156 18520918 18571405 18740707 18838798 19185463 19371657 19435497 19389799 19697153
3477 19697153 19739718 20004421 20140092 20019094 20416406 20797331 20670371 20602126 20695331 20762995
3467 20762995 20950229 21239784 21169995 21392173 21392994 21607593 21747950 22165292 22066738 22211103
3457 22211103 22588430 22665744 22693242 22812673 22995112 22987833 23304641 23650210 23895380 24150021
3447B4150021L62563n3989O0455K03524L81585N09609O2524J37810L99779M78423
3437B6692304M72851K63421L24345J04439J88619L24720J98966K69782q3807m23440
3427B8332200K40454K35028n2756j47658J89669J02159j48809k74381J40640M24924
3417B9041470Q5832q9722J64204J06186K30811J39378O5433N9174N6482J30340
3407B9989588K98333j67159K28972J96063j20558K26969N06379K05018K04513
3398C1568118J62691J41232m9754r4929O95218J07147J67355L74635L13080L33672
3388C3718465J86119J84121M13693m8061J69232K88953N72597M80617q8844M21200
3378C6298092L56696K24931L88413K26512N16834L52077K36992L55719M57053
$$ plain form
3447 24150021 24512584 24458595 24519050 24722574 25104159 25613768 25676292 25814102 26213881 26692304
3437 26692304 27165155 27428576 27752921 27857360 28045979 28370699 28569665 28839447 28755640 28332200
3427 28332200 28572654 28807682 28754926 28607268 28796937 28899096 28750287 28475906 28616546 29041470
3417 29041470 29127302 29037580 29201784 29307970 29538781 29678159 29743592 29802766 29859248 29989588
3407 29989588 30287921 30120762 30349734 30545797 30425239 30652208 31158587 31363605 31568118
3398 31568118 31730809 31872041 31822287 31727358 32422576 32529723 32697078 33071713 33384793 33718465
3388 33718465 33904584 34088705 34502398 34454337 34623569 34912522 35485119 35965736 35876892 36298092
3378 36298092 36654788 36879719 37268132 37494644 38011478 38363555 38600547 38956266 39413319
3369C9413319P56117L45108O24614K25427L02249O69801J04330O16367O77084
3360D3734416K80978P05119M68618O07707N73613M47479Q15278P98546O58930
3351D9090684L52058Q90531R34070N33423Q58674J096901P86392J061437J317628
3342E6921798O44015J138318P94035J144471R92897J202142R80604P20777Q88794
3333F5427851L59403L93749M38261N09697K44381M02439M60281K77967N40941
3324F9054970M41719O06626P76598R14826P85970J138036Q14715R14021J321606
3315G6769087J156119J308221J096739J259378J160538J811164J572445J247111
3307H7380802J494905J550490J694519K016030J666952J877959K004237K030734
$$ plain form
3369 39413319 40169436 40514544 41139158 41364585 41666834 42336635 42440965 43057332 43734416
3360 43734416 44015394 44720513 45189131 45796838 46370451 46817930 47633208 48431754 49090684
3351 49090684 49442742 50333273 51267343 51800766 52659440 53756341 54542733 55604170 56921798
3342 56921798 57565813 58704131 59498166 60642637 61635534 62837676 63818280 64539057 65427851
3333 65427851 65787254 66181003 66619264 67128961 67373342 67775781 68236062 68514029 69054970
3324 69054970 69496689 70103315 70879913 71794739 72580709 73718745 74533460 75447481 76769087
3315 76769087 77925206 79233427 80330166 81589544 82750082 84561246 86133691 87380802
3307 87380802 88875707 90426197 92120716 94136746 95803698 97681657 99685894 101716628
3299A01716628K149904K127945K106292K422990K205513K548967K224397K617528
3291A20120164K624157K282010K678008K860205K850158K872355K504764K494506
3283A41286327K843452K562674K474457K630572K532404K183913K641729K206276
3275A61361804K076623J997578K080193J625461J818623J398951J466039J084192
3267A74909464K18358P63574M91178J19454l05873p56136o14438o92650j302227
3258A72830704j155138j428977j401572j833603j631132j944936k637884k861155
3250A57936307k733973k926625k967786l204530k962526l093071l141176k991603
3242A33915017l220067k970322k883901k984190k972022k730448k623411k637827
$$ plain form
3299 101716628 103866532 105994477 108100769 110523759 112729272 115278239 117502636 120120164
3291 120120164 122744321 125026331 127704339 130564544 133414702 136287057 138791821 141286327
3283 141286327 144129779 146692453 149166910 151797482 154329886 156513799 159155528 161361804
3275 161361804 163438427 165436005 167516198 169141659 170960282 172359233 173825272 174909464
3267 174909464 175127822 175891396 176382574 176502028 176196155 175440019 174825581 174132931 172830704
3258 172830704 171675566 170246589 168845017 167011414 165380282 163435346 160797462 157936307
3250 157936307 155202334 152275709 149307923 146103393 143140867 140047796 136906620 133915017
3242 133915017 130694950 127724628 124840727 121856537 118884515 116154067 113530656 110892829
3234A10892829k789088k501779k612044k521030k402957k289000k326117k145108
3226I1305706j781542j551088j707033j681404j667993j320077j229084j300521
3218G9066964j178888j000364q02412r47456q74713n60284n27351p78763q98245
3209G1498488p64883q21596o59584k49869n26457q95316o54476n37027m03084
3200F5986196l30907p71868o17006m95911j003813o48998p17653j090990p92804
3191E9516246q54524j287895j098622q12314q91968j072444j359037p56362p76279
3182E0606801q32949o26352j200799j054641p28074n54092p43883q82744p31079
3173D3252188p56199q07536r39101j053321o25500o32663m93225q95133j195624
$$ plain form
3234 110892829 108103741 105601962 102989918 100468888 98065931 95776931 93450814 91305706
3226 91305706 89524164 87973076 86266043 84584639 82916646 81596569 80367485 79066964
3218 79066964 77888076 76887712 76085300 75137844 74263131 73702847 73175496 72396733 71498488
3209 71498488 70733605 69912009 69252425 69002556 68476099 67580783 66926307 66389280 65986196
3200 65986196 65655289 64883421 64266415 63770504 62766691 62117693 61400040 60309050 59516246
3191 59516246 58661722 57373827 56275205 55462891 54570923 53498479 52139442 51383080 50606801
3182 50606801 49773852 49147500 47946701 46892060 46163986 45609894 44866011 43983267 43252188
3173 43252188 42495989 41688453 40749352 39696031 39070531 38437868 37944643 37049510 35853886
3164C5853886o85591q05758o73861m03005q14701n72086m81002n65182o33014
3155C0219686k47015L3004o87607o11230m19157j99328m08376n05405j00153o09858
3145B6464561m31249j12711l86223k62556k18818k74254l27182j84746l9811q3804
3135B4143207m65676j61712n19468j47682m5366k18924j80698k71156j32039j88184
3125B1812302k5257r2469l07802l66620k60615N3411N7079j00091k85838j24084
3115B0360016O0023J10754j01700k1475R2286j13368L6533n13579k38289K9726
3105A9700927J48189n1623k90565k44488l11054J56494j20329n0754l56132m11767
3095A8168898M26045k63278k40024n8294k06094M9409K34063l79315L7430N8036
$$ plain form
3164 35853886 35168295 34362537 33688676 33285671 32470970 31898884 31417882 30852700 30219686
3155 30219686 29972671 30005675 29318068 28706838 28287681 28088353 27679977 27174572 27074419 26464561
3145 26464561 26033312 25920601 25534378 25271822 25053004 24778750 24451568 24266822 24227011 24143207
3135 24143207 23677531 23515819 22996351 22848669 22803303 22584379 22403681 22132525 22000486 21812302
3125 21812302 21787045 21694576 21386774 21020154 20759539 20812950 20870029 20769938 20484100 20360016
3115 20360016 20420039 20530793 20429093 20407618 20499904 20386536 20423069 19909490 19671201 19700927
3105 19700927 19849116 19797493 19506928 19262440 18951386 19107880 18987551 18936797 18580665 18168898
3095 18168898 18594943 18331665 18091641 18033347 17827253 17876662 18110725 17731410 17768840 17826876
3085A7826876l37193j77748k45636M2735J36030J87460m16614j7655L40484k02064
3075A7136675K52179k6670j63708R4138K7842j03090J39552J05788K19573k7734
3065A7654545k14817j81658K71859l82173l47314J90042M9170N43573P2549k20375
3055A7435401j48955J47084k47891K58751O6416j06380j20259R0018k78026M3250
3045A7139409J42206j712J92433j90478o5227L01821J3219K79945j41556j07396
3035A7562664K08946L60j20213k53795L36598J35398m5140j51861j02491K71547
3025A7842013J33221K67304N2780l72313M9821j30657J80508L2204J88983J84565
3015A8428429L54711m9248j85262L76288M22840l4236j16413L50138J71398N0469
$$ plain form
3085 17826876 17489683 17311935 17066299 17109034 17245064 17432524 17015910 16998255 17338739 17136675
3075 17136675 17388854 17362184 17198476 17292614 17320456 17217366 17356918 17462706 17682279 17654545
3065 17654545 17439728 17258070 17529929 17147756 16800442 16990484 17039654 17583227 17655776 17435401
3055 17435401 17286446 17433530 17185639 17444390 17510806 17404426 17284167 17374185 17096159 17139409
3045 17139409 17281615 17279903 17472336 17281858 17216631 17518452 17531671 17811616 17670060 17562664
3035 17562664 17771610 17771970 17651757 17397962 17734560 17869958 17824818 17672957 17570466 17842013
3025 17842013 17975234 18242538 18295318 17923005 17972826 17842169 18022677 18054881 18243864 18428429
3015 18428429 18783140 18733892 18548630 18924918 19347758 19313522 19197109 19547247 19718645 19769114
3005A9769114L75010j57976K01028o8450K3240M07680K4054P0567J55056L98342
2995B1197665l00285J53672L87652L74383K75306l6045K7261J07837L25625J45001
2985B2658072Q7113Q1261J23279K71304J95974M01729L05614J86465J78907K10355
2975B4700073M49350K24096l0981j20821K81925J72495K86851K58134M94285L10818
2965B7026225J09022K80636n0997N15900M46365J60869L44711L79246P0367M55080
2955B9737424N58043J77685M54742P43573M23939M08755M52035O27112P14930
2946C4298238N35288N03962O56191Q04445R66916N17269Q63411R35977R31112
2937D1012809P52259R38615J063216R75323J344030J294505J333003J752998J561719
$$ plain form
3005 19769114 20144124 19986148 20187176 20118726 20141966 20549646 20573700 20644267 20799323 21197665
2995 21197665 20897380 21051052 21438704 21813087 22088393 22052348 22079609 22187446 22513071 22658072
2985 22658072 22745185 22826446 22949725 23221029 23417003 23818732 24124346 24310811 24489718 24700073
2975 24700073 25149423 25373519 25342538 25221717 25503642 25676137 25962988 26221122 26715407 27026225
2965 27026225 27135247 27415883 27364886 27880786 28327151 28488020 28832731 29211977 29282344 29737424
2955 29737424 30295467 30473152 30927894 31671467 32095406 32504161 32956196 33583308 34298238
2946 34298238 34833526 35337488 35993679 36798124 37765040 38282309 39145720 40081697 41012809
2937 41012809 41765068 42703683 43766899 44742222 46086252 47380757 48713760 50466758 52028477
2928E2028477J056130J596357J975406J799502J766879J411093J873547J716713
2920F5224104J638493J893078K155472J952566K250809K183443K386047K681202
2912H2365214L183422L182036L162483L857829L818283M267084N156035N241491
2904A14233877O018726O738039P003477Q163079R059356J0558537J2179866J4574385
2896A88529342J6529549J7604251J7391304J4245978Q394326k84637q472963j3952281
2888B39984869j6692380j6861919j6118334j4725594j3203299j1333974j0056750
2881A40992619q563923q185911o374790n571948m649932m462764m292251l548723
2873I5342377k921498k808326k815672k455951k331808k437342j963125j999183
$$ plain form
2928 52028477 53084607 54680964 56656370 58455872 60222751 61633844 63507391 65224104
2920 65224104 66862597 68755675 70911147 72863713 75114522 77297965 79684012 82365214
2912 82365214 85548636 88730672 91893155 95750984 99569267 103836351 108992386 114233877
2904 114233877 120252603 126990642 133994119 142157198 151216554 161775091 173954957 188529342
2896 188529342 205058891 222663142 240054446 254300424 262694750 262410113 253937150 239984869
2888 239984869 223292489 206430570 190312236 175586642 162383343 151049369 140992619
2881 140992619 132428696 124242785 117867995 112296047 107646115 103183351 98891100 95342377
2873 95342377 92420879 89612553 86796881 84340930 82009122 79571780 77608655 75609472
2865G5609472j835512j909321j607612j781465j495304j200842j515282r91426
2857F3272708j059713q60877r65133j128579q34590p37426r28936o83947m92412
2848E5581095o62656n75160o49638o52186k12732m98912j89917m36338l42207
2839E1361349k72488m39088k90021l5103m60323k12090k67442L2428K26389k23734
2829D9419877j16004k33041K49409J11550k70571m9281J13828k72727P5586J15824
2819D9144450L12576m6312m0781M9725K75376K35695J11851M87584J15468N6585
2809E0702217L19991J14763P11484N36513k4023N10517L28946K96030K17348N52652
2799E4266438N59336K63555M99705P15727P06961N88762L55755P07627O02804
$$ plain form
2865 75609472 73773960 71864639 70257027 68475562 66980258 65779416 64264134 63272708
2857 63272708 62212995 61352118 60386985 59258406 58423816 57686390 56757454 56073507 55581095
2848 55581095 54918439 54343279 53693641 53041455 52828723 52329811 52139894 51703556 51361349
2839 51361349 51088861 50649773 50359752 50324649 49864326 49652236 49384794 49417222 49643611 49419877
2829 49419877 49303873 49070832 49320241 49431791 49161220 49111939 49225767 48953040 49028626 49144450
2819 49144450 49457026 49410714 49369933 49419658 49695034 49930729 50042580 50530164 50645632 50702217
2809 50702217 51022208 51136971 51848455 52384968 52360945 52871462 53200408 53496438 53713786 54266438
2799 54266438 54825774 55089329 55589034 56304761 57011722 57600484 57956239 58663866 59266670
2790E9266670N76761J138402R07079M15255O79371Q01522J033200R88352R33752
2781F6740364P82278Q37127J023568J135200J013831R11523J191057J166695R91856
2772G5793499J006485J418711J262490J195278R95938J254113J409267P11615
2764H5047396J529073J245282J413009J541702J344834J251232J561771J376812
2756I6311111J484913J499722J104274J439051J466781J622328J459318J392653
2748A07780151J749097J664738J677140J536202J377122J811863J788170J375379
2740A20759862J556723J311547J830033J544809J640652J668244J838635J453765
2732A33604270J221406J628215J572200J404942J643634J019390J599348J503125
$$ plain form
2790 59266670 59843431 60981833 61888912 62304167 62983538 63785060 64818260 65806612 66740364
2781 66740364 67522642 68359769 69383337 70518537 71532368 72443891 73634948 74801643 75793499
2772 75793499 76799984 78218695 79481185 80676463 81672401 82926514 84335781 85047396
2764 85047396 86576469 87821751 89234760 90776462 92121296 93372528 94934299 96311111
2756 96311111 97796024 99295746 100400020 101839071 103305852 104928180 106387498 107780151
2748 107780151 109529248 111193986 112871126 114407328 115784450 117596313 119384483 120759862
2740 120759862 122316585 123628132 125458165 127002974 128643626 130311870 132150505 133604270
2732 133604270 134825676 136453891 138026091 139431033 141074667 142094057 143693405 145196530
2724A45196530J185480J320520J108556J397485J217205Q63272J020424J238746
2716A54548218J096350J173389M49920Q32372P20630P78893J151874M92716P04436
2707A61948798R48525N15141R59306O08843O40839K34691K74960O42446L38542
2698A67112091L97277K57199K27681O7971m20693o98266k83604k96592o45557
2689A65717507k00173r11362p25954j020209o43424r31526j202133j352592q42604
2680A57887530r61557j541370j267273r94271j426475j501497j440668j754752
2672A46999667j835853j677202j643677j777726j805850j869376k071481j979292
2664A32339210k032151k326925k562519j890763k181824k053590j705329j848067
$$ plain form
2724 145196530 146382010 147702530 148811086 150208571 151425776 152289048 153309472 154548218
2716 154548218 155644568 156817957 157267877 158100249 158820879 159599772 160751646 161244362 161948798
2707 161948798 162897323 163412464 164371770 164980613 165621452 165856143 166131103 166773549 167112091
2698 167112091 167509368 167766567 167994248 168062219 167641526 166943260 166659656 166363064 165717507
2689 165717507 165517334 164605972 163880018 162859809 162216385 161284859 160082726 158730134 157887530
2680 157887530 156925973 155384603 154117330 153123059 151696584 150195087 148754419 146999667
2672 146999667 145163814 143486612 141842935 140065209 138259359 136389983 134318502 132339210
2664 132339210 130307059 127980134 125417615 123526852 121345028 119291438 117586109 115738042
2656A15738042k101186j908598j770214j936917j455462j608729k046397j642044
2648A01268495j192266j459423j365550j484348j234162j216573j551838j262784
2640I0501551j414752j436170j360143q74889j198832j075461q76281j288233
2632H0976790q26439j057151r52217j277478j104790j039207j333993j389247
2624G1996268j151639r78801r11437r56239j085199q67423r68087q38436r00686
2615F3338321p21543p15309o92752n80916n93707o38783r36021l31348n45932
2606E7582010n5577l63779l97815m97321m11808k13530j42597m31861l81360p2483
2596E4613879L441k94242k72559j30336j52083l8205J14531Q5813J06294k43945
$$ plain form
2656 115738042 113636856 111728258 109958044 108021127 106565665 104956936 102910539 101268495
2648 101268495 100076229 98616806 97251256 95766908 94532746 93316173 91764335 90501551
2640 90501551 89086799 87650629 86290486 85415597 84216765 83141304 82265023 80976790
2632 80976790 80150351 79093200 78140983 76863505 75758715 74719508 73385515 71996268
2624 71996268 70844629 69865828 68954391 67998152 66912953 66045530 65077443 64239007 63338321
2615 63338321 62616778 61901469 61208717 60627801 60034094 59395311 58459290 58127942 57582010
2606 57582010 57526433 57162654 56764839 56267518 55855710 55642180 55499583 55067722 54686362 54613879
2596 54613879 54617320 54323078 54050519 53920183 53768100 53729895 53844426 53930239 54036533 53792588
2586E3792588K18009j7533k11850J21678m2431r637n0621J47393K53784K30216
2576E4431596J49152J6572Q4948L73293j41435R525p6373J15438J34631J20149
2566E5217496L53819K10417r5110J78177J93146O3670J7968j8203l0081M05966
2556E6497265L15935r7570K58952n2073j45284K84469J010J24716K14208M61880
2546E7863508K26102R3142q1284L276K01670K10158L02600k43345l3913J16663
2536E8658577N1413n909R621j45348J55700o1895K51380K08359O348l28930K26543
2525E9025859J4266n0876K2827j03633K05746m9850K9961L4534r9022K7702J05852
2514E9163366p8369q3058j75879K19143L41589p842n01579m8968L50038O1175
$$ plain form
2586 53792588 54010597 53993064 53781214 53902892 53860461 53850824 53800203 53947596 54201380 54431596
2576 54431596 54580748 54597320 54682268 55055561 54914126 54923651 54847278 54962716 55097347 55217496
2566 55217496 55571315 55781732 55686622 55864799 56057945 56121615 56139583 56121380 56091299 56497265
2556 56497265 56813200 56715630 56974582 56922509 56777225 57061694 57062704 57187420 57401628 57863508
2546 57863508 58089610 58182752 58101468 58104744 58306414 58516572 58819172 58575827 58541914 58658577
2536 58658577 58709990 58704081 58713702 58568354 58724054 58662159 58913539 59121898 59128246 58799316 59025859
2525 59025859 59040125 58989249 59012076 58908443 59114189 59064339 59094300 59128834 59029812 59057514 59163366
2514 59163366 59084997 59001939 58826060 59045203 59386792 59378950 58877371 58828403 59178441 59239616
2504E9239616M0687j8964O0456K31215k08016o3982K28510o214k00693n075O9421
2493E9366961o3581J04916L34430Q5179P2042p6429k35558J02891J13664J76319
2483E9980834J64270o2307q5768J1676k8350J68355K30941K81795k31091O6346
2473F0496701j13194j51872M06457L91690K34183r7208K95228o9028j11714l7108
2463F1244135L01047L10803O3701L97083N73732J03840O8307L62184K07270k2181
2453F3609921L81688K66822K3089M54033J99608K5911N62919L34412K20158K91920
2443F6370481J77531M26678P9283K78286L18735P67226K0070M72N63382K77355
2433F9279499K90561O15176K73841J36514Q72708L56036K24505P73980M23248
$$ plain form
2504 59239616 59280303 59261339 59321795 59553010 59344994 59281012 59509522 59503308 59302615 59297540 59366961
2493 59366961 59303380 59408296 59742726 59827905 59899947 59823518 59587960 59690851 59804515 59980834
2483 59980834 60145104 60082797 59997029 60008705 59980355 60148710 60379651 60661446 60430355 60496701
2473 60496701 60383507 60231635 60638092 61029782 61263965 61166757 61461985 61392957 61281243 61244135
2463 61244135 61545182 61855985 61919686 62316769 62890501 62994341 63062648 63424832 63632102 63609921
2453 63609921 63991609 64258431 64281520 64735553 64935161 64961072 65523991 65858403 66078561 66370481
2443 66370481 66548012 66974690 67053973 67332259 67650994 68418220 68438290 68438762 69002144 69279499
2433 69279499 69570060 70185236 70459077 70595591 71468299 71824335 72048840 72822820 73246068
2424G3246068K45376M32252N15017N53648K51531N14372K62680P25197O14406
2415G7360547K45414K96686M35011Q42136Q33126M75710N97742M01779P23527
2406H2211678N34050O74462L39569M96257M01010P16498J71242P73486P62608
2397H7080860P70768O33427M54149P61024N03569O87634N95874O28303Q52362
2388I2967970Q54643O99549L88357Q22510Q05600M62196Q72733O89889P31963
2379I9295410M53630P76218P13564R28071O84051R32127P58685O63254O69120
2370A05874130J001881Q19393Q72891O59787O38185R47155R34991N56912R96210
2361A13301535Q57191P48044Q19471Q96973J036069Q49202P18257J129058O97757
$$ plain form
2424 73246068 73491444 73923696 74438713 74992361 75243892 75758264 76020944 76746141 77360547
2415 77360547 77605961 77902647 78337658 79179794 80012920 80488630 81086372 81488151 82211678
2406 82211678 82745728 83420190 83759759 84256016 84657026 85373524 85544766 86318252 87080860
2397 87080860 87851628 88485055 88939204 89700228 90203797 90891431 91487305 92115608 92967970
2388 92967970 93822613 94522162 94910519 95733029 96538629 97000825 97873558 98563447 99295410
2379 99295410 99749040 100525258 101238822 102166893 102850944 103783071 104541756 105205010 105874130
2370 105874130 106876011 107695404 108568295 109228082 109866267 110813422 111748413 112305325 113301535
2361 113301535 114158726 114906770 115726241 116623214 117659283 118508485 119226742 120355800 121053557
2352A21053557Q96486J127893J094706Q76424J083706Q43474R82501J214335J200455
2343A30373537J049153J310412J436345J169945J367920J292405J384565J224216
2335A40608498J370328J791248K306348J851344J508584J727877J752179J754543
2327A54670949K226067K483174K210638K138789K304709K298196K612781K768801
2319A73714104K392624K504782K757134K720110K227026K668502K723557K397929
2311A94105768K324981K211654K221398J765039J708280K088820J903106J281714
2303B09610760J124912J459193J195941J209915J002309R65853R13855O65505
2295B18148243P20722M68542O98352O82039J046391P89464J011551Q68587R89634
$$ plain form
2352 121053557 121950043 123077936 124172642 125049066 126132772 126976246 127958747 129173082 130373537
2343 130373537 131422690 132733102 134169447 135339392 136707312 137999717 139384282 140608498
2335 140608498 141978826 143770074 146076422 147927766 149436350 151164227 152916406 154670949
2327 154670949 156897016 159380190 161590828 163729617 166034326 168332522 170945303 173714104
2319 173714104 176106728 178611510 181368644 184088754 186315780 188984282 191707839 194105768
2311 194105768 196430749 198642403 200863801 202628840 204337120 206425940 208329046 209610760
2303 209610760 210735672 212194865 213390806 214600721 215603030 216568883 217482738 218148243
2295 218148243 218868965 219337507 220035859 220717898 221764289 222553753 223565304 224433891 225423525
2286B25423525J577619J838043J852810K077680K147430K705337K812832L007045
2278B43442321K643646K574018K253785J563202K04355p04912k193835l958001
2270B45824579m530370n412027o273724o426583o018791o273460n716902n461733
2262A99710989n637270m838487m374952m072779m090212l735943l500923l257895
2254A66202528l369912l085117k740002k906508k240277k222394k708817k148981
2246A44780520k390579k105970k119326k024259j973280j837756j830425j878691
2238A28620234j750522k257602j828845k198157j659845j265085j462839j521924
2230A14675415j094281j184289j241292p95445n39808r10544m73239n46782l2070
$$ plain form
2286 225423525 227001144 228839187 230691997 232769677 234917107 237622444 240435276 243442321
2278 243442321 246085967 248659985 250913770 252476972 252681327 251976415 249782580 245824579
2270 245824579 241294209 235882182 229608458 223181875 217163084 210889624 205172722 199710989
2262 199710989 194073719 189235232 184860280 180787501 176697289 172961346 169460423 166202528
2254 166202528 162832616 159747499 157007497 154100989 151860712 149638318 146929501 144780520
2246 144780520 142389941 140283971 138164645 136140386 134167106 132329350 130498925 128620234
2238 128620234 126869712 124612110 122783265 120585108 118925263 117660178 116197339 114675415
2230 114675415 113581134 112396845 111155553 110360108 109820300 108909756 108436517 107889735 107857665
2221A07857665l69883Q0546J16852p6310K07354l19308L90364K01746M22525K74220
2211A08785771N84140L71526O94881J301376M13798J125197J406895J136834Q05164
2202A16625582P05302Q16160L74718M71810R34385N52917N87809Q08335Q65132
2193A22742150P44941M35044N62114P26436M46491P6347L07807O44363K88727
2184A26974420k12169o90132q03316j146765j976161j584738k162592j770923
2176A16627624k035851k476601k047659k500925k085320k488497k440404k399929
2168I8152438k033945j927840k046145k157150k060534j959443j955771j722147
2160H2289463j740018j771248j720292j355116j550090j506503j177733j406365
$$ plain form
2221 107857665 107487782 107568328 107685180 107608870 107816224 107496916 107887280 108089026 108511551 108785771
2211 108785771 109369911 109741437 110436318 111737694 112151492 113276689 114683584 115820418 116625582
2202 116625582 117330884 118147044 118521762 118993572 119927957 120480874 121068683 121877018 122742150
2193 122742150 123487091 123922135 124484249 125210685 125657176 125733523 126041330 126685693 126974420
2184 126974420 126762251 126072119 125268803 124122038 122145877 120561139 118398547 116627624
2176 116627624 114591773 112115172 110067513 107566588 105481268 102992771 100552367 98152438
2168 98152438 96118493 94190653 92144508 89987358 87926824 85967381 84011610 82289463
2160 82289463 80549445 78778197 77057905 75702789 74152699 72646196 71468463 70062098
2152G0062098j346048j174420j449618j121126j038153j176754j233851j068378
2144F0453750q72306p79948q40059j043454o83154o69430j026128q29912m62707
2135E3246652n88297l50697q23341l60680n00587o42190q1680n47704q23310l59571
2125D8168595k59065m97249o37638j25559J17129k31478j99303l92179j23752
2116D5819501m59019l01235m25626k4716J24501R6278j3059k18192K35016L9763
2106D4873212l92075N8300K69861K25456p3392j02901N02147J91821O8407K62397
2096D5883233L5351J69667N0609M90948M21319N36828L17215K24111O85013M55764
2086D9270058N06758L53525N32425O13005K54663P34058O70598P57304O75730
$$ plain form
2152 70062098 68716050 67541630 66092012 64970886 63932733 62755979 61522128 60453750
2144 60453750 59581444 58801496 57961437 56917983 56234829 55565399 54539271 53709359 53246652
2135 53246652 52658355 52307658 51484317 51123637 50623050 49980860 49899180 49351476 48528166 48168595
2125 48168595 47909530 47412281 46774643 46649084 46766213 46534735 46335432 45943253 45819501
2116 45819501 45360482 45059247 44633621 44608905 44733406 44829684 44816625 44598433 44833449 44873212
2106 44873212 44481137 44539437 44809298 45034754 44961362 44858461 45360608 45552429 45620836 45883233
2096 45883233 45918584 46088251 46138860 46629808 47051127 47587955 47905170 48129281 48814294 49270058
2086 49270058 49776816 50130341 50662766 51275771 51530434 52264492 52935090 53692394 54368124
2077E4368124O71382L78387P45641Q20907Q62476R60466O88846J126451Q96476
2068F1519156P76552J075203J036802J369939J336255J173573J143707J166244
2060G0597431J586749J617138J476025J721870J623317J801065K079088J850548
2052H4353231J997150J976937K337760K218230K340126K770336K456871K500811
2044A02951452L036511K849999K440757K715756L629115L006234L345926L365383
2036A27341133L401860L506355L908886L847089L945914L915706M072095M498966
2028A58438004M710651M853212M985008N212062N372831N438406O082974O169825
2020B01262973N490725O044974N610007N569872M982460M810066M995338M536783
$$ plain form
2077 54368124 55039506 55417893 56163534 56984441 57846917 58807383 59496229 60622680 61519156
2068 61519156 62295708 63370911 64407713 65777652 67113907 68287480 69431187 70597431
2060 70597431 72184180 73801318 75277343 76999213 78622530 80423595 82502683 84353231
2052 84353231 86350381 88327318 90665078 92883308 95223434 97993770 100450641 102951452
2044 102951452 105987963 108837962 111278719 113994475 117623590 120629824 123975750 127341133
2036 127341133 130742993 134249348 138158234 142005323 145951237 149866943 153939038 158438004
2028 158438004 163148655 168001867 172986875 178198937 183571768 189010174 195093148 201262973
2020 201262973 206753698 212798672 218408679 223978551 228961011 233771077 238766415 243303198
2012B43303198M399012M302424M706408M934304M120062M327602M202650L613979
2004B77909639L455196L076610K402503J366822O06391J5584j320612k078492
1996B85433641k575335l887245m509106n349250n836766o029846o550814o830941
1988B43864338o813080o522774o471906o284072o424977o295962n849364n930067
1980A93272136n578106o197963o375743n648919o039431n668637n630841n618205
1972A46514291n334165n210245m803827m672890m413619m134097m520746m020167
1964A09404535l685463l710703l136302l097039l008321k468721k998310k971122
1956H4328554k469286k584326k194969k465719k468361k076223j963755j903758
$$ plain form
2012 243303198 247702210 252004634 256711042 261645346 265765408 270093010 274295660 277909639
2004 277909639 281364835 284441445 286843948 288210770 288817161 288832745 287512133 285433641
1996 285433641 282858306 278971061 274461955 269112705 263275939 257246093 250695279 243864338
1988 243864338 237051258 230528484 224056578 217772506 211347529 205051567 199202203 193272136
1980 193272136 187694030 181496067 175120324 169471405 163431974 157763337 152132496 146514291
1972 146514291 141180126 135969881 131166054 126493164 122079545 117945448 113424702 109404535
1964 109404535 105719072 102008369 98872067 95775028 92766707 90297986 87299676 84328554
1956 84328554 81859268 79274942 77079973 74614254 72145893 70069670 68105915 66202157
1948F6202157j739474j941838j829771j884561j489890j635316j295476j601996
1940E2783835j448202j445122j238156j052542q90611j226848j110644r78158
1932D3393552j268479j102490p32470r81387q30141p01540r36320q90876p76122
1923C5173727n94589q86159p11355q37740m31044n48354o22267n02198q54589
1914B9185432m77905k92614o97194p88464m02000m53614m05333n29114m70246
1905B4668948n50838l88698m15720q08042j73426j20114l66539o56430j61351
1896B1027790l69138j39686m09516l01330o01722m73399P2452l2721k47505l63789
1886A8161436k20990k47147l88797N0292m78014k84741j02355l16250l28370k87748
$$ plain form
1948 66202157 64462683 62520845 60691074 58806513 57316623 55681307 54385831 52783835
1940 52783835 51335633 49890511 48652355 47599813 46709202 45482354 44371710 43393552
1932 43393552 42125073 41022583 40290113 39308726 38478585 37777045 36840725 35949849 35173727
1923 35173727 34579138 33692979 32981624 32143884 31712840 31164486 30542219 30040021 29185432
1914 29185432 28707527 28414913 27717719 26929255 26527255 26073641 25668308 25139194 24668948
1905 24668948 24118110 23729412 23313692 22505650 22332224 22212110 21845571 21189141 21027790
1896 21027790 20658652 20518966 20109450 19808120 19206398 18732999 18805451 18772730 18525225 18161436
1886 18161436 17940446 17693299 17304502 17354794 16876780 16592039 16489684 16173434 15845064 15557316
1876A5557316L5046j12603m21265k22062K1899l40827k92357j0693l93098j61700
1866A3659656j18456k27800m43172j78464Q3359J12090j94981j30166k04676k28456
1856A2128934j66943k61898j15289j9381j77233n15577J51058k37677j47515N5335
1846A0693814k70487r110k46896k31991J43369q9393o3607l53132k31286K12115
1836I553396j88941j78461J65411l26346l5429j11147q4602M8990k55520j65249
1826H422102j23491J74775J06645j33027k63739m1348M5315j55m6587l04913Q6417
1815G921994k02226J45406R3998r5923N5607k34152n0076k81621J49117O3692
1805G565816K4376M571j93860J12194j72329k40659J20577p9821J25171k15641
$$ plain form
1876 15557316 15592362 15479759 15058494 14836432 14858331 14517504 14225147 14214454 13821356 13659656
1866 13659656 13541200 13313400 12870228 12691764 12775123 12887213 12692232 12562066 12357390 12128934
1856 12128934 11961991 11700093 11584804 11565423 11388190 10872613 11023671 10785994 10638479 10693814
1846 10693814 10423327 10414217 10167321 9935330 10078699 9989306 9925699 9572567 9341281 9553396
1836 9553396 9364455 9185994 9351405 9025059 8989630 8878483 8793881 8842871 8587351 8422102
1826 8422102 8298611 8473386 8580031 8447004 8183265 8141917 8187232 8187077 8140490 7835577 7921994
1815 7921994 7719768 7865174 7959172 7863249 7918856 7684704 7634628 7353007 7502124 7565816
1805 7565816 7590192 7594763 7400903 7513097 7340768 7100109 7220686 7140865 7266036 7050395
1795G050395N3561q6780M278J4448j19550O7557j77697K79837P6711k65668j88727
1784F708365j59048k7481k21232l14171N7869O3125M673K66031k63445j34859
1774E979827K6617K8611j96745l9140O1092j04150k45817k52135J39829k30811
1764E167178N678n2979K4051n32438J88171P3607k75532q4559l7464k86833K95379
1753D484259K49782m0305j51721k7385j38526j32224j39589J52081O1311o6741
1743D250942q0484J93176k02508l05981K16217N9981j16350l67090J21905J36607
1733C906415k47022k42248L17856K95594l93072J41308k41728m5299j3361j79195
1723C299248K2236K96351j98753k53042K30951N4042j92617R8758K3788j6825
$$ plain form
1795 7050395 7103956 7017176 7021454 7035902 6916352 6983909 6806212 7086049 7162760 6897092 6708365
1784 6708365 6549317 6521836 6300604 5986433 6044302 6107427 6112100 6378131 6114686 5979827
1774 5979827 6006444 6035055 5838310 5799170 5860262 5756112 5510295 5258160 5397989 5167178
1764 5167178 5172856 5119877 5143928 4611490 4799661 4873268 4597736 4513177 4475713 4188880 4484259
1753 4484259 4734041 4693736 4542015 4514630 4376104 4243880 4104291 4256372 4317683 4250942
1743 4250942 4170458 4363634 4161126 3855145 4071362 4131343 4014993 3647903 3769808 3906415
1733 3906415 3659393 3417145 3735001 4030595 3637523 3778831 3537103 3491804 3478443 3299248
1723 3299248 3321484 3617835 3419082 3166040 3396991 3451033 3258416 3357174 3380962 3364137
1713C364137j04410J03812o9460j53629k82289j08565J38903k53687O1835j89635
1703B507012j06420J37736L39143j9668k80140j52751K55251m92481L87314m29831
1693B145165o724N3294j99383N7755K42878J57558j49786o22M3775k4916j64646
1682B154348J25693j02114J01488o89l56167K17698N4204j03106K25294r3226
1672B223423O208o9326j30286J39815j76113k36451K03625k08693q9522K30402
1662A893082q8590j5656L90O6973k94030L19897k1588l15592M52769M0192k33834
1651A804013k06621L18719j82466J64144j07863l51058L47412J41337l47101l33575
1641A246941K71810M92519J3419j68438M2750q9261K15612r8308k22452j29061
$$ plain form
1713 3364137 3259727 3363539 3294079 3140450 2858161 2749596 2888499 2634812 2696647 2507012
1703 2507012 2400592 2538328 2877471 2857803 2577663 2424912 2680163 2187682 2574996 2145165
1693 2145165 2138441 2191735 1992352 2050107 2292985 2450543 2300757 2300135 2343910 2318994 2154348
1682 2154348 2280041 2177927 2279415 2278726 1922559 2140257 2194461 2091355 2316649 2223423
1672 2223423 2229631 2160305 2030019 2169834 1993721 1757270 1960895 1752202 1662680 1893082
1662 1893082 1804492 1788836 1789226 1856199 1562169 1882066 1860478 1544886 1997655 2037847 1804013
1651 1804013 1597392 1916111 1733645 1897789 1789926 1438868 1786280 1927617 1580516 1246941
1641 1246941 1518751 2011270 2024689 1856251 1899001 1809740 2025352 1927044 1704592 1575531
1631A575531o1360J98791j08430j07365J71347L4789P6754j94277J39283l52294
1621A372769J8406m4431M22797k09054K5565j24006O3815n24882M47937K42144
1611A691060l18415J5893k43541k0537r231L72252k64419J490K47696k3002o9469
1600A379777R6346j96256O2589J78996K9710j14074j37949j38711l7987l6961
1590A085480l1102N4129Q0931J03759J48483j54838q6020q3201J67594k66488
1580A018727J93192l82785L87204K1738J1623k24029J07890K5973j03078O2530
1570A118985N5138j5315N1683l09197P3589K13753J68446K6306k09579K15772
1560A389581j18125k87613P6449J45039q8550N8953J28872o860j83480j15925
$$ plain form
1631 1575531 1514171 1712962 1604532 1497167 1668514 1703303 1780057 1585780 1725063 1372769
1621 1372769 1391175 1346744 1769541 1560487 1586052 1462046 1525861 1000979 1448916 1691060
1611 1691060 1372645 1388538 1144997 1124460 1115229 1487481 1223062 1224552 1472248 1449246 1379777
1600 1379777 1476123 1279867 1342456 1521452 1551162 1437088 1299139 1160428 1122441 1085480
1590 1085480 1054378 1108507 1189438 1293197 1441680 1286842 1200822 1117621 1285215 1018727
1580 1018727 1211919 829134 1216338 1238076 1249699 1025670 1133560 1159533 1056455 1118985
1570 1118985 1174123 1158808 1210491 901294 974883 1188636 1357082 1383388 1173809 1389581
1560 1389581 1271456 983843 1060292 1205331 1116781 1175734 1304606 1297746 1114266 998341
1550I98341P8015n0137l02763K51075K45272r1021l68336K3966q6349L78850J923
1539A078836o8656P2729m28248P9912M6198L3929K6273L25565K4599K3808k76842
1528I38103m7907O3732j35881J48229M3311P7686j90343O0735J59865o7786J70044
1517A219788l30793m4090L7836J74265O7571k85014K54854p0495Q1515p8839k14960
1506H11638k4836L26289P094m6345j4894K16475j94503k14547J67087P7102n7954
1495A052606K59283j1065k30026l03546m9071K66210J85883J15556j1069j35644
1485A139117J60585p9920j49543K40990J9915J09175M07388l50984J48595j9554
1475A625764K94517N05483l94901k4482J11290l0305O7712l2130K07062L3753
$$ plain form
1550 998341 1076356 1026219 723456 974531 1219803 1128782 760446 784412 698063 1076913 1078836
1539 1078836 1010180 1082909 654661 734573 780771 814700 840973 1166538 1191137 1214945 938103
1528 938103 890196 953928 818047 966276 1009587 1087273 896930 957665 1117530 1049744 1219788
1517 1219788 888995 844905 882741 1057006 1124577 839563 1094417 1023922 1105437 1026598 811638
1506 811638 786802 1113091 1120185 1073840 1058946 1275421 1080918 866371 1033458 1110560 1052606
1495 1052606 1311889 1300824 1070798 767252 718181 984391 1170274 1285830 1274761 1139117
1485 1139117 1299702 1219782 1070239 1311229 1331144 1440319 1847707 1496723 1645318 1625764
1475 1625764 1920281 2425764 2030863 2006381 2117671 2087366 2155078 2122948 2330010 2363763
1465B363763K2857K66132K78908n0274q5269L13244N0770J62297L40496P1342
1455C734266M55210K76744J18291L30388n4158M04516M43J10482O5116O14017
1445F055315M18410K27105K71160P13175J52889N88127M84896R7916N92583Q09303
1435A0410879R13332N98200J216288J323374J543786J427784R44211J475402J837437
1426B1690693K277736K762754L325505L895505N021096N283632M468717K903454
1418E1629092k90363l164195n172035n397911m621493m300399l832294k997676
1410B1852726k236546k251636j665346j320313j423907j196119j038628q47695
1402I872536q31720j012178q72027l67443n33577m76790j36575l43923m69900
$$ plain form
1465 2363763 2386620 2652752 2931660 2881386 2796117 3109361 3160131 3322428 3662924 3734266
1455 3734266 4189476 4466220 4584511 4914899 4860741 5265257 5265700 5376182 5441298 6055315
1445 6055315 6473725 6700830 6971990 7685165 7838054 8426181 8911077 9008993 9601576 10410879
1435 10410879 11324211 11922411 13138699 14462073 16005859 17433643 18377854 19853256 21690693
1426 21690693 23968429 26731183 30056688 33952193 38973289 44256921 48725638 51629092
1418 51629092 51338729 48174534 43002499 37604588 32983095 28682696 24850402 21852726
1410 21852726 19616180 17364544 15699198 14378885 12954978 11758859 10720231 9872536
1402 9872536 9040816 8028638 7156611 6789168 6255591 5778801 5642226 5298303 4828403
1393D828403j98733j5212j80659m13339r2784l93096l43001k84646Q6575N91k37725
1382B756374J53298l11245k01782k05225J16076k48047p5874O2359q4353k39604
1372A721977m8984j06100k98540K07042R8961j83819K02691j42892j29054J73908
1362A495190l63703k17622j66244K29196K025J94240k40356n5970q2221q9907
1352G04628J5478m2560M8528n9646j71063K94559l1602k51249l37732J96552l41215
1341B4678J14554J81984L20130m3402j64837j73680L2860Q7217K53625k07969
1331D25160j44020K57289J06236l02703k6007q2965J11103j4680N9053M8123o7018
1320C69571j33832Q8838J72111k40104k08253j23926K7670p9786K19323k77756
$$ plain form
1393 4828403 4629670 4614458 4433799 4020460 3927676 3534580 3191579 2906933 2993508 2994099 2756374
1382 2756374 2909672 2598427 2396645 2191420 2307496 2059449 1983575 2045934 1961581 1721977
1372 1721977 1672993 1566893 1268353 1475395 1574356 1390537 1593228 1450336 1321282 1495190
1362 1495190 1131487 913865 747621 976817 978842 1173082 932726 876756 794535 704628
1352 704628 720106 677546 726074 666428 495365 789924 758322 507073 169341 365893 24678
1341 24678 139232 321216 641346 597944 433107 259427 292287 379504 633129 425160
1331 425160 281140 538429 644665 341962 315955 232990 344093 329413 388466 436589 369571
1320 369571 235739 324577 496688 256584 48331 -75595 -47925 -127711 91612 -186144
1310a86144K99231K77311N0234j54826R296k61670J10594Q1957K8832j19347J76669
1299C12137l4688l61688p1874K46967k03119K12448R5573l8624j98446J00902
1289E9588L22787j1892P6159Q5409j95846k44572j38913j36722P5163O1037k55732
1278c03534L25071L26274k19807k73930J29662j19387j04248J67912n5103j4654
1268a41744r4872l5379K4122j53003O6299p7833J61873L0389J41254q2835J91027
1257B9298j75337J14561K90655K15798j81337l33215K06753k38903j24430N0856
1247a45301J30431j03246j01618J9858p8456r6690R1526q2671J15983J01502J76550
1236B7868K7626l6735J13921k7031o1614j45372l5166l04552J62790Q0937K8821
$$ plain form
1310 -186144 113087 390398 440632 285806 295102 33432 144026 225983 254815 135468 312137
1299 312137 277449 -84239 -156113 90854 -112265 100183 195756 157132 -41314 59588
1289 59588 382375 370483 446642 532051 336205 91633 -47280 -184002 -108839 -47802 -303534
1278 -303534 21537 347811 128004 -145926 -16264 -135651 -239899 -71987 -127090 -141744
1268 -141744 -236616 -271995 -247873 -400876 -334577 -412410 -250537 -220148 -78894 -161729 29298
1257 29298 -146039 -31478 259177 474975 293638 -39577 167176 -71727 -196157 -145301
1247 -145301 -14870 -118116 -219734 -199876 -278332 -375022 -283496 -366167 -250184 -148682 27868
1236 27868 55494 18759 132680 105649 44035 -101337 -136503 -441055 -278265 -197328 -168507
1225a68507R8787j89038L00787N6387J11064M7315k97817K76873l3228j9174k15786
1214c2337O345o4074j55658K28349J6331p957J32651Q525O8032j76945j20912
1203i7650j981l12910L529M34925k51057j42371M56477k23391P3189l2418j45094
1192b38752j772J23758j696q2163Q0855p6098M3373j49408K5971p6542l0813K79716
1180a03571j31620j10705J79743n4652J03971N1870k40765K99442k27827o3141
1170b97255K05290j3940k90524K03831M0760j30915Q144J1240j84272J14452p3835
1159d07024L42602J96939m57663r8918l040J9197K11153k63169O680j60245L05319
1148c08169K51582k1969k53777q7751K5474O0577M6696k3271p0275j41061K07823
$$ plain form
1225 -168507 -69720 -258758 42029 98416 209480 256795 -41022 235851 202623 183449 -32337
1214 -32337 -25992 -90066 -245724 -17375 -1044 -9001 123650 132175 200207 23262 -97650
1203 -97650 -99631 -412541 -409012 25913 -225144 -367515 88962 -134429 -61240 -93658 -238752
1192 -238752 -240524 -116766 -118462 -200625 -119770 -195868 -152495 -301903 -275932 -352474 -383287 -103571
1180 -103571 -235191 -345896 -166153 -220805 -116834 -64964 -305729 -6287 -234114 -297255
1170 -297255 -91965 -105905 -396429 -192598 -151838 -282753 -274609 -263369 -447641 -333189 -407024
1159 -407024 -64422 132517 -325146 -424064 -427104 -407907 -196754 -459923 -453243 -613488 -308169
1148 -308169 -56587 -78556 -332333 -420084 -394610 -334033 -287337 -310608 -380883 -521944 -314121
1137c14121K5184J30653J48682k98926M7755j60748p9119J94825j66291Q3731
1127c88375j84090k58757L89395R2596J47471L8911R3305j64356J45983J19907
1117C1990k45918k14891l5262L35826j451Q4261j16846O6425k27362j4406K0626
1106c17008j47969k791r212J34796J9572j6948M0313j4331r4083K1485r2172O5961
1094d12387J82738k33058j61660O6020q689R9869J89753j57994N5535L7388k38882
1083e81367j05296N1851N8775o7583M60616M3867j20752R889j62243N9506O2872
1072b89865q1601l28977K74368K28347p332j3455j15715J47785J68512j08042
1062a25975O771J12877k27131m95103J03888L07675o0844o6109P1406J55796j05518
$$ plain form
1137 -314121 -288937 -158284 -9602 -308528 -260773 -421521 -500640 -305815 -472106 -388375
1127 -388375 -572465 -831222 -441827 -349231 -201760 -162849 -69544 -233900 -87917 31990
1117 31990 -213928 -428819 -464081 -128255 -129706 -45445 -162291 -95866 -323228 -337634 -317008
1106 -317008 -464977 -467768 -476980 -342184 -322612 -339560 -299247 -313578 -407661 -386176 -478348 -412387
1094 -412387 -229649 -462707 -624367 -558347 -567036 -467167 -277414 -435408 -379873 -342485 -581367
1083 -581367 -686663 -634812 -576037 -643620 -183004 -139137 -259889 -250000 -412243 -352737 -289865
1072 -289865 -371466 -700443 -426075 -197728 -205060 -218515 -334230 -186445 -17933 -125975
1062 -125975 -119204 -6327 -233458 -728561 -624673 -316998 -377842 -443951 -372545 -216749 -322267
1051c22267k843K04901k32754J8016J00905j46673P5388K27239o1431q1843K9064
1040a92298n9222k54412q6814J36003O7987k6490J72561l8364Q192l8715k7820
1029c39392n5407J00210J47031j50254j58333K63485n30252K48877j73713J91053
1019d56695L29758j02980J4683M106k08219k60497J90929k1762j2091K0987L6829
1008d64952j7310R6035J10233m1818J09448p8997k64567n1952J66696k41561K74272
997d04473J73839O1685j49071K09597k46061N2264O6494J79913k2500r2804r8303
986b69420l28933L42826l1949j41267L3071R219N6747P5250n17956P2603J94985
975e04824Q3943K02137p6018k39351M0165O9918O3940p4928j38869P6172o539
$$ plain form
1051 -322267 -325110 -120209 -352963 -334947 -234042 -380715 -305327 -78088 -139519 -221362 -192298
1040 -192298 -251520 -505932 -592746 -456743 -388756 -415246 -242685 -281049 -272857 -311572 -339392
1029 -339392 -394799 -294589 -147558 -297812 -456145 -192660 -722912 -474035 -647748 -456695
1019 -456695 -126937 -229917 -215234 -211128 -419347 -679844 -488915 -510677 -522768 -501781 -464952
1008 -464952 -482262 -386227 -275994 -317812 -208364 -287361 -551928 -603880 -437184 -678745 -404473
997 -404473 -230634 -168949 -318020 -108423 -354484 -302220 -235726 -55813 -78313 -171117 -269420
986 -269420 -598353 -255527 -287476 -428743 -395672 -386453 -329706 -254456 -772412 -699809 -504824
975 -504824 -420881 -218744 -294762 -534113 -493948 -424030 -360090 -435018 -573887 -497715 -504254
964e04254O1305J07823k3224m5660k7741J59299j47410J28062k3291m4260M011
953c55340k21690N5907L14619j48893k67776j44777M50479J54604j71597r4759
943d29223l31046P4571L47897j10966p3552j31269M35386j11215m0852k5893J09364
932b86798L1014j27744j46565O4008m38378R6434R8108n0195P4978Q1138L10587
921b93413J19575j18085j12614J28160r4630m28508Q6733K3124m957J8784J96121
910d79710k962M9411Q9462K5597j43575l11319J33756L07251l84503N3953J99271
899d63368k07632j25253L07805J5859j96619K82891Q466o2175k00912k05872l9315
888h86125M02076k1697J94903j73010j57484J79069o2229L9414J29820Q6110j83538
$$ plain form
964 -504254 -442949 -335126 -358350 -404010 -431751 -272452 -419862 -291800 -315091 -359351 -355340
953 -355340 -577030 -521123 -206504 -355397 -623173 -767950 -317471 -162867 -334464 -429223
943 -429223 -760269 -685698 -337801 -448767 -522319 -653588 -218202 -329417 -370269 -396162 -286798
932 -286798 -255784 -383528 -530093 -466085 -904463 -808029 -709921 -760116 -685138 -604000 -293413
921 -293413 -173838 -291923 -404537 -276377 -371007 -799515 -712782 -689658 -694615 -675831 -479710
910 -479710 -482672 -433261 -343799 -318202 -461777 -773096 -639340 -332089 -716592 -662639 -463368
899 -463368 -671000 -796253 -488448 -472589 -669208 -386317 -377851 -440026 -640938 -846810 -886125
888 -886125 -484049 -505746 -310843 -483853 -641337 -462268 -524497 -485083 -355263 -269153 -452691
877d52691M8052k13497j00210P0202J85900j89712K67163Q4326j18606K520P0907
866c45646l35766J27572N2481J5056J69652m6054J37755l8846N7529L2861N0573
855a22833j57249j06679J02100l3947j21935J35005n40101K83585J17011P7156
845c67887m05159L59088m2632M04254m78433l47696L28744J98935P378j66938
835e10346q805J72228k26746J69510J03234k29251m813n6419k5666O2930n2217
824f06361Q6927K80227j241p2760q8215o9671k9116J00210k48682K85408M5923
813c17351k21687L15321j13392j4870k42056J41437K12264p1235k04437r0754
803f06760K58213j01792j14231k20852P2448l4512m6218K20302O3721l7909J13311
$$ plain form
877 -452691 -404639 -618136 -718346 -648144 -462244 -651956 -384793 -300467 -419073 -416553 -345646
866 -345646 -681412 -553840 -501359 -486303 -316651 -362705 -224950 -263796 -206267 -173406 -122833
855 -122833 -280082 -386761 -284661 -318608 -440543 -305538 -845639 -562054 -445043 -367887
845 -367887 -773046 -413958 -456590 -52336 -530769 -878465 -549721 -350786 -343408 -510346
835 -510346 -519151 -346923 -573669 -404159 -300925 -530176 -534989 -591408 -617074 -554144 -606361
824 -606361 -519434 -239207 -240448 -313208 -401423 -471094 -500210 -400000 -648682 -363274 -317351
813 -317351 -539038 -223717 -337109 -351979 -594035 -452598 -240334 -311569 -516006 -606760
803 -606760 -348547 -450339 -564570 -785422 -712974 -747486 -793704 -573402 -509681 -547590 -434279
792d34279j39042J43334p1865o134p5597j45961j30342N9630O8751k8871J52853
781f07523l338p6762J92108O092k74865J35545j2686j37262p2233J12585j13240
770h51579r8344K41914j24220K57880K17723r6998j61213Q9743N0488j88368L41311
759c21663j4081k5223p2895k78917J30826M8357P7514k13507k87623J75458P0160
748g11594J37841L30330l86196l21128L46129P6113l333J99789k22751j1556J21882
737d44474j0245J60175j32403q9541O740m9779l20755K53690M67567k04775j73532
726e37332J39551J39851k84939R3660J52848j84874J14090j97172k05916j01869
716h72102J61523K11152n6725L15022j12573J12602k38011J29902J09144k07381
$$ plain form
792 -434279 -573321 -429987 -501852 -507986 -583583 -729544 -859886 -800256 -731505 -760376 -607523
781 -607523 -610861 -687623 -495515 -489423 -764288 -628743 -641429 -778691 -850924 -738339 -851579
770 -851579 -949923 -708009 -832229 -574349 -356626 -453624 -614837 -525094 -474606 -662974 -321663
759 -321663 -335744 -360967 -433862 -712779 -581953 -533596 -456082 -669589 -957212 -781754 -711594
748 -711594 -573753 -243423 -629619 -950747 -604618 -528505 -531838 -332049 -554800 -566356 -444474
737 -444474 -454719 -294544 -426947 -516488 -509748 -559527 -880282 -626592 -159025 -363800 -537332
726 -537332 -397781 -257930 -542869 -449209 -296361 -481235 -367145 -564317 -770233 -872102
716 -872102 -710579 -499427 -556152 -241130 -353703 -241101 -479112 -349210 -240066 -447447
706d47447R3769N4568j6412J54665q1533k36944J08172j58178p0631k22684J58978
695f63677J94984o8963P2333j941o5691P0598R7193l98795j41943L05483q1143
684f81562j93225K62340j22989P3850L14250J8611r1697k77188K98139j86486
674e85957M7911o7536R616J30132O7684j94225j99730J42101j09160L67630k17045
663f08579n0106n3203O6258m6298k86681L61657P8175j02606J47911j42994R5982
652e40484r9194R070j10871j35896K18959Q2137J29640L2316m016p7869j49402
641f45610j51863K20159J9234N0775J72917l7350Q3125j60326K68357o3871n7518
630c01971K3988o5090N107k77380l1340N8720o6687J08510m6315m6954L7798J3393
$$ plain form
706 -447447 -353678 -299110 -315522 -160857 -242390 -479334 -371162 -529340 -599971 -822655 -663677
695 -663677 -468693 -537656 -465323 -467264 -532955 -462357 -365164 -763959 -905902 -600419 -681562
684 -681562 -874787 -612447 -735436 -661586 -347336 -328725 -420422 -697610 -399471 -585957
674 -585957 -538046 -605582 -595966 -465834 -398150 -592375 -792105 -650004 -759164 -391534 -608579
663 -608579 -658685 -711888 -645630 -691928 -978609 -616952 -538777 -641383 -493472 -636466 -540484
652 -540484 -639678 -630608 -741479 -877375 -658416 -576279 -446639 -414323 -418339 -496208 -645610
641 -645610 -797473 -577314 -558080 -507305 -334388 -371738 -288613 -448939 -180582 -244453 -301971
630 -301971 -277983 -343073 -337966 -615346 -646686 -587966 -654653 -546143 -592458 -639412 -601614 -588221
618e88221k23581M1223K30655P320j70339L60454o0224l30084j5530Q7905n5225
607g15647J30518k31834m0011K34162j72336K672p0539K1833K62953L5133l25203
596h68299J30342K38649J39563j75836J1011k39759j53430K08275j08932n4204
586h72620L61764K1235l36077J12764O6216J20942J07319k75621r9341J80120
576f13299P5562l03253Q8610J32293K64339j78956j60459J61282j2107j5839J33699
565d28128l87760k1770M8898L95914j40167N7623o6402j04633L76448o1533l29594
554f61104J3747J62102o1821j54917j19607J54152K59056j18773L7630P1470M1820
543c76245j13251Q5179j33869j49872n8420o9879L7402q3150K21693j28368n403
$$ plain form
618 -588221 -811802 -770579 -539924 -532604 -702943 -342489 -402713 -732797 -748327 -660422 -715647
607 -715647 -585129 -816963 -856974 -622812 -795148 -792476 -863015 -841182 -578229 -543096 -868299
596 -868299 -737957 -499308 -359745 -535581 -524570 -764329 -917759 -709484 -818416 -872620
586 -872620 -510856 -489621 -825698 -712934 -646718 -525776 -418457 -694078 -793419 -613299
576 -613299 -537737 -840990 -752380 -620087 -355748 -534704 -695163 -533881 -545988 -561827 -428128
565 -428128 -815888 -837658 -788760 -392846 -533013 -475390 -541792 -646425 -269977 -331510 -661104
554 -661104 -647357 -485255 -547076 -701993 -821600 -667448 -408392 -527165 -489535 -418065 -376245
543 -376245 -489496 -404317 -538186 -688058 -746478 -816357 -778955 -862105 -640412 -768780 -774183
532g74183L27359k92147j31218R5146k16921J95023L6443L46133j90286J0940
522e93711J86565k01705J46051Q9303K0167j09009j60940N3124n45152L63021
512g52286L90963k30082l1400j96488K82722n306k84800J26743o2809J54012N3381
501e55350m7128J71958k39321K94876j75088j52510o0269J37414J22336J08592
491c94490n3323j70538J91298m40787M35488J52206j32817j69028Q1716K35947
481b64328j41619l57907j31802L8437J29673o4473L13363j74870j08123L4560
471g27089K06471J00175k12068j51500M4880L2649P9117R5580l8603J94478k43147
460f19057J61169k03470O5938J10506M0021q9974k70796N3180L55243M2133j32440
$$ plain form
532 -774183 -446824 -738971 -870189 -775043 -991964 -796941 -760498 -414365 -604651 -593711
522 -593711 -407146 -608851 -462800 -373497 -353330 -462339 -623279 -570155 -1115307 -752286
512 -752286 -361323 -591405 -622805 -819293 -536571 -541877 -826677 -699934 -762743 -608731 -555350
501 -555350 -602478 -430520 -669841 -374965 -550053 -702563 -762832 -625418 -503082 -394490
491 -394490 -447813 -618351 -427053 -867840 -432352 -280146 -412963 -581991 -500275 -264328
481 -264328 -405947 -763854 -895656 -857219 -727546 -792019 -478656 -653526 -761649 -727089
471 -727089 -520618 -420443 -632511 -784011 -739131 -706482 -627365 -531785 -570388 -375910 -619057
460 -619057 -457888 -661358 -595420 -484914 -444893 -534867 -805663 -752483 -397240 -355107 -487547
449d87547j72393R8387J67684k1131L4853M1479j60051J10883j98255j69009O8924
438f86176J85691J02646j56431k12765J6525J62996j8054r8705q9889L97620o2133
427d58675j60262J92679m47169L9210K00246k10894J50536J84368l8900L45604
417b03257O7528j22673J05267l67557M3260q3794j40011K08554j01798k62103
407h56584J55765M6449L24717K9317L7234j84416M2297j29911j40142j56050J50829
396f80495K05514J4957j17247l6384q955P3560k13511K88180P7603j40448K4494
385e12732l08054m454J35557J41908k65169L1793J77120O5914l0536K06016j90433
374e53070j58114J24934p4218J34513n3786l4524O7862J05611J46133r9327j21519
$$ plain form
449 -487547 -659940 -561553 -393869 -415000 -380147 -338668 -498719 -387836 -586091 -755100 -686176
438 -686176 -500485 -397839 -554270 -767035 -750510 -587514 -605568 -704273 -794162 -396542 -458675
427 -458675 -618937 -426258 -873427 -834217 -633971 -844865 -694329 -509961 -548861 -203257
417 -203257 -135729 -258402 -153135 -520692 -477432 -561226 -701237 -492683 -594481 -856584
407 -856584 -700819 -654370 -329653 -300336 -263102 -447518 -405221 -535132 -675274 -831324 -680495
396 -680495 -474981 -460024 -577271 -613655 -622610 -549050 -762561 -474381 -396778 -537226 -512732
385 -512732 -820786 -825240 -689683 -547775 -812944 -781151 -604031 -538117 -568653 -362637 -553070
374 -553070 -711184 -586250 -660468 -525955 -579741 -614265 -546403 -440792 -294659 -393986 -515505
363e15505r7031K789k18421j73439L17499J47886m31139O5058J70337K09287j93695
352g16374m1037J12733j0811n1970j39236o7781L89438Q0791k64862J28042n7586
341f38653Q0779j4191l51726J9713M08321N9078m04202j87411J51677J17051J72187
330e87377P7681m7826m8388j15275M4342M4470J17350M1052j82059n681N988J74398
318d81325k92840n54K0117J18168l0397J13099J8464l03847K67947q4297J96774
307d58691k58833k2572J92495J54443P2305K2205j53876J342j64699k26635m5757
296h88273L35908J46317m1865J09734l03062N2626j78354l9610L73561k19721
286f52739l45646j05446K54412J52649k47756J14401L93275j89263j99696m8737
$$ plain form
363 -515505 -612536 -609747 -828168 -1001607 -684108 -536222 -967361 -902303 -731966 -522679 -716374
352 -716374 -757411 -644678 -655489 -707459 -846695 -914476 -525038 -444247 -709109 -581067 -638653
341 -638653 -557874 -572065 -923791 -904078 -495757 -436679 -840881 -1028292 -876615 -759564 -587377
330 -587377 -509696 -557522 -605910 -721185 -676843 -632373 -515023 -473971 -656030 -661711 -655723 -481325
318 -481325 -774165 -774719 -754602 -636434 -666831 -553732 -535268 -839115 -571168 -655465 -458691
307 -458691 -717524 -740096 -547601 -393158 -320853 -298648 -452524 -451182 -615881 -842516 -888273
296 -888273 -552365 -406048 -447913 -338179 -641241 -588615 -766969 -806579 -433018 -652739
286 -652739 -998385 -1103831 -849419 -696770 -944526 -830125 -436850 -626113 -825809 -874546
276h74546K05585L7989J31754J46277o6703n2142l77574J3216R3849K01653K63142
265b77500l52977N127Q8959j22810Q4071k27107J60476P2657L34234j96049l40266
254g71185p0231K46247k41167P5810L79819j67193L2933k29785o5853L14342L2077
243d64186k28631K11244j73972J62527j83730k17347J22733J0828N9732J13792
233e87010M7430p9997j87005K1179K38949j78486j35382N9529J28477j51046j19075
222i42437K36664K1189M4086L22068j77465l17351M4060j96934P5676j09386K83333
211g16497K47140j34444j30401P5277j64637l78308K95316M3489K95946j41904
201g09023q9834R7669J87639J83316m41830N431N11Q5950o9053J10898J89846
$$ plain form
276 -874546 -668961 -630972 -499218 -352941 -419644 -471786 -849360 -836144 -742295 -540642 -277500
265 -277500 -630477 -625350 -536391 -659201 -575130 -802237 -641761 -569104 -234870 -430919 -771185
254 -771185 -841416 -595169 -836336 -760526 -380707 -547900 -514967 -744752 -810605 -496263 -464186
243 -464186 -692817 -481573 -655545 -493018 -676748 -894095 -771362 -760534 -700802 -587010
233 -587010 -539580 -619577 -806582 -785403 -546454 -724940 -860322 -800793 -672316 -823362 -942437
222 -942437 -705773 -684584 -640498 -318430 -495895 -813246 -769186 -966120 -890444 -999830 -716497
211 -716497 -469357 -603801 -734202 -658925 -823562 -1201870 -906554 -863065 -567119 -709023
201 -709023 -798857 -701188 -513549 -330233 -772063 -766632 -766121 -680171 -749224 -638326 -448480
190d48480j12714j22263r8491J36719j84499N1632j42807N0664J06310J76057
180e87872k67031K42474Q7532q288k3550j73918R9703n1773j8457J00415q304
169f09069J31926k66315j1249k5351j18903J67470n1320J09132m8932l3864n4672
158h11147N3249O9381r9762j87816q5526J36521o5573k0261K02453m3523r9727
147i51731l3978P1211O1779K01228j26437o7123j57912o0784J08371J51409j32336
136i36303p7495j7771K14072K12582l33171J06231J46202j55268j06948R2291
126h55578P7340L9604r5552P9806j62220k03195l6646j05310K16431J73717K56963
115f14640j85343j36954j02719J65599q9210J76908M6550j86802j62658m953J76594
$$ plain form
190 -448480 -561194 -683457 -781948 -645229 -829728 -778096 -920903 -870239 -763929 -587872
180 -587872 -854903 -612429 -524897 -533185 -556735 -730653 -630950 -682723 -701180 -600765 -609069
169 -609069 -477143 -743458 -754707 -780058 -898961 -731491 -782811 -673679 -722611 -756475 -811147
158 -811147 -757898 -688517 -788279 -976095 -1061621 -925100 -990673 -1010934 -808481 -852004 -951731
147 -951731 -985709 -914498 -852719 -651491 -777928 -845051 -1002963 -1063747 -955376 -803967 -936303
136 -936303 -1013798 -1031569 -817497 -604915 -938086 -831855 -685653 -840921 -947869 -855578
126 -855578 -778238 -738634 -834186 -754380 -916600 -1119795 -1156441 -1261751 -1045320 -871603 -614640
115 -614640 -799983 -936937 -1039656 -874057 -963267 -786359 -739809 -926611 -1089269 -1094222 -917628
104i17628l3840J10177j3540j04687k25081J87178Q095L1546k5771j3340l2350
93a029241k76034K07530J13994R7845O577M5566p2664j37437m0429K63242j5274
82h36325k01262p7875L5791J32874p5833j28213n6544K38523j94326j49846K49951
71a063085M2777k73297J23597J05746m3711l01912R0089L3631J03560p7853R2049
60a168409O1484M2696j3199J94732l20506m0150j53004k8855L52777n5824k3813
49a152071J92720r4244l33049O9050L1462K31100k37273R757N5352J68980j81806
38a240022j85j2288k17608O7237K26546Q8597N9790J22581k19002j76399Q4761
27a215992J12332j16792M3329j01161r6156j05090J4206K06141k769m4977J59876
$$ plain form
104 -917628 -951468 -841291 -854831 -959518 -1184599 -997421 -989326 -957780 -983551 -996891 -1029241
93 -1029241 -1305275 -1097745 -983751 -885906 -879329 -833763 -906427 -1043864 -1084293 -821051 -836325
82 -836325 -1037587 -1115462 -1079671 -946797 -1022630 -1150843 -1207387 -968864 -1163190 -1313036 -1063085
71 -1063085 -1020308 -1293605 -1170008 -1064262 -1107973 -1409885 -1319796 -1286165 -1182605 -1260458 -1168409
60 -1168409 -1106925 -1064229 -1077428 -882696 -1203202 -1243352 -1396356 -1425211 -1072434 -1128258 -1152071
49 -1152071 -959351 -1053595 -1386644 -1317594 -1286132 -1055032 -1292305 -1282548 -1227196 -1058216 -1240022
38 -1240022 -1240207 -1252495 -1470103 -1402866 -1176320 -1087723 -1027933 -905352 -1124354 -1300753 -1215992
27 -1215992 -1103660 -1220452 -1177123 -1278284 -1374440 -1479530 -1465324 -1259183 -1261952 -1306929 -1147053
16a147053k77482P1740M7546j04887K04615k31394J29502P6185K5073j36565j0470
5a353190k09181J32956R5868N2330j63729
0a444946
$$ plain form
16 -1147053 -1424535 -1352795 -1305249 -1410136 -1205521 -1436915 -1307413 -1231228 -1206155 -1342720 -1353190
5 -1353190 -1562371 -1429415 -1333547 -1281217 -1444946
0 -1444946
$$ Imaginary data points
##PAGE= N=2
##DATA TABLE= (X++(I..I)), XYDATA
16383g734230j97098L41988K62166n6825j07605K23235l7171j3153J32101K54669
16373f931923J17940J2402r6552J96056J51699m1503K84790J31972j81250k4730
16363f381099R2113K48766r7327K7217K51350J22060J16010L24005j20415M9791
16353e367529k52560M4836J87291p1466J25791P6995K11528k6241K33369J86724
16343d651262Q2057J6763j19858J68295P3533Q5565J38364Q3896o3222P3017P4237
16332d038615J17485j28633J88991P6271K91703j31968q134L56825o8274L14360
16322c029989k8498o8272L52322J72076r3628p1901J58293J10440l2083R2087
16312b439153o8468o0935r8645J80096K27864L2661Q2855M09692o3101J46103
$$ plain form
16383 -7734230 -7931328 -7589340 -7327174 -7383999 -7491604 -7268369 -7305540 -7318693 -7186592 -6931923
16373 -6931923 -6813983 -6801581 -6898133 -6702077 -6550378 -6591881 -6307091 -6175119 -6356369 -6381099
16363 -6381099 -6288986 -6040220 -6137547 -6110330 -5858980 -5736920 -5620910 -5296905 -5417320 -5367529
16353 -5367529 -5620089 -5575253 -5387962 -5459428 -5333637 -5256642 -5045114 -5071355 -4837986 -4651262
16343 -4651262 -4569205 -4552442 -4672300 -4504005 -4430472 -4344907 -4206543 -4122647 -4185869 -4112852 -4038615
16332 -4038615 -3921130 -4049763 -3860772 -3784501 -3492798 -3624766 -3632900 -3276075 -3344349 -3029989
16322 -3029989 -3058487 -3126759 -2774437 -2602361 -2695989 -2767890 -2609597 -2499157 -2531240 -2439153
16312 -2439153 -2507621 -2568556 -2667201 -2487105 -2259241 -2226580 -2143725 -1734033 -1797134 -1651031
16302a651031R3339o7880J92684m1435K57882L1405q2713K75196N6247J6929r0473
16291a009850p3607K39886k24365O5159J16841J18850J60087J6457K50345J32771
16281b07426k74500K04222n4932j3384J9055K08258p5478K60217K9703j35238
16271c9503J31455k01276J56230N7767Q7213K50012J43549j69955k41762J1159
16261A84889M57747J95165L7232j41802J60149j3429n9248J08303L3853J98823
16251A161682J45707j99623J50256j40576j31852K31114L9457J01770J92635P619
16241A558189j12996K78485J67423j07848K78893j86400J62946m8487N9596N2540
16231B102341K6295r0964K3843K5043O542J72868j36411k5117N4232J81067J28850
$$ plain form
16302 -1651031 -1557692 -1625572 -1432888 -1474323 -1216441 -1185036 -1267749 -992553 -936306 -919377 -1009850
16291 -1009850 -1083457 -843571 -1067936 -1002777 -885936 -767086 -606999 -590542 -340197 -207426
16281 -207426 -481926 -277704 -332636 -346020 -326965 -118707 -194185 66032 95735 -39503
16271 -39503 91952 -109324 46906 104673 191886 441898 585447 415492 173730 184889
16261 184889 642636 837801 875033 733231 893380 879951 820703 929006 962859 1161682
16251 1161682 1307389 1107766 1258022 1117446 985594 1216708 1256165 1357935 1550570 1558189
16241 1558189 1445193 1723678 1891101 1783253 2062146 1875746 2038692 1990205 2049801 2102341
16231 2102341 2128636 2037672 2061515 2086558 2093100 2265968 2129557 2104440 2158672 2339739 2468589
16220B468589M8987j32360O9620l6707k7842L6486K80091J49952p370r3330k5583
16209B730533J64599K51814J17517k87260J06976n3757j65250L65322j05355J37724
16199C262863q4307k3264N3442l7649K42296j6989j6878k7232Q1422j30989J41404
16188C444119O543J51452l10221K2537K94827K29740l54102j15597J30968R3649
16178C593915K25305j08820Q8696J41356l5497j4691J5215J06457N1623J06013
16168D169572r9639P2893j77872j03153K73727M1242J09699j06457j2176J07010
16158D274846M5421l76644m4406L70052j98243j35004J87755j40857m0571J67404
16148D109753J16372n8589J04123l90029J02150L77527L08968l1404l7565j70205
$$ plain form
16220 2468589 2517576 2385216 2454836 2418129 2390287 2426773 2706864 2856816 2849446 2756116 2730533
16209 2730533 2895132 3146946 3264463 2977203 3084179 3030422 2865172 3230494 3125139 3262863
16199 3262863 3178556 3155292 3208734 3171085 3413381 3396392 3379514 3352282 3433704 3302715 3444119
16188 3444119 3450662 3602114 3291893 3314430 3609257 3838997 3484895 3369298 3500266 3593915
16178 3593915 3819220 3710400 3799096 3940452 3904955 3890264 3905479 4011936 4063559 4169572
16168 4169572 4069933 4142826 3964954 3861801 4135528 4176770 4286469 4180012 4167836 4274846
16158 4274846 4320267 3943623 3899217 4269269 4071026 3936022 4123777 3982920 3942349 4109753
16148 4109753 4226125 4167536 4271659 3881630 3983780 4361307 4670275 4638871 4601306 4431101
16138D431101N6513k24379P0744L90480k70984m7058L0035N3544N3845k21038
16128D322803J19682J47789j24917o2784K61968J05976r4161k0367p8952l2995
16118D544042j54616J90921P8512j6101J66273j30620k43345K48660M3707Q5641
16108D813074m56Q9698K35460m55623j54999K58297P1498j202j87558J8548J94501
16097D881238j59669l6963j68158K66794K07708K95037l91988j24190O2607L1629
16087D864045J16942Q7332l1740j27953K11414j94472j24549L06335O6410j20262
16077E053502l31733j36914J47779J68136J5447M08717o0090j68989K61458m1057
16067E316256j41868K7168k60725k59970K98085j89463J26897P8418l4852L45146
$$ plain form
16138 4431101 4487614 4263235 4333979 4724459 4453475 4406417 4436452 4489996 4543841 4322803
16128 4322803 4442485 4590274 4465357 4402573 4664541 4770517 4676356 4655989 4577037 4544042
16118 4544042 4389426 4580347 4658859 4642758 4809031 4678411 4435066 4683726 4727433 4813074
16108 4813074 4812618 4902316 5137776 4682153 4527154 4785451 4856949 4855747 4668189 4686737 4881238
16097 4881238 4721569 4684606 4516448 4783242 4990950 5285987 4893999 4769809 4832416 4864045
16087 4864045 4980987 5068319 5036579 4908626 5120040 4925568 4801019 5107354 5173764 5053502
16077 5053502 4721769 4584855 4732634 4900770 4916217 5324934 5264844 5095855 5357313 5316256
16067 5316256 5174388 5201556 4940831 4680861 4978946 4789483 4916380 4994798 4959946 5305092
16057E305092M8304j46336k3905j41206r4248k25486K41773r8650r1980K60953
16047E034311j3786Q374j17787J81809l5601o767J95714k64822n9796O9228k17787
16036D773090N1951P5790m8202K46258k3366l5157j14216L13978j68445J58735
16026E230416M13538k52711k37712o0352j63762K80421o4744P8272j19701N17
16016E104182Q8969K58977p2708l125j90939q8575O6658P0725m0988q6892j09073
16005D997211L11139P2165j30117j75668l45819J29036J03510L12496M4936k55042
15995E063847j94219Q8564L22391j26660n03951N11084J33171J01881k1416n9501
15985E315191L3049J41583j12334j35748o2691k49419J80249K54584j66371l1396
$$ plain form
16057 5305092 5353396 5207060 5183155 5041949 4947701 4722215 4963988 4865338 4773358 5034311
16047 5034311 5020525 5028899 4911112 5092921 5057320 5050553 5246267 4981445 4921649 4990877 4773090
16036 4773090 4825041 4900831 4852629 5098887 5075521 5040364 4926148 5240126 5071681 5230416
16026 5230416 5643954 5391243 5153531 5093179 4929417 5209838 5145094 5223366 5103665 5104182
16016 5104182 5193151 5452128 5379420 5376295 5185356 5096781 5163439 5234164 5193176 5106284 4997211
16005 4997211 5308350 5380515 5250398 5074730 4728911 4857947 4961457 5273953 5318889 5063847
15995 5063847 4869628 4958192 5280583 5153923 4649972 5161056 5294227 5396108 5374692 5315191
15985 5315191 5348240 5489823 5377489 5241741 5179050 4929631 5109880 5364464 5198093 5166697
15975E166697n795J89002j30100p0802l23601K71546R45r491k14j0144J13732
15964E191775n6034R3145K72753r4421k89294P7772j49552J25262o4867J30361
15954E236900L9293k6716Q711k7898M2382j40908o4285n3326j7463L1220L1242
15943E059152J69635J33708J65151K6010j3675k64864m1718m8436r3099J17253
15933E209117J73831M9915L9190l1983p1242J82955J2074q2039k7283l03373j8290
15922E132872l41584J51565L86301p7512j21491m3255L18857j03992k04017J9802
15912E117546K33871n5830j71806k49578K72609K95906j40010R363q0642l26265
15902D905164K47998k10086k54847K48470J1828K4935K91946m33022p2882O04107
$$ plain form
15975 5166697 5160902 5349904 5219804 5149002 4825401 5096947 5097892 5088401 5088187 5078043 5191775
15964 5191775 5135741 5228886 5501639 5407218 5117924 5195696 5046144 5171406 5106539 5236900
15954 5236900 5276193 5249477 5258188 5230290 5272672 5131764 5067479 5014153 4996690 5027910 5059152
15943 5059152 5228787 5362495 5527646 5553656 5539981 5275117 5233399 5184963 5091864 5209117
15933 5209117 5382948 5432863 5472053 5440070 5368828 5551783 5563857 5481818 5454535 5151162 5132872
15922 5132872 4791288 4942853 5329154 5251642 5130151 5086896 5405753 5301761 5097744 5117546
15912 5117546 5351417 5295587 5123781 4874203 5146812 5442718 5302708 5312071 5231429 4905164
15902 4905164 5153162 4943076 4688229 4936699 4948527 4973462 5265408 4832386 4759504 5363611
15892E363611k22026M2127J6699j38471k31604p8923K93828o4692n3069J19388
15882E046868J11602j13193j10551L36909J63842k21608J37509j71809J05481
15873E285050J44146j88357L3348J22607j97801J10509O1541J0024k18485j5966
15863E146616q7674J86541L75511k12528l57892n5467m7619L94469o0385k95118
15853D986454K53363l2062j73037K1836l3431k5602R0224j72875L762j38539L77665
15842E157758j58783o5753K70351m2864m00386J48664J14622M04075k73168k36365
15832D918151M142j6062J47780m3599l16768L98088J78938J2404K0451L753k3551
15821E283727J60311k60370Q3192m4761j1467n733O6077m60528J13728M47690
$$ plain form
15892 5363611 5141585 5183712 5200411 5061940 4830336 4751413 5045241 4980549 4927480 5046868
15882 5046868 5158470 5045277 4934726 5271635 5435477 5213869 5351378 5179569 5285050
15873 5285050 5429196 5240839 5274187 5396794 5198993 5309502 5371043 5381067 5162582 5146616
15863 5146616 5058942 5245483 5620994 5408466 5050574 4995107 4947488 5341957 5281572 4986454
15853 4986454 5239817 5207755 5034718 5056554 5023123 4997521 5087745 4914870 4918632 4780093 5157758
15842 5157758 4998975 4933222 5203573 5160709 4760323 4908987 5023609 5427684 5154516 4918151
15832 4918151 4922293 4906231 5054011 5010412 4693644 5091732 5270670 5283074 5303525 5307278 5283727
15821 5283727 5444038 5183668 5266860 5222099 5210632 5204899 5270976 4810448 4924176 5371866
15811E371866l62159L18917k48755O0637J41215J7894N4003k16003R2748n3910
15801E176453K05114m27567n0989L10783o2892K24040j4699J06389q8954j06339
15791E271339k86232K48562L91k22289J20784J90953N3203r2237l79863K13405
15781E118016j06950q87j0504J71745k11338J77016j90706J78844k743L582R0712
15770E216787q2699J85289j39575K61556M6530l5689j46865n946P8394p7506o1294
15759E238982N4663k94213k8172M62143N3462j55899k16192O5341l093l00148
15749D876874K57954m4176J44233K05361o6050K03247j68927J36993k47934Q0139
15739E377714J21389J3610J32915l77788K35987j87545Q3318J26306l1874o9291
$$ plain form
15811 5371866 5009707 5328624 5079869 5140506 5281721 5299615 5353618 5137615 5230363 5176453
15801 5176453 5381567 4954000 4903011 5213794 5150902 5374942 5360243 5466632 5377678 5271339
15791 5271339 4985107 5233669 5234060 5011771 5132555 5323508 5376711 5284474 4904611 5118016
15781 5118016 5011066 5010179 4999675 5171420 4960082 5137098 4946392 5125236 5122493 5126075 5216787
15770 5216787 5134088 5319377 5179802 5441358 5487888 5452199 5305334 5299388 5377782 5300276 5238982
15759 5238982 5293645 4999432 4971260 5433403 5486865 5330966 5114774 5180115 5177022 4876874
15749 4876874 5134828 5090652 5234885 5440246 5374196 5577443 5408516 5545509 5297575 5377714
15739 5377714 5499103 5512713 5645628 5267840 5503827 5316282 5399600 5525906 5494032 5424741
15729E424741k60912L6654J03228n771K09040p6554k85410j13803K03310K60969
15719E495492j59301k34440l949J39880L84570n0582l39346r0485J37819j83683
15709E095975L6793R8142k79422J87772P8867k8289j48572K22250L564j66916
15699E100164J40410p1672M9541L25303o30m57269j31371J63782O3052l007l133
15688E175170R2343m6675K08349m7392K02345j99202j57285N1757K29625q1061
15678E427974P3260j52885r5284L4678J03525k27701M5991r028j71618L28232
15668E357144Q6735J35023n71808j21950K43956J28762n0594m8056J03583L6052
15658E298847l3734M357J47417J11246j61052k4828m5215J27656l11773n0732
$$ plain form
15729 5424741 5163829 5200483 5303711 5297940 5506980 5430426 5145016 5031213 5234523 5495492
15719 5495492 5336191 5101751 5097802 5237682 5622252 5571670 5232324 5141839 5279658 5095975
15709 5095975 5132768 5230910 4951488 5139260 5218127 5189838 5041266 5263516 5267080 5100164
15699 5100164 5240574 5168902 5218443 5543746 5543116 5085847 4954476 5118258 5181310 5178303 5175170
15688 5175170 5267513 5220838 5429187 5381795 5584140 5384938 5227653 5279410 5509035 5427974
15678 5427974 5501234 5348349 5253065 5287743 5391268 5163567 5209558 5200530 5028912 5357144
15668 5357144 5443879 5578902 5007094 4885144 5129100 5257862 5207268 5159212 5262795 5298847
15658 5298847 5265113 5269470 5416887 5528133 5367081 5342253 5297038 5424694 5112921 5062189
15648E062189J4338O6514J35422L6745J72088M5806j58986l0729o9861j71736
15638E101790K35933M1462j70717L0462N089J08966j07724K05911J22933j85695
15628E388410j00088l39327J36423N30707n7265j79595j31083J35210K2058j67655
15618E237795N8072j49208J96131L90812m10929l4125J50888q2452K10362k20927
15608E346419l27848L40188j8179N8908K42345j09342P7122k75142J61665q1186
15598E414950K45281J02857m18727p6213J65629k36679k07325k4039K41122L4213
15588E241069j16630O5941j03742K95855k02229o5657o6822K07410j51369M1730
15578E145556M0001J39299r3015J45110l1981O8820j15654j75651J23296M0894
$$ plain form
15648 5062189 5076527 5143041 5278463 5315208 5487296 5533102 5374116 5343387 5273526 5101790
15638 5101790 5337723 5379185 5208468 5238930 5244019 5352985 5245261 5451172 5574105 5388410
15628 5388410 5288322 4948995 5085418 5616125 5558860 5379265 5248182 5383392 5405450 5237795
15618 5237795 5295867 5146659 5342790 5733602 5322673 5288548 5439436 5356984 5567346 5346419
15608 5346419 5018571 5358759 5340580 5399488 5641833 5532491 5609613 5334471 5496136 5414950
15598 5414950 5660231 5763088 5344361 5268148 5433777 5197098 4989773 4965734 5206856 5241069
15588 5241069 5124439 5190380 5086638 5382493 5180264 5114607 5047785 5255195 5103826 5145556
15578 5145556 5185557 5324856 5231841 5376951 5344970 5413790 5298136 5122485 5245781 5286675
15568E286675K20806K69068l11617m14685K90832o3271L0561l3601k3644Q5326
15558E336450k00954l8057J7125j43241l837J66900K35843J39868j44873o005
15548E359219j34148J59321K17891l7794L9629l67865J14908l6661o7269R589
15538E256820J40427N2377L3003k12705J01538R6045Q5219l6791O638j1942k54208
15527E256421P2903j1095j62212k5467K9278J06887M91030k22780k60620j49423
15517E124922r8309P9869j1474K72276R5952r8568J83749k16545k33563j09651
15507D988658J27615L38649N1856j59140o6018k9190J35571P8664Q3559j88059
$$ plain form
15568 5286675 5507481 5776549 5464932 5050247 5341079 5277808 5308369 5274768 5251124 5336450
15558 5336450 5135496 5097439 5114564 4971323 4967486 5134386 5370229 5510097 5365224 5359219
15548 5359219 5225071 5384392 5602283 5564489 5604118 5236253 5351161 5314500 5247231 5256820
15538 5256820 5397247 5449624 5482627 5269922 5371460 5467505 5552724 5515933 5522571 5510629 5256421
15527 5256421 5329324 5318229 5156017 5130550 5159828 5266715 5757745 5534965 5274345 5124922
15517 5124922 5026613 5106482 5095008 5367284 5463236 5364668 5548417 5331872 5098309 4988658
15507 4988658 5116273 5454922 5506778 5347638 5281620 5252430 5388001 5466665 5550224 5362165
$$ [...]
##END NTUPLES=NMR SPECTRUM
##END=
