##TITLE=1H_CG-1207-x51
 CDCl3
 8 sc, 
 12.8.2024
##JCAMPDX= 6.0         $$ Bruker NMR JCAMP-DX V2.0
##DATA TYPE= NMR SPECTRUM
##DATA CLASS= NTUPLES
##ORIGIN= UXNMR, Bruker Analytische Messtechnik GmbH
##OWNER= root
$$ XWIN-NMR		Version 3.5
$$ Mon Aug 12 13:55:06 2024 Russian Standard Time (UT+4h)  she@DPX200
##.OBSERVE FREQUENCY= 200.1318
##.OBSERVE NUCLEUS= ^1H
##.ACQUISITION MODE= SIMULTANEOUS
##.ACQUISITION SCHEME= undefined
##.AVERAGES= 24
##.DIGITISER RES= 18
##SPECTROMETER/DATA SYSTEM= spect
##.PULSE SEQUENCE= zg30
##.SOLVENT NAME= CDCl3
##.SHIFT REFERENCE= (INTERNAL, CDCl3, 0, 20.9944)
##AUDIT TRAIL= $$ (NUMBER, WHEN, WHO, WHERE, WHAT)
$$ ##TITLE= Audit trail, XWIN-NMR		Version 3.5
$$ ##JCAMPDX= 5.01
$$ ##ORIGIN= Bruker BioSpin GmbH
$$ ##OWNER= she
$$ F:/spectra/data/she/nmr/H-F/1/pdata/1/auditp.txt
$$ ##AUDIT TRAIL=  $$ (NUMBER, WHEN, WHO, WHERE, WHAT)
(   1,<2024-08-12 13:54:09.26 +0400>,<she>,<DPX200>,
      <continue with go, POWCHK disabled, PULCHK disabled
       configuration hash MD5:
       00 E9 B6 7A A2 85 ED C7 34 08 36 98 17 FE 4E 26
       data hash MD5: 16K
       19 9B 19 2D 8F 9F 34 59 2E BE DF C9 C7 96 4A 3D>)
(   2,<2024-08-12 13:54:11.67 +0400>,<she>,<DPX200>,
      <Start of raw data processing
       efp BC_mod = 2 LB = 0.24 FT_mod = 6 PKNL = 1 PHC0 = -25992.81 PHC1 = 13.98749 SI = 16K 
       data hash MD5: 16K
       80 48 05 6E 7E 5B 45 4A 2D 40 85 98 26 D9 FC 09>)
(   3,<2024-08-12 13:54:28.98 +0400>,<she>,<DPX200>,
      <pk PHC0 = -10.95754 PHC1 = 13.6 
       data hash MD5: 16K
       52 AE A7 3C 72 15 42 CB 14 94 4B B4 92 90 D4 3F>)
(   4,<2024-08-12 13:54:32.26 +0400>,<she>,<DPX200>,
      <abs ABSG = 5 
       data hash MD5: 16K
       12 7B E3 94 3F 75 6F D3 65 C6 E4 9F 39 40 35 27>)
$$ ##END=
$$ 
$$ hash MD5
$$ 71 78 B3 D0 61 BD 97 07 43 CF 3F EA B9 DE FF F2
##$RELAX= 
##$RELAX= 
##$RELAX= 
##$RELAX= 
##$RELAX= 
##$RELAX= 
$$ Bruker specific parameters
$$ --------------------------
##$DU= <F:/spectra>
##$EXPNO= 1
##$NAME= <H-F>
##$PROCNO= 1
##$TYPE= <nmr>
##$USER= <she>
##$AMP= (0..31)
100 100 100 100 100 100 100 100 100 100 100 100 100 100 100 100 100 100 
100 100 100 100 100 100 100 100 100 100 100 100 100 100 
##$AQSEQ= 0
##$AQ_mod= 1
##$AUNM= <au_zg>
##$AUTOPOS= <>
##$BF1= 200.13
##$BF2= 200.13
##$BF3= 200.13
##$BF4= 200.13
##$BF5= 200.13
##$BF6= 200.13
##$BF7= 200.13
##$BF8= 200.13
##$BYTORDA= 1
##$CFDGTYP= 0
##$CFRGTYP= 5
##$CHEMSTR= <none>
##$CNST= (0..31)
1 1 145 1 1 1 1 1 1 1 1 1 1 1 1 1 1 1 1 1 1 1 1 1 1 1 1 1 1 1 1 1 
##$CPDPRG= <>
##$CPDPRG1= <>
##$CPDPRG2= <>
##$CPDPRG3= <>
##$CPDPRG4= <mlev>
##$CPDPRG5= <mlev>
##$CPDPRG6= <mlev>
##$CPDPRG7= <mlev>
##$CPDPRG8= <mlev>
##$CPDPRGB= <>
##$CPDPRGT= <>
##$D= (0..31)
0 1.2 0 0 0 0 0 0 0 0.06 0 0.03 0 0 0 0 0.0002 0 0 0 0 0 0 0 0 0 0 0 0 
0 0 0 
##$DATE= 1723456335
##$DBL= (0..7)
120 120 120 120 120 120 120 120 
##$DBP= (0..7)
150 150 150 150 150 150 150 150 
##$DBP07= 0
##$DBPNAM0= <>
##$DBPNAM1= <>
##$DBPNAM2= <>
##$DBPNAM3= <>
##$DBPNAM4= <>
$$ [...]
##$SUBNAM3= <"">
##$SUBNAM4= <"">
##$SUBNAM5= <"">
##$SUBNAM6= <"">
##$SUBNAM7= <"">
##$SUBNAM8= <"">
##$SUBNAM9= <"">
##$SW= 24.0689170037331
##$SWIBOX= (0..15)
0 0 2 0 0 0 0 0 0 0 0 0 0 0 0 0 
##$SW_h= 4816.95568400771
##$TD= 16384
##$TD0= 1
##$TE= 0
##$TE2= 300
##$TE3= 300
##$TEG= 300
##$TL= (0..7)
0 120 120 120 120 120 120 120 
##$TP= (0..7)
150 150 150 150 150 150 150 150 
##$TP07= 0
##$TPNAME0= <>
##$TPNAME1= <>
##$TPNAME2= <>
##$TPNAME3= <>
##$TPNAME4= <>
##$TPNAME5= <>
##$TPNAME6= <>
##$TPNAME7= <>
##$TPOAL= (0..7)
0.5 0.5 0.5 0.5 0.5 0.5 0.5 0.5 
##$TPOFFS= (0..7)
0 0 0 0 0 0 0 0 
##$TUNHIN= 0
##$TUNHOUT= 0
##$TUNXOUT= 0
##$USERA1= <user>
##$USERA2= <user>
##$USERA3= <user>
##$USERA4= <user>
##$USERA5= <user>
##$V9= 5
##$VALIST= <valist>
##$VCLIST= <CCCCCCCCCCCCCCC>
##$VD= 0
##$VDLIST= <DDDDDDDDDDDDDDD>
##$VPLIST= <PPPPPPPPPPPPPPP>
##$VTLIST= <TTTTTTTTTTTTTTT>
##$WBST= 1024
##$WBSW= 4
##$XGAIN= (0..3)
0 0 0 0 
##$XL= 0
##$YL= 0
##$YMAX_a= 217071
##$YMIN_a= -203081
##$ZGOPTNS= <>
##$ZL1= 120
##$ZL2= 120
##$ZL3= 120
##$ZL4= 120
##$ABSF1= 20.99438
##$ABSF2= -3.074751
##$ABSG= 5
##$ABSL= 3
##$ALPHA= 0
##$AQORDER= 0
##$ASSFAC= 0
##$ASSFACI= 0
##$ASSFACX= 0
##$ASSWID= 0
##$AUNMP= <proc_1d>
##$AZFE= 0.1
##$AZFW= 0.1
##$BCFW= 0
##$BC_mod= 2
##$BYTORDP= 0
##$COROFFS= 0
##$CY= -3
##$DATMOD= 1
##$DC= 0
##$DFILT= <>
##$DTYPP= 0
##$F1P= 0
##$F2P= 0
##$FCOR= 1
##$FTSIZE= 16384
##$FT_mod= 6
##$GAMMA= 0
##$GB= 0
##$INTBC= 1
##$INTSCL= 3.70164e-10
##$ISEN= 128
##$LB= 0.24
##$LEV0= 0
##$LPBIN= 0
##$MAXI= 10000
##$MC2= 0
##$MEAN= 0
##$ME_mod= 0
##$MI= 1.114404
##$NCOEF= 0
##$NC_proc= -8
##$NLEV= 6
##$NOISF1= 3.799351
##$NOISF2= 2.8
##$NSP= 0
##$NTH_PI= 0
##$NZP= 0
##$OFFSET= 20.99438
##$PC= 1
##$PHC0= -26003.77
##$PHC1= 27.58749
##$PH_mod= 1
##$PKNL= yes
##$PPARMOD= 0
##$PSCAL= 0
##$PSIGN= 0
##$REVERSE= no
##$SF= 200.130006872328
##$SI= 16384
##$SIGF1= 3
##$SIGF2= 2
##$SINO= 5.538805
##$SIOLD= 16384
##$SREGLST= <1H.CDCl3>
##$SSB= 0
##$STSI= 16384
##$STSR= 0
##$SW_p= 4816.95568400771
##$SYMM= 0
##$S_DEV= 0
##$TDeff= 16384
##$TDoff= 0
##$TI= <>
##$TILT= no
##$TM1= 0
##$TM2= 0
##$TOPLEV= 0
##$USERP1= <user>
##$USERP2= <user>
##$USERP3= <user>
##$USERP4= <user>
##$USERP5= <user>
##$WDW= 1
##$XDIM= 16384
##$YMAX_p= 380489103
##$YMIN_p= -2612437
$$ End of Bruker specific parameters
$$ ---------------------------------
##NTUPLES= NMR SPECTRUM
##VAR_NAME=  FREQUENCY,     SPECTRUM/REAL,   SPECTRUM/IMAG
##SYMBOL=    X,             R,               I
##VAR_TYPE=  INDEPENDENT,   DEPENDENT,       DEPENDENT
##VAR_FORM=  AFFN,          ASDF,            ASDF
##VAR_DIM=   16384,         16384,           16384
##UNITS=     HZ,            ARBITRARY UNITS, ARBITRARY UNITS
##FACTOR=    0.29402158847633, 1,            1
##FIRST=     4201.60560398944, 0,            0
##LAST=      -615.35008001827, 0,            0
##MIN=       -615.35008001827, -2612437,     0
##MAX=       4201.60560398944, 380489103,    0
$$ Real data points
##PAGE= N=1
##DATA TABLE= (X++(R..R)), XYDATA
$$ [...]
$$ plain form
5344 2132990 3019314 3015495 2695352 2855453 2823092 2485787 2735601 3017894 1234517 1985231
5334 1985231 3010732 2500383 2441042 3367510 3790677 3472801 3752721 3239300 2944448 3039529
5324 3039529 3331827 3076016 1938529 1677762 3065502 3215216 3130646 2747034 2600806
5315 2600806 2236475 2048117 2974494 3503470 3890221 3921314 3777384 4026176 2992857 2697214
5305 2697214 2886749 2311922 2517325 2811800 2937791 3609852 3320912 3257097 4081421 3961603
5295 3961603 4074182 3430364 4138620 4275089 3518146 3736559 3962784 4151921 4413372 4555332
5285 4555332 4740987 4757781 5190544 4694174 4195649 3859855 3691778 3942087 3417199 4108991
5275 4108991 3814592 3769062 3799952 4333750 4958532 5696617 4981651 5082585 4890787 3887266
$$ packed form
5344B132990Q86324l819l20143J60101l2361l37305K49814K82293j783377P50714
5334A985231J025501n10349n9341R26468M23167l17876K79920n13421k94852R5081
5324C039529K92298k55811j137487k60767J387740J49714q4570l83612j46228
5315B600806l64331j88358R26377N28976L86751L1093j43930K48792j033319k95643
5305B697214J89535n74827K05403K94475J25991O72061k88940o3815Q24324j19818
5295C961603J12579o43818P08256J36469p56943K18413K26225J89137K61451J41960
5285D555332J85655J6794M32763m96370m98525l35794j68077K50309n24888O91792
5275D108991k94399m5530L0890N33798O24782P38085p14966J00934j91798j003521
$$ plain form
5265 3887266 3826023 3012916 3446073 3931897 5689533 5249759 4108758 4998698 4823974
5256 4823974 5635337 4750139 4509407 5125877 5489289 6472321 5468112 5127608 4468229
5247 4468229 4474289 5474590 3859358 4384402 5164082 5053472 5701174 5516697 5781986 6582908
5237 6582908 6003779 6277031 6060588 5593075 5615884 5599759 7300932 6568407 6218522 6478928
5227 6478928 6918363 7137703 6578568 6646748 7648532 7612951 7330514 7885732 7449755 6259931
5217 6259931 7027860 8674747 8263749 7563236 8522584 8102262 8688535 8751714 8367627 8899492
5207 8899492 8581869 9710308 9199901 8737375 8349258 8754487 9585776 10083068 9658713
5198 9658713 9006472 9298118 10217936 11237105 10906055 11589420 11046827 10935396 10628516
$$ packed form
5265C887266o1243q13107M33157M85824J757636m39774j141001Q89940j74724
5256D823974Q11363q85198k40732O16470L63412R83032j004209l40504o59379
5247D468229O060J000301j615232N25044P79680j10610O47702j84477K65289Q00922
5237F582908n79129K73252k16443m67513K2809j6125J701173p32525l49885K60406
5227F478928M39435K19340n59135O8180J001784l5581k82437N55218m35977j189824
5217F259931P67929J646887m10998p00513R59348m20322N86273O3179l84087N31865
5207H899492l17623J128439n10407m62526l88117M05229Q31289M97292m24355
5198I658713o52241K91646R19818J019169l31050O83365n42593j11431l06880
$$ plain form
5189 10628516 11486371 11599326 12290775 11883824 12114799 11832119 11755427 11020322 10835240 11070162
5179 11070162 11333197 10967368 11174258 11807249 11342140 10757748 11051399 11409446 11190182
5170 11190182 10153241 10784061 11027752 10530124 11091789 10398727 10965641 9900198 10624594
5161 10624594 11221919 10781275 11151459 11145857 10916050 10677181 10714626 11098738 10940676 10523007
5151 10523007 10568205 11362215 11435439 10763691 10075392 10338130 10551249 11179597 10837689 10028287
5141 10028287 10497480 10583682 10578892 11225880 11182552 11257158 10658913 10944415 11073771 10921005
5131 10921005 10651047 10988502 10976844 10638805 11171453 10927952 10685073 10773678 11269876 10953847
5121 10953847 10701890 11186890 10680374 11068840 10273730 9810546 9624995 11011123 11809991
$$ packed form
5189A0628516Q57855J12955O91449m06951K30975k82680p6692p35105j85082K34922
5179A1070162K63035l65829K06890O32991m65109n84392K93651L58047k19264
5170A1190182j036941O30820K43691m97628N61665o93062N66914j065443P24396
5161A0624594N97325m40644L70184n602k29807k38869L7445L84112j58062m17669
5151A0523007M5198P94010P3224o71748o88299K62738K13119O28348l41908q09402
5141A0028287M69193Q6202m790O46988m3328P4606n98245K85502J29356j52766
5131A0921005k69958L37455j1658l38039N32648k43501k42879Q8605M96198l16029
5121A0953847k51957M85000n06516L88466p95110m63184j85551J386128P98868
$$ plain form
5112 11809991 11921236 11351719 11880530 12516490 12037912 12550437 12342267 11500017 11491631 11583723
5102 11583723 11733977 11921256 11340236 11189512 11410944 11870205 12712980 12215870 12555823
5093 12555823 12598447 11769537 11853376 12144615 12718759 12950703 11752742 13329432 13477779
5084 13477779 12280849 11858030 12334657 13054892 12737000 13282438 13693972 13978758 12633108
5075 12633108 12470666 12737986 13095342 13462964 13853847 14921547 15498665 13938493 13851152
5066 13851152 13898075 13841550 13957668 15252165 14213780 15057314 16282573 16023569 15932553
5057 15932553 14915551 14772094 15443756 14900163 15493357 15746607 14164482 15195637 14670303
5048 14670303 13118045 14061899 14729658 14388620 14207825 13777246 13422270 13305827 13876437
$$ packed form
5112A1809991J11245n69517N28811O35960m78578N12525k08170q42250q386R2092
5102A1583723J50254J87279n81020j50724K21432M59261Q42775m97110L39953
5093A2555823M2624q28910Q3839K91239N74144K31944j197961J576690J48347
5084A3477779j196930m22819M76627P20235l17892N45438M11534K84786j345650
5075A2633108j62442K67320L57356L67622L90883J067700N77118j560172q7341
5066A3851152M6923n6525J16118J294497j038385Q43534J225259k59004r1016
5057A5932553j017002j43457O71662n43593N93194K53250j582125J031155n25334
5048A4670303j552258R43854O67759l41038j80795m30579l54976j16443N70610
$$ plain form
5039 13876437 14258796 14160377 14267229 14017547 14116620 14320059 13601582 12976008 13007069 12937788
5029 12937788 11236417 11854693 12289135 11637094 11374349 11246409 11550596 11972731 10702169
5020 10702169 11221639 12092588 11752810 11987251 11353418 10862783 10859017 11964728 11120570 11486817
5010 11486817 11090122 11041406 12249359 12451751 11943722 12447579 12351985 12092409 11864417 10811699
5000 10811699 10896433 11944911 11809127 10431804 11681709 12810860 12792086 12608087 12326463
4991 12326463 13283255 12747398 12302366 13036816 13762949 14466903 14034786 13883402 13628529
4982 13628529 15265299 14457237 13856062 14402772 14315078 13359774 13296954 13743756 13978345 14470584
4972 14470584 14904172 15568295 15154612 15777819 15206872 15479379 15155486 15684965 16763255
$$ packed form
5039A3876437L82359r8419J06852k49682R9073K03439p18477o25574L1061o9281
5029A2937788j701371O18276M34442o52041k62745j27940L04187M22135j270562
5020A0702169N19470Q70949l39778K34441o33833m90635l766J105711q44158L66247
5010A1486817l96695m8716J207953K02392n08029N03857r5594k59576k27992j052718
5000A0811699Q4734J048478j35784j377323J249905J129151j8774j83999k81624
4991A2326463R56792n35857m45032P34450P26133P03954m32117j51384k54873
4982A3628529J636770q08062o01175N46710q7694r55304o2820M46802K34589M92239
4972A4470584M33588O64123m13683O23207n70947K72507l23893N29479J078290
$$ plain form
4963 16763255 15085459 14399733 14930725 14323102 14882462 15656429 15335314 14628291 15245466
4954 15245466 15879098 15492401 15591912 15194634 16549674 16070683 15759752 15278794 15118601
4945 15118601 15602545 15949363 16279055 15669040 15219223 14941615 15087733 15994583 16200548
4936 16200548 14543489 15176813 15849357 16044180 15221630 15239228 14854383 14284835 14906148
4927 14906148 14974925 14398064 14635006 14852003 15088828 15106807 15163520 14376337 14719307 15494798
4917 15494798 15785049 15318012 14696099 14436787 14857995 15316402 14886348 15504629 14925447
4908 14925447 14461005 14077683 14201259 14958656 15111118 14756025 14710540 15494848 16513239
4899 16513239 17098019 16321213 15667168 15856708 14807166 14864842 15700335 15514985 15381915
$$ packed form
4963A6763255j677796o85726N30992o07623N59360P73967l21115p07023O17175
4954A5245466O33632l86697R9511l97278J355040m78991l10931m80958j60193
4945A5118601M83944L46818L29692o10015m49817k77608J46118R06850K05965
4936A6200548j657059O33324O72544J94823q22550J7598l84845n69548O21313
4927A4906148O8777n76861K36942K16997K36825J7979N6713p87183L42970P75491
4917A5494798K90251m67037o21913k59312M21208M58407m30054O18281n79182
4908A4925447m64442l83322J23576P57397J52462l55093m5485P84308J018391
4899A6513239N84780p76806o54045J89540j049542N7676Q35493j85350j33070
$$ plain form
4890 15381915 14445963 14937007 15527045 15450752 16126036 16410596 16410872 16136378 16252648 16605888
4880 16605888 16357741 16168716 16403523 17613273 16518759 17156264 16902433 17662548 17803326
4871 17803326 16440570 16139011 16030016 16740908 16430154 16773887 18059277 18200181 17346418
4862 17346418 17647817 17474000 18089519 17164585 16602393 17420178 17002956 16715060 15752316
4853 15752316 16240117 18049058 17387247 18631040 18894634 19146588 17723967 17474047 17362397
4844 17362397 17637998 19087049 19297900 18408606 18593723 18424645 18468686 18176741 20048371
4835 20048371 20075058 19550624 20316963 21160969 20841451 19973361 20349171 21028416 21077110 21466851
4825 21466851 21746021 20491773 21107309 21720988 22184029 22105636 22648123 23643961 23965937
$$ packed form
4890A5381915r35952M91044N90038p6293O75284K84560K76k74494J16270L53240
4880A6605888k48147j89025K34807J209750j094514O37505k53831P60115J40778
4871A7803326j362756l01559j08995P10892l10754L43733J285390J40904q53763
4862A7346418L01399j73817O15519r24934n62192Q17785m17222k87896r62744
4853A5752316M87801J808941o61811J243793K63594K51954j422621k49920j11650
4844A7362397K75601J449051K10851q89294J85117j69078M4041k91945J871630
4835B0048371K6687n24434P66339Q44006l19518q68090L75810O79245M8694L89741
4825B1466851K79170j254248O15536O13679M63041p8393N42487R95838L21976
$$ plain form
4816 23965937 24606285 25506111 24586052 24420486 25392543 25887544 25704074 25742925 26551089 27587975
4806 27587975 27342478 27228668 27664594 27544805 28157447 29001775 28797674 28902093 29184476
4797 29184476 30263389 30619599 30076371 29502458 29183194 30026542 29707231 29492998 29679338
4788 29679338 30419899 29856446 30501652 30844231 30105252 30774267 31118406 32253976 32445511
4779 32445511 31484649 31856570 30988911 31216784 30101416 29696945 30845085 31183548 30687127
4770 30687127 29851222 29382043 29780063 31335330 30739174 31066323 31194923 30798051 30774101
4761 30774101 31841472 31021078 31912291 31987297 31981494 32360002 32056208 33198610 32924811 32322013
4751 32322013 33548013 32500329 32813635 33320706 33970659 34413784 34214374 34377847 34065931
$$ packed form
4816B3965937O40348Q99826r20059j65566R72057M95001j83470L8851Q08164J036886
4806B7587975k45497j13810M35926j19789O12642Q44328k04101J04419K82383
4797B9184476J078913L56210n43228n73913l19264Q43348l19311k14233J86340
4788B9679338P40561n63453O45206L42579p38979O69015L44139J135570J91535
4779C2445511r60862L71921q67659K27873j115368m04471J148140L38463m96421
4770C0687127q35905m69179L98020J555267n96156L27149J28600l96872k3950
4761C0774101J067371q20394Q91213P5006n803L78508l03794J142402k73799o02798
4751C2322013J226000j047684L13306N07071O49953M43125j99410J63473l11916
$$ plain form
4742 34065931 36013562 36230201 35601408 35334880 35997984 37586482 37197981 37482616 38287405
4733 38287405 38776056 37929837 38890991 39576863 39596493 38682113 38864230 39263092 39243163 39228404
4723 39228404 39221330 40967499 40315577 40324661 40862705 39648630 40668089 40887384 40985155 41819479
4713 41819479 41921499 41117223 40513164 41419902 41472101 41450295 41613159 42703127 42507392 42369359
4703 42369359 42711308 43366444 42929360 43284394 44389484 43708825 44605507 44177368 44491554
4694 44491554 44635914 44921193 44683667 44729903 44540201 45292424 45210055 45275557 45765120 45900680
4684 45900680 45798389 46205691 46972255 46237668 46809204 46239315 46231903 45896149 47053325 46412757
4674 46412757 46555638 45322282 44976801 44665592 43922566 44994163 45521807 44671236 44096241
$$ packed form
4742C4065931J947631K16639o28793k66528O63104J588498l88501K84635Q04789
4733C8287405M88651q46219R61154O85872J9630r14380J82117L98862j9929j4759
4723C9228404p074J746169o51922R084N38044j214075J019459K19295R7771Q34324
4713D1819479J02020q04276o04059R06738N2199k1806J62864J089968j95735j38033
4703D2369359L41949O55136m37084L55034J105090o80659Q96682m28139L14186
4694D4491554J44360K85279k37526M6236j89702P52223q2369O5502M89563J35560
4684D5900680j02291M07302P66564p34587N71536n69889p412l35754J157176o40568
4674D6412757J42881j233356l45481l11209p43026J071597N27644q50571n74995
$$ plain form
4665 44096241 44182564 43754467 44210351 43622705 42488438 41987533 41594648 43080614 42712702
4656 42712702 42588212 42995838 42005064 41702701 41076478 42273955 41546325 39946092 40346539
4647 40346539 40938930 39253760 39045000 39586170 39209826 39103389 38180482 36909563 37405973
4638 37405973 37434527 37824193 37742714 36569209 35913685 35175850 36812801 35441507 34140966
4629 34140966 35200270 35024845 34936199 34206716 33234883 32805181 32661602 33250750 32411658
4620 32411658 31920762 31940542 31878789 31549186 31844659 32127881 32301967 30842740 30518150 31141751
4610 31141751 30848610 30297033 30351759 28389242 29447834 29498306 29503663 29294656 28359218 28413473
4600 28413473 28383262 27033829 27220414 26938331 27199207 27061581 27495038 28127972 27156062
$$ packed form
4665D4096241Q6323m28097M55884n87646j134267n00905l92885J485966l67912
4656D2712702j24490M07626r90774l02363o26223J197477p27630j600233M00447
4647D0346539N92391j685170k08760N41170l76344j06437r22907j270919M96410
4638C7405973K8554L89666q1479j173505o55524p37835J636951j371294j300541
4629C4140966J059304j75425q8646p29483r71833m29702j43579N89148q39092
4620C2411658m90896J9780o1753l29603K95473K83222J74086j459227l24590O23601
4610C1141751k93141n51577N4726j962517J058592N0472N357k09007r35438N4255
4600B8413473l0211j349433J86585k82083K60876j37626M33457O32934r71910
$$ plain form
4591 27156062 26892636 26279107 26823344 26119837 26149730 25392114 25558909 25980183 26168472 25611531
4581 25611531 24743286 23990216 24043793 24350588 24947169 24811273 24076916 23651585 24193702 23340450
4571 23340450 23425471 24049639 23920111 23481417 23042658 22612002 22716539 23031249 23574294 24444638
4561 24444638 23433924 22686419 23958614 23475524 23397518 22728730 22603115 23249969 22761410
4552 22761410 22440256 22317551 20798435 21076610 21275818 21293470 22195253 21567557 20976312
4543 20976312 21520101 20431845 20700906 20730050 20490565 20721317 20137993 20445626 20102734
4534 20102734 20508083 20876877 19947248 19124622 19546382 20175817 18624209 18465124 18362583
4525 18362583 18048549 17932550 18511688 18740343 18940330 19145115 17502420 16991858 17672121
$$ packed form
4591B7156062k63426o13529N44237p03507K9893p57616J66795M21274J88289n56941
4581B5611531q68245p53070N3577L06795N96581j35896p34357m25331N42117q53252
4571B3340450Q5021O24168j29528m38694m38759m30656J04537L14710N43045Q70344
4561B4444638j010714p47505J272195m83090p8006o68788j25615O46854m88559
4552B2761410l21154j22705j519116K78175J99208J7652R01783o27696n91245
4543B0976312N43789j088256K69061K9144k39485K30752n83324L07633l42892
4534B0102734M05349L68794r29629q22626M21760O29435j551608j59085j02541
4525A8362583l14034j15999N79138K28655J99987K04785j642695n10562O80263
$$ plain form
4516 17672121 17764166 18057686 18813448 18402322 17613709 17153915 18379835 17563724 17563164 16288021
4506 16288021 17125694 17857119 16888982 17096427 17247184 17488223 17755315 17398294 16865431
4497 16865431 16706889 16548269 17218939 16868283 15598349 15216606 15827372 16397125 16070635
4488 16070635 15627509 15999620 15266101 16269811 15443245 15550126 15477074 15960786 16575437
4479 16575437 15826191 15801672 15956670 16044175 16676477 17017150 15659274 15416049 15414747 15864345
4469 15864345 15935518 16422889 16823793 15731007 15844538 16280865 15783799 15244993 15450236
4460 15450236 16074159 15316040 14583160 14819869 14757154 15687545 16057565 15846616 16601115 14977968
4450 14977968 14413776 15630961 15705703 15035255 14701543 14400382 13838218 14703882 14725217 13765747
$$ packed form
4516A7672121R2045K93520P55762m11126p88613m59794J225920q16111n60j275143
4506A6288021Q37673P31425r68137K07445J50757K41039K67092l57021n32863
4497A6865431j58542j58620O70670l50656j269934l81743O10766N69753l26490
4488A6070635m43126L72111p33519J003710q26566J06881p3052M83712O14651
4479A6575437p49246k4519J54998Q7505O32302L40673j357876k43225j302M49598
4469A5864345P1173M87371M00904j092786J13531M36327m97066n38806K05243
4460A5450236O23923p58119p32880K36709o2715R30391L70020k10949P54499j623147
4450A4977968n64192J217185P4742o70448l33712l01161n62164Q65664K1335r59470
$$ plain form
4440 13765747 14126809 14726636 14697899 14724702 14936943 14429118 13605789 13779076 14788974 14496250
4430 14496250 14516378 14627557 14412934 13588863 12896553 13312211 14041957 14293908 14708304 13776562
4420 13776562 13311879 14067252 14657277 13647780 13370447 13305264 14867713 14750053 13737807
4411 13737807 12772486 12321331 12820659 12950246 12855857 12312752 12294832 11930644 13133919 12256537
4401 12256537 12084489 11977933 11816020 12233601 11602016 12263279 11890706 11781575 11343746
4392 11343746 11074391 11610226 10518461 9841307 10311654 10339456 9991347 10331835 11156425
4383 11156425 10364696 9563710 9706232 9847482 9165800 9253097 10112021 10561661 9796211 10089417
4373 10089417 9217755 8994066 9089000 8879368 8607971 8554167 9732870 9704922 9320261 8574388
$$ packed form
4440A3765747L61062N99827k8737K6803K12241n07825q23329J73287J009898k92724
4430A4496250K0128J11179k14623q24071o92310M15658P29746K51951M14396r31742
4420A3776562m64683P55373N90025j009497k77333o5183J562449j17660j012246
4411A3737807r65321m51155M99328J29587r4389n43105j7920l64188J203275q77382
4401A2256537j72048j06556j61913M17581o31585O61263l72573j09131m37829
4392A1343746k69355N35835j091765o77154M70347K7802l48109L40488Q24590
4383A1156425p91729q00986J42522J41250o81682Q7297Q58924M49640p65450K93206
4373A0089417q71662k23689R4934k09632k71397n3804J178703k7948l84661p45873
$$ plain form
4363 8574388 8710965 9218922 9538159 9393393 8936704 9357457 9545232 9088881 9898203 8194300
4353 8194300 8747471 9204962 8814791 8589475 8297514 7287507 7671280 7241607 7699178
4344 7699178 7817944 8328689 7910106 8414704 9712412 8750978 9917852 8824770 8882903
4335 8882903 8536162 7536387 7580743 8846030 9237851 8454478 8163980 8496942 8499972 8599202
4325 8599202 8631217 8543772 8140716 8692445 8141243 7045965 8739987 9066235 8592675 8446008
4315 8446008 8779409 9749229 10049164 9912783 9187421 8505309 8047271 7671979 9098418
4306 9098418 10028853 9765526 8821840 9314825 8841408 9107378 9599028 9739217 9875264 9000627
4296 9000627 8880706 8036496 9173953 9784415 8998276 9425418 8507123 9505326 9847703
$$ packed form
4363H574388J36577N07957L19237j44766m56689M20753J87775m56351Q09322j703903
4353H194300N53171M57491l90171k25316k91961j010007L83773m29673M57571
4344G699178J18766N10745m18583N04598J297708r61434J166874j093082N8133
4335H882903l46741r99775M4356J265287L91821p83373k90498L32962L030R9230
4325H599202L2015q7445m03056N51729n51202j095278J694022L26248m73560j46667
4315H446008L33401R69820K99935j36381p25362o82112m58038l75292J426439
4306I098418R30435k63327r43686M92985m73417K65970M91650J40189J36047q74637
4296I000627j19921q44210J137457O10462p86139M27142r18295R98203L42377
$$ plain form
4287 9847703 9332984 9661031 9784446 9348559 8848716 8710294 9750941 9365469 9458729 9533735
4277 9533735 9801635 10041941 8993326 8568962 9469361 9743063 9157310 9082622 9695396 10080601
4267 10080601 9620121 9300995 9534684 9399488 8329285 9440387 10336582 9730320 9968131
4258 9968131 9309449 9489785 9663931 10005528 10221795 10139051 10673457 10078047 10691246 10348320
4248 10348320 10237780 10515208 10607856 10824404 11167029 11032698 11165535 10500712 11335418 10721426
4238 10721426 10742222 11619294 12135718 11509394 11797556 11563843 12179242 13112063 11998024
4229 11998024 12980438 13635497 12816637 13697369 13536655 13984314 13544871 14037260 13741530
4220 13741530 13189404 13619971 14084968 15186385 15384649 14344817 13654396 12978314 13008721
$$ packed form
4287I847703n14719L28047J23415m35887m99843j38422J040647l85472R3260P5006
4277I533735K67900K40306j048615m24364R00399K73702n85753p4688O12774L85205
4267A0080601m60480l19126K33689j35196j070203J111102Q96195o06262K37811
4258I968131o58682J80336J74146L41597K16267q2744N34406n95410O13199l42926
4248A0348320j10540K77428R2648K16548L42625j34331J32837o64823Q34706o13992
4238A0721426K0796Q77072N16424o26324K88162k33713O15399R32821j114039
4229A1998024R82414O55059q18860Q80732j60714M47659m39443M92389k95730
4220A3741530n52126M30567M64997J101417J98264j039832o90421o76082L0407
$$ plain form
4211 13008721 13472736 14891411 15200654 16244481 16991882 16985638 16032461 16442599 17122775
4202 17122775 16506494 16724922 16924182 16845956 17612826 17972323 17575472 18972208 19233775
4193 19233775 18505034 18258134 18637908 19021032 19593210 20341292 20909656 20619408 21032988
4184 21032988 21366733 22359001 22262094 22467367 22826608 23313424 23066609 24403995 24514060
4175 24514060 25420273 25315291 25689812 26380484 25847805 25119780 25613374 25711052 25131760 26664790
4165 26664790 27023965 26780857 26471943 26767775 27634079 27806444 28469634 29237038 29012520
4156 29012520 28537139 28559208 29564939 29616669 29515634 29419843 29314910 29128308 28412677 29635568
4146 29635568 27976988 28543483 28758162 28520067 29013813 29411452 28293676 28099243 28155183
$$ packed form
4211A3008721M64015J418675L09243J043827P47401o244r53177M10138O80176
4202A7122775o16281K18428J99260p8226P66870L59497l96851J396736K61567
4193A9233775p28741k46900L79774L83124N72178P48082N68364k90248M13580
4184B1032988L33745R92268r6907K05273L59241M86816k46815J337386J10065
4175B4514060R06213j04982L74521O90672n32679p28025M93594R7678n79292J533030
4165B6664790L59175k43108l08914K95832Q66304J72365O63190P67404k24518
4156B9012520m75381K2069J005731N1730j01035r5791j04933j86602p15631J222891
4146B9635568j658580N66495K14679k38095M93746L97639j117776j94433N5940
$$ plain form
4137 28155183 28651263 29377989 29645895 28917395 28862314 28798280 28588507 29293164 28926046 27886224
4127 27886224 27367267 28101832 27878063 27732976 27967874 27540464 27866203 28286289 27343449
4118 27343449 28194259 27630886 26832638 27096108 27087183 27839484 26751608 25265230 26903098
4109 26903098 27835918 27140926 26978169 25950576 25394705 27114872 27373542 26830900 26986087
4100 26986087 27160445 27208152 26845349 26104592 27267255 27129875 27393350 28091948 27765963
4091 27765963 27411746 27209045 26726229 27215720 27419708 27858323 28651660 29125951 28008547
4082 28008547 27025275 28617615 27702752 27146850 28349137 28144224 28178354 29261124 30339824
4073 30339824 30011607 29357307 29037296 29214330 28197100 27944589 28985955 29226154 29195159
$$ packed form
4137B8155183M96080P26726K67906p28500n5081o4034k09773P04657l67118j039822
4127B7886224n18957P34565k23769j45087K34898m27410L25739M20086r42840
4118B7343449Q50810n63373p98248K63470q925P52301j087876j486378J637868
4109B6903098R32820o94992j62757j027593n55871J720167K58670n42642J55187
4100B6986087J74358M7707l62803p40757J162663j37380K63475O98598l25985
4091B7765963l54217k02701m82816M89491K03988M38615P93337M74291j117404
4082B8008547r83272J592340r14863n55902J202287k04913L4130J082770J078700
4073C0339824l28217o54300l20011J77034j017230k52511J041366K40199l0995
$$ plain form
4064 29195159 29987109 30375649 30248030 30083022 30458020 29651480 29759165 30606244 30084832
4055 30084832 30738165 30645613 29469574 29442962 29264682 30574551 30253592 29829357 31379876
4046 31379876 31753217 31417911 30192497 31681766 31438493 30922713 31688719 32390322 33001016
4037 33001016 32283126 31904366 32041809 31795299 31574192 32346952 30809463 31294966 31028302
4028 31028302 31112647 30480521 30226071 30287338 30333117 30510655 30690857 30243004 28520170 28826926
4018 28826926 29466530 28866732 28628203 28605405 27728943 27314526 27822871 27866152 27047119 26459996
4008 26459996 26768202 26242820 25747548 25878217 25670410 25721312 24674651 24966082 24829592
3999 24829592 25650998 24919937 24524208 25234169 25289708 25881965 25642096 24593699 24473955
$$ packed form
4064B9195159P91950L88540j27619j65008L74998q06540J07685Q47079n21412
4055C0084832O53333r2552j176039k6612j78280J309869l20959m24235J550519
4046C1379876L73341l35306j225414J489269k43273n15780P66006P01603O10694
4037C3001016p17890l78760J37443k46510k21107P72760j537489M85503k66664
4028C1028302Q4345o32126k54450O1267M5779J77538J80202m47853j722834L06756
4018B8826926O39604n99798k38529k2798q76462m14417N08345M3281q19033n87123
4008B6459996L08206n25382m95272J30669k07807N0902j046661K91431j36490
3999B4829592Q21406p31061l95729P09961N5539N92257k39869j048397j19744
$$ plain form
3990 24473955 23874147 23142504 24094445 23465646 23620638 24155308 23342913 23446331 24191860
3981 24191860 23676200 24472401 24370350 25046256 25978566 24697365 24981464 25310446 25445806
3972 25445806 25478008 26211685 26448203 26606474 26152334 27013096 27342470 26374186 27215428 27617738
3962 27617738 26997389 28477213 28791679 28897431 28603293 29088743 29475712 30384583 30960780
3953 30960780 31250500 30219021 30547323 31107939 31250981 31533451 32309519 33647749 34444902
3944 34444902 34625085 35186081 35219966 35488085 36129294 35244810 35466948 36418109 35926461 36038006
3934 36038006 36354786 36006161 35787620 35735248 36939358 36958243 36402041 35345568 36093546
3925 36093546 36131019 35957161 36147881 36557963 35651909 35695857 35259446 35196891 35416173 35174913
$$ packed form
3990B4473955n99808p31643R51941o28799J54992N34670q12395J03418P45529
3981B4191860n15660P96201j02051O75906R32310j281201K84099L28982J35360
3972B5445806L2202P33677K36518J58271m54140Q60762L29374r68284Q41242M02310
3962B7617738o20349J479824L14466J05752k94138M85450L86969R08871N76197
3953C0960780K89720j031479L28302N60616J43042K82470P76068J338230P97153
3944C4444902J80183N60996L3885K68119O41209q84484K22138R51161m91648J11545
3934C6038006L16780l48625k18541n2372J204110J8885n56202j056473P47978
3925C6093546L7473j73858J90720M10082r06054M3948m36411o2555K19282k41260
$$ plain form
3915 35174913 34790546 34282301 33370979 32790700 32777596 31916410 31931095 31546673 31357287 31799060
3905 31799060 31201880 29986677 29709989 29375108 29211743 29480203 28898243 28563737 28032126
3896 28032126 28505031 28967144 28688913 27841411 27388786 26842000 26476805 26593962 27126140
3887 27126140 27638050 27299443 26493901 25702907 26932516 25836809 25740782 26525151 27202187
3878 27202187 27755728 27392438 27150095 27320329 25078530 24172858 22982613 22757189 22822898
3869 22822898 22739332 22438313 21523141 21936387 23385257 22720354 21980023 22419000 21860471
3860 21860471 21572521 21863883 21092012 20862824 20878921 19756067 20708426 20383436 19896154
3851 19896154 19687601 19329174 18672431 18350137 18160572 18832426 19011900 18815608 18440113
$$ packed form
3915C5174913l84367n08245r11322n80279j3104q61186J4685l84422j89386M41773
3905C1799060n97180j215203k76688l34881j63365K68460n81960l34506n31611
3896B8032126M72905M62113k78231q47502m52625n46786l65195J17157N32178
3887B7126140N11910l38607q05542p90994J229609j095707r6027P84369O77036
3878B7202187N53541l63290k42343J70234k241799r05672j190245k25424O5709
3869B2822898q3566l01019r15172M13246J448870o64903p40331M38977n58529
3860B1860471k87950K91362p71871k29188J6097j122854R52359l24990m87282
3851A9896154k08553l58427o56743l22294j89565O71854J79474j96292l75495
$$ plain form
3842 18440113 17552016 16881451 17170550 17420094 17514101 16522607 15445080 14500440 15599803
3833 15599803 16276697 16197889 16282871 15835657 14788571 14680258 14646318 14624229 13834188 12615663
3823 12615663 13265823 13870193 13166338 12850944 12406954 13075361 12990777 13307624 13865437 14584328
3813 14584328 13975504 13386694 13561025 13375153 13280556 12331446 12413475 12468997 12623049 12076611
3803 12076611 11882127 12647492 13659837 13111672 12556700 13177053 13051251 13430579 13487699
3794 13487699 12492877 13560147 13847826 13597990 13277484 13475721 12676253 11691635 11679111
3785 11679111 12698127 13705461 12411624 12693720 11752088 13051252 12528808 12241376 12703545
3776 12703545 13373754 12127279 12040949 12363790 11856967 12565281 12537828 12582636 12087320 13363985
$$ packed form
3842A8440113q88097o70565K89099K49544R4007r91494j077527r44640J099363
3833A5599803O76894p8808Q4982m47214j047086j08313l3940k2089p90041j218525
3823A2615663O50160O04370p03855l15394m43990O68407q4584L16847N57813P18891
3813A4584328o08824n88810J74331j85872r4597r49110Q2029N5522J54052n46438
3803A2076611j94484P65365J012345n48165n54972O20353j25802L79328N7120
3794A3487699r94822J067270K87679k49836l20506J98237p99468r84618j2524
3785A1679111J019016J007334j293837K82096r41632J299164n22444k87432M62169
3776A2703545O70209j246475q6330L22841n06823P08314k7453M4808m95316J276665
$$ plain form
3766 13363985 13019932 12726318 13226308 13034188 12697931 12528163 13725461 13601584 13383008
3757 13383008 13725405 13185850 13221197 13001616 12723074 13345915 12403457 11945095 12643558 13253644
3747 13253644 12555239 11550581 13372716 13063058 13640663 13282963 13192468 13842718 13266790
3738 13266790 14375573 14685981 13117233 13767565 13262473 13625753 13284030 12817566 12695040
3729 12695040 13097424 12522990 13130896 12936153 13833552 14721599 14505835 13459978 13797051
3720 13797051 14180166 14596780 15671298 15371157 14595992 14223168 14853872 14177460 14627491
3711 14627491 15023019 15424763 15787515 15399905 15825953 16408602 15784990 16703994 16824823
3702 16824823 17141274 17317269 17713622 17645927 18142170 18546473 17963267 18142238 18676292 19756143
$$ packed form
3766A3363985l44053k93614M99990j92120l36257j69768J197298j23877k18576
3757A3383008L42397n39555L5347k19581k78542O22841r42458m58362O98463O10086
3747A3253644o98405j004658J822135l09658N77605l57700r0495O50250n75928
3738A3266790J108783L10408j568748O50332n05092L63280l41723m66464j22526
3729A2695040M02384n74434O07906j94743Q97399Q88047k15764j045857L37073
3720A3797051L83115M16614J074518l00141p75165l72824O30704o76412M50031
3711A4627491L95528M01744L62752l87610M26048N82649o23612R19004J20829
3702A6824823L16451J75995L96353o7695M96243M04303n83206J78971N34054J079851
$$ plain form
3692 19756143 18780574 19117425 19821752 20141082 20847978 20093499 20494154 21118130 21758918
3683 21758918 22102221 21919376 22458100 21692602 22087369 22477645 22566290 21721651 22256934 23771120
3673 23771120 24577123 23949396 23918988 23123408 23820093 23175476 23237747 23505150 24696357 25023576
3663 25023576 25032372 26846960 25378125 24947032 25439627 26352518 26024309 27434616 26547711
3654 26547711 26454924 27604204 28471316 29362447 30291223 31089538 31080540 31182260 31024298 32104445
3644 32104445 33617697 33641700 33254051 33917630 34631592 35677849 35852377 36547742 37772728
3635 37772728 38149235 39136387 39573530 39811318 40794859 41747014 42360295 42347796 42552051 42648536
3625 42648536 43146930 45153793 44921957 46191752 47005382 47009209 47203523 48931678 50404074
$$ packed form
3692A9756143r75569L36851P04327L19330P06896p54479M00655O23976O40788
3683B1758918L43303j82845N38724p65498L94767L90276Q8645q44639N35283J514186
3673B3771120Q06003o27727l0408p95580O96685o44617O2271K67403J191207L27219
3663B5023576Q796J814588j468835m31093M92595R12891l28209J410307q86905
3654B6547711r2787J149280Q67112Q91131R28776P98315q998J01720j57962J080147
3644C2104445J513252K4003l87649O63579P13962J046257J74528O95365J224986
3635C7772728L76507R87152M37143K37788R83541R52155O13281j2499K04255R6485
3625D2648536M98394K006863k31836J269795Q13630L827J94314J728155J472396
$$ plain form
3616 50404074 49219658 49797415 51939353 53463419 54178665 55214297 56004000 56631203 59425398
3607 59425398 60705343 61283874 63268872 64764769 66492640 68681286 70022483 71446343
3599 71446343 72239968 74748154 76762891 78986165 79608813 81525778 84247152 85488202
3591 85488202 87546277 90969641 94099372 96796230 99084190 102351813 105790048 109794961
3583 109794961 113992556 118782215 126333523 135691252 149685529 171408202 207491441 253216735
3575 253216735 266433793 255417663 227363035 196866830 171951442 147914884 131631646
3568 131631646 119013307 108852247 99455398 92800028 87982478 83211526 77981724 76295217
3560 76295217 72423299 69776993 66611054 64358765 62186849 60625628 58183901 57095611
$$ packed form
3616E0404074j184416N77757K141938J524066P15246J035632P89703O27203K794195
3607E9425398J279945N78531J984998J495897J727871K188646J341197J423860
3599G1446343P93625K508186K014737K223274O22648J916965K721374J241050
3591H5488202K058075L423364L129731K696858K287960L267623L438235M004913
3583A09794961M197595M789659P551308R357729J3994277K1722673L6083239M5725294
3575B53216735J3217058j1016130k8054628l0496205k4915388k4036558j6283238
3568A31631646j2618339j0161060r396849o655370m817550m770952n229802j686507
3560G6295217l871918k646306l165939k252289k171916j561221k441727j088290
$$ plain form
3552 57095611 55859737 55252227 53504714 52613393 51483112 51788297 50232932 49094247 48582748
3543 48582748 48517309 49326724 48551017 48219472 47290620 47173130 47146207 45793617 45605242 44843175
3533 44843175 45497721 44533445 43714323 43780911 43125021 43079584 43664874 43176195 41771022 41548740
3523 41548740 42183107 42332975 42142375 41705155 40841331 39119157 40710468 41220180 40118236
3514 40118236 40208581 40728382 39838738 40114661 40234399 39361393 39489290 39491144 38868299 39057140
3504 39057140 39966604 39875961 38741322 39091204 39373929 39704216 40296004 39557888 39795814
3495 39795814 40422955 40764834 40780422 40237985 40652432 40843243 40624466 41013355 40809204 41338593
3485 41338593 42642464 42093589 41611878 42028968 41132566 41704058 42979297 43675570 43771585
$$ packed form
3552E7095611j235874o07510j747513q91321j130281L05185j555365j138685n11499
3543D8582748o5439Q09415p75707l31545r28852j17490k6923j352590j88375p62067
3533D4843175O54546r64276q19122O6588o55890m5437N85290m88679j405173k22282
3523D1548740O34367J49868j90600m37220q63824j722174J591311N09712j101944
3514D0118236R0345N19801q89644K75923J19738q73006J27897J854o22845J88841
3504C9057140R09464r0643j134639L49882K82725L30287N91788p38116K37926
3495C9795814O27141L41879J5588n42437M14447J90811k18777L88889k04151N29389
3485D1338593J303871n48875m81711M17090q96402N71492J275239O96273R6015
$$ plain form
3476 43771585 43564131 43473336 44590722 45042038 45017659 45263875 45996418 45875845 46404270 46983224
3466 46983224 48101812 49006995 49096636 48843693 48468217 50190920 50979987 50660836 51931557
3457 51931557 51628780 52242538 52915826 53483807 54384280 54948664 55470979 56706870 57365474
3448 57365474 57596125 57996985 58545897 59026648 59791869 61325089 63136565 64033409 65262298
3439 65262298 65072669 65357779 66708585 67999657 70025232 71019293 71320260 72926218 73906813
3430 73906813 75737182 77790779 79397675 79819314 80449719 81750223 83320185 83215557 84994316
3421 84994316 86836592 87336499 88303025 89812198 91106172 91916424 92307052 92717931 93794338
3412 93794338 94869153 95387958 95791139 95613765 96177561 97713737 97965360 98564105 99524568
$$ packed form
3476D3771585k07454r0795J117386M51316k4379K46216P32543j20573N28425N78954
3466D6983224J118588R05183Q9641k52943l75476J722703P89067l19151J270721
3457E1931557l02777O13758O73288N67981R00473N64384N22315J235891O58604
3448E7365474K30651M00860N48912M80751P65221J533220J811476Q96844J228889
3439F5262298j89629K85110J350806J291072K025575R94061L00967J605958R80595
3430G3906813J830369K053597J606896M21639O30405J300504J569962j04628J778759
3421H4994316J842276M99907R66526J509173J293974Q10252L90628M10879J076407
3412I3794338J074815N18805M03181j77374N63796J536176K51623N98745R60463
$$ plain form
3403 99524568 100240678 102042603 103233364 103441318 105724725 107532327 109793763 110697821 112553711
3394 112553711 114378924 116461786 118629549 120456291 122550783 125315117 128350201 131081684
3386 131081684 133168422 135303955 136490183 138925747 140504306 141342583 142713793 143892753
3378 143892753 143831000 144268639 143565998 142304871 142331454 141833447 141719663 140424750 137885328
3369 137885328 136120761 134617183 132005504 131508278 128825791 126852571 124408725 122464341
3361 122464341 120617992 119306660 117962937 116126895 114887607 113266014 111828839 110478737
3353 110478737 110345705 109605167 108654291 107946620 106748300 105481738 106024917 104667817 104284534
3344 104284534 104182182 103930554 102678818 102015754 102395987 102325594 100099522 99296220 98871507
$$ packed form
3403I9524568P16110J801925J190761K07954K283407J807602K261436R04058J855890
3394A12553711J825213K082862K167763J826742K094492K764334L035084K731483
3386A31081684K086738K135533J186228K435564J578559Q38277J371210J178960
3378A43892753o1753M37639p02641j261127K6583m98007j13784j294913k539422
3369A37885328j764567j503578k611679m97226k682487j973220k443846j944384
3361A22464341j846349j311332j343723j836042j239288j621593j437175j350102
3353A10478737j33032p40538r50876p07671j198320j266562N43179j357100l83283
3344A04284534j02352k51628j251736o63064L80233p0393k226072q03302m24713
$$ plain form
3335 98871507 98398574 97478224 96167648 95577009 94418121 93725037 92868157 92783337 92985412
3326 92985412 92459793 91603232 91193875 90216076 89831387 90147536 90678057 89486797 88758263
3317 88758263 88307730 87892519 88115520 87455848 86530719 86574434 86492724 86582248 86253069 86483798
3307 86483798 86662925 85437507 85124732 84958302 85733964 85985651 85985264 86608274 86090898 86598832
3297 86598832 87746180 88191663 89214847 89378625 90226715 90806765 91171745 90704067 90894444
3288 90894444 91992790 92809004 93489677 93599291 94284163 95246161 95349301 96358482 98251766
3279 98251766 98986394 101229470 103480927 105885989 107585473 108679035 110870145 111175354
3271 111175354 111824059 114164545 113469307 112980968 112895349 112819415 112674878 112165108 112504858
$$ packed form
3335I8871507m72933r20350j310576n90639j158888o93084q56880q4820K02075
3326I2985412n25619q56561m09357r77799l84689L16149N30521j191260p28534
3317H8758263m50533m15211K23001o59672r25129M3715q1710Q9524l29179K30729
3307H6483798J79127j225418l12775j66430P75662K51687l87O23010n17376N07934
3297H6598832J147348M45483J023184J63778Q48090N80050L64980m67678J90377
3288I0894444J098346Q16214O80673J09614O84872R61998J03140J009181J893284
3279I8251766P34628K243076K251457K405062J699484J093562K191110L05209
3271A11175354O48705K340486o95238m88339q5619p5934j44537n09770L39750
$$ plain form
3262 112504858 115314208 114822010 115842782 117242128 118476276 121184098 124986406 127634255
3254 127634255 130898064 133142397 133964439 136746629 139451101 140358827 140975208 140920566 140402309
3245 140402309 141393168 140924302 140135482 139457006 140335960 138765369 136493939 135545614 134155888
3236 134155888 131444453 130067693 127503559 123942579 121481791 118330590 113658155 109948750
3228 109948750 105623710 103548683 101314578 98272151 95431879 93431417 91050822 89052066
3220 89052066 87971803 85130227 82791158 81474694 79571657 79365038 79175400 77541745
3212 77541745 76688182 77030006 76938561 76643980 76220811 75993333 75872983 74204692 74319050
3203 74319050 74984501 74431473 74274737 75415335 75522835 75168977 74185987 74628257 74368202
$$ packed form
3262A12504858K809350m92198J020772J399346J234148K707822L802308K647849
3254A27634255L263809K244333Q22042K782190K704472R07726O16381n4642n18257
3245A40402309R90859m68866p88820o78476Q78954j570591k271430r48325j389726
3236A34155888k711435j376760k564134l560980k460788l151201m672435l709405
3228A09948750m325040k075027k234105l042427k840272k000462k380595j998756
3220H9052066j080263k841576k339069j316464j903037k06619j89638j633655
3212G7541745q53563L41824r1445k94581m23169k27478j20350j668291J14358
3203G4319050O65451n53028j56736J140598J07500l53858r82990M42270k60055
$$ plain form
3194 74368202 74179407 72379087 71317180 70797852 69996433 69308407 69250891 68495921 66740972
3185 66740972 66892741 65414450 64231289 64226365 63158817 62603193 63115598 61954253 61962464
3176 61962464 61014445 60729825 60353649 60607254 59503584 59612854 59451416 59118729 58774523
3167 58774523 58311224 58220475 58272349 57406814 58019803 57337686 57173694 57058175 57564235 56697082
3157 56697082 55956638 58180413 57311661 57493421 56586153 57011912 57067171 56681702 56349192
3148 56349192 56556496 56801899 56683825 57263977 57491979 57224798 58195292 58253357 58589292 58174145
3138 58174145 58229743 58938950 59004901 59953118 60337723 60238135 61890350 62421764 63764411 64480951
3128 64480951 64449848 64229998 64752024 64124569 64169526 64352760 63819108 63757566 63226469 63854202
$$ packed form
3194G4368202j88795j800320j061907n19328q01419o88026n7516p54970j754949
3185F6740972J51769j478291j183161m924j067548n55624N12405j161345Q211
3176F1962464r48019k84620l76176K53605j103670J09270j61438l32687l44206
3167E8774523m63299r0749N1874q65535O12989o82117j63992j15519N06060q67153
3157E6697082p40444K223775q68752J81760r07268M25759N5259l85469l32510
3148E6349192K07304K45403j18074N80152K28002k67181R70494N8065L35935m15147
3138E8174145N5598P09207O5951R48217L84605r9588J652215N31414J342647P16540
3128F4480951l1103k19850N22026o27455M4957J83234n33652o1542n31097O27733
$$ plain form
3118 63854202 64215972 62978150 62200421 63524305 63317024 63095621 62815577 62126707 62614007
3109 62614007 62575999 63418188 62225414 61517150 61860333 61060895 61410304 61017809 61179577
3100 61179577 61091041 60962999 60634395 60640967 60749754 60868119 61409302 62402749 61665721 62652363
3090 62652363 61473269 61597974 62686470 61047987 61081518 61060326 63259960 63962603 63906721
3081 63906721 64748556 66494528 66785116 67028791 68289568 68913667 69531282 71027406 70895380
3072 70895380 71464438 73095575 73593070 74670387 75712576 76217445 77210339 77603184 78495127
3063 78495127 79431766 80086509 80972532 82159793 83626411 84518460 84892991 86246013 88638152
3054 88638152 90665712 93143734 93637756 95730067 97512850 100412668 103231154 104145523
$$ packed form
3118F3854202L61770j237822p77729J323884k07281k21403k80044o88870M87300
3109F2614007l8008Q42189j192774p08264L43183p99438L49409l92495J61768
3100F1179577q8536j28042l28604O572J08787J18365N41183R93447p37028R86642
3090F2652363j179094J24705J088496j638483L3531k1192K199634P02643n5882
3081F3906721Q41835J745972K90588K43675J260777O24099O17615J496124j32026
3072G0895380N69058J631137M97495J077317J042189N04869R92894L92845Q91943
3063G8495127R36639O54743Q86023J187261J466618Q92049L74531J353022K392139
3054H8638152K027560K478022M94022K092311J782783K899818K818486R14369
$$ plain form
3046 104145523 106294609 108723433 111666332 112291592 114140481 115985716 118540718 121874225
3038 121874225 124799428 126829884 129201003 131356958 132806976 135167120 136732575 138216901
3030 138216901 139351490 140212679 140811673 140690275 141054532 141516699 140578955 141213865 139576244
3021 139576244 139310762 140923492 141012920 140497040 138315932 138840026 139630538 139409889 138968585
3012 138968585 137677515 138048257 138935854 139465836 140847928 141616880 142797866 144471280 144641763
3003 144641763 146108178 147896944 149405078 150015759 149764345 150218767 150592245 150539588 150190550
2994 150190550 150372547 150424168 149533883 149606770 149107980 148393089 145648235 144371716 143468573
2985 143468573 141810690 138396854 136825329 133861309 132154703 130498848 127983755 127417625
$$ packed form
3046A04145523K149086K428824K942899O25260J848889J845235K555002L333507
3038A21874225K925203K030456K371119K155955J450018K360144J565455J484326
3030A38216901J134589Q61189N98994j21398L64257M62167r37744O34910j637621
3021A39576244k65482J612730Q9428n15880k181108N24094P90512k20649m41304
3012A38968585j291070L70742Q87597N29982J382092P68952J180986J673414J70483
3003A44641763J466415J788766J508134O10681k51414M54422L73478n2657l49038
2994A50190550J81997N1621q90285P2887m98790p14891k744854j276519r03143
2985A43468573j657883l413836j571525k964020j706606j655855k515093n66130
$$ plain form
2977 127417625 125469407 123281273 121897358 120499651 118706274 118447164 117510486 116864264
2969 116864264 116310385 115898196 115338441 116373501 116518321 116494846 116366751 117276740 120107848
2960 120107848 118569555 119211983 120732594 119123297 120134350 119943556 119398747 118434114 117990492
2951 117990492 118362528 117910591 116966786 116701765 116513731 114807260 112726818 110956280 109965320
2942 109965320 107884301 106460898 105263137 103544956 102602148 102045415 100702846 100439240
2934 100439240 99137692 98254760 97363858 97374622 96994527 97307104 97296904 96408567 95843630
2925 95843630 94328462 94400273 94304137 92431091 91948695 91820200 92800790 93843334 94077562
2916 94077562 94689795 96611065 98441499 98779810 101363938 101678680 103369873 104339177 104163324
$$ packed form
2977A27417625j948218k188134j383915j397707j793377k59110r36678o46222
2969A16864264n53879m12189n59755J035060J44820k3475j28095R09989K831108
2960A20107848j538293O42428J520611j609297J011053j90794n44809r64633m43622
2951A17990492L72036m51937r43805k65021j88034j706471k080442j770538r90960
2942A09965320k081019j423403j197761j718181r42808n56733j342569k63606
2934A00439240j301548q82932q90902J0764l80095L12577j0200q88337n64937
2925I5843630j515168P1811r6136j873046m82396j28495R80590J042544K34228
2916I4077562O12233J921270J830434L38311K584128L14742J691193R69304j75853
$$ plain form
2907 104163324 104759263 107025601 107187292 108114345 109388629 110869827 111662717 111670500 111158655
2898 111158655 111904979 111403842 111493462 112933844 113844522 114238352 114261097 114832705 115132318
2889 115132318 113379851 112672421 111977791 111111054 108957246 107218154 105610911 102826391
2881 102826391 100332922 97745420 95074363 92045555 90797288 89449455 88099843 86905559
2873 86905559 85264795 83363541 83007206 81109314 80641909 79222419 78317549 76617460 74812482
2864 74812482 72911617 71946877 70811671 68288694 67120506 66022820 63766621 62615283
2856 62615283 61920045 61171311 60319583 59831997 59147636 58729691 57339754 56956661 57079802
2847 57079802 56556313 56591373 57963529 57641889 56133708 56076740 55257501 55029173 55454249
$$ packed form
2907A04163324N95939K266338J61691R27053J274284J481198P92890P783n11845
2898A11158655P46324n01137Q9620J440382R10678L93830K2745N71608K99613
2889A15132318j752467p07430o94630q66737k153808j739092j607243k784520
2881A02826391k493469k587502k671057l028808j248267j347833j349612j194284
2873H6905559j640764j901254l56335j897892m67405j419490r04870j700089j804978
2864G4812482j900865r64740j135206k522977j168188j097686k256199j151338
2856F2615283o95238p48734q51728m87586o84361m17945j389937l83093J23141
2847E7079802n23489L5060J372156l21640j508181n6968q19239k28328M25076
$$ plain form
2838 55454249 54489882 53721500 53509585 52222233 53147472 52480966 51430668 50365315 49089394
2829 49089394 48322727 48492710 47240393 47079187 46748652 45634424 45049824 44548364 43105360
2820 43105360 41355025 41048183 40077187 39360816 38798729 39548593 39519237 37647726 37348093
2811 37348093 36098975 36128219 36101794 34894953 34904351 34399227 33574855 33502559 33598230 33355304
2801 33355304 33218930 33056982 31970697 32360360 32119951 32635452 32290784 30779208 31782454
2792 31782454 31382782 31336193 31547329 30902296 31751001 31506995 31693535 30671397 31183493
2783 31183493 31523140 31527142 31159991 31594494 31647536 32095003 32574674 31244587 30993953 31340066
2773 31340066 32707802 32608968 32897609 32943907 33376597 34359657 33838613 34147422 33890146 34673785
$$ packed form
2838E5454249r64367p68382k11915j287352R25239o66506j050298j065353j275921
2829D9089394p66667J69983j252317j61206l30535j114228n84600n01460j443004
2820D3105360j750335l06842r70996p16371n62087P49864k9356j871511k99633
2811C7348093j249118K9244k6425j206841R398n05124q24372p2296R5671k42926
2801C3355304j36374j61948j086285L89663k40409N15501l44668j511576J003246
2792C1782454l99672m6589K11136o45033Q48705k44006J86540j022138N12096
2783C1183493L39647M002l67151M34503N3042M47467M79671j330087k50634L46113
2773C1340066J367736r8834K88641M6298M32690R83060n21044L08809k57276P83639
$$ plain form
2763 34673785 35161473 35013333 36109536 35922708 36549046 36397748 37696172 37823858 39011207
2754 39011207 38484941 38878842 39182485 40340779 41780588 42805948 43537769 44343277 45978489
2745 45978489 48020053 48743086 50261048 52648594 54654254 55650053 58225083 61052955
2737 61052955 63222433 65154897 68390608 72980229 78458602 84995223 91605654 99752036
2729 99752036 106228019 108099457 108376306 106032948 103039600 100087231 99327021 99450970 99521101
2720 99521101 98957759 100318360 102908565 105889936 109177802 112281092 114677801 119206704
2712 119206704 124330022 130103214 137147179 142253860 149450574 156057865 165115984 171915469
2704 171915469 179561146 187905688 195567344 203475419 210805740 215069784 218751025 220823614
$$ packed form
2763C4673785M87688j48140J096203j86828O26338j51298J298424J27686J187349
2754C9011207n26266L93901L03643J158294J439809J025360P31821Q05508J635212
2745D5978489K041564P23033J517962K387546K005660R95799K575030K827872
2737F1052955K169478J932464L235711M589621N478373O536621O610431Q146382
2729I9752036O475983J871438K76849k343358k993348k952369p60210J23949P0131
2720I9521101n63342J360601K590205K981371L287866L103290K396709M528903
2712A19206704N123318N773192P043965N106681P196714O607291R058119O799485
2704A71915469P645677Q344542P661656P908075P330321M264044L681241K072589
$$ plain form
2696 220823614 222660114 223071773 225682029 228808973 232295655 238752895 247504043 255233895
2688 255233895 264809878 276284312 289001827 302971196 320463291 340082903 357880770
2681 357880770 373136115 380489103 379959505 370246757 356565562 337630929 317903935 299276334
2673 299276334 280980745 264682092 249844106 236162039 224962476 214329911 204221785
2666 204221785 194617610 186514020 179251835 172371174 166181978 160739476 155011059 149893117
2658 149893117 145417468 141138878 137740305 134601658 131864154 127645999 125871956 123022472
2650 123022472 121417850 122109654 121526294 121211530 121893178 122481449 122292340 121243589 118068222
2641 118068222 114691196 109815346 104579931 98711830 94068822 89595595 86174318 82252531
$$ packed form
2696B20823614J836500M11659K610256L126944L486682O457240Q751148P729852
2688B55233895R575983J1474434J2717515J3969369J7492095J9619612J7797867
2681C57880770J5255345P352988n29598r712748j3681195j8934633j9726994j8627601
2673B99276334j8295589j6298653j4837986j3682067j1199563j0632565j0108126
2666B04221785r604175q103590p262185o880661o189196n442502n728417n117942
2658A49893117m475649m278590l398573l138647k737504m218155j774043k849484
2650A23022472j604622O91804n83360l14764O81648N88271j89109j048751l175367
2641A18068222l377026m875850n235415n868101m643008m473227l421277l921787
$$ plain form
2633 82252531 78894622 76264407 72943794 70822636 67070832 64830080 62928884 61450257
2625 61450257 59741916 57505065 56496745 55268328 53035403 52516261 51163726 49320281
2617 49320281 48091118 46686898 46182608 45231798 43942392 43426924 42785480 42317689 39962821
2608 39962821 40652314 39883629 37796136 37902873 37067345 35600799 34557026 33528014 32733286
2599 32733286 31472226 31251359 30580576 29179133 29177942 29266477 28709558 27402185 27119639
2590 27119639 27009948 25140126 25371802 23491436 24067869 24126561 22495466 22726199 22612764
2581 22612764 22664405 22248219 22479360 21350230 20987270 21247549 21398915 20640379 20255308
2572 20255308 19695529 19981261 19391621 19479910 19505398 18662801 18568673 18676416 17151274 16537188
$$ packed form
2633H2252531l357909k630215l320613k121158l751804k240752j901196j478627
2625F1450257j708341k236851j008320j228417k232925n19142j352535j843445
2617D9320281j229163j404220n04290r50810j289406n15468o41444m67791k354868
2608C9962821O89493p68685k087493J06737q35528j466546j043773j029012p94728
2599C2733286j261060k20867o70783j401443j191Q8535n56919j307373k82546
2590B7119639j09691j869822K31676j880366N76433N8692j631095K30733j13435
2581B2612764N1641m16186K31141j129130l62960K60279J51366p58536l85071
2572B0255308n59779K85732n89640Q8289K5488q42597r4128J07743j525142o14086
$$ plain form
2562 16537188 17327085 16816745 16795556 15932276 16546509 16060939 15667603 16189451 15478350 14775754
2552 14775754 14709473 15717950 15274747 15388141 14655973 14430638 14652214 13048539 13528735
2543 13528735 14449153 13216321 13236915 12850406 12285963 13260515 13027435 13041009 12942501 11967899
2533 11967899 12200237 12645309 12324289 11907422 12533630 11675249 11462948 11296675 12100761
2524 12100761 11927806 11287337 10777578 9638152 11141263 11064138 10551983 11072754 11032756
2515 11032756 11766619 11624483 10821743 10883944 10016750 9639387 10221768 10369739 10638368 10231662
2505 10231662 9564165 10323601 11103771 10033173 9720992 10831711 9888883 9448753 9424531
2496 9424531 9035781 10094334 9913961 9120152 9166485 9632942 9235752 9501163 10166550 9438677
$$ packed form
2562A6537188P89897n10340k1189q63280O14233m85570l93336N21848p11101p02596
2552A4775754o6281J008477m43203J13394p32168k25335K21576j603675M80196
2543A3528735R20418j232832K0594l86509n64443R74552k33080J3574r8508r74602
2533A1967899K32338M45072l21020m16867O26208q58381k12301j66273Q04086
2524A2100761j72955o40469n09759j139426J503111p7125n12155N20771l9998
2515A1032756P33863j42136q02740O2201q67194l77363N82381J47971K68629m06706
2505A0231662o67497P59436P80170j070598l12181J110719r42828m40130k4222
2496I424531l88750J058553j80373p93809M6333M66457l97190K65411O65387p27873
$$ plain form
2486 9438677 9919413 9537902 8590017 8977000 8544110 8758271 8896681 8385815 7898290 9383728
2476 9383728 9833328 10115508 9130742 9302176 9831472 10411763 9718524 9829919 9118165 9230485
2466 9230485 9261355 8916942 8932470 8235667 9663652 8963586 8467935 9473640 9590370 8861498
2456 8861498 8358515 7395718 7047338 7822568 8034868 7359997 7147263 7722244 7267200 6815582
2446 6815582 6999787 7027421 7309831 6621570 6419680 7308912 7579804 7126918 7331536 7588968
2436 7588968 7050292 6699592 7195119 7008946 6144359 6502553 6829416 6481353 6830481 6571525
2426 6571525 5092450 6047046 6365493 6298444 6306992 5578871 5714132 5785627 6446339 5273724
2416 5273724 5035485 5450330 5111982 5338178 6179237 7052806 6733511 5789156 5745519 5055847
$$ packed form
2486I438677M80736l81511r47885L86983m32890K14161J38410n10866m87525J485438
2476I383728M49600K82180r84766J71434N29296N80291o93239J11395p11754J12320
2466I230485L0870l44413J5528o96803J427985p00066m95651J005705J16730p28872
2456H861498n02983r62797l48380P75230K12300o74871k12734N74981m55044m51618
2446F815582J84205K7634K82410o88261k01890Q89232K70892m52886K04618K57432
2436G588968n38676l50700M95527j86173q64587L58194L26863l48063L49128k58956
2426F571525j479075R54596L18447o7049Q548p28121J35261P1495O60712j172615
2416E273724k38239M14845l38348K26196Q41059Q73569l19295r44355m3637o89672
$$ plain form
2406 5055847 4651429 4681099 4965056 5741378 5410762 5578567 5352378 5734025 5210236 5819760
2396 5819760 4952791 4507897 5752504 4657611 4799007 5977358 5986440 5603537 5683508 5394126
2386 5394126 5804790 4639779 4396728 4437426 4514487 4865501 6339740 5523559 6243423 6188754
2376 6188754 5658301 4510060 6103063 6879274 5979638 5562699 4375709 3420161 4555227
2367 4555227 5657266 5174881 4307169 5223296 5854018 4694042 4968202 5254964 5521746
2358 5521746 4729698 5138757 4760852 5614556 6792247 5116200 5100400 4894564 4509877
2349 4509877 4668484 4533512 3459988 3387903 4894243 5146238 4236586 4712938 5297685
2340 5297685 5903559 5590988 5457450 5722549 5642542 4713238 5723842 6282301 4650825
$$ packed form
2406E055847m04418K9670K83957P76322l30616J67805k26189L81647n23789O09524
2396E819760q66969m44894J244607j094893J41396J178351R082l82903P9971k89382
2386E394126M10664j165011k43051M0698P7061L51014J474239q16181P19864n4669
2376F188754n30453j148241J593003P76211q99636m16939j186990r55548J135066
2367D555227J102039m82385q67712R16127O30722j159976K74160K86762K66782
2358E521746p92048M09059l77905Q53704J177691j676047j5800k05836l84687
2349D509877J58607j34972j073524p2085J506340K51995r09652M76352N84747
2340E297685O05874l12571j33538K65099q0007r29304J010604N58459j631476
$$ plain form
2331 4650825 4184468 3933385 3802715 4311924 4934876 4409626 3691707 3916332 4214276 4100704
2321 4100704 3969330 4366301 4413271 4309318 4760346 4635118 3373241 3362115 4243625 3540584
2311 3540584 5001184 4559946 4761808 5091757 4521993 4371554 3863785 3558634 4301631
2302 4301631 4541366 4498547 4749621 5178203 4624931 4100140 4270631 5302392 5714842 5331464
2292 5331464 5908055 5683577 5473625 5435509 5234762 4766088 4618255 5154987 4704320 3861395
2282 3861395 3809727 3587163 4149656 4742230 3797278 4212503 4591496 4211931 4252512 4856058
2272 4856058 4994225 4493508 4456855 4728253 4968465 4400465 3378827 3585851 4327895 4142108
2262 4142108 4510425 5364470 3546053 4140640 4654068 3334619 3350195 4055810 3535518
$$ packed form
2331D650825m66357k51083j30670N09209O22952n25250p17919K24625K97944j13572
2321D100704j31374L96971M6970j03953M51028j25228j261877j1126Q81510p03041
2311C540584J460600m41238K01862L29949n69764j50439n07769l05151P42997
2302D301631K39735m2819K51074M28582n53272n24791J70491J031761M12450l83378
2292E331464N76591k24478k09952l8116k00747m68674j47833N36732m50667q42925
2282C861395n1668k22564N62493N92574r44952M15225L78993l79565M0581O03546
2272D856058J38167n00717l6653K71398K40212n68000j021638K07024P42044j85787
2262D142108L68317Q54045j818417N94587N13428j319449J5576P05615n20292
$$ plain form
2253 3535518 4374504 3972533 3581214 4021218 3682329 3494119 3405295 3857200 3917500 4458454
2243 4458454 4213415 4436572 3248824 3606376 4593351 3865094 3903423 3875054 3619049 3995288
2233 3995288 3751220 3309773 4636056 4534336 4427852 3406291 3321009 4405124 3939716
2224 3939716 3355026 4640534 4363704 4330033 4242631 4024209 4537307 3629584 4564684 4807071
2214 4807071 5358498 5029297 3607589 3943952 4232794 4771360 3130205 4013033 3857197
2205 3857197 3696018 4168396 4405885 4225836 4652518 5568491 5173558 5212412 4706790 4394421
2195 4394421 4919194 4595599 4786947 5459778 4540719 4642425 4678964 5270449 5523924 4490313
2185 4490313 4434407 4527360 4252001 4812801 4756727 4907703 5936395 5140136 5705173 4534787
$$ packed form
2253C535518Q38986m01971l91319M40004l38889j88210q8824M51905O0300N40954
2243D458454k45039K23157j187748L57552R86975p28257L8329k8369k56005L76239
2233C995288k44068m41447J326283j01720j06484j021561q5282J084115m65408
2224C939716n84690J285508k76830l3671q7402k18422N13098r07723R35100K42387
2214D807071N51427l29201j421708L36363K88842N38566j641155Q82828j55836
2205C857197j61179M72378K37489j80049M26682R15973l94933L8854n05622l12369
2195D394421N24773l23595J91348O72831r19059J01706L6539N91485K53475j033611
2185D490313n5906R2953k75359N60800n6074J50976J028692p96259N65037j170386
$$ plain form
2175 4534787 5132336 5551332 5603382 5768330 5341030 6221085 6280484 6427062 6003984 5427933
2165 5427933 5898153 6203549 5976162 5946775 6405267 7600521 7395741 7140363 7811435 7856620
2155 7856620 7464005 8717970 7739902 7750944 7880525 7968375 7136667 9024613 10128040
2146 10128040 9201501 10683128 10406221 10025312 10768690 10533676 11091868 10869445 11494506
2137 11494506 10525952 11231998 12420428 12813636 13924652 14572676 14023628 14645271 15598098
2128 15598098 16947873 17332049 18801494 19147272 19399577 21313003 22119875 23246396 24532501
2119 24532501 27111687 28121522 29721887 32252736 34656145 36298355 38516558 40497590
2111 40497590 42510054 46994717 49907205 54035733 59160457 64838751 71606154 77138713
$$ packed form
2175D534787N97549M18996N2050J64948m27300Q80055N9399J46578m23078n76051
2165E427933M70220L05396k27387k9387M58492J195254k04780k55378O71072M5185
2155G856620l92615J253965r78068J1042J29581Q7850q31708J887946J103427
2146A0128040r26539J481627k76907l80909P43378k35014N58192k22423O25061
2137A1494506r68554P06046J188430L93208J111016O48024n49048O21643R52827
2128A5598098J349775L84176J469445L45778K52305J913426Q06872J126521J286105
2119B4532501K579186J009835J600365K530849K403409J642210K218203J981032
2111D0497590K012464M484663K912488M128528N124724N678294O767403N532559
$$ plain form
2103 77138713 82139480 88136270 94363344 104498188 113105770 128822718 149705224 183476822
2095 183476822 234936627 314208238 353933754 344952432 308057684 255307583 218708413
2088 218708413 179088998 150766827 130228411 112613734 98108109 89050104 81672697
2081 81672697 73688227 66440934 60455435 55432437 50763282 46244500 42932013 38695839
2073 38695839 36385371 33278145 32443906 30559658 29379728 28158868 26767389 25737896
2065 25737896 24593781 23801708 22394020 20731184 19987154 19424172 18441453 17758550 17255044
2056 17255044 16329181 16192636 16069632 15844076 14994706 13350732 13453335 12851981 12983100
2047 12983100 12731180 12565398 12670970 10648714 10248739 9347539 10004886 9674334 9729122
$$ packed form
2103G7138713N000767N996790O227074J0134844Q607582J5716948K0882506L3771598
2095A83476822N1459805P9271611L9725516q981322l6894748n2750101l6599170
2088B18708413l9619415k8322171k0538416j7614677j4505625r058005p377407
2081H1672697p984470p247293n985499n022998m669155m518782l312487m236174
2073C8695839k310468l107226q34239j884248j179930j220860j391479j029493
2065B5737896j144115p92073j407688j662836p44030n62982r82719o82903n03506
2056A7255044r25863j36545j23004k25556q49370j643974J02603o01354J31119
2047A2983100k51920j65782J05572k022256l99975r01200O57347l30552N4788
$$ plain form
2038 9729122 9902128 9755145 9110961 8875990 8746771 7593623 7892365 8839255 9271562
2029 9271562 8526253 7825729 8625408 8109548 8165405 7862933 8301259 7321137 7032888 7497612
2019 7497612 7845243 6980665 5871169 5616823 4736063 5610399 5964554 6790377 5706850
2010 5706850 5342448 5662434 6022594 7451467 6896848 5653333 6445222 6393970 5306653
2001 5306653 5041436 5289781 5898495 4965336 4752156 4488121 4793789 5064713 4453963 4324311
1991 4324311 5215418 3642912 4353316 3853832 4427614 4825733 3957292 3839676 4691708
1982 4691708 4454196 4372360 4688617 4617355 4159586 3738475 4467775 4773206 3295581 2750693
1972 2750693 2719693 3727828 4872606 4861717 4167125 3208613 3737159 4121117 3716805 4037800
$$ packed form
2038I729122J73006j46983o44184k34971j29219j153148K98742R46890M32307
2029I271562p45309p00524P99679n15860N5857l02472M38326r80122k88249M64724
2019G497612L47631q64578j109496k54346q80760Q74336L54155Q25823j083527
2010E706850l64402L19986L60160J428873n54619j243515P91889n1252j087317
2001E306653k65217K48345O08714r33159k13180k64035L05668K70924o10750j29652
1991D324311Q91107j572506P10404m99484N73782L98119q68441j17616Q52032
1982D691708k37512q1836L16257p1262m57769m21111P29300L05431j477625n44888
1972B750693l1000J008135J144778j0889o94592r58512N28546L83958m04312L20995
$$ plain form
1962 4037800 3540981 3723071 3820467 2850778 3185065 2951158 3957491 4243919 4036321 4050921
1952 4050921 3718984 4727808 4165734 3444134 3399531 2655237 3147731 2835103 3084471 2357993
1942 2357993 4115372 4525081 3776687 4013006 3483764 2902498 3534474 2606945 3327258
1933 3327258 3527503 2746192 1986662 2998153 3305664 2936687 2940954 3403393 3420775 3062705
1923 3062705 2550626 2535813 3528039 3631363 3252053 3204815 2972282 2929987 2375632 3486749
1913 3486749 3038286 2920347 3397300 2854511 2578893 3023428 2985545 3340855 2331013 2154358
1903 2154358 1328565 2217160 3358259 2380710 2954558 3474090 2328467 2437658 2806648
1894 2806648 3264364 3150694 3833735 3965249 3778270 4131433 3195779 3264695 3311797 2584038
$$ packed form
1962D037800m96819J82090R7396r69689L34287k33907J006333K86428k07598J4600
1952D050921l31937J008824n62074p21600m4603p44294M92494l12628K49368p26478
1942B357993J757379M09709p48394K36319n29242n81266O31976r27529P20313
1933C327258K00245p81311p59530J011491L07511l68977M267M62439J7382l58070
1923C062705n12079j4813R92226J03324l79310m7238k32533m2295n54355J111117
1913C486749m48463j17939M76953n42789k75618M44535l7883L55310j009842j76655
1903B154358q25793Q88595J141099r77549N73848N19532j145623J09191L68990
1894B806648M57716j13670O83041J31514j86979L53163r35654O8916M7102p27759
$$ plain form
1884 2584038 2298143 2892221 2728990 2454173 2477109 2058930 2153635 1458856 2392038 2459616
1874 2459616 2326895 2139718 1396570 2373194 1792178 1793364 2828076 2159369 1552087 1148632
1864 1148632 2444742 2644178 3229197 2746253 2198434 1896370 2087448 2730809 2841183
1855 2841183 1712705 1494606 2128199 2486987 2733594 1707068 1789744 1419604 3000947
1846 3000947 2621920 1820468 1298402 1964267 1767401 1907405 1677192 2140941 1004062
1837 1004062 1170773 2138138 2397520 1520146 1010080 2278966 2098002 1955796 2338850
1828 2338850 2249197 1761095 1675538 2229603 1643565 1391725 2263465 2331527 2210446 2217266
1818 2217266 1062216 756873 372554 1314698 2580460 2305984 2002183 1871396 1422851
$$ packed form
1884B584038k85895N94078j63231k74817K2936m18179R4705o94779R33182O7578
1874B459616j32721j87177p43148R76624n81016J186J034712o68707o07282m03455
1864A148632J296110J99436N85019m82944n47819l02064J91078O43361J10374
1855B841183j128478k18099O33593L58788K46607j026526Q2676l70140J581343
1846C000947l79027q01452n22066O65865j96866J40004k30213M63749j136879
1837A004062J66711R67365K59382q77374n10066J268886j80964j42206L83054
1828B338850q9653m88102q5557N54065n86038k51840Q71740O8062j21081O820
1818B217266j155050l05343l84319R42144J265762k74476l03801j30787m48545
$$ plain form
1809 1422851 1335405 1118155 622012 685864 2640667 2065505 2138342 2582968 1526633 1716285
1799 1716285 2146293 1759860 3180776 2874742 1603820 2025494 2166917 2682459 2299748
1790 2299748 1707915 2129422 1617942 2070457 2259766 1583419 1691373 2089057 849447
1781 849447 559767 1702935 1785708 2430241 1613925 1514577 2036441 1294799 1360457 734236
1771 734236 1179772 1595700 2838542 2169153 2594777 2202473 1169130 1483782 2053742
1762 2053742 1958527 1962249 1589495 2346208 2262733 1058011 1163844 431326 -213378 17140
1752 17140 880051 570516 1626357 1543435 1728199 1844400 1766181 1463945 1675405 1694954
1742 1694954 1446620 1372782 1792545 1848291 1190719 1874028 2974064 2039642 2202309 1322790
$$ packed form
1809A422851q7446k17250m96143O3852J954803n75162P2837M44626j056335J89652
1799A716285M30008l86433J420916l06034j270922M21674J41423N15542l82711
1790B299748n91833M21507n11480M52515J89309o76347J07954L97684j239610
1781H49447k89680J143168Q2773O44533q16316r9348N21864p41642O5658o26221
1771G34236M45536M15928J242842o69389M25624l92304j033343L14652N69960
1762B053742r5215L722l72754P56713q3475j204722J05833p32518o44704K30518
1752A7140Q62911l09535J055841q2922J84764J16201p8219l02236K11460J9549
1742A694954k48334p3838M19763N5746o57572O83309J100036r34422J62667q79519
$$ plain form
1732 1322790 773031 1395751 1090616 1746934 1579605 1364693 1809324 2156079 1733752 1180974
1722 1180974 1472459 1660956 2088463 2342098 2345573 2419339 2124351 1081915 919802 1150325
1712 1150325 2107173 1698400 1360761 259924 419018 1036837 1424115 1817118 1009770
1703 1009770 1354732 1944318 1717350 1896160 1197732 1799262 1803929 445039 108601 -65635
1693 -65635 1029778 1487494 1142193 981024 1253818 1451369 1021309 341663 74045 690602
1683 690602 1200510 1481165 1190162 1145899 1642913 1550643 707557 334371 342826 722632
1673 722632 718934 813719 1394042 1849838 901999 502335 1527282 1669778 1946487 1725422
1663 1725422 907362 1126534 711824 517844 938594 1156353 1692252 1771695 1103305 1640487
$$ packed form
1732A322790n49759O22720l05135O56318j67329k14912M44631L46755m22327n52778
1722A180974K91485J88497M27507K53635L475P3766k94988j042436j62113K30523
1712A150325R56848m08773l37639j100837J59094O17819L87278L93003q07348
1703A009770L44962N89586k26968J78810o98428O01530M667j358890l36438j74236
1693f5635J095413M57716l45301j61169K72794J97551m30060o79646k67618O16557
1683F90602N09908K80655k91003m4263M97014r2270q43086l73186Q455L79806
1673G22632l698R4785N80323M55796r47839l99664J024947J42496K76709k21065
1663A725422q18060K19172m14710j93980M20750K17759N35899P9443o68390N37182
$$ plain form
1653 1640487 1081684 964623 1303538 652157 1447351 1486078 2133870 1941423 956451 676347
1643 676347 928667 637717 126807 155229 696163 1278641 1177839 1314789 1688344 1490649
1633 1490649 1070196 729464 259918 318708 187187 -409400 227281 1637727 914730 546622
1623 546622 679698 1090879 1186203 1075523 1489136 1614836 1078617 1846781 1365779 314102
1613 314102 841241 697642 2287589 1737454 1674222 1939961 1599423 1518613 1440171 1142859
1603 1142859 1850801 1809494 1132662 863540 1043433 1501638 794065 877513 1496289 647598
1593 647598 272229 240360 214876 1627766 1018770 1227135 846304 1108468 481199 173862
1583 173862 89073 625117 1179742 787939 281766 992902 1167072 868631 1152377 545361
$$ packed form
1653A640487n58803j17061L38915o51381P95194L8727O47792j92447r84972k80104
1643F76347K52320k90950n10910K8422N40934N82478j00802J36950L73555j97695
1633A490649m20453l40732m69546N8790j31521n96587O36681J410446p22997l68108
1623E46622J33076M11181R5324j10680M13613J25700n36219P68164m81002j051677
1613C14102N27139j43599J589947n50135o3232K65739l40538q0810p8442k97312
1603A142859P07942m1307o76832k69122J79893M58205p07573Q3448O18776q48691
1593F47598l75369l1869k5484J412890o08996K08365l80831K62164o27269l07337
1583A73862q4789N36044N54625l91803n06173P11136J74170k98441K83746o07016
$$ plain form
1573 545361 -559826 649112 1137048 -15903 295077 1000368 1012413 807573 1513442
1564 1513442 1159349 1443299 1858426 2480170 1613475 1415149 1873169 1686794 1936333 901118
1554 901118 1458342 2056534 1544127 1254193 1008217 715437 1096106 1405097 1330437 483882
1544 483882 -197956 197858 130003 52689 84622 1710643 1138671 1024826 884270 1573045
1534 1573045 1134891 1372327 1342502 995649 1961458 366521 -45043 1529894 1261973
1525 1261973 567607 1615773 1527829 1171032 1846324 1483385 1515604 1264792 2434240 2333154
1515 2333154 1224032 1337639 763801 1142059 372222 529294 1312853 1051365 1869050
1506 1869050 1234268 727122 608894 560937 442906 588030 135196 394689 216956 762517
$$ packed form
1573E45361j105187J208938M87936j152951L10980P05291J2045k04840P05869
1564A513442l54093K83950M15127O21744q66695j98326M58020j86375K49539j035215
1554I01118N57224N98192n12407k89934k45976k92780L80669L08991p4660q46555
1544D83882o81838L95814o7855p7314L1933J626021n71972j13845j40556O88775
1534A573045m38154K37436k9825l46853R65809j594937m11564J574937k67921
1525A261973o94366J048166q7944l56797O75292l62939L2219k50812J169448j01086
1515B333154j109122J13607n73838L78258p69837J57072P83559k61488Q17685
1506A869050o34782n07146j18228m7957j18031J45124m52834K59493j77733N45561
$$ plain form
1496 762517 1117974 1511260 858646 1321941 964141 876721 1637761 1409736 1996483 1641451
1486 1641451 972183 1113168 612062 1838121 1801446 1216863 1285067 669473 825607 697464
1476 697464 638401 1503560 1214905 722280 1070961 1396082 1446404 861432 1834518 1278648
1466 1278648 827851 1833938 1388830 619443 679995 459256 638181 767176 340952 124476
1456 124476 281585 289720 541473 138316 1436389 1668166 948612 555010 115736 1432585
1446 1432585 996274 313917 431091 862174 1025691 163786 740275 612840 1210414 608954
1436 608954 738453 -17834 916389 614574 271166 812640 1483185 1736607 172053 575603
1426 575603 1895696 1745831 2152203 966965 1615816 1246975 562919 884656 1353906
$$ packed form
1496G62517L55457L93286o52614M63295l57800q7420P61040k28025N86747l55032
1486A641451o69268J40985n01106J226059l6675n84583O8204o15594J56134j28143
1476F97464n9063Q65159k88655m92625L48681L25121N0322n84972R73086n55870
1466A278648m50797J006087m45108p69387O0552k20739J78925J28995m26224k16476
1456A24476J57109Q135K51753m03157J298073K31777p19554l93602m39274J316849
1446A432585m36311o82357J17174M31083J63517q61905N76489j27435N97574o01460
1436F08954J29499p56287R34223l01815l43408N41474O70545K53422j564554M03550
1426E75603J320093j49865M06372j185238O48851l68841o84056L21737M69250
$$ plain form
1417 1353906 1015651 1917559 1279338 481666 1149846 854968 315185 350342 1589644 498399
1407 498399 967102 1688656 915142 523663 1138463 668527 713629 632768 520991 771730
1397 771730 752371 989227 958235 1741414 1045653 995753 1325315 909673 1665999 707211
1387 707211 -65249 222390 776108 1351248 1656929 1423360 666661 -77989 543086 923382
1377 923382 -238631 625103 -5172 18950 1048942 978981 918534 631537 258254 288809
1367 288809 597628 779403 703420 327887 441663 -251388 667851 1768703 1594713 572357
1357 572357 89052 -1165408 -380317 -721255 -67883 15371 -1062198 336646 666577
1348 666577 -59965 381192 -131484 28061 555658 415128 1356492 1436066 2646269 725837
$$ packed form
1417A353906l38255R01908o38221p97672O68180k94878n39783L5157J239302j091245
1407D98399M68703P21554p73514l91479O14800m69936M5102q0861j11777K50739
1397G71730j9359K36856l0992P83179o95761m9900L29562m15642P56326r58788
1387G07211p72460K87639N53718N75140L05681k33569p56699p44650O21075L80296
1377I23382j162013Q63734o30275K4122J029992o9961o0447k86997l73283L0555
1367B88809L08819J81775p5983l75533J13776o93051R19239J100852j73990j022356
1357E72357m83305j254460P85091l40938O53372Q3254j077569J398844L29931
1348F66577p26542M41157n12676J59545N27597j40530R41364P9574J210203j920432
$$ plain form
1338 725837 213230 775976 597878 432492 -433398 -272601 444925 1239919 872992 1469450
1328 1469450 1026498 653986 84401 -259847 602183 1333546 743660 513952 434877 536808
1318 536808 522969 147890 186653 93565 1632133 1155987 1679006 2311771 693299 1114162
1308 1114162 608458 395907 -369885 1172843 665377 996064 1083286 -240581 -455810
1299 -455810 -330776 820235 219049 -82626 353406 765900 992230 810328 982791 412942
1289 412942 -67713 1095197 399498 306093 -542487 923304 1014296 783909 1607859 -296631
1279 -296631 -377459 991896 731704 496918 833998 747267 1094288 754590 1232610 1211264
1269 1211264 153425 1117670 1315142 852961 869334 1619707 1405401 589931 657925 1435459
$$ packed form
1338G25837n12607N62746j78098j65386q65890J60797P17526P94994l66927N96458
1328A469450m42952l72512n69585l44248Q62030P31363n89886k29708p9075J01931
1318E36808j3839l75079L8763r3088J538568m76146N23019O32765j618472M20863
1308A114162n05704k12551p65792J542728n07466L30687Q7222j323867k15229
1299d55810J25034J151011o01186l01675M36032M12494K26330j81902J72463n69849
1289D12942m80655J162910o95699r3405q48580J465791R0992k30387Q23950j904490
1279b96631q0828J369355k60192k34786L37080q6731L47021l39698M78020k1346
1269A211264j057839R64245J97472m62181J6373P50373k14306q15470O7994P77534
$$ plain form
1259 1435459 728918 -120850 534595 477837 -176159 1047372 1236102 631185 1667523
1250 1667523 409277 -1029496 -317130 -215148 58837 940307 736990 649553 844889
1241 844889 1800318 1307556 929752 328039 -221827 -526366 -1444230 489230 1651114
1232 1651114 928580 387135 79481 893489 714644 -571976 -170122 211076 575844
1223 575844 1763958 1984989 238456 39443 216130 1013632 985811 164542 670372 409886
1213 409886 188772 -256315 266809 -498020 558993 242303 720964 180749 -57676 366469
1203 366469 910435 578864 864531 546912 157682 583959 158467 453971 284503 629881
1193 629881 764382 415658 71238 208412 787708 227515 1421 190819 484906 1651992
$$ packed form
1259A435459p06541q49768O55445n6758o53996J223531J88730o04917J036338
1250A667523j258246j438773P12366J01982K73985Q81470k03317q7437J95336
1241H44889R55429m92762l77804o01713n49866l04539r17864J933460J161884
1232A651114p22534n41445l07654Q14008j78845j286620M01854L81198L64768
1223E75844J188114K21031j746533j99013J76687P97502k7821q21269N05830k60486
1213D09886k21114m45087N23124p64829J057013l16690M78661n40215k38425M24145
1203C66469N43966l31571K85667l17619l89230M26277m25492K95504j69468L45378
1193F29881J34501l48724l44420J37174N79296n60193k26094J89398K94087J167086
$$ plain form
1183 1651992 539774 -480230 874111 553987 649523 1794614 824395 1679495 1132691
1174 1132691 571681 -221575 865968 908121 255373 -89811 559385 343746 123255 664776
1164 664776 -89388 -151866 307500 95577 -282204 420933 560685 288579 -337247 438145
1154 438145 793886 1816824 1640649 714651 699341 -270254 -1045965 -835143 -425828 487771
1144 487771 1106964 841100 476501 221039 243755 586312 678209 35159 807526 1064154
1134 1064154 774445 429969 97869 180135 584283 68329 284599 244176 -374772 -366763
1124 -366763 59284 153381 -263970 447001 -689394 -1498629 -801423 -5963 670522 619274
1114 619274 1241254 1372019 1332782 655280 67947 66079 1123353 -616576 -535805 327799
$$ packed form
1183A651992j112218j020004J354341l20124R5536J145091r70219Q55100n46804
1174A132691n61010p93256J087543M2153o52748l45184O49196k15639k20491N41521
1164F64776p54164o2478M59366k11923l77781P03137J39752k72106o25826P75392
1154D38145L55741J022938j76175r25998j5310r69595p75711K10822M09315R13599
1144D87771O19193k65864l64599k55462K2716L42557R1897o43050P72367K56628
1134A064154k89709l44476l32100Q2266M04148n15954K16270m0423o18948Q009
1124c66763M26047R4097m17351P10971j136395q09235O97206P95460O76485n1248
1114F19274O21980J30765l9237o77502n87333j868J057274j739929Q0771Q63604
$$ plain form
1104 327799 -29912 123424 474904 -504320 -450247 -77777 805864 125934 -638145 134078
1094 134078 902287 1541750 345587 623631 -186074 -165780 429904 384431 -1134092 -1126121
1084 -1126121 -964077 -306740 -33057 -573828 -142287 144632 -158381 -365288 494435 -171307
1074 -171307 406786 205644 -442156 -963801 216452 1503669 1716667 1487365 -269115
1065 -269115 -146981 -366614 -85720 29355 -432022 -237820 5071 -388649 -502432 -732893
1055 -732893 43146 396796 380460 -244988 930828 1222495 246543 333704 707958 2036062
1045 2036062 1218719 936754 530183 -43083 562236 -213746 -488210 -741558 170821 41007
1035 41007 91964 1001136 1239226 285060 -608951 -23433 -240357 -183888 -57734 778234
$$ packed form
1104C27799l57711J53336L51480r79224N4073L72470Q83641o79930p64079P72223
1094A34078P68209O39463j196163K78044q09705K0294N95684m5473j518523P971
1084a126121J62044O57337K73683n40771M31541K86919l03013k06907Q59723o65742
1074a71307N78093k01142o47800n21645J180253J287217K12998k29302j756480
1065b69115J22134k19633K80894J15075m61377J94202K42891l93720j13783k30461
1055g32893P76039L53650j6336o25448J175816K91667r75952Q7161L74254J328104
1045B036062q17343k81965m06571n73266O05319p75982k74464k53348R12379j29814
1035D1007N0957R09172K38090r54166q94011N85518k16924N6469J26154Q35968
$$ plain form
1025 778234 -792909 -779757 -666352 -520004 -75745 -49542 110353 449329 -175030 -720563
1015 -720563 -328023 -15999 -53456 -1032817 -365994 -136407 98221 -82135 189415 1010636
1005 1010636 935385 778226 1629624 1268246 -253701 -173134 -84057 -1059787 -257644 -31421
995 -31421 630085 -449848 -242833 -42654 -224669 202149 22698 54728 -510583 -241711
985 -241711 158520 468094 64072 -229975 -5513 787005 -188993 249031 -140114 -1083888
975 -1083888 -69201 -393804 -51363 59834 128778 -547441 -806230 -556321 383246 987989
965 987989 403156 -222578 -87204 -46449 39108 -965217 -293404 -496111 110581 228224
955 228224 -65754 789132 137218 151468 -297998 -429962 -94292 -39101 -84539 -132498 -251272
$$ packed form
1025G78234j571143J3152J13405J46348M44259K6203J59895L38976o24359n45533
1015g20563L92540L12024l7457r79361O66823K29587K34628j80356K71550Q21221
1005A010636p5251j57159Q51398l61378j521947Q0567Q9077r75730Q02143K26223
995c1421O61506j079933K07015K00179j82015M26818j79451L2030n65311K68872
985b41711M00231L09574m04022k94047K24462P92518r75998M38024l89145r43774
975a083888J014687l24603L42441J11197O8944o76219k58789K49909R39567O04743
965I87989n84833o25734J35374M0755Q5557j004325O71813k02707O06692J17643
955B28224k93978Q54886o51914J4250m49466j31964L35670N5191m5438m7959j18774
$$ plain form
944 -251272 -445224 -22525 748876 1114283 -303092 -221656 362723 -824836 -565455 161113
934 161113 -1188976 -1655736 -1236909 -108786 12499 -187062 842308 628468 33263
925 33263 -418620 422059 86111 309978 1000569 551041 122165 755570 664749 675896
915 675896 537617 1152777 303419 -133599 -205147 73522 192563 366599 -83764 598180
905 598180 148026 -506424 156095 242739 139746 -405951 -558217 -461470 -156344 1665753
895 1665753 135573 458036 -37239 -446853 635162 50516 -54493 -493285 -1336773
886 -1336773 -628673 466512 296164 -525 -1223046 -1221823 -911068 -318309 -250857 -909427
876 -909427 -492800 -168507 -785697 77189 332600 -407345 59590 830291 878224 99007
$$ packed form
944b51272j93952M22699P71401L65407j417375Q1436N84379j187559K59381P26568
934A61113j350089m66760M18827J128123J21285j99561J029370k13840n95205
925C3263m51883Q40679l35948K23867O90591m49528m28876O33405r0821J1147
915F75896j38279O15160q49358m37018p1548K78669J19041J74036m50363O81944
905E98180m50154o54450O62519Q6644j02993n45697j52266R6747L05126J822097
895A665753j530180L22463m95275m09614J082015n84646j05009m38792q43488
886a336773P08100J095185j70348k96689j222521J223L10755N92759O7452o58570
876i09427M16627L24293o17190Q62886K55411p39945M66935P70701M7933p79217
$$ plain form
866 99007 28919 41911 -582299 -244261 -689253 -977559 -396991 135607 -176686 -336758
856 -336758 -390775 -241704 32220 -1698504 -1950178 -355456 5842 1468745 1086282 173287
846 173287 -647369 -159382 204449 244300 258467 631465 74058 -369153 -48446 404176
836 404176 -645835 -430043 -631335 -535062 602869 388698 -590075 -409147 -64703 -671461
826 -671461 162857 512305 936707 119856 112550 -854839 -583551 -166901 165240 298158
816 298158 -182765 529753 993430 314081 -29810 -278927 -660924 -932422 -269765 -517187
806 -517187 -168997 -1162024 243584 131796 584265 1004550 235443 -124742 955444 647884
796 647884 -121892 1863 540924 -159101 -1334264 -187729 449118 1046600 13625
$$ packed form
866I9007p0088J2992o24210L38038m44992k88306N80568N32598l12293j60072
856c36758n4017J49071K73924j730724k51674J594722L61298J462903l82463r12995
846A73287q20656M87987L63831L9851J4167L72998n57407m43211L20707M52622
836D04176j050011K15792k01292R6273J137931k14171r78773J80928L44444o06758
826f71461Q34318L49448M24402q16851p306r67389K71288M16650L32141J32918
816B98158m80923P12518M63677o79349l43891k49117l81997k71498O62657k47422
806e17187L48190r93027J405608j11788M52469M20285p69107l60185J080186l07560
796F47884p69776J23755N39061p00025j175163J146535O36847N97482j032975
$$ plain form
787 13625 -817784 -555578 -42266 -198282 229591 -66948 978153 1194558 859098 258178
777 258178 -301361 -364745 -35822 -1055042 -629704 335244 -62152 -834669 22045 471690
767 471690 219651 -397705 -530000 -350404 -763193 -1374765 -1020910 -179997 196197 185325
757 185325 -311565 -548657 -811881 -714922 -180132 -15941 85563 -25003 -87665 190929
747 190929 683007 -464595 -651288 -43451 562183 931865 278852 -144454 -417236 -16245
737 -16245 -634262 -392835 -242081 -1109330 -694122 -859189 -1154648 -792359 32615 -337129
727 -337129 186258 -1130768 -580442 -300962 -123837 -513781 -1211048 -310242 722207 -324339
717 -324339 -933269 323665 34633 -621974 -550543 -1137479 -1076990 -1283204 -1216469 -168804
$$ packed form
787A3625q31409K62206N13312j56016M27873k96539J045101K16405l35460o00920
777B58178n59539o3384L28923j019220M25338R64948l97396p72517Q56714M49645
767D71690k52039o17356j32295J79596m12789o11572L53855Q40913L76194j0872
757A85325m96890k37092k63224R6959N34790J64191J01504j10566o2662K78594
747A90929M92078j147602j86693O07837O05634L69682o53013m23306k72782M00991
737a6245o18017K41427J50754q67249M15208j65067k95459L62289Q24974l69744
727c37129N23387j317026N50326K79480J77125l89944o97267R00806J032449j046546
717c24339o08930J256934k89032o56607P1431n86936O0489k06214O6735J047665
$$ plain form
707 -168804 -338827 -135024 673825 -25640 -750511 -395653 350733 -36002 -697266 -538775
697 -538775 -820850 785245 1084499 67283 -624214 -945514 258630 347990 -361975 125246
687 125246 -479786 1141101 969708 -20532 127877 273298 -24474 -1006037 -854654 -589133
677 -589133 -1353221 -938141 -237349 978444 198088 -1224063 -1720511 -709339 -632426 -745776
667 -745776 -340148 -1289332 -913340 -863526 -801974 -110691 255506 -142410 -862629 -614274
657 -614274 -326197 -641915 -464570 532925 -692457 -767770 -757216 -737789 -397167 -434883
647 -434883 30449 -78368 235857 -108963 787675 1049545 208092 -435153 -10962 -348041
637 -348041 -523262 -790466 -1145560 -1516421 -2447803 -1169335 -202011 -411427 -795501 -922989
$$ packed form
707a68804j70023K03803Q08849o99465p24871L54858P46386l86735o61264J58491
697e38775k82075J606095K99254j017216o91497l21300J204144Q9360p09965M87221
687A25246o05032J620887j71393r90240J48409J45421k97772r81563J51383K65521
677e89133p64088M15080P00792J215793p80356j422151m96448J011172P6913j13350
667g45776M05628r49184L75992M9814O1552O91283L66197l97916p20219K48355
657f14274K88077l15718J77345R97495j225382p5313J0554J9427L40622l7716
647d34883M65332j08817L14225l44820Q96638K61870q41453o43245M24191l37079
637c48041j75221k67204l55094l70861r31382J278468R67324k09416l84074j27488
$$ plain form
627 -922989 -73224 -283500 -608892 -46399 -981382 -747748 -23408 1183347 629393 707318
617 707318 471648 350195 -398257 -699291 -139940 -391050 -1091594 -1313951 -746999 -686730
607 -686730 -1217118 -1239194 -1305566 -852608 19947 79868 -565221 377931 -521533 -815887
597 -815887 -691112 -660802 -959950 -458088 117996 166851 -761161 -901903 -519197 255096
587 255096 305474 -251915 451878 -116495 -338132 -367167 577314 886058 1238535 608620
577 608620 -565828 -302559 -1036792 -1389921 -921031 -195871 229966 -130181 -1154975 -1602195
567 -1602195 -900876 -1230577 -272253 -520732 -481085 -949262 -772543 -271299 -385811 -229383
557 -229383 339213 -390171 -706272 -1421992 200471 -122207 -531310 -112468 -691475 -687798
$$ packed form
627i22989Q49765k10276l25392N62493r34983K33634P24340J206755n53954P7925
617G07318k35670j21453p48452l01034N59351k51110p00544k22357N66952O0269
607f86730n30388k2076o6372M52958Q72555N9921o45089R43152q99464k94354
597h15887J24775L0310k99148N01862N76084M8855r28012j40742L82706P74293
587B55096N0378n57389P03793n68373k21637k9035R44481L08744L52477o29915
577F08620j174448K63269p34233l53129M68890P25160M25837l60147j024794m47220
567a602195P01319l29701R58324k48479L9647m68177J76719N01244j14512J56428
557b29383N68596p29384l16101p15720J622463l22678m09103M18842n79007L677
$$ plain form
547 -687798 257820 267512 194440 -473918 -1447397 -1802686 -1805145 -1007193 -1496290 -2612437 -1129388
536 -1129388 -564424 -310447 -325898 -209483 -336833 25450 -142921 -394366 -1067609 -1090013
526 -1090013 183664 179322 -308946 -1432610 -1015724 -903483 -1054750 -165755 -178357 -154417
516 -154417 -653482 -581310 -933586 -922969 -881537 -815971 -461021 -834722 -237098 -1120100 -1678867
505 -1678867 -892341 -553897 -1321860 -399239 113415 -128123 -252681 -662952 -1035028 -697209
495 -697209 -476631 -1145771 -890341 -637827 102809 -520167 -227287 -935718 -1757044 -1195094
485 -1195094 -2221167 -1223662 -684768 -1572220 -1187546 -573526 -1317975 -1716321 -1325505 -1566890
475 -1566890 -138414 67630 -573306 -571199 -1671042 -1298448 -72832 -354151 -224036 -80802
$$ packed form
547f87798R45618R692p3072o68358r73479l55289k459P97952m89097j116147J483049
536a129388N64964K53977j5451J16415j27350L62283j68371k51445o73243k2404
526a090013J273677m342m88268j123664M16886J12241j51267Q88995j2602K3940
516a54417m99065P2172l52276J0617M1432O5566L54950l73701N97624q83002n58767
505a678867P86526L38444p67963R22621N12654k41538j24558m10271l72076L37819
495f97209K20578o69140K55430K52514P40636o22976K92880p08431q21326N61950
485a195094j026073R97505N38894q87452L84674O14020p44449l98346L90816k41385
475a566890J428476K06044o40936K107j099843L72594J225616k81319J30115J43234
$$ plain form
465 -80802 -1125263 -1181582 -1775882 -700268 -468976 -82939 -620948 -1100361 -332681 -723682
455 -723682 -487579 -209142 -1234117 -890415 -891773 -403010 -551288 -491982 79389 -163249
445 -163249 -329332 416316 623920 -429561 -400865 -317690 -754262 -548432 -567216 30855
435 30855 985313 230956 -1634248 -1805678 -913813 -659677 -1257074 -529375 -1323703 -590083
425 -590083 -126034 -909396 -799073 -1466220 -519260 -10588 843803 52091 -813208 -668241
415 -668241 -567398 -898409 -361001 1225853 1068712 -261807 120473 -135296 -652037 -585408
405 -585408 -247593 732992 -145443 266894 -16026 -42052 -164824 -689907 -905319 -307774
395 -307774 -259826 -1441402 -937628 -673879 -931409 1025637 679293 72393 -910246 -843186
$$ packed form
465h0802j044461n6319n94300J075614K31292L86037n38009m79413P67680l91001
455g23682K36103K78437j024975L43702j358M88763j48278N9306N71371k42638
445a63249j66083P45648K07604j053481K8696Q3175m36572K05830j8784N98071
435C0855R54458p54357j865204j71430Q91865K54136n97397P27699p94328P33620
425e90083M64049p83362J10323o67147R46960N08672Q54391p91712q65299J44967
415f68241J00843l31011N37408J586854j57141j330519L82280k55769n16741O6629
405e85408L37815R80585q78435M12337k82920k6026j22772n25083k15412N97545
395c07774M7948j181576N03774K63749k57530J957046l46344o06900r82639O7060
$$ plain form
385 -843186 -655936 -74054 -485385 48697 -113596 -457227 312521 -274220 -981931 -389049
375 -389049 775964 158955 485415 -1031944 -1042509 -425589 -29267 389651 -314593 -279466
365 -279466 144802 -294147 -296086 -1151390 -985414 -977444 -182902 332322 -1312577 -1075697
355 -1075697 -247603 -336560 -87123 -640058 -601263 -1399423 -507457 -661337 -600023 537458
345 537458 503483 -97243 -54979 51645 -526166 -542517 885258 418789 -33882 -1478853
335 -1478853 -324503 830633 363225 7511 55889 -94570 -113185 83715 190428 -91493
325 -91493 -188047 527831 -372126 -1542310 -505663 -7674 1276335 91046 -811526 -18789
315 -18789 -639170 -326823 -492232 -20113 -371908 -872029 -1116994 -768387 -856926 -698351
$$ packed form
385h43186J87250N81882m11331N34082j62293l43631P69748n86741p07711N92882
375c89049J165013o17009L26460j517359j0565O16920L96322M18918p04244L5127
365b79466M24268m38949j939q55304J65976P970P94542N15224j644899K36880
355a075697Q28094q8957K49437n52935L8795p98160Q91966j53880O1314J137481
345E37458l3975o00726M2264J06624n77811j6351J427775m66469m52671j444971
335a478853J154350J155136m67408l55714M8378j50459j8615J96900J06713k81921
325i1493r6554P15878q99957j170184J036647M97989J284009j185289r02572P92737
315a8789o20381L12347j65409M72119l51795n00121k44965L48607q8539J58575
$$ plain form
305 -698351 -89580 -534489 -706504 -128277 -73457 -1173686 -1032954 -548730 -634910 3580
295 3580 1113158 202231 -1208820 -527733 -1121796 -406887 -73639 -422796 -1298478 -836144
285 -836144 467107 455151 -902327 -340572 -647849 -1175963 -1070828 -1300699 -923192 -379617
275 -379617 154161 -201504 -826332 -659498 -725346 -634977 -1099244 -538077 -1596672 -1056531
265 -1056531 -432032 -958270 -709780 538750 469450 -889418 -588497 -553631 -1501550 -415
255 -415 -364447 -331299 440170 -687307 -410604 -1076579 -296360 -159633 275571 145406
245 145406 -55552 -1027023 -1073464 -736829 -1881935 -2024647 -628199 -445426 -1194920 -1993206
235 -1993206 -965228 293917 -7338 205931 -313288 -545426 -1056809 210754 339753
$$ packed form
305f98351O08771m44909j72015N78227N4820j100229J40732M84224q6180O38490
295C580J109578r10927j411051O81087n94063P14909L33248l49157q75682M62334
285h36144J303251j1956j357478N61755l07277n28114J05135k29871L77507N43575
275c79617N33778l55665o24828J66834o5848R0369m64267N61167j058595N40141
265a056531O24499n26238K48490J248530o9300j358868L00921L4866r47919J501135
255d15l64032L3148P71469j127477K76703o65975P80219J36727M35204j30165
245A45406k00958r71471m6441L36635j145106j42712J396448J82773p49494p98286
235a993206J027978J259145l01255K13269n19219k32138n11383J267563J28999
$$ plain form
226 339753 511037 -364108 469702 -174864 -853209 -1253598 -1354359 -706090 -791417 -397004
216 -397004 -1770334 -1763189 -1060493 -62453 279343 429235 98784 -151359 -161677 -311451
206 -311451 -466006 -523896 -1093897 -629188 -254012 373290 -627064 -650522 -1060381 -31759
196 -31759 554209 -122661 168267 -343111 -668500 -367594 -599992 -428925 -600432 -592229
186 -592229 -443533 -1065552 -691679 -311762 -978504 -947779 -669599 -79897 -887788 -1511538
176 -1511538 -1031456 -1000803 -762165 -14649 -303551 -564634 -100315 -969483 79369 437000
166 437000 406180 -341109 447753 -79906 -151678 -694043 -1789822 -1488881 -913552 -839666
156 -839666 -340051 -167701 -840661 -323370 -905769 -567845 -1166665 -1144149 -822734 -952808
$$ packed form
226C39753J71284q75145Q33810o44566o78345m00389j00761O48269q5327L94413
216c97004j373330P145P02696R98040L41796J49892l30451k50143j0318j49774
206c11451j54555n7890n70001M64709L75176O27302j000354k3458m09859J028622
196c1759N85968o76870K90928n11378l25389L00906k32398J71067j71507Q203
186e92229J48696o22019L73873L79917o66742L0725K78180N89702q07891o23750
176a511538M80082L0653K38638P47516k88902k61083M64319q69168J048852L57631
166D37000l0820p47289P88862n27659p1772n42365j095779L00941N75329P3886
156h39666M99615J72350o72960N17291n82399L37924n98820K2516L21415j30074
$$ plain form
146 -952808 -669568 -419214 -1268300 -1606373 -408516 -894992 -557390 87883 -870896 -5262
136 -5262 -510136 60086 -94296 -447710 -800106 -609591 -392890 -421174 -506442 -1163134 -1526102
125 -1526102 -1429042 -1422398 -1192589 -214413 -478807 -456065 -491602 -607619 16234 -505165 -702914
114 -702914 -1317079 -810274 -719053 -948550 -1232670 -1609470 -1568683 -763553 -172023 -1866067
104 -1866067 -1631925 -1842261 -921661 -80009 324438 -706226 -862716 -549299 -441094 -270219
94 -270219 -678992 -908970 -1251599 -1343931 -1019521 -1170331 -529015 -547223 -854681 -877660 -581375
83 -581375 -777867 -1084069 -1084174 -785998 -923407 -335280 72831 -1250877 -1042551 -1143653
73 -1143653 -1192040 175640 159831 -97290 -671784 -1205961 -210705 -149105 -364675 -860890
$$ packed form
146i52808K83240K50354q49086l38073J197857m86476L37602O45273r58779Q65634
136e262n04874N70222j54382l53414l52396J90515K16701k8284q5268o56692l62968
125a526102R7060O644K29809R78176k64394K2742l5537j16017O23853n21399j97749
114g02914o14165N06805R1221k29497k84120l76800M0787Q05130N91530j694044
104a866067K34142k10336R20600Q41652M04447j030664j56490L13417J08205J70875
94b70219m08773k29978l42629r2332L24410j50810O41316j8208l07458k2979K96285
83e81375j96492l06202j05K98176j37409N88127M08111j323708K08326j01102
73a143653m8387J367680j5809k57121n74494n34177R95256O1600k15570m96215
$$ plain form
63 -860890 -1225146 -654409 -1148194 -1972418 -1724482 -487233 -564022 -1029789 -673670 -777362
53 -777362 -760561 -599736 -811241 -273732 -462828 -516094 -368133 -689186 -600654 -774204 -455844
42 -455844 -245726 -944913 -524850 -701277 -1229302 -922488 -458264 -784389 -756221 -770501
32 -770501 56490 -540357 -1652507 -1071242 -1272162 -1050984 -878430 -790071 -170122 350845
22 350845 -683027 -549579 -1166388 -1005637 -149939 -495739 -952552 -1018970 -1553209 -1396522
12 -1396522 -854417 -1045171 -1637705 -1249940 -1067879 -1195013 -1073365 -1326658 -978571 -157354
2 -157354 -698871 -436348
0 -436348
$$ packed form
63h60890l64256N70737m93785q24224K47936J237249p6789m65767L56119j03692
53g77362J6801J60825k11505N37509j89096n3266J47961l21053Q8532j73550L18360
42d55844K10118o99187M20063j76427n28025L06814M64224l26125K8168j4280
32g70501Q26991n96847j112150N81265k00920K21178J72554Q8359O19949N20967
22C50845j033872J33448o16809J60751Q55698l45800m56813o6418n34239J56687
12a396522N42105j90754n92534L87765J82061j27134J21648k53293L48087Q21217
2a57354n41517K62523
0d36348
$$ Imaginary data points
##PAGE= N=2
##DATA TABLE= (X++(I..I)), XYDATA
$$ plain form
16383 -5714338 -5481331 -5687385 -4319398 -4999704 -5073954 -5127012 -5189883 -4869280 -4552425 -4481118
16373 -4481118 -4417789 -4696056 -4291732 -3931595 -4028122 -3780287 -3911600 -4476200 -4626385 -4169438
16363 -4169438 -4119642 -4295415 -4415994 -3826169 -3624362 -3939833 -3839493 -3242832 -3370226 -3565666
16353 -3565666 -2812164 -2250664 -3443817 -3643906 -3723184 -3065825 -2820396 -3158767 -3106133 -2972013
16343 -2972013 -3113159 -3390939 -3116368 -3223997 -2107955 -1779108 -1693645 -1783969 -2910099
16334 -2910099 -3519924 -2791965 -2135265 -1985913 -1879226 -888723 -1392321 -1994137 -1840804
16325 -1840804 -1595269 -1504243 -1553654 -1790085 -1620299 -1417638 -1891992 -1793666 -1292006 -914349
16315 -914349 -512099 -997425 -1595385 -700730 -885538 -1064006 -850447 -1173301 -228738 -699615
$$ packed form
16383e714338K33007k06054J367987o80306p4250n3058o2871L20603L16855P1307
16373d481118O3329k78267M04324L60137r6527K47835j31313n64600j50185M56947
16363d169438M9796j75773j20579N89825K01807l15471J00340N96661j27394j95440
16353c565666P53502N61500j193153k00089p9278O57359K45429l38371N2634J34120
16343b972013j41146k77780K74571j07629J116042L28847Q5463r0324j126130
16334b910099o09825P27959O56700J49352J06687R90503n03598o01816J53333
16325a840804K45535R1026m9411k36431J69786K02661m74354R8326N01660L77657
16315i14349M02250m85326n97960Q94655j84808j78468K13559l22854R44563m70877
$$ plain form
16305 -699615 -1594388 -1599700 -1142593 -284674 -929100 -923859 -1163700 -565592 -35128 160889
16295 160889 -547397 -188827 161411 102115 -468925 -1238133 -719967 -27491 -208721 -179751
16285 -179751 -386918 753822 1087052 771305 275713 -421557 -296052 283595 1113437
$$ packed form
16305f99615q94773n312M57107Q57919o44426N241k39841N98108N30464J96017
16295A60889p08286L58570L50238n9296n71040p69208N18166O92476j81230K8970
16285a79751k07167J140740L33230l15747m95592o97270J25505N79647Q29842
$$ [...]
##END NTUPLES=NMR SPECTRUM
##END=
