##TITLE=1H_CG-1207-X42
 CDCl3
 8 sc, 
 13.8.2024
##JCAMPDX= 6.0         $$ Bruker NMR JCAMP-DX V2.0
##DATA TYPE= NMR SPECTRUM
##DATA CLASS= NTUPLES
##ORIGIN= UXNMR, Bruker Analytische Messtechnik GmbH
##OWNER= root
$$ XWIN-NMR		Version 3.5
$$ Tue Aug 13 14:18:28 2024 Russian Standard Time (UT+4h)  she@DPX200
##.OBSERVE FREQUENCY= 200.1313
##.OBSERVE NUCLEUS= ^1H
##.ACQUISITION MODE= SIMULTANEOUS
##.ACQUISITION SCHEME= undefined
##.AVERAGES= 8
##.DIGITISER RES= 18
##SPECTROMETER/DATA SYSTEM= spect
##.PULSE SEQUENCE= zg30
##.SOLVENT NAME= DMSO
##.SHIFT REFERENCE= (INTERNAL, DMSO, 0, 21.1898)
##AUDIT TRAIL= $$ (NUMBER, WHEN, WHO, WHERE, WHAT)
$$ ##TITLE= Audit trail, XWIN-NMR		Version 3.5
$$ ##JCAMPDX= 5.01
$$ ##ORIGIN= Bruker BioSpin GmbH
$$ ##OWNER= she
$$ F:/spectra/data/she/nmr/H-F/1/pdata/1/auditp.txt
$$ ##AUDIT TRAIL=  $$ (NUMBER, WHEN, WHO, WHERE, WHAT)
(   1,<2024-08-13 14:17:12.40 +0400>,<she>,<DPX200>,
      <created by zg, POWCHK disabled, PULCHK disabled
       configuration hash MD5:
       00 E9 B6 7A A2 85 ED C7 34 08 36 98 17 FE 4E 26
       data hash MD5: 16K
       95 9A 52 55 E7 29 06 B3 A4 7A 3D F3 F5 89 7E D2>)
(   2,<2024-08-13 14:17:15.54 +0400>,<she>,<DPX200>,
      <Start of raw data processing
       efp BC_mod = 2 LB = 0.24 FT_mod = 6 PKNL = 1 PHC0 = -26008.95 PHC1 = 29.78749 SI = 16K 
       data hash MD5: 16K
       FA BA E3 43 41 3A 64 20 F3 71 58 89 93 4F 51 38>)
(   3,<2024-08-13 14:17:38.29 +0400>,<she>,<DPX200>,
      <pk PHC0 = 18.06035 PHC1 = -23.80001 
       data hash MD5: 16K
       4D CC E1 FE 23 0F 45 C3 07 CD C7 F7 57 55 96 E9>)
(   4,<2024-08-13 14:17:42.07 +0400>,<she>,<DPX200>,
      <abs ABSG = 5 
       data hash MD5: 16K
       45 B7 3D 5D CC 1E 27 67 BF 0B CA 03 83 44 1D 00>)
(   5,<2024-08-13 14:18:03.26 +0400>,<she>,<DPX200>,
      <abs ABSG = 5 
       data hash MD5: 16K
       47 BE 38 28 F0 2F 1D 29 25 C1 A3 6A E7 BE D7 80>)
$$ ##END=
$$ 
$$ hash MD5
$$ 4A D6 7F AD 8E 2F 35 32 D7 0D D4 87 D6 4F BB 8D
##$RELAX= 
##$RELAX= 
##$RELAX= 
##$RELAX= 
##$RELAX= 
##$RELAX= 
$$ Bruker specific parameters
$$ --------------------------
##$DU= <F:/spectra>
##$EXPNO= 1
##$NAME= <H-F>
##$PROCNO= 1
##$TYPE= <nmr>
##$USER= <she>
##$AMP= (0..31)
100 100 100 100 100 100 100 100 100 100 100 100 100 100 100 100 100 100 
100 100 100 100 100 100 100 100 100 100 100 100 100 100 
##$AQSEQ= 0
##$AQ_mod= 1
##$AUNM= <au_zg>
##$AUTOPOS= <>
##$BF1= 200.13
##$BF2= 200.13
##$BF3= 200.13
##$BF4= 200.13
##$BF5= 200.13
##$BF6= 200.13
##$BF7= 200.13
##$BF8= 200.13
##$BYTORDA= 1
##$CFDGTYP= 0
##$CFRGTYP= 5
##$CHEMSTR= <none>
##$CNST= (0..31)
1 1 145 1 1 1 1 1 1 1 1 1 1 1 1 1 1 1 1 1 1 1 1 1 1 1 1 1 1 1 1 1 
##$CPDPRG= <>
##$CPDPRG1= <>
##$CPDPRG2= <>
##$CPDPRG3= <>
##$CPDPRG4= <mlev>
##$CPDPRG5= <mlev>
##$CPDPRG6= <mlev>
##$CPDPRG7= <mlev>
##$CPDPRG8= <mlev>
##$CPDPRGB= <>
##$CPDPRGT= <>
##$D= (0..31)
0 1.2 0 0 0 0 0 0 0 0.06 0 0.03 0 0 0 0 0.0002 0 0 0 0 0 0 0 0 0 0 0 0 
0 0 0 
##$DATE= 1723544232
##$DBL= (0..7)
$$ [...]
##$SUBNAM3= <"">
##$SUBNAM4= <"">
##$SUBNAM5= <"">
##$SUBNAM6= <"">
##$SUBNAM7= <"">
##$SUBNAM8= <"">
##$SUBNAM9= <"">
##$SW= 24.0689771365484
##$SWIBOX= (0..15)
0 0 2 0 0 0 0 0 0 0 0 0 0 0 0 0 
##$SW_h= 4816.95568400771
##$TD= 16384
##$TD0= 1
##$TE= 0
##$TE2= 300
##$TE3= 300
##$TEG= 300
##$TL= (0..7)
0 120 120 120 120 120 120 120 
##$TP= (0..7)
150 150 150 150 150 150 150 150 
##$TP07= 0
##$TPNAME0= <>
##$TPNAME1= <>
##$TPNAME2= <>
##$TPNAME3= <>
##$TPNAME4= <>
##$TPNAME5= <>
##$TPNAME6= <>
##$TPNAME7= <>
##$TPOAL= (0..7)
0.5 0.5 0.5 0.5 0.5 0.5 0.5 0.5 
##$TPOFFS= (0..7)
0 0 0 0 0 0 0 0 
##$TUNHIN= 0
##$TUNHOUT= 0
##$TUNXOUT= 0
##$USERA1= <user>
##$USERA2= <user>
##$USERA3= <user>
##$USERA4= <user>
##$USERA5= <user>
##$V9= 5
##$VALIST= <valist>
##$VCLIST= <CCCCCCCCCCCCCCC>
##$VD= 0
##$VDLIST= <DDDDDDDDDDDDDDD>
##$VPLIST= <PPPPPPPPPPPPPPP>
##$VTLIST= <TTTTTTTTTTTTTTT>
##$WBST= 1024
##$WBSW= 4
##$XGAIN= (0..3)
0 0 0 0 
##$XL= 0
##$YL= 0
##$YMAX_a= 89145
##$YMIN_a= -78136
##$ZGOPTNS= <>
##$ZL1= 120
##$ZL2= 120
##$ZL3= 120
##$ZL4= 120
##$ABSF1= 21.18983
##$ABSF2= -2.879366
##$ABSG= 5
##$ABSL= 3
##$ALPHA= 0
##$AQORDER= 0
##$ASSFAC= 0
##$ASSFACI= 0
##$ASSFACX= 0
##$ASSWID= 0
##$AUNMP= <proc_1d>
##$AZFE= 0.1
##$AZFW= 0.1
##$BCFW= 0
##$BC_mod= 2
##$BYTORDP= 0
##$COROFFS= 0
##$CY= -3
##$DATMOD= 1
##$DC= 0
##$DFILT= <>
##$DTYPP= 0
##$F1P= 0
##$F2P= 0
##$FCOR= 1
##$FTSIZE= 16384
##$FT_mod= 6
##$GAMMA= 0
##$GB= 0
##$INTBC= 1
##$INTSCL= 3.70164e-10
##$ISEN= 128
##$LB= 0.24
##$LEV0= 0
##$LPBIN= 0
##$MAXI= 10000
##$MC2= 0
##$MEAN= 0
##$ME_mod= 0
##$MI= 1.114404
##$NCOEF= 0
##$NC_proc= -9
##$NLEV= 6
##$NOISF1= 3.799351
##$NOISF2= 2.8
##$NSP= 0
##$NTH_PI= 0
##$NZP= 0
##$OFFSET= 21.18983
##$PC= 1
##$PHC0= -25990.89
##$PHC1= 5.98748
##$PH_mod= 1
##$PKNL= yes
##$PPARMOD= 0
##$PSCAL= 0
##$PSIGN= 0
##$REVERSE= no
##$SF= 200.129467768109
##$SI= 16384
##$SIGF1= 3
##$SIGF2= 2
##$SINO= 5.538805
##$SIOLD= 16384
##$SREGLST= <1H.CDCl3>
##$SSB= 0
##$STSI= 16384
##$STSR= 0
##$SW_p= 4816.95568400771
##$SYMM= 0
##$S_DEV= 0
##$TDeff= 16384
##$TDoff= 0
##$TI= <>
##$TILT= no
##$TM1= 0
##$TM2= 0
##$TOPLEV= 0
##$USERP1= <user>
##$USERP2= <user>
##$USERP3= <user>
##$USERP4= <user>
##$USERP5= <user>
##$WDW= 1
##$XDIM= 16384
##$YMAX_p= 400300234
##$YMIN_p= -8526688
$$ End of Bruker specific parameters
$$ ---------------------------------
##NTUPLES= NMR SPECTRUM
##VAR_NAME=  FREQUENCY,     SPECTRUM/REAL,   SPECTRUM/IMAG
##SYMBOL=    X,             R,               I
##VAR_TYPE=  INDEPENDENT,   DEPENDENT,       DEPENDENT
##VAR_FORM=  AFFN,          ASDF,            ASDF
##VAR_DIM=   16384,         16384,           16384
##UNITS=     HZ,            ARBITRARY UNITS, ARBITRARY UNITS
##FACTOR=    0.29402158847633, 1,            1
##FIRST=     4240.70955610356, 0,            0
##LAST=      -576.246127904153, 0,           0
##MIN=       -576.246127904153, -8526688,    0
##MAX=       4240.70955610356, 400300234,    0
$$ Real data points
##PAGE= N=1
##DATA TABLE= (X++(R..R)), XYDATA
$$ [...]
9659F31359L15559j096078R64923j024710j08045o68819K465114J118277k743823
9650a46243J541108n9049j882489n29847J990967J48469Q7998o05387J45463J570657
9640B261647j157916q75817j84173J302385k66800l082127J093669J180746L50484
9631F22098J358542k618902m17442l15775J016567J870158j677575o99870Q48081
9622a4118j37430j760636J927100N25322K08053j602773O97222J483617J006866
9613B333223j421208R43105r83160N10368j737208n07600j041996j8193J697387
9604b25282J18804o00388j009716J358266J035427J56067m98473J378188p60738
9595I52155o25194m31168p54700J389234J707918j549827m47398j777426j707418
$$ y = [631359, 946918, -149160, 815763, -208947, -316992, -985811, 1479303, 2597580, -146243, 1394865, 1335816, -546673, -1076520, 914447, 1062916, 1150914, 545527, 690990, 2261647, 1103731, 227914, 43741, 1346126, 1079326, -2002801, -909132, 271614, 622098, 1980640, -638262, -1055704, -1371479, -354912, 1515246, -162329, -862199, -14118, -151548, -1912184, 14916, 540238, 748291, -854482, -157260, 1326357, 2333223, 912015, 1855120, 871960, 1382328, -354880, -862480, -1904476, -1922669, -225282, -106478, -706866, -1716582, -358316, 677111, 833178, 334705, 1712893, 952155, 326961, -104207, -858907, 530327, 2238245, 688418, 241020, -1536406, -3243824]
9586c243824J767400Q77595j61955J243134J48228j392175m24058K68652N00409
9577d16594n09954j395315j006674K061567M17570O74960J96558R91779l62191
9568F51706o11405J114516N98957k089273k300455r29530J894032J855090k98703
9559a15065p8453r52327M00021J180352q59394p90236J461795r23238n50301J553157
9549C26311J87548j010588l38718J98661R22862j993312L966777m52130j840654
9540c3243M48531o51731q614o94847J835821k51998j845262J652452m05672Q99997
9530I45434o67103k325223K103499P96141Q66386j13282j100420k527106J156663
9521h65011J756254j099066l58900m30599m01770j845560K638601Q31566k069986
$$ y = [-3243824, -1476424, -598829, -760784, 482350, 630578, -761597, -1185655, -917003, -416594, -926548, -2321863, -3328537, -1266970, -849400, -174440, 22118, 1013897, 651706, 40301, 1154817, 1753774, -335499, -2635954, -3565484, -1671452, 183638, -115065, -193518, -1145845, -745824, 434528, -424866, -1215102, 246693, -676545, -1226846, 326311, 513859, -496729, -835447, -636786, 286076, -1707236, 2259541, 1807411, -33243, 415288, -236443, -245057, -939904, 895917, 643919, -1201343, 451109, 45437, 945434, 278331, -2046892, 56607, 852748, 1719134, 1605852, 505432, -2021674, -865011, 891243, -207823, -566723, -997322, -1399092, -3244652, -606051, 225515, -1844471]
9512a844471J141334k468631J536516L322947j273666k103188J54503k30275O04662
9503a160269K94345j308825J439716M20436m60825j50313J411181k34390p95657
9494e44601J281523j81689j540806O69695k11042l19658M52225l11701j8389k485553
9484c209996Q24483J763033j157458O3491o33101R07666j149274O3545K686442
9475A58831O79027l07588j043993O2041q11933J070026R55732j629561r06909
9466a774327n44892K017978L20726r54363P58116K332425j474730j746778o79994
9457a745839K618559o17098j300234N50868L18662M64322N81935J147771j782155
9448B36791n18043K24969Q4105n30430K05936j490631R53988l52001O61056j163175
$$ y = [-1844471, -703137, -3171768, -1635252, 1687695, 414029, -1689159, -1534656, -1764931, -1160269, -865924, -2174749, -735033, -314597, -775422, -925735, 485446, 251056, -544601, 736922, 555233, -985573, -315878, -526920, -846578, -394353, -706054, -724443, -3209996, -2385513, -622480, -1779938, -1716447, -2349548, -1441882, -2591156, -2527611, 158831, 837858, 530270, -513723, -451682, -1263615, -193589, 762143, -867418, -1774327, -2319219, -301241, 19485, -934878, -176762, 2155663, 680933, -1065845, -1745839, 872720, 255622, -1044612, -493744, -175082, 289240, 871175, 2018946, 236791, -281252, -56283, 27822, -502608, -296672, -1787303, -833315, -1185316, -524260, -1687435]
9438a687435P70192J775085j585441l3259K86816L55063J164350p46755k40763
9429E7853L43148L65768L8466q63370r57464L92751M24699q15324K77795j600070
9419b335748k10961n58131J593429J847106r05653K32383J072205R55617l314175
9410a623928N26495M57290j257720J513213J3613j318355n48443O67238J768522
9401A97925Q66646j87874j743716Q08011L46644O65682K1322j030435O27160p93524
9391b22159J474556j513017p12892J03964O03961O46637M59069o26926M9285Q21921
9381A084399j327019k281627J627897K107249j265577O53661P97183k049058j241705
9372a894597J04302K333758p14747j210798P86816l25177P97358n32180P02961
$$ y = [-1687435, -917243, 857842, -727599, -760858, -474042, -118979, 1045371, 298616, 57853, 401001, 766769, 805235, -58135, -1015599, -622848, -198149, -1013473, -735678, -2335748, -2546709, -3104840, -1511411, 335695, -569958, -337575, 734630, 1690247, -1623928, -1097433, -640143, -1897863, -384650, -371037, -1689392, -2237835, -1570597, 197925, 1064571, 876697, -867019, -59008, 287636, 953318, 974640, -55795, 571365, -222159, 1252397, -260620, -973512, -869548, -265587, 381050, 840119, 213193, 262478, 1084399, -242620, -2524247, -896350, 1210899, -54678, 598983, 1396166, -652892, -1894597, -1790295, 543463, -171284, -1382082, -595266, -920443, -123085, -655265, 47696]
9363D7696p2018k43793J373115M34718j459488k19270j907503J673390J647j57914
9353e29420L83914r69152K42862J441265k257535k56188N95465l63006J541151
9344a70644j50280l39612K93813Q72479j053044J253352j941323j507876J058583
9335a684552N74380P15394K67918J178456j077357J17314J95027n40748j201269
9326a455437M19619K328027j17592M06723r81583k100164K77954n38035Q05518
9317i54970J482159j491318J231325j127626R22568J879888k033804j908325k02085
9308b202188K047635n52883n43941K562130j782581O22280j443447J036504r30917
9299a187408P2116J021044j836210O83858K65629P03768n5395P29972J113292
$$ y = [47696, -24322, -268115, 1105000, 1539718, 80230, -139040, -2046543, -373153, -371506, -529420, -145506, -1114658, -871796, 569469, -1688066, -1944254, -1348789, -1711795, -170644, -320924, -660536, -366723, 505756, -547288, 706064, -1235259, -2743135, -1684552, -1110172, -394778, -126860, 1051596, -25761, 91553, 286580, -254168, -1455437, -1035818, 1292209, 1174617, 1581340, 599757, -1500407, -1222453, -1760488, -954970, 527189, -964129, 267196, -860430, 62138, 1942026, -91778, -2000103, -2202188, -154553, -707436, -1251377, 1310753, -471828, 150452, -1292995, -256491, -1187408, -1115292, -94248, -1930458, -1246600, -980971, -277203, -332598, 397374, 1510666]
9290A510666k675273L74883k7850L7774K53908k11009P39343N33250j080440j41220
9280f85968J694944r21081k67280j531832L6598n9499k52319j883778J798930
9271b071285K576978R88298j151755j923348k35765l85158J903470K110171r64182
9262H47424k918683J173150J824683q43007m2825j036456M1059J66806J784605
9253I96756J033238j934675K99313K73132j060752J373049N56020k496911J436631
9244D75801q6074p34574J166264j205281J156448Q05989r05817K9625Q66220p83860
9234G84741M60286k89646q09322j098292L64212J759408R15110o85090j781816
9225c80409P13286J377714k068330j21259K65811J91349R29746N0096k765821
$$ y = [1510666, -1164607, -789724, -817574, -779800, -525892, -736901, 2442, 535692, -544748, -685968, 1008976, 87895, -179385, -1711217, -1674619, -1734118, -1986437, -3870215, -2071285, 505693, 1493991, 342236, -1581112, -1816877, -2202035, -298565, 1811606, 847424, -2071259, -898109, 926574, 83567, 40742, -995714, -954655, -787849, 996756, 2029994, 95319, 394632, 667764, -392988, 980061, 1536081, -960830, 475801, 389727, -344847, 821417, -383864, 772584, 1578573, 672756, 702381, 1568601, 784741, 1245027, 955381, 146059, -952233, -588021, 1171387, 2086497, 1401407, -380409, 332877, 1710591, -357739, -478998, -213187, -21838, 907908, 958004, -1807817]
9216a807817M69133Q14223k122487K662445r22155o72070j126781m41211K451536
9207f95184M61139n90452K08944K716421k248732m97246j523870N80455J150954
9198d37571L75222L28340j356786J133535J09957l12524j118929R03895l61701
9189g36562p17831K28140N16109r28237J334815j673512Q46472k62261r5425l39289
9179a827581k94494l28589j589835J087098Q81960R60290P60327r87073O04876
9170g33021P13783n29837J069249q09541m4792m62341J478853r40743J52087K425213
9160B318910j56905O01434k194332j128911N76811j45851J17507j008170j12789
9151a132296K98576P89109l36199N45598j332529N82536l22447N68572l43155
$$ y = [-1807817, -1338684, -524461, -2646948, 15497, -906658, -1578728, -2705509, -3146720, -695184, -234045, -824497, -615553, 2100868, -147864, -645110, -2168980, -1588525, -437571, -62349, 265991, -1090795, 42740, 152697, -159827, -1278756, -374861, -736562, -1454393, -1226253, -710144, -1638381, -303566, -1977078, -1130606, -1392867, -1488292, -1827581, -2122075, -2450664, -4040499, -2953401, -2071441, -1111151, -350824, -1337897, -733021, -19238, -549075, 520174, -289367, -334159, -796500, 682353, -258390, -106303, 2318910, 2162005, 2763439, 569107, -559804, 17007, -128844, -11337, -1019507, -1132296, -833720, -44611, -380810, 164788, -1167741, -585205, -907652, -339080, -682235]
9142f82235K25195j430282q109O78277j66366J009645l45326N25502r13927J76617
9132i31009j192011k73951P55227K217351J08801J01506j56807j01067j032054
9123e04014R01565J395623k642607n53176K58096j178692Q58663J399187J659223
9114A593868j037711p91107l6395J51956J668123l147557j598240J537842J413443
9105b45778q59978O8189N88171J750152k76549k516283j108288J653069k6113
9096i73408m60484K045043q87868R98497K35223j469798j33383o5732P19129j175861
9086a168642J166117K16110k86080P20054P69200j56999j120228k940000J356405
9077a444063K012776k339759L6922L039402N31940j591181L34652j025645J413227
$$ y = [-682235, -457040, -1887322, -1895431, -1217154, -1383520, -373875, -719201, -193699, -1107626, -931009, -2123020, -2396971, -1641744, 575607, 684408, 785914, 629107, 528040, -504014, 397551, 1793174, -849433, -1402609, -1144513, -2323205, -1464542, -65355, 1593868, 556157, -234950, -271345, -119389, 1548734, -1598823, -3197063, -1659221, -245778, -1105756, -1037567, -449396, 1300756, 1024207, -1492076, -2600364, -947295, -973408, -1433892, 611151, -276717, 721780, 957003, -512795, -646178, -711910, 7219, -1168642, -2525, 213585, -72495, 647559, 1416759, 1259760, 139532, -2800468, -1444063, 568713, -1771046, -1734124, 1305278, 1837218, 246037, 580689, -444956, 968271]
9068I68271k748468r98273J325712J563873j243246j33100n52143Q18509N70446
9059d28419O8323n32589r6498N07059J95317n88116j160870J674025K604339k149211
9049I3360k249997J176519N21608M45080L16543p39852J381341P21285k449530
9040g83643K77836K32808n72036J889245j248060P64577J223037k148484M05464
9031D0744l42359m88094J686657j937521j246177J270723N36518J792918j658605
9022c45196J391552n80185j462360L39544J705423o37995j530434Q4458N09390
9013e25803J217987j267226p43976J8631r33374O29202p91735L34952N84915J1972
9003a464455J061338J7274N46152j74962k113242J346267K08123o7643K340739
$$ y = [968271, -1780197, -2778470, -1452758, 111115, -1132131, -1265231, -1817374, -998865, -428419, -360096, -892685, -989183, -482124, -286807, -874923, -2035793, -361768, 2242571, 93360, -2156637, -980118, -458510, -13430, 303113, -436739, 944602, 1665887, -783643, -505807, -272999, -845035, 1044210, -203850, 560727, 1783764, -364720, 40744, -301615, -789709, 896948, -1040573, -2286750, -1016027, -479509, 1313409, -345196, 1046356, 466171, -996189, -656645, 1048778, 410783, -1119651, -1035193, -525803, 692184, -575042, -1319018, -1300387, -2233761, -1604559, -2396294, -2061342, -1476427, -1464455, -403117, -385843, 160309, -14653, -2127895, -781628, -573505, -641148, 1699591]
8994A699591L19620l59423j039127k0934J156078j932703O1866K17956k58154
8985a55230n58228o59933r00653k03190K100933j435203M3762j42850l29370O70479
8975a569483K22431n55087J595975j685564J114852R99807o03951j753842J182522
8966a052340l25877M60121J400321k023484J002780R99875j144759m44069K831248
8957A703816p54266j24513m86116k721021P74252O18800M19411P82661R32888
8948A145912j562628m25362o30616P22720J110950N32777n65893n20277o2155
8939b54572q35080j989845J802371L602228k516373M8083l435090p53867J345082
8930b987063J916351R94450J752752j238262K10630o90057r81246j454937L346820
$$ y = [1699591, 2019211, 1659788, 620661, 599727, 1755805, -176898, -115032, 102924, -155230, -713458, -1373391, -2274044, -2477234, -376301, -1811504, -1767742, -1910592, -2239962, -1569483, -1347052, -1902139, -306164, -1991728, -876876, 122931, -481020, -2234862, -1052340, -1378217, -918096, 482225, -1541259, -538479, 461396, -683363, -1127432, 1703816, 949550, 825037, 338921, -2382100, -1607848, -989048, -569637, 213024, 1145912, -416716, -842078, -1472694, -749974, 360976, 893753, 327860, -192417, -254572, -1089652, -3079497, -1277126, 2325102, -191271, -143188, -3578278, -4332145, -2987063, -1070712, -76262, 1676490, 438228, 648858, -41199, -1022445, -2477382, 869438]
8921H69438k342473L89685Q70170L76524m21805j84192j261446O26831P06064
8912c71204n6703k06644J68931K102970j746468p37457j232154M40187j517137
8903c155679J079799N67833J829443j139987j213790J817513M37351j19680p85914
8894f83111K27910m61584j80898k29169r70624Q69823n17719L96736k505748K089528
8884a964856J78905J467367J038510j332748p96079J077272l97277M72612M57381
8875B01087K78202Q35820O3865m34101k388627P3411q33835J113861n11047J738899
8865A37535O0232j328673K253934j66225n934j22032j848324J741520n57333m21640
8855b56940M77095J605989M11793k359251J0585p17291p3158j88889j083922J979741
$$ y = [869438, -1473035, -1083350, -213180, 163344, -258461, -442653, -1704099, -1077268, -371204, -427907, -634551, -465620, 1637350, -109118, -846575, -2078729, -1638542, -3155679, -2075880, -1508047, 321396, -818591, -2032381, -214868, 222483, 102803, -683111, -455201, -916785, -1097683, -1326852, -2297476, -1427653, -1945372, -1548636, -4054384, -1964856, -1785951, -318584, 719926, -612822, -1408901, -331629, -728906, -256294, 201087, 479289, 1315109, 1378974, 944873, -1443754, -1370343, -2204178, -1090317, -1601364, 137535, 197767, -1130906, 1123028, 956803, 950869, 828837, -1019487, 722033, 164700, -256940, 220155, 1826144, 2237937, -121314, -110729, -828020, -901178, -1090067, -2173989, -194248]
8845a94248o8272J804306j16450k164062O83526j634949l5390j66714L40572L076231
8835A524550j036451q64960J72128l332146J514916R55018L65753N98867J166982
8826A064657l060683J040632j064583J718940K84942J05655M70210m40812j549493
8817a430535L37907J909237m80198n82371r58919j271672J913425J936427o13925
8808G59376n04594l90487R1523j41376j306546M07000K140706j152728Q03015
8799G05889j486611N27221l75908m76498l40259R45323J695460l4668o99076j180101
8789g19228p06181J383827N49905j045124K478332j6663l087282Q17840n61872
8780i06446R34491j842069J83260J415593J226407N11068j663343J058486K86601
$$ y = [-194248, -262520, 1541786, 1425336, -738726, -55200, -1690149, -1725539, -1892253, -1551681, 1524550, 488099, -376861, -204733, -3536879, -2021963, -1066945, -701192, -102325, 1064657, -1996026, -955394, -2019977, -301037, -16095, 89560, 559770, 118958, -1430535, -1092628, 816609, 336411, -245960, -1204879, -2476551, -563126, 1373301, 759376, 254782, -135705, -44182, -185558, -1492104, -1085104, 1055602, -97126, 705889, -780722, -253501, -629409, -1105907, -1446166, -500843, 1194617, 1159949, 460873, -719228, -1425409, -41582, 508323, -536801, 1941531, 1924868, -1162414, -344574, -906446, 28045, -1814024, -1630764, -215171, 1011236, 1522304, -141039, 917447, 1204048]
8771A204048k41361k624551L52072L92979o33056O13012j431760l64992K563092
8762a70517P5336K16444j58600K12275j716610j464053J000668q4560k18082J038621
8752a269078l2038n6245J378133J607901m73550L17649m38223r69285j235963
8743a170699R24797j053676O6351J15885j008487J422481l72242O73846K96863
8734a04881J652978l99324q0791q29698r5922l5192J78661n17343j522519m39206
8724b193237J634281j117874J758025j74878J20919M65666J284680k022069O60239
8715D15752q71219J19701o9564R61276j460116K425709k82417k064964L56298
8706d69544k93704K1720l99207K290852j640352J39928m87304K18970J059933
$$ y = [1204048, 962687, -1661864, -1309792, -916813, -1549869, -936857, -2368617, -2733609, -170517, -95181, 121263, -37337, 174938, -1541672, -3005725, -2005057, -2089617, -2307699, -1269078, -1301116, -1357361, 20772, 1628673, 1155123, 1472772, 1034549, 65264, -1170699, -245902, -1299578, -1233227, -1117342, -2125829, -703348, -1075590, -401744, -104881, 1548097, 1148773, 1067982, 238284, 142362, 107170, 285831, -231512, -1754031, -2193237, -558956, -1676830, 81195, -93683, 27236, 492902, 1777582, -244487, 415752, -455467, -335766, -405330, 555946, -904170, 1521539, 1239122, -825842, -469544, -763248, -741528, -1140735, 1150117, -490235, -350307, -837611, -618641, 441292]
8697D41292L3090j447300M74033Q37356l86082j332924l48722J346945K52225
8688a30087M39606K38171q28306N71438j360663j428294J365480J004547o51046
8679g79154L36619j352672R33318J560781j013054J44416j70590k217947J403420
8670a154863O18539K60437N87021O84478o75163j059047j002782J509543J471955
8661A240118n47589n71447K89525J99503R69269j781852J728551R89885j737023
8652G78940n34826l80831L52053j480787J32374j75906J647770J203408p34033
8643H08162m58991N79966j037583k01283o00291j83630J474804k75183J434948
8634A540919m437k674612O24644J124117j580355M15926N28315J15513l52477
$$ y = [441292, 474382, -972918, -498885, 338471, -47611, -1380535, -1729257, -382312, -130087, 309519, 547690, -280616, 290822, -1069841, -2498135, -1132655, -128108, -779154, -442535, -1795207, -861889, 698892, -314162, -169746, -340336, -2558283, -1154863, -536324, -275887, 311134, 995612, 320449, -738598, -1741380, -231837, 1240118, 692529, 121082, 410607, 610110, 1579379, -202473, 1526078, 2515963, 778940, 244114, -136717, 215336, -1265451, -1133077, -1308983, 338787, 1542195, 808162, 349171, 929137, -108446, -309729, -910020, -1093650, 381154, 105971, 1540919, 1536482, -1138130, -513486, 610631, -969724, -553798, -25483, 90030, -262447]
8625b62447J038750J35161k844203r4214J808818k75023K29923j173874O44420
8616g92689R08524n24799j151442K92800K288673p03071l0481m61064Q61687J427649
8606B115787L45527m92804o76576m1292K0599j523973n53373m98831Q01525R79424
8596D76013j485344n81642J337443J593176j383306o32483m95817Q80571j72467
8587d63856j831819l11112J652419q41241j83962P42534n2729J01947j549107
8578b736926J583319p61176J33059K866783n11556K6448m0301j99871n23698p58220
8568i22139J127155M14548m51444r23780K33605j310285q32403J602958P13193
8559c48592p88192o18862J888026p3088m61092l81384Q79778p95306Q95397J02616
$$ y = [-262447, 776303, 911464, -1932739, -2026953, -218135, -493158, -263235, -1437109, -792689, 115835, -408964, -1560406, -1267606, 1021067, 317996, 287515, -173549, 688138, 2115787, 2461314, 1968510, 1291934, 1250642, 1271241, -252732, -806105, -1304936, -503411, 476013, -1009331, -1590973, -253530, 1339646, -43660, -676143, -1171960, -291389, -463856, -2295675, -2606787, -954368, -1795609, -1979571, -1237037, -1289766, -1187819, -2736926, -1153607, -1914783, -1781724, 1085059, 573503, 599951, 559650, 359779, -163919, -922139, 205016, 619564, 168120, -755660, -522055, -1832340, -2664743, -1061785, -348592, -1136784, -1755646, 132380, 59292, -401800, -783184, 96594, -698712, 196685, 299301]
8549B99301m5575j869449m66000P31114n69052K010140k29474k448601O83502
8540a904094J873169o45003J009496o089o95438k85849J797416k74963j593613
8531g24968J71987J109565k48268j205739N55244k47779j583591M43871L12873
8522a416805J40681J119384L07684J82144L04825o0514k070127R6044J97486P36027
8512d63171L1091Q1326K755486k64689j012637J54477J13643k289792P07571L43629
8502A56934J261314j203063j387892m4344K94430j151086J423884J532152n75570
8493C06759o32878j53592P25429k28264O50005o22779j687418Q80553J429148
8484F66963k98372r24904M91674k28417m69625j423196m15616K054321n17014
$$ y = [299301, 253726, -1615723, -2081723, -1350609, -1919661, 90479, -138995, -2587596, -1904094, -30925, -675928, 333568, 327479, -367959, -653808, 1143608, 868645, -724968, -552981, 556584, 308316, -897423, -342179, -589958, -2173549, -1729678, -1416805, -1276124, -156740, 150944, 333088, 637913, 577399, -1492728, -1396684, -1199198, -463171, -432080, -350754, 2404732, 2140043, 1127406, 1281883, 1395526, -894266, -186695, 156934, 1418248, 215185, -1172707, -1217051, -922621, -2073707, -649823, 882329, 306759, -326119, -479711, 245718, 17454, 667459, 44680, -1642738, -762185, 666963, 368591, -556313, -64639, -293056, -762681, -2185877, -2601493, -547172, -1064186]
8475a064186K725386J008497k083037R162P23262l97387j456427L95208m7126
8466a86648k42056J168521o84989J125303k728434j196218J028992L64496R25264
8457d25769n31908j361688p64533K110451J37303k461K019052N33296o59508k03838
8447H50397n64181j17233J07012j93285L07196N5406o59443P39692J336062j008928
8437H52695j162643k30978q87256N09483j19219J65529K238920M0519r75256o36400
8427b04606N26681R54933o01954k205100o49800J415127q08248K002413R80098
8418A409544j739141q70275K884381j494101q78652r08434L61873J476158L32484
8409E73837J946223l283729l75191L424919Q72549r98617M16555n72794j886581
$$ y = [-1064186, 1661200, 2669697, 586660, 595822, 1319084, 921697, -534730, -139522, -186648, -428704, 739817, 54828, 1180131, -1548303, -2744521, -1715529, -1351033, -425769, -957677, -2319365, -3083898, -973447, -836144, -838605, 1180447, 1713743, 1054235, 850397, 286216, 168983, 275995, 82710, 389906, 445312, -214131, 525561, 1861623, 852695, -309948, -540926, -1428182, -918699, -1037918, -872389, 1366531, 1407050, 431794, -204606, 322075, 1277008, 675054, -1530046, -2179846, -764719, -1572967, 429446, 1409544, -329597, -1199872, 1684509, 190408, -688244, -1596678, -1234805, 241353, 573837, 2520060, -763669, -1138860, 2286059, 3158608, 2159991, 2576546, 2003752, 117171]
8400A17171N51117q88925m7803N34921j370582J314146N40337o55973j809282
8391a714873Q24473P33583M09343J180964j918788o17512k832J048160m21495
8382d78977J445800j90084O94180m96155j24156r09823J236932P98635k272986
8373b96634J41728p74679N95339L2014l19831P42337P67593k546353J50303K02461
8363a305722R41365n70336R77492o86495j189144r0553J184402Q90988o69344
8354e17347k43327l39251J430478J225830j882349L15859L1866J068228j27097
8345I62890l11505j953729O13128j45733J063075J05954l33298o74745j21028
8336g94991M04341P24128k30591j97788j44194J365721j244198k65281o86377
$$ y = [117171, 668288, -220637, -268440, 266481, -1104101, 210045, 750382, 94409, -1714873, -890400, -156817, 252526, 1433490, -485298, -1102810, -1105642, -57482, -478977, 966823, 776739, 1470919, 974764, 850608, -59215, 1177717, 1976352, -296634, -154906, -929585, -334246, -302232, -622063, 120274, 887867, -1658486, -1508183, -1305722, -364357, -934693, 42799, -643696, -1832840, -1923393, -738991, 151997, -517347, -760674, -1099925, 330553, 1556383, -325966, -10107, 21759, 1089987, 962890, 651385, -1302344, -689216, -834949, 228126, 334080, 782, -673963, -794991, -390650, 333478, 102887, -94901, -239095, 1126626, -117572, -382853, -1069230]
8327a069230n06133l2067K84393L37401J204015k15810m51586k46969Q92065J059490
8317A255569j104914J459658j741086P89863q18335J290713j62974j643245L49016
8308c25735o69684k84521Q53086k413683P87470p72724K07432l42203J510226
8299a450336J912022K81498k119512q76327J643442J808335n70150M38035K8635
8290A095642o90009L45761J31428r66629l38881N81160k08818N61118J598454
8281B109226K79902j541407j561612K079217j400591j820050K085789J33j159331
8272i28724q04269k14454K081610j45719m49460K92707j809102J866316J540725
8263A429630O71140M29924O44914j024979q74864M06418j845957J23723j402282
$$ y = [-1069230, -1575363, -1607430, -1323037, -985636, 218379, 2569, -449017, -695986, 196079, 1255569, 150655, 1610313, -130773, 659090, -159245, 1131468, 968494, -674751, -325735, -995419, -1279940, -426854, -2840537, -2053067, -2825791, -2618359, -2960562, -1450336, 461686, 743184, -1376328, -2252655, -609213, 1199122, 628972, 1067007, 1095642, 405633, 751394, 882822, -83807, -422688, 158472, -50346, 510772, 2109226, 2389128, 847721, -713891, 1365326, -35265, -1855315, 230474, 230607, -928724, -1732993, -1947447, 134163, -11556, -461016, -168309, -1977411, -111095, 1429630, 2100770, 2530694, 3175608, 2150629, 1275765, 1682183, -163774, -40051, -1442333]
8254a442333r0662Q84470Q57977L30283j260430q16225L14653J352260O4291j38068
8244E6216o67064k117279J097033R91255J858341K58177m52480m5534q28935j75727
8234b5997J374541K34782j808681Q32403l33569p63281k71641K855944k263035
8225a68534p62955J111724k58672M30371Q65913q96630k82725l62136J882800
8216A559156j313576j356603r64799J857859J306236k054305J430396J707826
8208B172190o586r55734j184903l61781o88486l40434K406944n82250j65975J52634
8198D45619j177023K659927K7218K148196p20767O814538m289286j4435110M730246
8189c796442J603410K260430j444675m38135o31171R39548o3124M78043N61642
$$ y = [-1442333, -1532995, -648525, 209452, 539735, -720695, -1536920, -1222267, 129993, 194284, 56216, -610848, -2728127, -1631094, -639839, 1218502, 1476679, 1024199, 978665, 149730, -25997, 1348544, 1583326, -225355, 607048, 273479, -489802, -761443, 2094501, -168534, -931489, 180235, -78437, 351934, 1217847, 321217, 38492, -323644, 1559156, 245580, -1111023, -2075822, -217963, 1088273, -966032, 464364, 2172190, 2165604, 1209870, 24967, -336814, -1025300, -1365734, 1041210, 458960, 292985, 445619, -731404, 1928523, 1955741, 4103937, 3383170, 10197708, 5908422, -8526688, -3796442, -2193032, 67398, -1377277, -1815412, -2446583, -1507035, -1570159, -1092116, -530474]
8180e30474P23358j369768N86206Q1921j934418K871862o95482r46818k52910
8171a466523l74595k27505N95915J315147J224034p97681r94m96044n85066K70792
8161e42520P27461J127757l90546Q06150k307139m45515J501545j052174K8793
8152e46188m9994l31532J625509k82240j652953J583796O39975j770788N22827
8143b61588L49779l35173k14768r22461M53457J607835M85244j3332R97417k352683
8133b06273j397380J704135R78516j961502J611048J445378j137094r35427M30689
8124E32090m82943n39293K140785o0704k412401K233114o08470p49152J413010
8115A466036j795043j690066J313123r99043k13538N38399m70345O24069R23634
$$ y = [-530474, 192884, -1176884, -590678, -508757, -2443175, 428687, -266795, -1213613, -1466523, -1841118, -2068623, -1472708, -157561, 1066473, 268792, 267798, -228246, -813312, -542520, 184941, 1312698, 922152, 1728302, -578837, -1024352, 477193, -574981, -546188, -596182, -927714, 697795, 415555, -1237398, 346398, 986373, -784415, -261588, 88191, -246982, -461750, -1384211, -930754, 677081, 1162325, 1148993, 2146410, -206273, -1603653, 100482, 1078998, -882504, 728544, 2173922, 1036828, 101401, 532090, 49147, -490146, 1650639, 1589935, -822466, 1410648, 802178, 53026, 1466036, -329007, -2019073, -705950, -1704993, -1918531, -1380132, -1850477, -1226408, -302774]
8106c02774m31737l28668K392589o81816R11736j133259j133645L62929J402213
8097A057568J336939j360034m30929J43750k44979j321729k69178l14783M79905
8088i23470O98935J414002j397656k024260J63276K119747O71409k140525J228565
8079a89977j331118J846712Q28284j542801m83401o90716J906278P10357P83065
8070A836683l185152M67604P73667P49914j750030K57261M11189J252158k153452
8061a340158K76106K839648L83526N44390p15987j555307j388357Q65928P50594
8052F60383M64619p45355j124422O76283l64288k321819J319328K429607m94015
8043E00321l55490p94467r89224J407790l74807K001467k056182p10569O18264
$$ y = [-302774, -734511, -1063179, 1329410, 647594, 1559330, 426071, -707574, -344645, 1057568, 2394507, 1034473, 603544, 747294, 502315, -819414, -1088592, -1403375, -923470, -224535, 1189467, -208189, -2232449, -2069173, 50574, 721983, -1418542, -189977, -1521095, 325617, 1153901, -388900, -872301, -1563017, 343261, 1053618, 1836683, -1348469, -880865, -107198, 642716, -1107314, -850053, -438864, 813294, -1340158, -1064052, 1775596, 2159122, 2703512, 1987525, 432218, -956139, -90211, 660383, 1125002, 379647, -744775, -68492, -432780, -2754599, -1435271, 994336, 500321, 144831, -649636, -1638860, -231070, -605877, 1395590, -660592, -1371161, -752897]
8034g52897J923200n43311r60363O92701R50771j941518J28926j8446L53657K70657
8024A03377p34705J040733j54573j300698k22041L71598m7547o51933L222221
8015A626432q88730p36217P79574k266296J668874O14854q85006O30879k167633
8006a623269L48760L150024J116556k703217j472234M8699q37690J186155J06056
7997f80160J246943J32896Q29337j403550K024256o73479k143955j045926j94900
7988a908538J867856J464689q95421o01693N09933j727215L56849J087169J235762
7979A389391J866774k513102k088037j078531J212849J290694j672471J206938
7971c85495k57301k14100J317669J247Q7648j093332l23005P66208j331076O02804
$$ y = [-752897, 1170303, 626992, -333371, 359330, 1310101, -631417, -502491, -520937, -167280, 103377, -631328, 409405, 254832, -1045866, -1267907, -896309, -943856, -1595789, 1626432, 737702, 1485, 781059, -1485237, 183637, 798491, -86515, 544364, -1623269, -1274509, 1875515, 2992071, 288854, -1183380, -1134681, -1972371, -786216, -680160, 566783, 699679, 1529016, 125466, 2149722, 1476243, -667712, -1713638, -1908538, -40682, 1424007, 528586, -73107, 436826, -1290389, -933540, 153629, 1389391, 3256165, 743063, -1344974, -2423505, -1210656, 80038, -1592433, -385495, -642796, -856896, 460773, 462020, 549668, -543664, -866669, -100461, -1431537, -828733]
7961h28733j9022J873884k2254j543708p0053J365296P31539J068134j929973
7952F25110j178806m0259O20097r4750J027835n77488p24666J412714q13269j128480
7942h71962L79550L0118p69679m70205J588913j14997Q30548J292828k254435
7933c59321K064826P87979j693753m46101J634673j112028m47278j83631J232842
7924A478208j74207j465458K08291K8782j29683P67444j6963k03764N8820J28810
7914F80280j16327j123254M64461j224279j197812J707736p45105l19556O31145
7905a242711K879197j299489j150323q92583R51068J913695j579724M26798K01382
7896B07310j170603l20354J821123j561593J1775L49278M63780M21705m11800
$$ y = [-828733, -847755, 1026129, 1003875, -539833, -609886, 755410, 1486949, 2555083, 625110, -553696, -593955, 26142, -68608, 959227, 381739, -342927, 1069787, 256518, -871962, -492412, -462294, -1231973, -1702178, -113265, -228262, 602286, 1895114, -359321, 1705505, 2493484, 799731, 353630, 1988303, 876275, 428997, 245366, 1478208, 1304001, -161457, 46834, 75616, -54067, 713377, 696414, 492650, 551470, 680280, 563953, -559301, -94840, -1319119, -2516931, -809195, -1554300, -1873856, -1242711, 1636486, 336997, -813326, -1705909, -754841, 1158854, -420870, 5928, 207310, -963293, -1283647, 537476, -1024117, -1012342, -663064, -199284, 222421, -189379]
7887a89379J579666j300337l28387K256079q37705N99234Q2948r58100K02285
7878A106304k013105L95365J501976q63608j51361O17519j214110J432320n45160
7869B66140j820129Q81475J370394p32406m97862j331900J577888R22165l6133
7860E99632o28902K26992J740377p7766j514623j568298K615921L48483n33062
7851A208754k372744l82894n42547P64720J003940J591302K12981j055024L29256
7842G57744j563772J051528j545749j713933L272141k16937q15924K156010j872518
7833d91410M40487N32840J376671j712033j090450R65054o11471P92816J434121
7824A636625k031807P07008K145115l65516j074562k08692o04494p53160K30946
$$ y = [-189379, 1390287, 89950, -238437, 2017642, 1179937, 1779171, 1862119, 904019, 1106304, -906801, -511436, 990540, 126932, -24429, 593090, -621020, 811300, 266140, -1553989, -672514, 697880, -34526, -532388, -1864288, -286400, 635765, 599632, -29270, 197722, 1938099, 1860333, 345710, -1222588, 1393333, 1741816, 1208754, -1163990, -1546884, -2089431, -1324711, -320771, 1270531, 1483512, 428488, 757744, -806028, 245500, -1300249, -3014182, 257959, 41022, -774902, 1381108, -491410, -50923, 481917, 1858588, 146555, -943895, 21159, -590312, 202504, 1636625, -395182, 311826, 2456941, 2091425, 1016863, 808171, 203677, -549483, -318537]
7815c18537l45818J802129Q4226k003796N85291N14159J269594J097422j540779
7806A143891P22259k02817n21564j63704P77160k7329n85236j259623N98693N72413
7796A054143N08359j374726Q77444O24302j072594O25895n93539k8251Q19964
7787A440997p14013l28624N47869M11844P82721N23536j769820j26037j087921
7778c19448n35631R57148K027871j107662l87637Q49596j804692J193780J914633
7769B787958k010139k054677N85769N8524p58565L02675J087856m63961J200365
7760G35805n95917q10257M30718R39972j188964R98831k299322j03430K240101
7751C47537P81162J746975l812307L09539L07724P03236K138956K61297j299502
$$ y = [-318537, -664355, 1137774, 1222000, -781796, -196505, 317654, 1587248, 2684670, 1143891, 1866150, 1663333, 1141769, 978065, 1755225, 1727896, 1142660, -116963, 481730, 1054143, 1562502, 187776, 1065220, 1689522, 616928, 1242823, 649284, 621033, 1440997, 726984, 398360, 946229, 1358073, 2140794, 2664330, 894510, 768473, -319448, -855079, 102069, 2129940, 1022278, 634641, 1484237, -320455, 873325, 2787958, 777819, -1276858, -691089, -632565, -1391130, -1088455, -599, -464560, 735805, 139888, -670369, -239651, 700321, -488643, 510188, -1789134, -1892564, 347537, 1128699, 2875674, -936633, -627094, -319370, 383866, 2522822, 2784119, 1484617]
7742A484617j385918J221302l50094J151173J97814k776227j56511N39025j454505
7733a529324J147218O00365P35249J453141j495174j70275k235002J383802j755723
7724a865723K156087L5144J243620p42452N20219L09148k72959j16539j556167
7715b89622J235806q22871J236209l161740L84130J228580k382217J812821J875409
7706A116505j647690l11938r42119M87100J076053J064963M28044o42420n04108
7697A24390l88923O96640O30466M54456J24384p09271N17146n17518q42944j660959
7687a572133J640952j289553J115446N0043l36688J121539n53838j36861P03397
7678G42304k99141M85885R82793l9303o69777j997630k502335K120831k82343
$$ y = [1484617, 98699, 1320001, 969907, 2121080, 2318894, -457333, -613844, -74819, -1529324, -382106, 218259, 953508, 2406649, 911475, 741200, -1493802, -110000, -1865723, 290364, 325508, 1569128, 826676, 1346895, 1656043, 1383084, 1266545, -289622, 946184, 123313, 1359522, -1802218, -1418088, -189508, -2571725, -758904, 1116505, -531185, -843123, -1785242, -1298142, -222089, 842874, 1270918, 628498, 124390, -264533, 432107, 1062573, 1517029, 1641413, 932142, 1449288, 931770, 88826, -1572133, 68819, -1220734, -105288, -55245, -391933, 729606, 175768, 38907, 742304, 443163, 929048, 1911841, 1872538, 1202761, -794869, -3297204, -1176373, -1458716]
7669a458716o45932o57679o30845L757504j49800K244398o16425K2097j990847
7660a26245M06416O80642L50982j159450j946385P95279L63154J574911j263440
7651c24136M83145J038695J025143r15589k551233J074859Q19867k244166J944159
7642C50744j22718O59439o5230N50459Q41119k84811j387903J681710j937917
7633B84892l66251K15217M44453J501523k80125j48123m00254n78976m73883J05138
7623C03611R09474Q34767m01621j176497J18488J154791L98980J214791j055588
7614B301196J159456k097758P1663J59499l7434j011985L88327J016968O79434
7605B629366r00470m85439r36079J369478J38538j65591o18971L67l34779J98865
$$ y = [-1458716, -2104648, -2762327, -3393172, 364332, 214532, 2458930, 1842505, 1864602, -126245, 280171, 960813, 1311795, 152345, -1794040, -998761, -635607, 939304, -324136, 159009, 1197704, 2222847, 1307258, -1243975, -169116, 650751, -1593415, 350744, 228026, 887465, 822235, 1372694, 2213813, 1929002, 541099, 2222809, 284892, -81359, 133858, 578311, 2079834, 1799709, 1651586, 1251332, 672356, 198473, 303611, 1213085, 2047852, 1646231, 469734, 588222, 1743013, 2141993, 3356784, 2301196, 3460652, 1362894, 1434557, 1594056, 1556622, 544637, 932964, 1949932, 2629366, 1728896, 1243457, 307378, 1676856, 1815394, 1649803, 1030832, 1031199, 696420, 895285]
7595H95285L29008k82207q94642O11238J583960k98929L67795k616494l73561
7586f78547M00527J928926J220082j175321Q9582J463265r66391n55018Q95665
7577B622770m31570l7619Q98825o91425j716961p24988J82021K797847m86955
7568B411945q78936J546464j676352R00418o42520k00436k08508r52472o36841
7559c37238Q28846m18300K13325m67426O66512N50594r57877Q29305L65474j421199
7549a47984J596812J57653n70219o3174n61367O36449R71799K80319r52800r402
7539A338086M78728N45361L87639q82897j534853R88518P1558p64559j571971
7530i44390K647224j686217L79978K582590p56318j067563k5578J324J507314
$$ y = [895285, 1224293, 942086, 47444, 658682, 2242642, 1943713, 2311508, -304986, -678547, -278020, 1650906, 2870988, 1695667, 1785249, 3248514, 2282123, 1727105, 2622770, 2191200, 2153581, 3052406, 2360981, 644020, -80968, 101053, 2898900, 2411945, 1533009, 3079473, 1403121, 2303539, 1661019, 1460583, 1252075, 299603, -337238, 491608, 73308, 286633, -180793, 485719, 1036313, 78436, 907741, 1273215, -147984, 1448828, 1606481, 1036262, 973088, 411721, 1048170, 2019969, 2300288, 1347488, 1338086, 1816814, 2362175, 2749814, 1866917, 332064, 1320582, 1392140, 627581, -944390, 1702834, 16617, 396595, 2979185, 2222867, 1155304, 1129726, 1131050, 2638364]
7521B638364J79167j294559p2176l1664k00303o1643J131301m15671l18588J27104
7511A681332J251545R5760k59162J251221q44480N14382l53160R60405k042215
7502B255628j716524K061762J978478M7707l26855j0520Q04984j017895L8313
7493D115078m66679q28849J257391M85866L014937L35598J391224M88187J527906
7484A1320659J858933n60043k939700j50926K728796l422771k723116n37767J134093
7475F708158j568992Q16318K58323O99303J704527k389260M7496J781520m72158
7466G585235j433981K004650J47930J099233M11901K113781J242814j927772K11044
7457A1454835j6086n11727n73339Q83831o45196l774975l307423O36731P46007
$$ y = [2638364, 2817531, 1522972, 1450796, 1419132, 1218829, 1157186, 2288487, 1872816, 1554228, 1681332, 2932877, 3028637, 2769475, 4020696, 3176216, 3690598, 3337438, 4297843, 2255628, 539104, 2600866, 4579344, 4627051, 4300196, 4289676, 5094660, 4076765, 4115078, 3648399, 2819550, 4076941, 4562807, 7577744, 7913342, 9304566, 9792753, 11320659, 13179592, 12619549, 9679849, 9528923, 12257719, 8834948, 6111832, 5574065, 6708158, 5139166, 5955484, 6213807, 6913110, 8617637, 6228377, 6275873, 8057393, 7585235, 6151254, 8155904, 8303834, 9403067, 9814968, 11928749, 13171563, 11243791, 11454835, 11438749, 10927022, 10353683, 11237514, 10592318, 6817343, 3509920, 4146651, 4892658]
7448D892658j722992J17310R83905j338487J004172J28336j605732P05024J527690
7439D691884j562249r80394L315967j225874o39671m31830J347526j212335o64610
7430B638414j235934K24160j045500K388792M27530O66820M87765k066864J196292
7421C681475J41227Q50862k023504m51821o21949k009109J368267J678945n77914
7412B036479K095145O66257n44963j668224J217617l93912j062774j075531j487555
7403b17461J904004J745339j468948J032540j540046l59062J262200k83722k25787
7394A849057O49956j111062O8750j071863j091604L219005l87607j696730R23219
7385A351121L24364k247392J395102R19906P72499r24494r39590J897091M92313
$$ y = [4892658, 3169666, 3286976, 4270881, 2932394, 3936566, 4064902, 2459170, 3164194, 4691884, 3129635, 2149241, 5465208, 4239334, 3599663, 3167833, 4515359, 3303024, 2638414, 1402480, 1626640, 581140, 2969932, 3397462, 4064282, 4552047, 2485183, 3681475, 3822702, 4673564, 2650060, 2198239, 1576290, -432819, 935448, 2614393, 2036479, 4131624, 4797881, 4252918, 2584694, 3802311, 3408399, 2345625, 1270094, -217461, 1686543, 3431882, 1962934, 2995474, 1455428, 1096366, 2358566, 2074844, 1849057, 2499013, 1387951, 1456701, 384838, -706766, 2512239, 2124632, 427902, 1351121, 1675485, -571907, 823195, 1743101, 2515600, 1591106, 651516, 2548607, 3040920]
7376C040920j449818J631324j24674k76621q79515m00632M59364o4622J95819
7367B131545j631581j55166l62391J434598j09660l71282n04746j265649J503208
7358F68876L1943P47682j284655P95600K966704Q3399j488801J239208k45363
7349C514593j049523l90636k80975m4733j94853k548380M05527J751901m9338
7340A113583J523243Q3495j852901o79830R39954L4002k318914J065966Q6090
7331e312J462429J258213j277754Q70768l23993j42898j415126R6421l54632r9244
7321F8872p54535q66608J955383M97714M30306m95150r5442j131985j119040J186230
7311c24255K851938K23677J43656J155490k364161r8515P42897p0456k15505Q86662
$$ y = [3040920, 1591102, 3222426, 3097752, 2821131, 1941616, 1540984, 2000348, 1935726, 2131545, 499964, 344798, -17593, 1417005, 1307345, 936063, 431317, -834332, 668876, 700819, 1448501, 163846, 959446, 3926150, 4009549, 2520748, 3759956, 3514593, 2465070, 2074434, 1793459, 1748726, 1553873, -994507, -588980, 1162921, 1113583, 2636826, 2720321, 867420, 187590, 1127544, 1161546, -1157368, -91402, -5312, 1457117, 2715330, 1437576, 2308344, 1984351, 1841453, 426327, 522748, 168116, 68872, -685663, -1552271, 403112, 900826, 1331132, 835982, 740540, -391445, -1510485, -324255, 2527683, 2751360, 2895016, 4050506, 1686345, 1587830, 2330727, 2260271, 2044766, 2931428]
7301B931428m63442m57902L91291o07298M6812j130326J365026M21506k61438
7292B235657R98157Q38630q88968j71351o00113j319667R34693k454059J924498
7283A497477J63365K11006j028907J115569p30186p58054R6285j15913J089102
7274A539744L60858j664172M02278J615890k0996n5395Q5327j828100P02559J340902
7264B478895N72709j5510P44486O6823l74675L31385m59076j042825j54982O44002
7254B791232J36727o94925O19608J49760j412687j212812J053093J088308O26051
7245C144355j71549l67384M33821n48340k72913O35085k30260J053917j158540
7236B518192P88311j500297o48755n76822M69302J215233J32906J740761l214312
$$ y = [2931428, 2467986, 2010084, 2401375, 1794077, 1840889, 710563, 2075589, 2497095, 2235657, 3233814, 4072444, 3183476, 3012125, 2412012, 1092345, 2027038, -427021, 1497477, 1660842, 1871848, 842941, 1958510, 1228324, 470270, 566555, 450642, 1539744, 1900602, 236430, 638708, 2254598, 2233602, 2178207, 2263534, 435434, 1137993, 2478895, 3051604, 3036094, 3780580, 3847403, 3472728, 3804113, 3345037, 2302212, 2147230, 2791232, 2927959, 2233034, 2852642, 3002402, 1589715, 376903, 1429996, 2518304, 3144355, 2972806, 2605422, 3039243, 2490903, 2217990, 2853075, 2622815, 3676732, 2518192, 3306503, 1806206, 1157451, 580629, 1049931, 2265164, 2398070, 4138831, 924519]
7227I24519p22693J179654J643197O78383q24105P61213m80550m7124j022228
7218B090266r49694J477940P38728J176289k32387J282269j135715J357348k290340
7209C514704O02672n918M30005R80129q61408j886624Q4393J646291R9272j433163
7199C170353J697885J065784j229898q37096L050926M06270k853666J324555J58819
7190E953932j483890P73009o9774q77392k42623N49603L62342q67106J20168K315124
7180F533393m90796j549455p88902J325611m94611J196089j238932j185917J726273
7171E032753n03954k39870O55075J798510j411779K68317r89979J424272J604987
7162G638332j566403o28841P25163R31015j117136M98649j766130m30379J290808
$$ y = [924519, 201826, 1381480, 3024677, 3703060, 2878955, 3640168, 3159618, 3112494, 2090266, 1140572, 2618512, 3357240, 4533529, 4301142, 5583411, 4447696, 5805044, 3514704, 4117376, 4111458, 4541463, 5521592, 4660184, 2773560, 2857953, 4504244, 4603516, 3170353, 4868238, 5934022, 4704124, 3867028, 6917954, 7324224, 4470558, 5795113, 5953932, 4470042, 5243051, 5173277, 4295885, 4053262, 4602865, 4965207, 4098101, 4218269, 6533393, 6042597, 4493142, 3704240, 5029851, 4535240, 5731329, 4492397, 3306480, 5032753, 4528799, 4288929, 4944004, 6742514, 5330735, 5599052, 4609073, 6033345, 7638332, 6071929, 5443088, 6168251, 7099266, 5982130, 6480779, 4714649, 4284270, 5575078]
7153E575078j876793o2876J54731J569483k79321L97298J016763p3177q46334
7144E574852p90147R91204o94959J499421P17912k124370l94731l90682J848324
7135F236824J171529j242036J7315Q20384m03395N43834j227769K445121q59174
7126G502633j249414P85282J188725P03131j274126L42463j02994J159379j68192
7117H886887k947j121630k033R65779R53421n09486k301903J921874O39246j065828
7107H363380J035503k257297J612591J74372l5963m12161J240701J161902J287764
7098A2170792J570827q33382n86616J350530k279252j034420L150162r30694O83715
7089A3261662m6024J826911M11035L7872L932n20592J271356Q68462P30912J03838
$$ y = [5575078, 3698285, 3635409, 3790140, 5359623, 5080302, 5477600, 6494363, 6421186, 5574852, 4784705, 5775909, 5080950, 6580371, 7298283, 5173913, 4779182, 4388500, 6236824, 7408353, 6166317, 6183632, 7004016, 6600621, 7144455, 5916686, 8361807, 7502633, 6253219, 7038501, 8227226, 8930357, 7656231, 7998694, 7895700, 9055079, 8886887, 8883940, 7762310, 7760277, 8726056, 9679477, 9169991, 6868088, 8789962, 9429208, 8363380, 9398883, 7141586, 8754177, 8928549, 8892586, 8480425, 9721126, 10883028, 12170792, 13741619, 12908237, 12321621, 13672151, 11392899, 10358479, 13508641, 12577947, 13261662, 13215638, 15042549, 15453584, 15491456, 15495388, 14974796, 16246152, 17114614, 17845526, 17949364]
7079A7949364l93362J660442K284429O4421M97068L95539J588991J654895j043064
7070B4658723J921820j43268J7813J21522R21468P03109J116936J554374K654703
7061C3527200L596551M047170M312025K978906Q02943L751537L312161j338549
7053E4989944k343175j513085L6490k391580r12834K204417L02450j235861L92868
7044D9529634p6972j279604l179417j389953R09636j913716k270903q42796j535157
7035C7950752Q1610L6106L96263J348918K308231K762079J73202k070835p84972
7026D2201354k547419J77370k89826j827067L10153m384533k225623m15493p85952
7017C0212964j236179j696618n66012l67935o21511k174022o16182l9485p10781
$$ y = [17949364, 17556002, 19216444, 21500873, 21565294, 22062362, 22457901, 24046892, 25701787, 24658723, 26580543, 26437275, 26455088, 26576610, 27498078, 28201187, 29318123, 30872497, 33527200, 37123751, 41170921, 45482946, 48461852, 49264795, 53016332, 56328493, 54989944, 52646769, 51133684, 51170174, 48778594, 47865760, 50070177, 50372627, 49136766, 49529634, 49452662, 48173058, 44993641, 43603688, 44513324, 42599608, 40328705, 39485909, 37950752, 38032362, 38068468, 38464731, 39813649, 42121880, 44883959, 45057161, 42986326, 42201354, 39653935, 39831305, 39541479, 37714412, 38024565, 33640032, 31414409, 30998916, 30212964, 28976785, 27280167, 26714155, 26346220, 25724709, 23550687, 22934505, 22895020, 22184239]
7008B2184239J232806o64169j391257j298052j502849J390308j599805j375494
7000A6975727J776332J192535J19677j024689J05963J039573Q64590n50442J177401
6991B1676667p33374P3398K64561N02872P04778n5566J28409Q81059m05343R18734
6981B3956195N53126j458198o58554K086334o446j515215J80203R91336l95606
6972B3733175K654849K482576Q19767j152690J095457P46241M3336o53393o32592
6963B9136726m92735J500055K142186J566905P62591N24809K722736L516538o28527
6954D0751284J492498J211628k07611K185631O66521J528445r75174p00249K43334
6945D6196307J016400r84527o13066J705496K57319j255488M128680J046755K175854
$$ y = [22184239, 23417045, 22752876, 21361619, 20063567, 18560718, 19951026, 18351221, 16975727, 18752059, 19944594, 20064271, 19039582, 19145545, 20185118, 21049708, 20499266, 21676667, 20943293, 21016691, 21281252, 21784124, 22488902, 22433336, 22561745, 23442804, 23037461, 23956195, 24509321, 23051123, 22392569, 24478903, 24472457, 22957242, 23137445, 24128781, 23733175, 26388024, 28870600, 29690367, 28537677, 29633134, 30379375, 30422711, 29769318, 29136726, 28643991, 30144046, 32286232, 33853137, 34615728, 35140537, 37863273, 41379811, 40751284, 42243782, 43455410, 43247799, 45433430, 46099951, 47628396, 46653222, 45952973, 46196307, 47212707, 46228180, 45615114, 47320610, 47577929, 46322441, 50451121, 51497876, 53673730]
6936E3673730L339547J927233J420279K466323L786226L729600M233391K832067
6928G7408396K830835L789580N144506K315036J704960K449947r08785K112248
6920I6846723K030217j07199j84924K503876L812105J0622071J0220662J1733045
6912A37476576Q215790K1432360K3085813L4805142N9614597R8917327J6752629
6905D00300234o2379832p3608563o5546600l6415317k8792476j9001710j7059865
6898I7495871j1145675j0353801l525765p979656k457524l157290m264799m364885
6890E0246476j319556j659829j336824l074973j356261r13493k066897o45402
6882C7873241n97971j775836k82394M84534j478050m36143q8217l032570j826317
$$ y = [53673730, 57013277, 58940510, 60360789, 62827112, 66613338, 70342938, 74576329, 77408396, 80239231, 84028811, 89173317, 91488353, 93193313, 95643260, 94734475, 96846723, 98876940, 98769741, 98584817, 101088693, 104900798, 115522869, 125743531, 137476576, 145692366, 167124726, 190210539, 225015681, 284630278, 383547605, 400300234, 337920402, 264311839, 198765239, 162349922, 133557446, 114555736, 97495871, 86350196, 75996395, 72470630, 64490974, 62033450, 58876160, 54611361, 50246476, 48926920, 47267091, 45930267, 42855294, 41499033, 40585540, 38518643, 37873241, 37275270, 35499434, 35217040, 35701574, 34223524, 33787381, 33699164, 30666594, 28840277]
6873B8840277j20040J341960j357070j002188m9250R36q198J370463j771913J066304
6863B8311281l17125J218413k374696r65426O61253k113322j736408M75566J46279
6854B3305815L3016j648321j9855K926236J96713k413714o73303n87478P54048
6845B1873157J720430j809460R62507r63000k08349J368678L589973J506955k752838
6836B5288053K616574j4726P97415r71132K315519O65460o64048n54229k748029
6827B6730857L99195l62627o64284o58698R32553M23373O44743j71511p28746
6818B6544855L328458K477192J388861O4748M3244M720741M189069j277316j759645
6809C9720207p30353M270038r51504j397424j645157r88601j325144r50414j380975
$$ y = [28840277, 28720237, 30062197, 28705127, 27702939, 27653689, 27654625, 27646427, 29016890, 27244977, 28311281, 27994156, 29212569, 26837873, 25872447, 26533700, 24420378, 22683970, 23159536, 23305815, 23338831, 21690510, 21670655, 24596891, 24793604, 22379890, 21706587, 21119109, 21873157, 23593587, 21784127, 22746634, 21783634, 21575285, 22943963, 26533936, 28040891, 25288053, 27904627, 27889901, 28687316, 27716184, 30031703, 30697163, 30033115, 29478886, 26730857, 27130052, 26767425, 26103141, 25444443, 26376996, 26800369, 27445112, 27273601, 26544855, 29873313, 32350505, 33739366, 33804114, 33847358, 38568099, 42757168, 41479852, 39720207, 38989854, 43259892, 42308388, 40910964, 39265807, 38277206, 36952062, 36001648, 34620673]
6800C4620673j139903K51205r42078K241042Q1140J862609J242493L567396K530911
6791D4315488J269183R60351K72448r62883J645053j285913j496872N94536j104402
6782D4206989k485766q41314k433036j807254k980542j873069l138554k434329
6774B6213125O11715p01839n79657p61813K694804L080791K283878O31611p37697
6765C2734918J33599j520545n26562N76607k191927j372531k187006k641694l442942
6756A9561917k933778j264309q3018j122410L62471K73373k648605L112440k167719
6747A3090362m39264k96545n09929O18772K003627O20771o5493l32987k174374
6738A2514940p29712q22005m70j439276o77098J015538k151184k421376J031750
$$ y = [34620673, 33480770, 33731975, 32789897, 35030939, 35112079, 36974688, 38217181, 41784577, 44315488, 45584671, 46545022, 46817470, 45854587, 47499640, 46213727, 44716855, 45311391, 44206989, 41721223, 40879909, 38446873, 36639619, 33659077, 31786008, 28647454, 26213125, 26824840, 26123001, 25543344, 24781531, 27476335, 30557126, 32841004, 33472615, 32734918, 32868517, 31347972, 30821410, 31398017, 29206090, 27833559, 25646553, 23004859, 19561917, 16628139, 15363830, 15280812, 14158402, 14520873, 14794246, 12145641, 15258081, 13090362, 12651098, 12354553, 11844624, 12463396, 14467023, 15087794, 15022301, 14689314, 12514940, 11785228, 10963223, 10962753, 9523477, 8846379, 9861917, 7710733, 5289357, 6321107]
6729F321107K35260j049360J774234R31432p43810k086152L37897k8276o50491
6720E041841R80317J83413j122588l94935O30142r40796J320028R05869O6701
6711F669992m82415j155010M75068J486111k144374P37355l87311j865693K044312
6702E378035j876089n56637N58833O34082p59451R20935L24274j766556O82617
6693C540043O8762R12764p37398L0991L21157j170614n16591J166267m58784j5740
6683C140857J28679r64955J669162J99640m63411k100966Q69195j121180k45391
6674A111630R16474M09476O78498j19719J711267r78671j203380n10131K441642
6665D457086q87694p80798j073626O9298m51100L34081J551931j025935R27283
$$ y = [6321107, 6556367, 5507007, 7281241, 8212673, 7468863, 5382711, 5720608, 5692332, 5041841, 6022158, 6205571, 5082983, 4688048, 5318190, 4377394, 5697422, 6603291, 6669992, 6187577, 5032567, 5507635, 6993746, 4849372, 5586727, 5199416, 3333723, 5378035, 3501946, 2945309, 3504142, 4138224, 3378773, 4299708, 4623982, 2857426, 3540043, 3608805, 4521569, 3784171, 3815162, 4136319, 2965705, 2449114, 3615381, 3156597, 3140857, 3269536, 2304581, 3973743, 4173383, 3709972, 1609006, 2478201, 1357021, 1111630, 2028104, 2437580, 3116078, 2996359, 4707626, 3728955, 2525575, 2015444, 4457086, 3569392, 2788594, 1714968, 1784266, 1333166, 1667247, 3219178, 2193243, 3120526]
6656C120526p04159M64745q56493J78898K403775k66501o28477j13240k02352
6647C396722j257474j549712K566420M84819j656179r09800N31639J062195J42690
6638B811320N24902k209142K623275j162397K52698J805113j303200j180498M0463
6629B202534N87645r99635P36841J76280J142200R7009j825949O61303q46061
6620A932167P19524N56995j37720j935464k44664j24450L349415k431272m50792
6611A233739K87338J156265j780016m40345J338643j14081O1147L33068K476388
6602D552146K79256m90970k703650J620331k44158q67038j70302L05338J57295
6593B438248Q00080k045542O57541J97548O80849J351792l40128p55203p51579
$$ y = [3120526, 2416367, 2881112, 2024619, 2203517, 4607292, 4340791, 3712314, 3599074, 3396722, 2139248, 589536, 3155956, 3640775, 1984596, 1074796, 1606435, 2668630, 2811320, 3336222, 1127080, 3750355, 2587958, 2840656, 4645769, 3342569, 2162071, 2202534, 2790179, 1790544, 2527385, 2703665, 3845865, 3942874, 2116925, 2778228, 1932167, 2651691, 3208686, 3070966, 1135502, 890838, 766388, 4115803, 1684531, 1233739, 1521077, 2677342, 897326, 456981, 1795624, 1681543, 1742690, 2075758, 4552146, 4831402, 4340432, 1636782, 3257113, 3012955, 2145917, 1975615, 2280953, 2438248, 3238328, 1192786, 1850327, 2047875, 2728724, 4080516, 3740388, 2985185, 2233606]
6584B233606j74688J035155j062687J132519r89995J551402M97436k009200J078967
6575C292515Q67790j4596o93018q83495j276261J40450o35890J183966J2878o45513
6565A348826J175431j553441J329530j158135J716549R98941j562630M9042l70313
6556A973800q637o77851P8492J096109K188639q07525m51697R65067n11959N6374
6546C900812j634901J22757j950206k28778P24043J264176j468744p88680K368028
6537B308507k702535J384771m44433j338928J245175o29911N19592M80688P2188
6528H95114P83017L93261p32328P11513j357247q44314J706287l95280J283331
6519B443354j44513L35909k224990J136000J463364j121721q21990N65572j70929
$$ y = [2233606, 2058918, 3094073, 2031386, 3163905, 2173910, 3725312, 4222748, 2213548, 3292515, 4160305, 4145709, 3452691, 2569196, 1292935, 1433385, 797495, 1981461, 1994339, 1348826, 2524257, 970816, 2300346, 1142211, 2858760, 3857701, 2295071, 2344113, 1973800, 1965163, 1287312, 1365804, 2461913, 4650552, 3843027, 3391330, 4356397, 3844438, 3900812, 2265911, 2388668, 438462, 209684, 933727, 2197903, 729159, -59521, 2308507, -394028, 990743, 546310, -792618, 452557, -177354, 342238, 822926, 895114, 1678131, 2071392, 1339064, 2050577, 693330, -150984, 1555303, 1160023, 2443354, 2298841, 2634750, 409760, 1545760, 3009124, 1887403, 1065413, 1630985, 1460056]
6510A460056q74367r48114P46910P81078J6887l70723n70860n16084p9694k18253
6500e73164m3873J338199j101774Q93443K409485q9838j497077m07756J526529
6491B454174K18286j236720q09438O11226N30924J822349J14808k243106j64532
6482A297971j823561n9696P14395n91390M62450N58446J73303l57846K34188o83171
6472g4911O42757Q057J940115J779243j658427p62170N90771r0451r0193j264349
6462A020442m4135k208875J578852Q06494r0346J462503m73913k268296K93870
6453G6596q54898Q58118J095347K17596n83428P60697J13937j836138M46715j689811
6443a395269J676590n69310J230125N4106n54234j200005J691526P1948o508p89545
$$ y = [1460056, 585689, -362425, 384485, 1165563, 1182450, 811727, 240867, -275217, -354911, -573164, -617037, 721162, -380612, 512831, 2922316, 2832478, 1335401, 927645, 2454174, 2672460, 1435740, 626302, 1237528, 1768452, 3590801, 3705609, 1462503, 1297971, -525590, -585286, 129109, -462281, 169, 558615, 731918, 374072, 608260, -74911, 567846, 575903, 2516018, 4295261, 2636834, 1874664, 2465435, 2374984, 2284791, 1020442, 976307, -1232568, 346284, 1152778, 1062432, 2524935, 2051022, -217274, 76596, -778302, 79816, 1175163, 1392759, 809331, 1570028, 1683965, -152173, 294542, -1395269, 281321, -287989, 942136, 996242, 442008, -757997, 933529, 1005477, 998969, 209424]
6433B09424l03436p81730J039020L04788l35175k2419K118509j077031j534671
6424c82721J079357o47034J153055o48514j114765M44503R72070p38026l03542
6415a85617R3716k75006J163901Q14560N16789n05393j884704q5502l90190R96482
6405B59036P53995R61790j872037j174051R54916R42876J468342j286018j087596
6396g8747J366662j23204l88880m48546q69271K144162J699706k552773j284424
6387e35315K228497j76287n44237K93455R99298j20635j996501J123805r36999
6378C35081j237619J777354l19813l15029R70321l05078j652712J693767q47772
6369I8500o5530q92157L94832N0116K44096J66519k56555L71696N44607J864883
$$ y = [209424, -94012, -875742, 163278, 468066, 132891, 110472, 2228981, 1151950, -382721, 696636, 49602, 1202657, 554143, -560622, -116119, 855951, 117925, -185617, -91901, -366907, 796994, 1611554, 2128343, 1622950, -261754, -347256, -737446, 259036, 1013031, 1974821, 102784, -1071267, -116351, 826525, 2294867, 1008849, -78747, 1287915, 1164711, 775831, 327285, -541986, 1602176, 3301882, 749109, -535315, 1693182, 1516895, 972658, 1266113, 2265411, 2144776, 148275, 1272080, 335081, -902538, 874816, 555003, 239974, 1210295, 905217, -747495, 946272, 98500, 32970, -859187, -464355, -414239, -170143, -3624, -260179, 111517, 656124, 2521007]
6359B521007j340408j540889k58710J041246Q11439j790821r2943J993363p46467
6350E96817j017955J025244r86321n78139j099188J270080M96762j466376J642113
6341a16963l1108p69883L32232K502509k148352q1717J188913j594638J113804
6332C94797L83697K235775k247830m22061L58540k694975l31244K713164j159504
6323g69641r54555K245546k311746l68837P94542K373206l40823j263720j20919
6314g16947J798222j11033m40812j898526n26942N28600J006351r28214J647161
6305C57860O564j865831K603981J895975j275143o0377j43616j611967J79306
6296H6752J002202r60391J8343q14723N48095N82485K03601L14926Q84651o95901
$$ y = [2521007, 1180599, -360290, -619000, 422246, 1233685, -557136, -650079, 1343284, 596817, -421138, 604106, -382215, -960354, -2059542, -789462, -292700, -1759076, -116963, -148071, -917954, -585722, 1916787, -231565, -313282, 875631, -719007, 394797, 778494, 3014269, 766439, 344378, 702918, -1992057, -2323301, 389863, -769641, -1724196, 521350, -1790396, -2159233, -1364691, 1008515, 667692, -596028, -716947, 1081275, 970242, 529430, -1369096, -1896038, -1367438, -361087, -1289301, 357860, 364424, -1501407, 1102574, 2998549, 1723406, 1663029, 1519413, -92554, 86752, 1088954, 128563, 146906, -667817, -119722, 462763, 666364, 981290, 1865941, 1170040]
6286A170040j594472o80709J022007R77421N42961j540177n92778l67572Q1056
6277i82223J666719N67917P37083p56111r94312J648686j113769J85786K41957
6268A201733j445529J021815p09805J544366k179825J175075j242434K86917m45938
6259g93625q51602K310364L06281j004953R15587m26133q33143J338765q18806
6250A42735j361109Q59589q25600n17672J806965j507367K9123L6297j358584
6241b695623R97428j38969Q08287Q04161j014792k21365L45041O47174j554721
6232b023379J868187Q47465o94390k20671N27748j066642P59792J485303j087742
6223C95671j199158m82196k73764J508057j034741m82367K940540K685j879733
$$ y = [1170040, -424432, -1105141, -83134, 894287, 1437248, -102929, -695707, -1063279, -982223, 684496, 1252413, 1989496, 1233385, 239073, 1887759, 773990, 959776, 1201733, -243796, 778019, 68214, 1612580, -567245, 607830, -634604, -347687, -793625, -1645227, 665137, 971418, -33535, 882052, 455919, -377224, 961541, 142735, -1218374, -358785, -1184385, -1702057, 104908, -1402459, -1373336, -1337039, -2695623, -1698195, -1837164, -1028877, -224716, -1239508, -1460873, -1115832, -468658, -2023379, -155192, 692273, -2117, -222788, 304960, -761682, -1890, 1483413, 395671, -803487, -1285683, -1559447, -51390, -1086131, -1568498, 1372042, 1374727, -505006]
6214e05006o01697J953966n05221M06394l11859L84181J080095l0551j269431
6205F00871k94580k507425k44831K724501k283516M46249J557092M62879K37886
6196F99126j237320n60399r44497M0744K245248j56005j051964J720725r76581
6187b20923M11594Q84470N30433j325810P77492n27909j026217J616112N27404
6178A646646l49553J34416p13175p34647J86520j652350q76718J863093M14944
6169h0824j183618O81305o12401j058507Q31686l40522M17636K029411J03995
6160G88161k06913k31338m62772J72723j164166L07350K95302J120820r31536
6151c12369k191802j71642r1587R49798M71193q24355K470945J336454p97754
$$ y = [-505006, -1106703, 847263, 342042, 748436, 436577, 820758, 1900853, 1870302, 600871, 306291, -2201134, -2445965, 278536, -2004980, -1558731, -1639, 461240, 699126, -538194, -1098593, -2043090, -2002346, 242902, 86897, -965067, 755658, -220923, 190671, 1075141, 1605574, 279764, 1057256, 529347, -496870, 1119242, 1646646, 1297093, 1431509, 718334, -16313, 170207, -1482143, -2358861, -495768, -80824, -1264442, -583137, -1195538, -2254045, -1422359, -1762881, -1345245, 684166, 788161, 581248, 349910, -112862, 59861, -1104305, -796955, -501653, 619167, -312369, -2504171, -2675813, -2767400, -1817602, -1346409, -2170764, 300181, 1636635, 838881]
6142H38881j390534N61764Q21420j406566L46815n66076J42708K21008J046320
6133F15740J029748j266610r99453R737J211166m37053m84142j138583n63588
6124b023038M08504J175979M26153j545454O44148q47944J18448J552499q14698
6115i05403p3944J217536K927m16461J81606q92769N35790L569627k313805j299374
6105c94270l20170k75429L45466P3469Q18907j73634j655991K328073P7937K29019
6095A053377k261639k76081J559764O90878j93719k785674P11373R43149J757058
6086A198486j456383J05853l6894J98012k19542L70515p70053j565219K796127
6077F20902j809102j087124O49639J976261l01258m8395K12925q39706p4613o00221
$$ y = [838881, -551653, 10111, 831531, -575035, -228220, -794296, -651588, -430580, 615740, 1645488, 378878, -620575, -610838, 600328, 163275, -320867, -1459450, -2023038, -1614534, -438555, -12402, -1557856, -913708, -1761652, -1643204, -90705, -905403, -979347, 238189, 241116, -175345, 6261, -886508, -350718, 3218909, 905104, -394270, -714440, -989869, -644403, -570934, 247973, 74339, -1581652, 746421, 824358, 1053377, -1208262, -1484343, 75421, 766299, 572580, -2213094, -1501721, -558572, 1198486, -257897, -152044, -188938, 9074, -210468, 160047, -610006, -2175225, 620902, -1188200, -2275324, -1625685, 350576, 49318, 923, 213848, -625858, -700471, -1300692]
6067a300692J757641Q4059k83083p84076p84240J022279R37765q00416n69032
6058g19795J54241O36677j580546l0781J409351J705127j947239n76532Q41839
6049a07658j454668J79536J247663L05664O01873p96437p3283m08820r68809J115775
6039c59164j7186Q82989r86050n72511M69366P66419q34767j271462k43105J48542
6029b016929m09863J378189k966P72943o9776K21099n99038j090927J744433J844400
6019A771565j856418k38316L30611Q97500o22918k076656R17419N48839j132584
6010a460958p97067Q03276J158463O53108r22969J75605J395864J83181n73125
6001F15378q1870m3585o17741K009170n15841k069582m01018J666578Q97483l01100
$$ y = [-1300692, 456949, 541008, 257925, -526151, -1310391, -288112, 649653, -150763, -719795, -565554, 71123, -1509423, -1540204, -130853, 1574274, -372965, -949497, -107658, -1562326, -1382790, -135127, 170537, 772410, -24027, -97310, -506130, -1474939, -359164, -376350, 506639, -479411, -1051922, -582556, 183863, -650904, -1922366, -2165471, -2016929, -2426792, -1048603, -1051569, -278626, -348402, -127303, -726341, -1817268, -72835, 1771565, -84853, -323169, 7442, 904942, 282024, -1794632, -877213, -328374, -1460958, -2258025, -1454749, -296286, 356822, -566147, -390542, 1005322, 1188503, 615378, 533508, 489923, -127818, 1881352, 1365511, -704071, -1105089, 561489, 1458972, 1157872]
5991A157872j043304J07566j210305j330830L103187M95074j889876m20525R70848
5982f0293o30751k87648J66273M96371j023155j970322J834963J088218N31369
5973A45025j61781N53522J165534q21831q77805j244944J256968j914878o4489
5964a964679p77929J711728k34416N21587J729527J02471o88862p07514J55407
5955a52680R85704P21518j826446j493969Q17501j120746K49660L814n68428R37700
5945a446372j515983J898446O72623m25062l47969q57081J746321k21615M82579
5936a4113l95124q74452J362014O8851k312922N80430K13425M83253j309769K32034
5926a966373N80554P28703k68927n14224J7663J447760j412771l6059K471279
$$ y = [1157872, 114568, 222134, -988171, -2319001, 784186, 1279260, -610616, -1031141, -60293, -691044, -978692, -812419, -316048, -1339203, -3309525, -1474562, -386344, 145025, -16756, 536766, 1702300, 880469, 2664, -1242280, 14688, -1900190, -1964679, -2742608, -1030880, -1265296, -743709, 985818, 1088289, 399427, -308087, -152680, 833024, 1554542, -271904, -1765873, -948372, -2069118, -1819458, -1815644, -2384072, -1446372, -2962355, -1063909, -391286, -816348, -1164317, -2021398, -275077, -496692, -14113, -409237, -1283689, 78325, 147176, -2165746, -1585316, -1371891, -888638, -2198407, -1966373, -1385819, -657116, -926043, -1440267, -1422604, 25156, -1387615, -1423674, 1047605]
5917A047605k9901n21793j171092r8298j612731K92192Q16448M02531O72325J56652
5907d6062J29957j367367L9073m22650J491280J93470j317032K47667j6363R85812
5897h2215n67374J310506j308673J007207j721278j145195J639846n50933J243105
5888a75004j404623j323861R48337M12904J386044j432117l69614l45056J071817
5879a231173K281283k153642k35743n80845J833556J006575r73046K62034k307526
5870b098527J519006j492501K10041K809073Q68622k441317m1905p7740J357616
5861F12368j311868J41463J856896l185706j352081K299174Q97334j78326J047011
5852H26265j482047O1025k13108Q44213j63825M08057j25993j432435J449596
$$ y = [1047605, 1017704, 495911, -675181, -773479, -2386210, -2094018, -1277570, -875039, -202714, -46062, 83895, -1283472, -1244399, -1667049, -175769, 17701, -1299331, -1051664, -1068027, -82215, -649589, 660917, -647756, 359451, -1361827, -2507022, -867176, -1418109, -175004, -1579627, -2903488, -1955151, -1542247, -156203, -1588320, -1957934, -2302990, -1231173, 1050110, -1103532, -1339275, -1920120, -86564, 920011, -53035, 208999, -2098527, -579521, -2072022, -1861981, 947092, 1815714, -625603, -667508, -745248, 612368, -699500, -558037, 1298859, -1886847, -3238928, -939754, -42420, -220746, 826265, -655782, -594757, -807865, 36348, -127477, 280580, 154587, -1277848, 171748]
5843A71748Q38697j207982J237892p51813k745818J370824J801590L49292r40156
5834A24274o94361L75887J77903k81129j595454P72928O80293K42089k12540j722847
5824b132957M01566M21156j284439j83503K304634j59797N94232l16148r18500
5815a273756n57065J289679j69573N37025j506321M54934n3697j181855p94923
5806c255552Q53741K864545l71174l28763o88628J129609K42821J929917o80817
5797A695699j429271k6471j691946R68558j94706j161057N0941K325703N72391
5788A109841P013j059329j665550K47031J906007l62885k152313L95454K000266
5779D25535k66058O28173j363796m64723L480841k456388n80653L55516n13010
$$ y = [171748, 1010445, -197537, 1040355, 288542, -2457276, -1086452, 715138, 1064430, 124274, -570087, -194200, -16297, -297426, -1892880, -1119952, -439659, -197570, -410110, -2132957, -1731391, -1310235, -2594674, -2778177, -473543, -633340, -39108, -355256, -1273756, -1830821, -541142, -710715, -173690, -1680011, -1225077, -1278774, -2460629, -3255552, -2401811, 462734, 91560, -237203, -925831, 203778, 446599, 2376516, 1695699, 266428, 239957, -1451989, -483431, -678137, -1839194, -1788253, 537450, 1109841, 1116854, 57525, -1608025, -1360994, 545013, 182128, -1970185, -1574731, 425535, 159477, 787650, -576146, -1040869, 2439972, -16416, -597069, -241553, -754563]
5770g54563J638329K96984q40833J050635k368529P33636m20811j759856K350607
5761g4401K737p99988m30167J55837J302235k59649m34824O4516O22137j199681
5751a051248o80930K903697M83703l879462l03227K595089N76546j385439J734102
5742I92831j841498r02295o79052J576825P02270K98523j881711n41318j33158
5733b408583J004846J487783j068837J236359K30504j378187j647609J853451
5725f90273J217878P80188q26804L88537r11173K05544K022236j643663p22546
5716a80076J595598j001760j647459n07901J929426o27869j59749R67533j806090
5707a438347J20320J92906O45058J722256j155000j759294J9109m51608M43098
$$ y = [-754563, 883766, 1180750, 339917, 1390552, -977977, -244341, -665152, -2425008, -74401, -71664, -871652, -1301819, -1145982, 156253, -103396, -538220, -473704, 148433, -1051248, -1732178, 1171519, 1655222, -2224240, -2527467, 67622, 644168, -741271, 992831, -848667, -1750962, -2430014, -853189, -150919, 147604, -1734107, -2275425, -2408583, -1403737, 84046, -984791, 251568, 482072, -896115, -2543724, -690273, 527605, 1307793, 480989, 869526, -41647, 163897, 2186133, 542470, -180076, 1415522, 413762, -1233697, -1741598, 187828, -440041, -599790, 367743, -1438347, -1318027, -1125121, -480063, 1242193, 87193, -1672101, -1652992, -2104600, -1661502]
5698a661502L0368J268181M46316j397242J121493k00711n85807J188511k96647
5689h7040o17306N85997k204990M76436J64532J509893J16979J28403o70565K30402
5679c67259R3783N46260o95616m51967M83513k58087k60999M72062N4129L03904
5669h0277J526196k541528k77669j088529N59679K502039k9981j946297j74084
5660a550451J439362q54357M07680j25064J008877R27579k29224M97700r84276
5651E37826j141498j243003K146444p80895l03008j257869J438615O06712o31270
5642f27946R95808o1517k44605Q8257j877548P67222J053324O30957J002028k352191
5632f26211K7518J55529j901041L317759m69953J20992K41871m5509m78821K24655
$$ y = [-1661502, -1631134, -362953, 83363, -1313879, -192386, -393097, -978904, 209607, -87040, -704346, -118349, -2323339, -1846903, -1682371, -172478, -55499, 72904, -597661, -367259, -273476, 272784, -422832, -874799, -391286, -649373, -910372, -438310, -384181, -80277, 1445919, -1095609, -1373278, -2461807, -1902128, 599911, 569930, -1376367, -1550451, -111089, -965446, -557766, -682830, 326047, 1253626, 1024402, 1522102, 537826, -603672, -1846675, 299769, -481126, -784134, -2042003, -603388, 3324, -627946, 367862, 306345, 61740, 149997, -1727551, -960329, 92995, 723952, 1725980, -626211, -598693, -443164, -2344205, 973554, 503601, 624593, 866464, 820955, 342134, 566789]
5622E66789L10377j323655N66739r00561l69634J230261J294210P8774M79960
5613A933260k001185p09500q41749P94028j17358j625391P77624R26298O72965
5604a91008J014457M79555K30422k02655n33594j441013J9393K90143K09006j533382
5594a658676J129233J892091m05456l18189O56382j116530m75266j786536J723869
5585c59078N20637n30115L7520J285330Q66076j436572j289470r61377k12896
5576b079945J51060j170581K082672K099372q6093L60040J73840N80947j225233
5567H86079j281503n25033M29626p2155J690651J97870j611654p96448P67236
5558c15331N75526J112749o92890m60749j69712r02659Q51148j055948m71344
$$ y = [566789, 877166, -446489, 120250, -780311, -1149945, 80316, 1374526, 1453300, 1933260, -67925, -777425, -1619174, -825146, -942504, -2567895, -1790271, -863973, -191008, 823449, 1303004, 1533426, 1330771, 797177, -643836, -624443, -334300, -125294, -1658676, -529443, 1362648, 957192, 639003, 1295385, 178855, -296411, -2082947, -359078, 161559, -368556, -331036, 954294, 1820370, 383798, -905672, -1867049, -2079945, -1928885, -3099466, -1016794, 1082578, 996485, 1356525, 1530365, 2111312, 886079, -395424, -920457, -490831, -562986, 1127665, 1325535, -286119, -1082567, -315331, 260195, 1372944, 680054, 219305, 49593, -853066, -1918, -1057866, -1529210]
5549a529210Q23697J043826Q1906n40254k19502k75040P82790J142824n2776j099469
5539A58792j782480k33492n25570R73968J13443P24360j412921R98315J694528
5530G08943p06297N47526r97088J276168R8595q63405Q15713j50938K34382j807058
5520h43459j405491J874164n98469J416994K537949k386157j515700O02260K52882
5511f5027N32139l40188j044289k194736J155846l3761K81601J095066M34518
5502a78831J35025N8132P98857P16342n37741J74448n26480k313353m78928K575118
5492D22589J307717p92339O41385m37805p86421o51179R38446n29907q59872N11184
5482b36202R57068J930133J32235P79335J910766o13923l469959r0403P04628
$$ y = [-1529210, -705513, 338313, 420219, -120035, -339537, -614577, 168213, 1311037, 1258261, 158792, -1623688, -1857180, -2382750, -1408782, -1295339, -570979, -1983900, -985585, 708943, 2646, 550172, -446916, 829252, 927847, 64442, 880155, 729217, 963599, -843459, -2248950, -374786, -973255, 443739, 2981688, 595531, -920169, -317909, -65027, 467112, 126924, -917365, -3112101, -1956255, -1990016, -1708415, -613349, -178831, -43806, 14326, 813183, 1529525, 991784, 1166232, 639752, -1673601, -2152529, 422589, 1730306, 937967, 1579352, 1141547, 355126, -296053, 642393, 112486, -747386, -236202, 720866, 2650999, 2783234, 3562569, 5473335, 4859412, 1389453, 1299050, 2003678]
5473B003678j581705j653931J159005q32694L10356J897712j426682R27164L93187
5464A196090l345701K15951n41950O16120M27340J349000n85575M10439k1236
5455b79522J074895L42746k28612J36943j709133R9180l10727O55471p64626J664916
5445F81531m01514J436289m56169R32578j082396k171351P43595n6058N30123
5436A56628l32179M51232r6594O06179k802213J144105m52484Q9308O22378K406971
5426A793331j47819j409928J300030j252991P3363j001262L8252J137079L82067
5417I12122j012981j185674J649510q32290l31284J117293p02641q61881P27866
5408e19960K862540k40917k725648Q27606J465323j015244R18587j254170J34775
$$ y = [2003678, 421973, -1231958, -72953, -905647, -595291, 1302421, -124261, 802903, 1196090, -2149611, -1933660, -2475610, -1859490, -1432150, -83150, -668725, -258286, -279522, 795373, 1138119, 909507, 1046450, -662683, -563503, -874230, -218759, -983385, 681531, 280017, 1716306, 1260137, 2192715, 1110319, -1061032, -317437, -373495, 156628, -175551, 275681, 179087, 785266, -2016947, -872842, -1325326, -1236018, -613640, 1793331, 1645512, 235584, 1535614, 282623, 355986, -645276, -607024, 530055, 912122, -100859, -1286533, 362977, -469313, -800597, 316696, -385945, -1247826, -519960, 2342580, 2101663, -623985, 203621, 1668944, 653700, 1572287, 318117, 452892]
5399D52892j478661j618486K153490K84003j385012P35130Q88402K99550j880932
5390a549624k05975O53230L96213K120434j764056J021967n0822l57608O52405
5381I16164r23819o39902l85950k64593J949067N58350j046899J683056j341173
5372E04301n42728n07401J222206n47356R37888k427514K091941R20979k20670
5363A431646q76116j869660J252980Q08914N20005L03185q04934l86690O27947
5354A007277j027971k53223J379437q10730O63539L35121p87442R87853M66886
5345A960747j772910q4724K6899l81645J256719Q27172r18675J015498m02266
5336A526815r45987P09811k05370K426266j851911p49765l56949p55543J086448
$$ y = [452892, -1025769, -2644255, -490765, -206762, -1591774, -856644, 31758, 331308, -1549624, -1755599, -1102369, -706156, 1414278, -349778, 672189, 621367, 263759, 916164, -7655, -647557, -1033507, -1298100, 650967, 1209317, 162418, 1845474, 504301, -38427, -545828, 676378, 129022, 1066910, -1360604, 731337, 1652316, 1431646, 555530, -1314130, -61150, 747764, 1267769, 1570954, 766020, 379330, 1007277, -20694, -273917, 1105520, 294790, 958329, 1293450, 506008, 1493861, 1960747, 187837, 103113, 130012, -251633, 1005086, 1832258, 913583, 1929081, 1526815, 580828, 1290639, 1085269, 3511535, 1659624, 909859, 552910, -202633, 883815]
5327H83815P00400O54144j340727J165169N84832j298237p48229J316372K77562
5318B195101n92322J04255n15699j182110Q62514L77120j440095K344666j46167
5309B007263R80221m8598J050369N76433J223369k749523m3430L51927J434195
5300D782226J45460j001600n71605q54728J389457j343367o98042J862522o67422
5291C042901j113552K661732n94500j566833J116640J390723j381901j156364
5283B398846J13311k059869J552564P07222m80958r46649L94639k62868P13595
5274B129833k538562K384339m5520l173579L614170j744704k231585J463190J142802
5265A000384q88439j10943R66619J98221J941051P31404l140280j75681R43740
$$ y = [883815, 1584215, 2238359, 897632, 2062801, 2647633, 1349396, 601167, 1917539, 2195101, 1602779, 1707034, 1191335, 9225, 871739, 1248859, -191236, 2153430, 2007263, 2987484, 2938886, 3989255, 4565688, 5789057, 3039534, 2996104, 3348031, 4782226, 4927686, 3926086, 3354481, 2499753, 3889210, 2545843, 1847801, 3710323, 3042901, 1929349, 4591081, 3996581, 2429748, 3546388, 4937111, 3555210, 2398846, 2512157, 452288, 2004852, 2712074, 2231116, 1284467, 1679106, 1416238, 2129833, -408729, 1975610, 1930090, -1243489, 2370681, 625977, -1605608, -142418, 1000384, 111945, 1002, 967621, 1165842, 3106893, 3838297, 698017, 522336, 1466076]
5256A466076R84199j081306O89564L52897R00393q99890P90244m44704M05157
5247C162630j599149K715005k96748j667920j183583p6039j28977k60460M4848
5238G09607J024840N7811j095600l49383J245565n84114j481540K237803M2926
5229A807915n99226j47518L75543J91260M6250r52527J811748O124n73678j172866
5219G93025K424745j76630j757364o79167J384455q56677J213964M6065l35645
5210B056771J41175J519586r09535p18091J066060n93627r71751J244872J866513
5201D701973j059151Q73583j1575n23370m98466P62304J244871r5892k5787k297197
5191C071293M82243K98866K395764N02427k930706j0523K310023J852489j287857
$$ y = [1466076, 2450275, 1368969, 2058533, 2411430, 3311823, 2411933, 3202177, 2757473, 3162630, 1563481, 4278486, 3981738, 2313818, 1130235, 1054196, 925219, 664759, 709607, 1734447, 1792258, 696658, 347275, 1592840, 1008726, -472814, 1764989, 1807915, 1208689, 1061171, 1436714, 1627974, 1674224, 721697, 2533445, 2539569, 1965891, 793025, 3217770, 3041140, 1283776, 604609, 1989064, 1132387, 2346351, 2392416, 2056771, 2197946, 3717532, 2807997, 2089906, 3155966, 2562339, 1590588, 2835460, 4701973, 3642822, 4516405, 4504830, 3981460, 3482994, 4245298, 5490169, 5394277, 5368490, 3071293, 3553536, 3852402, 6248166, 6750593, 3819887, 3809364, 6119387, 7971876, 6684019]
5182F684019l365037K519299K57240j620616K000622j161211Q37647k236219R5014
5173D010758J191739k250188N15245J708967J176982o52784J415207N77036j788597
5164E904365Q08198l353470J190343o2898k165436M23760J297460j643745L75499
5155B774076K26501j648409Q92923j019625O07336K4681J482466n58671r65814
5146A815464k54636j794934P94036n29479R70363J632023l35102k139568J240224
5137A398391K455073J414670p84994l00852q00820M10106j932882L59242L56841
5128B574775l0335p62195M19254Q42628M62176n030l29661k38957j417184J438130
5118B953601M74847j40033K24493q0793j336714J421161Q67826J98803j058762
$$ y = [6684019, 3318982, 5838281, 6095521, 4474905, 6475527, 5314316, 6151963, 3915744, 4010758, 5202497, 2952309, 3467554, 5176521, 6353503, 5700719, 7115926, 7692962, 5904365, 6712563, 3359093, 4549436, 4486538, 2321102, 2744862, 4042322, 2398577, 2774076, 3000577, 1352168, 2245091, 1225466, 1832802, 1857483, 3339949, 2781278, 1815464, 1560828, -234106, 559930, 30451, 1000814, 2632837, 2297735, 158167, 1398391, 3853464, 5268134, 4483140, 4182288, 3381468, 3791574, 1858692, 2217934, 2574775, 2544440, 1782245, 2201499, 3044127, 3506303, 3501273, 3171612, 2932655, 1515471, 2953601, 3428448, 3288415, 3512908, 3432115, 2095401, 3516562, 4384388, 4583191, 3524429]
5109C524429j270580q93118J927215K28204O30399j429666j67788Q45190l85748
5100C008537L62446k27928r1765j106085J099483O67844p72889L19384k17746
5091C041281J121933o39809l42861L84146K118283m28055n93057R85851j33561
5082E514151m73896j065084R26668N75669O14926l577o1861J217921l67835l4162
5072F842920k11121P8070K201752o58721K629877J556488j984108J150492L74192
5063A1979841j478203j773436p94416M9714m16045J938371O5647j407K631652
5054A2201718k36212k072339K535450R44645Q1062J702784k735283j855654J04772
5045A0670943O51559j378226q87295q76857j68758K562057j073694n26777j554876
$$ y = [3524429, 2253849, 1360731, 3287946, 3516150, 4146549, 2716883, 2549095, 3394285, 3008537, 3370983, 3143055, 3051290, 1945205, 3044688, 3712532, 2939643, 3259027, 3041281, 4163214, 3523405, 3180544, 3564690, 5682973, 5254918, 4661861, 5647712, 5514151, 5040255, 3975171, 4901839, 5477508, 6092434, 6088857, 6026996, 7244917, 6877082, 6842920, 6631799, 6709869, 8911621, 8252900, 10882777, 12439265, 10455157, 11605649, 11979841, 10501638, 8728202, 7933786, 7983500, 7567455, 9505826, 9571473, 9570066, 12201718, 11965506, 9893167, 12428617, 13373262, 13454324, 15157108, 12421825, 10566171, 10670943, 11322502, 9944276, 9056981, 8180124, 8011366, 10573423, 9499729, 8972952, 7418076]
5036G418076J996289N63830j169069j42252O6263J477202o77169r7992j745542
5027G689636o21789J026333k284612q38304N75332j92339m14722p07227M92555
5018D724863J246390j494251j035277M0441o98561J876246L30192M321k40801
5009D753563J139887m83379j264250j36333j379914J25064O59287O84896m37281
5000C661540p34403Q33605j76382n40859J838622J422148k84730j570348J578514
4991F027707j009421k098873o44525n23312K883581M86051L60688q1780r76359
4982D423757j48630N33880K056458k296520K36180J653803j990648k98456P07012
4973D876836L49460P9175p25701j214066J507466j613156J453329m86917j693435
$$ y = [7418076, 9414365, 9978195, 8809126, 8666874, 8733137, 10210339, 9533170, 9435178, 7689636, 7067847, 8094180, 5809568, 4971264, 5546596, 5354257, 4939535, 4232308, 4724863, 5971253, 4477002, 3441725, 3482166, 2783605, 4659851, 4990043, 4994364, 4753563, 5893450, 5410071, 4145821, 4009488, 2629574, 2754638, 3413925, 4098821, 3661540, 2927137, 3760742, 3584360, 3043501, 4882123, 6304271, 6019541, 4449193, 6027707, 5018286, 2919413, 2274888, 1751576, 4635157, 5121208, 5481896, 5400116, 4423757, 4275127, 4809007, 6865465, 4568945, 4805125, 6458928, 4468280, 4169824, 4876836, 5226296, 5305471, 4579770, 3365704, 4873170, 3260014, 4713343, 4226426, 2532991]
4964B532991Q72183Q34307j547563q0922L217475J99399M52017J867523o44640
4955G702770n50500J90722n78613j223024J709528j304195L86538J683935P79206
4946H796367L93002q53116j084203j339362J503461k27896J351634P91856j649258
4937G682485J298941M14735j675688K9706J570348n20572R70106j662224J785858
4928I893695q70124j53496J778680r3957m58334q95480J650413k01193o91536
4919I958668j157167K031207l86161Q85586n12826J321906N960j82815J08188
4910A2072546R62530j29409J266203n22051O8044k049385K701871j496192K87158
4901A3161315j061726j145488K654134n69658J89522j187198p07712O3644k155213
$$ y = [2532991, 3405174, 4239481, 2691918, 2610996, 5828471, 6027870, 6479887, 8347410, 7702770, 7152270, 7342992, 6764379, 5541355, 7250883, 5946688, 6333226, 8017161, 8796367, 9189369, 8336253, 7252050, 5912688, 7416149, 7188253, 8539887, 9331743, 7682485, 8981426, 9396161, 7720473, 7750179, 9320527, 8799955, 9770061, 8107837, 9893695, 9023571, 8870075, 10648755, 10554798, 10096464, 9200984, 10851397, 10650204, 9958668, 8801501, 10832708, 10446547, 11332133, 10819307, 12141213, 12147173, 11964358, 12072546, 13035076, 12905667, 14171870, 13649819, 13717863, 11668478, 14370349, 12874157, 13161315, 12099589, 10954101, 13608235, 13038577, 13228099, 12040901, 11333189, 11396833, 9241620]
4892I241620r99906K020856j689217N37445J073556J662264j660743K18804j274135
4883I130544M81617M48026J814077K190712n17847n94437J159505P00041j381762
4874A3430476K3587O20843J852170J352341j346392p71175J647720j056427Q13494
4865A6566637K787063K573137j066464j552337O45458O64844J789451J405311
4857B3813100J868395P90898Q90133N19934K845129K252066K671109M163674N81429
4848D0395867k017213J47634N30141k120403J57664j93594N78879K202730r56324
4839C8725381l98468J724523K684948K804208L508179M070469N770089K024153
4831F0913482q58444j063509l034827m139764n289060m036014l437204k540316
$$ y = [9241620, 8241714, 10262570, 8573353, 9110798, 10184354, 11846618, 10185875, 10404679, 9130544, 9612161, 10060187, 11874264, 14064976, 13547129, 12952692, 14112197, 14812238, 13430476, 13454063, 14074906, 15927076, 17279417, 15933025, 15161850, 16809570, 15753143, 16566637, 19353700, 21926837, 20860373, 19308036, 19953494, 20618338, 22407789, 23813100, 25681495, 26472393, 27362526, 27882460, 30727589, 32979655, 35650764, 39814438, 40395867, 38378654, 38526288, 39056429, 36936026, 37093690, 36900096, 37478975, 39681705, 38725381, 38326913, 40051436, 42736384, 45540592, 49048771, 53119240, 58889329, 60913482, 60055038, 58991529, 55956702, 51816938, 46527878, 42491864, 39054660, 36514344]
4823C6514344k523805p31437J944881n35369n48962J629056J195452J421422r81617
4814C7383965K880793n4867m519280k080737k683658l088235l269757k721936
4806B1846288j267445j031543l476237r48426p56822j545331k06802o58295J506764
4797A3462151K76151j303791r5439j352059J237480p61493o36978l11942k97322
4788A0216758r56395L12123n32348n37211L27848K28780J982604j048156l37398
4779I656605j591138r96684J286836R40461o64452P45662M46530m59298j966832
4770G397690M205041m12631j303867R57290k533269R54854J137371o49135j713163
4761H040181r35501R95578J190792l33391J588357n75078l60635k52757N5930
$$ y = [36514344, 33990539, 33259102, 35203983, 34668614, 34119652, 35748708, 36944160, 38365582, 37383965, 40264758, 40209891, 35690611, 33609874, 30926216, 27837981, 24568224, 21846288, 20578843, 19547300, 16071063, 15122637, 14365815, 12820484, 12613682, 11955387, 13462151, 13738302, 12434511, 12339072, 10987013, 12224493, 11463000, 10826022, 10514080, 10216758, 9260363, 9572486, 9040138, 8502927, 8830775, 9059555, 11042159, 9994003, 9656605, 8065467, 7068783, 8355619, 9296080, 8631628, 9377290, 9823820, 9364522, 7397690, 11602731, 11190100, 9886233, 10843523, 8310254, 9265108, 10402479, 9753344, 8040181, 7104680, 8100258, 9291050, 8957659, 10546016, 9970938, 9610303, 9357546, 9413476]
4752I413476j499318J442616P67339O07038r65609p57551l35821q13158m59721
4743G399291k00969K178671n42820J3241J018206J095823R81160k059685J13376
4734I996294m59031Q15737j49712o35174M49352L38132q42999m75255m04439l83745
4724H249160J211602L4989l55900J164905M79175j024742K13743j493616n4153
4715H425163J631312P87528r64618J33657O62726K229122l048899R12242n76813
4706A0191420j93748K59729J826603j375276k026973K564108J433372J474926
4698A4154161j179589j381784k49328N92508J41063n45419p1252l70035L77912
4689A1468237M11034Q79822k00537l76662k199842J723495j6316P37475K63688
$$ y = [9413476, 7914158, 9356774, 10124113, 10731151, 9765542, 9007991, 8672170, 7859012, 7399291, 7198322, 9376993, 8834173, 8847414, 9865620, 10961443, 11942603, 9882918, 9996294, 9537263, 10353000, 10203288, 9568114, 10017466, 10355598, 9512599, 9037344, 8632905, 8249160, 9460762, 9495751, 9139851, 10304756, 10783931, 9759189, 9972932, 8479316, 8425163, 10056475, 10844003, 9879385, 10013042, 10675768, 12904890, 9855991, 10768233, 10191420, 9997672, 10257401, 12084004, 10708728, 8681755, 11245863, 12679235, 14154161, 12974572, 11592788, 11343460, 11935968, 12077031, 11531612, 11460360, 11090325, 11468237, 11879271, 12759093, 12558556, 12181894, 9982052, 11705547, 11689231, 12426706, 12690394]
4680A2690394J596235K2572M55341k98571j497230j90244k17470K165985K64624
4671A4991636J0617Q79760R36854k264155J229628K519306N50316j389733P27251
4662A8191480r26079K138637q48523K036322J296613m65976L74019K47441R40792
4653B2984726q33864O04869q66762m94119k03937R21791J121641j680547L80377
4644B1934175r6845l2034Q61594K000361K835906J253988L68029J840116j635958
4635B9329332p40697j364606j071470m8206p66139J023677K375870j091461j083910
4626B6562390K218789J475271N71529P14706J21575J354930Q23069j82232p42147
4617C2917880k61272L86533J128285j412615J357329L298j51273Q96306K108037
$$ y = [12690394, 14286629, 14309201, 14764542, 14465971, 12968741, 12778497, 12561027, 14727012, 14991636, 15002253, 15882013, 16818867, 14554712, 15784340, 18303646, 18853962, 17464229, 18191480, 17265401, 19404038, 18555515, 20591837, 21888450, 21422474, 21796493, 22043934, 22984726, 22150862, 22755731, 21888969, 21394850, 21190913, 22112704, 23234345, 21553798, 21934175, 21837330, 21805296, 22666890, 24667251, 27503157, 28757145, 29125174, 30965290, 29329332, 28588635, 27224029, 26152559, 26104353, 25338214, 26361891, 28737761, 27646300, 26562390, 28781179, 30256450, 30827979, 31542685, 31664260, 33019190, 33842259, 33660027, 32917880, 32656608, 33043141, 34171426, 32758811, 34116140, 34119438, 33968165, 34864471, 36972508]
4608C6972508K196823J888519p34087R12158K97185K351596L413864q28917J714849
4599D8184498L105690K807895L72567L886558J716312L733535l81124J715462
4591F5141393J150162j421617K051755J484845J994660K710534L029748L360495
4583G9501975L096157N446009M943115L347692K465834O71630K047494m05733
4575A01114173p78165j517852l414813k551220j576965j596520j692163M024441
4567I2010916M79877j071860J251926N892825J918722N35071j525301n8828k885494
4558I6547854m399727k937761o649005l553436k475671k911030m901297k530665
4550F6189262l643991K06405k83273j064027K262757j163319k623951j195220
$$ y = [36972508, 39169331, 41057850, 40323763, 41235921, 41533106, 43884702, 47298566, 46469649, 48184498, 51290188, 54098083, 54470650, 58357208, 60073520, 63807055, 63425931, 65141393, 66291555, 64869938, 66921693, 68406538, 70401198, 73111732, 76141480, 79501975, 82598132, 88044141, 92987256, 96334948, 98800782, 99472412, 101519906, 101114173, 100336008, 98818156, 95403343, 92852123, 91275158, 89678638, 87986475, 92010916, 92490793, 91418933, 92670859, 98563684, 100482406, 101017477, 99492176, 99433348, 96547854, 92148127, 89210366, 82561361, 79007925, 76532254, 73621224, 68719927, 66189262, 62545271, 62751676, 62468403, 61404376, 63667133, 62503814, 59879863, 58684643]
4542E8684643l114037p92303k706835k586352l079015k355547j127335k55041
4534D2668178J588359k346980q33334j496957k257694k659846j38510l430917
4526C1092299q08773k89581k61114q03671k067171j667286P97323J468628n09086
4517B6951568j391097j158341Q3824k6935r36289J62186j050520l173086P5662
4508A9536972j014062O67189q25232k50847P17026m79073M1003R05871m69585
4499A8829262j753695k450984O45854J270616j424994J85546o08014K47852j074499
4490A3866944J413799j219068L89627J016494m46694j99557j366751j341843J342025
4481A3454976O01436j666445K788137j701509l47150m73802j467712R42993J661892
$$ y = [58684643, 55570606, 54778303, 52071468, 49485116, 46406101, 44050554, 42923219, 42668178, 44256537, 41909557, 41076223, 39579266, 37321572, 34661726, 34523216, 31092299, 30283526, 29993945, 29732831, 28929160, 26861989, 25194703, 25992026, 27460654, 26951568, 25560471, 24402130, 24485954, 24459019, 23522730, 23684916, 22634396, 19461310, 19536972, 18522910, 19190099, 18364867, 18114020, 18831046, 18351973, 18392976, 19298847, 18829262, 17075567, 14624583, 15270437, 16541053, 15116059, 15301605, 14693591, 14941443, 13866944, 15280743, 14061675, 14451302, 15467796, 15021102, 14821545, 13454794, 12112951, 13454976, 14056412, 12389967, 15178104, 13476595, 13129445, 12655643, 11187931, 12130924, 13792816]
4472A3792816j424841k55920J327312m70667J317779j83629J997473l094142j060465
4463A1945716M3453j178749J504146j732243K21194R08219M50521j535387j49838
4454A0477032R30464k187062J717113N21185M66407j186786l353563K945754l80737
4445I949807m12777K442430J825826j229818k218657j202245k70379J730788Q22557
4436A1437532j116573J847115k003127n78056j181629J714582n59430N09272M04272
4427A0473958R1343o31501J170912N24513k120317Q17530J556990p93622j892302
4418I197504K298045J458552k252713J23299J623124l240456J300369P8790K24701
4409A0811215j82905n87149j23702m90951j34999n8809J00413J346418N71718
$$ y = [13792816, 12367975, 12112055, 13439367, 12968700, 14286479, 14102850, 16100323, 13006181, 11945716, 11989169, 10810420, 12314566, 10582323, 10803517, 11711736, 12162257, 10626870, 10477032, 11407496, 9220434, 10937547, 11458732, 11925139, 10738353, 7384790, 10330544, 9949807, 9537030, 11979460, 13805286, 12575468, 10356811, 9154566, 8884187, 10614975, 11437532, 10320959, 12168074, 10164947, 9586891, 8405262, 10119844, 9560414, 10069686, 10473958, 10565301, 9933800, 11104712, 11629225, 9508908, 10326438, 11883428, 11089806, 9197504, 11495549, 12954101, 10701388, 10824687, 12447811, 9207355, 10507724, 10586514, 10811215, 10628310, 10041161, 9917459, 9426508, 9291509, 9232700, 9333113, 10679531, 11251249]
4400A1251249j551557l62745j212262R63423j096843K919547N36030n88044j82813
4391A0675985j125591K83357J408978j073634M0394j102795q51222O10564M76075
4382I342111q47691J062292r05204k170470K444061j234656J80697m27820J268726
4373H712046J00214k36252r42953j621797r11198K577938k92768J597269J120516
4364A0103015j347324j057073j02765J19227Q5692J566885j062410j109278J193974
4355H389943n35992N0690J389124P87823k350042N4768k87023O35674P54354l33128
4345H556191j651875R74447J686647l4946q8149j479898p14753Q81635K27030
4336H356329j086211J648718o79989j734886m54539K72014j11499k42450k00623
$$ y = [11251249, 9699692, 9336947, 8124685, 9088108, 7991265, 10910812, 11446842, 10858798, 10675985, 9550394, 9833751, 11242729, 10169095, 10209489, 9106694, 8255472, 8866036, 9342111, 8494420, 9556712, 8651508, 6481038, 8925099, 7690443, 7871140, 7443320, 8712046, 8812260, 8576008, 7633055, 6011258, 5100060, 7677998, 7385230, 8982499, 10103015, 8755691, 7698618, 7595853, 7715080, 7800772, 9367657, 8305247, 7195969, 8389943, 7853951, 7904641, 9293765, 10081588, 7731546, 7786314, 7499291, 8134965, 8889319, 8556191, 6904316, 7878763, 9565410, 9530464, 9442315, 7962417, 7247664, 8129299, 8356329, 7270118, 8918836, 8238847, 6503961, 6049422, 6321436, 6209937, 5967487, 5766864]
4327E766864J268630m97365j452345P85942J475985j417654j04567K079561K34843
4318H139894m67988L45322l96114k142612O13528j80997j469293l47900K781849
4309F875689m65776P52508j476996q99671Q60130q67465Q86952P88568k69937
4300F184002N42578k00821M09366J613930j590727j78883o42313k78088l94754
4291E464290R97785o73309J094078J15278k047453m46725m18508J463315J179091
4282F727842q18126p27810L26240N56385M99366N22232j825322l68410p39331
4273D153066l50451P94832j596796J593314Q09540L98421j573911O27965J318934
4264F174914j803672j201805K154732J059495J289933r10534k527159o42229J333050
$$ y = [5766864, 7035494, 6538129, 5085784, 5871726, 7347711, 5930057, 5825490, 7905051, 8139894, 7671906, 8017228, 7621114, 5478502, 6092030, 5911033, 4441740, 4093840, 6875689, 6409913, 7162421, 5685425, 4785754, 5645884, 4778419, 5665371, 6453939, 6184002, 6726580, 6525759, 6935125, 8549055, 6958328, 6779445, 6137132, 5859044, 5464290, 6462075, 5788766, 6882844, 6998122, 4950669, 4503944, 4085436, 5548751, 6727842, 5909716, 5181906, 5508146, 6064531, 6563897, 7086129, 5260807, 4892397, 4153066, 3802615, 4597447, 3000651, 4593965, 5403505, 5801926, 4228015, 4855980, 6174914, 4371242, 3169437, 5324169, 6383664, 7673597, 6763063, 4235904, 3593675, 4926725]
4255D926725j427567l45820J282812N03237L16572k468974J105495R55203m10531
4246D437152o5714j834562M09122K65301O85226J80823K96919M79141j687910
4237C165498R00696L83054J395722o14978o58711O47384P0332l38389j734000
4228C216608k425510J688456J153462J198250M85904j119844k29898J901362k20423
4219E648367J04550k45961J85575j090857n09619J176084N77019j117613Q9971
4210D817516j0210r94138R34581R39064j789626n15494n48240J244163J11084
4201D188700p72802P54247q98979O58775j003073J093838M1123q15810M67608
4192C713627J516575j011811J385427J663842j420605p48331j86383p29679r97799
$$ y = [4926725, 3499158, 3153338, 4436150, 4939387, 5255959, 2786985, 3892480, 4847683, 4437152, 4371438, 2536876, 2945998, 3211299, 3896525, 4077348, 4374267, 4853408, 3165498, 4066194, 4449248, 5844970, 5229992, 4571281, 5218665, 5288997, 4950608, 3216608, 791098, 2479554, 3633016, 4831266, 5317170, 4197326, 3967428, 5868790, 5648367, 5752917, 5506956, 5692531, 4601674, 4092055, 5268139, 5845158, 4727545, 4817516, 4807306, 3813168, 4747749, 5686813, 3897187, 3381693, 2833453, 4077616, 4188700, 3415898, 4170145, 3271166, 3929941, 2926868, 4020706, 4061829, 3246019, 3713627, 5230202, 4218391, 5603818, 7267660, 5847055, 5098724, 4912341, 4182662, 3184863]
4183C184863n92096R64079P81579K03496Q85157j816341O91264q34241J417209
4174D884969P97171j602863j977747Q37513J578739l23231K198816q27833k772045
$$ y = [3184863, 2592767, 3556846, 4338425, 4541921, 5427078, 3610737, 4302001, 3467760, 4884969, 5682140, 4079277, 2101530, 2939043, 4517782, 4194551, 6393367, 5565534, 2793489]
$$ [...]
##END NTUPLES=NMR SPECTRUM
##END=
