##TITLE=1H_CG-1207-X41
 CDCl3
 8 sc, 
 13.8.2024
##JCAMPDX= 6.0         $$ Bruker NMR JCAMP-DX V2.0
##DATA TYPE= NMR SPECTRUM
##DATA CLASS= NTUPLES
##ORIGIN= UXNMR, Bruker Analytische Messtechnik GmbH
##OWNER= root
$$ XWIN-NMR		Version 3.5
$$ Tue Aug 13 14:04:51 2024 Russian Standard Time (UT+4h)  she@DPX200
##.OBSERVE FREQUENCY= 200.1313
##.OBSERVE NUCLEUS= ^1H
##.ACQUISITION MODE= SIMULTANEOUS
##.ACQUISITION SCHEME= undefined
##.AVERAGES= 8
##.DIGITISER RES= 18
##SPECTROMETER/DATA SYSTEM= spect
##.PULSE SEQUENCE= zg30
##.SOLVENT NAME= DMSO
##.SHIFT REFERENCE= (INTERNAL, DMSO, 0, 21.2486)
##AUDIT TRAIL= $$ (NUMBER, WHEN, WHO, WHERE, WHAT)
$$ ##TITLE= Audit trail, XWIN-NMR		Version 3.5
$$ ##JCAMPDX= 5.01
$$ ##ORIGIN= Bruker BioSpin GmbH
$$ ##OWNER= she
$$ F:/spectra/data/she/nmr/H-F/1/pdata/1/auditp.txt
$$ ##AUDIT TRAIL=  $$ (NUMBER, WHEN, WHO, WHERE, WHAT)
(   1,<2024-08-13 14:03:30.50 +0400>,<she>,<DPX200>,
      <created by zg, POWCHK disabled, PULCHK disabled
       configuration hash MD5:
       00 E9 B6 7A A2 85 ED C7 34 08 36 98 17 FE 4E 26
       data hash MD5: 16K
       36 EF 45 B3 FD CD 14 29 BE 1E CD 6D 1F 13 A5 46>)
(   2,<2024-08-13 14:03:36.20 +0400>,<she>,<DPX200>,
      <Start of raw data processing
       efp BC_mod = 2 LB = 0.24 FT_mod = 6 PKNL = 1 PHC0 = -25996.35 PHC1 = 12.98749 SI = 16K 
       data hash MD5: 16K
       70 ED 13 A3 0B 98 22 45 59 4A 6B B8 AF 25 98 D5>)
(   3,<2024-08-13 14:04:03.09 +0400>,<she>,<DPX200>,
      <pk PHC0 = -6.001803 PHC1 = 8 
       data hash MD5: 16K
       11 B9 2B 9E 6B EC 6F F8 D8 CA B4 A1 B1 CD 90 C2>)
(   4,<2024-08-13 14:04:06.70 +0400>,<she>,<DPX200>,
      <abs ABSG = 5 
       data hash MD5: 16K
       6F 75 39 96 35 9B ED A9 0F C6 90 94 02 A5 8F EC>)
$$ ##END=
$$ 
$$ hash MD5
$$ 41 4A 55 28 BA CA 2E E1 A4 B2 93 9D 8B FF 3D 5D
##$RELAX= 
##$RELAX= 
##$RELAX= 
##$RELAX= 
##$RELAX= 
##$RELAX= 
$$ Bruker specific parameters
$$ --------------------------
##$DU= <F:/spectra>
##$EXPNO= 1
##$NAME= <H-F>
##$PROCNO= 1
##$TYPE= <nmr>
##$USER= <she>
##$AMP= (0..31)
100 100 100 100 100 100 100 100 100 100 100 100 100 100 100 100 100 100 
100 100 100 100 100 100 100 100 100 100 100 100 100 100 
##$AQSEQ= 0
##$AQ_mod= 1
##$AUNM= <au_zg>
##$AUTOPOS= <>
##$BF1= 200.13
##$BF2= 200.13
##$BF3= 200.13
##$BF4= 200.13
##$BF5= 200.13
##$BF6= 200.13
##$BF7= 200.13
##$BF8= 200.13
##$BYTORDA= 1
##$CFDGTYP= 0
##$CFRGTYP= 5
##$CHEMSTR= <none>
##$CNST= (0..31)
1 1 145 1 1 1 1 1 1 1 1 1 1 1 1 1 1 1 1 1 1 1 1 1 1 1 1 1 1 1 1 1 
##$CPDPRG= <>
##$CPDPRG1= <>
##$CPDPRG2= <>
##$CPDPRG3= <>
##$CPDPRG4= <mlev>
##$CPDPRG5= <mlev>
##$CPDPRG6= <mlev>
##$CPDPRG7= <mlev>
##$CPDPRG8= <mlev>
##$CPDPRGB= <>
##$CPDPRGT= <>
##$D= (0..31)
0 1.2 0 0 0 0 0 0 0 0.06 0 0.03 0 0 0 0 0.0002 0 0 0 0 0 0 0 0 0 0 0 0 
0 0 0 
##$DATE= 1723543410
##$DBL= (0..7)
120 120 120 120 120 120 120 120 
##$DBP= (0..7)
150 150 150 150 150 150 150 150 
##$DBP07= 0
##$DBPNAM0= <>
##$DBPNAM1= <>
##$DBPNAM2= <>
##$DBPNAM3= <>
##$DBPNAM4= <>
##$DBPNAM5= <>
$$ [...]
##$SUBNAM3= <"">
##$SUBNAM4= <"">
##$SUBNAM5= <"">
##$SUBNAM6= <"">
##$SUBNAM7= <"">
##$SUBNAM8= <"">
##$SUBNAM9= <"">
##$SW= 24.0689771365484
##$SWIBOX= (0..15)
0 0 2 0 0 0 0 0 0 0 0 0 0 0 0 0 
##$SW_h= 4816.95568400771
##$TD= 16384
##$TD0= 1
##$TE= 0
##$TE2= 300
##$TE3= 300
##$TEG= 300
##$TL= (0..7)
0 120 120 120 120 120 120 120 
##$TP= (0..7)
150 150 150 150 150 150 150 150 
##$TP07= 0
##$TPNAME0= <>
##$TPNAME1= <>
##$TPNAME2= <>
##$TPNAME3= <>
##$TPNAME4= <>
##$TPNAME5= <>
##$TPNAME6= <>
##$TPNAME7= <>
##$TPOAL= (0..7)
0.5 0.5 0.5 0.5 0.5 0.5 0.5 0.5 
##$TPOFFS= (0..7)
0 0 0 0 0 0 0 0 
##$TUNHIN= 0
##$TUNHOUT= 0
##$TUNXOUT= 0
##$USERA1= <user>
##$USERA2= <user>
##$USERA3= <user>
##$USERA4= <user>
##$USERA5= <user>
##$V9= 5
##$VALIST= <valist>
##$VCLIST= <CCCCCCCCCCCCCCC>
##$VD= 0
##$VDLIST= <DDDDDDDDDDDDDDD>
##$VPLIST= <PPPPPPPPPPPPPPP>
##$VTLIST= <TTTTTTTTTTTTTTT>
##$WBST= 1024
##$WBSW= 4
##$XGAIN= (0..3)
0 0 0 0 
##$XL= 0
##$YL= 0
##$YMAX_a= 787214
##$YMIN_a= -700152
##$ZGOPTNS= <>
##$ZL1= 120
##$ZL2= 120
##$ZL3= 120
##$ZL4= 120
##$ABSF1= 21.24418
##$ABSF2= -2.825018
##$ABSG= 5
##$ABSL= 3
##$ALPHA= 0
##$AQORDER= 0
##$ASSFAC= 0
##$ASSFACI= 0
##$ASSFACX= 0
##$ASSWID= 0
##$AUNMP= <proc_1d>
##$AZFE= 0.1
##$AZFW= 0.1
##$BCFW= 0
##$BC_mod= 2
##$BYTORDP= 0
##$COROFFS= 0
##$CY= -3
##$DATMOD= 1
##$DC= 0
##$DFILT= <>
##$DTYPP= 0
##$F1P= 0
##$F2P= 0
##$FCOR= 1
##$FTSIZE= 16384
##$FT_mod= 6
##$GAMMA= 0
##$GB= 0
##$INTBC= 1
##$INTSCL= 3.70164e-10
##$ISEN= 128
##$LB= 0.24
##$LEV0= 0
##$LPBIN= 0
##$MAXI= 10000
##$MC2= 0
##$MEAN= 0
##$ME_mod= 0
##$MI= 1.114404
##$NCOEF= 0
##$NC_proc= -6
##$NLEV= 6
##$NOISF1= 3.799351
##$NOISF2= 2.8
##$NSP= 0
##$NTH_PI= 0
##$NZP= 0
##$OFFSET= 21.24859
##$PC= 1
##$PHC0= -26002.35
##$PHC1= 20.98749
##$PH_mod= 1
##$PKNL= yes
##$PPARMOD= 0
##$PSCAL= 0
##$PSIGN= 0
##$REVERSE= no
##$SF= 200.129456009739
##$SI= 16384
##$SIGF1= 3
##$SIGF2= 2
##$SINO= 5.538805
##$SIOLD= 16384
##$SREGLST= <1H.CDCl3>
##$SSB= 0
##$STSI= 16384
##$STSR= 0
##$SW_p= 4816.95568400771
##$SYMM= 0
##$S_DEV= 0
##$TDeff= 16384
##$TDoff= 0
##$TI= <>
##$TILT= no
##$TM1= 0
##$TM2= 0
##$TOPLEV= 0
##$USERP1= <user>
##$USERP2= <user>
##$USERP3= <user>
##$USERP4= <user>
##$USERP5= <user>
##$WDW= 1
##$XDIM= 16384
##$YMAX_p= 446263906
##$YMIN_p= -1215278
$$ End of Bruker specific parameters
$$ ---------------------------------
##NTUPLES= NMR SPECTRUM
##VAR_NAME=  FREQUENCY,     SPECTRUM/REAL,   SPECTRUM/IMAG
##SYMBOL=    X,             R,               I
##VAR_TYPE=  INDEPENDENT,   DEPENDENT,       DEPENDENT
##VAR_FORM=  AFFN,          ASDF,            ASDF
##VAR_DIM=   16384,         16384,           16384
##UNITS=     HZ,            ARBITRARY UNITS, ARBITRARY UNITS
##FACTOR=    0.29402158847633, 1,            1
##FIRST=     4252.46885160681, 0,            0
##LAST=      -564.486832400898, 0,           0
##MIN=       -564.486832400898, -1215278,    0
##MAX=       4252.46885160681, 446263906,    0
$$ Real data points
##PAGE= N=1
##DATA TABLE= (X++(R..R)), XYDATA
$$ [...]
$$ plain form
5580 1194043 1247872 1128544 1288494 1258422 1318496 1424630 1359955 1420106 1283806 1334401 1292089
5569 1292089 1294703 1289146 1142182 1201067 1193358 1313808 1245844 1164952 1182665 1202843 1168871 1208200
5557 1208200 1237749 1183255 1299230 1209656 1180320 1317137 1243022 1138173 1145961 1106650 1270653
5546 1270653 1417063 1352471 1266611 1256723 1277019 1268611 1354616 1154673 1236007 1255513 1365406
5535 1365406 1267408 1080894 1036251 1136023 1195112 1301843 1348788 1251556 1367735 1492895 1463449
5524 1463449 1302337 1450289 1402460 1540013 1461066 1469384 1247842 1275602 1398206 1300626 1319569
5513 1319569 1400105 1266667 1201263 1309447 1312880 1162493 1254928 1353953 1323852 1294251 1269047
5502 1269047 1240796 1218493 1212910 1350173 1304703 1245870 1298702 1188917 1379425 1397632 1401956
$$ packed form
5580A194043N3829j19328J59950l0072O0074J06134o4675O0151j36300N0595m2312
5569A292089K614n557j46964N8885p709J20450o7964q0892J7713K0178l3972L9329
5557A208200K9549n4494J15975q9574k9336J36817p4115j04849P788l9311J64003
5546A270653J46410o4592q5860r888K0296q408Q6005j99943Q1334J9506J09893
5535A365406r7998j86514m4643R9772N9089J06731M6945r7232J16179J25160k9446
5524A463449j61112J47952m7829J37553p8947Q318k21542K7760J22604r7580J8943
5513A319569Q0536j33438o5404J08184L433j50387R2435R9025l0101k9601k5204
5502A269047k8251k2303n583J37263m5470n8833N2832j09785J90508J8207M324
$$ plain form
5491 1401956 1454866 1399177 1429711 1520454 1490746 1398620 1469874 1426083 1362871 1384539 1360843
5480 1360843 1371306 1359645 1427907 1437028 1436319 1431074 1384502 1515805 1573860 1626757 1288102 1313601
5468 1313601 1465319 1452384 1607979 1518297 1714080 1634111 1685891 1628150 1765091 1631194
5458 1631194 1753325 1752369 1642816 1738920 1822802 1742697 1836830 2132140 1864184 1956068 2029363
5447 2029363 2015776 2071895 2129099 2291636 2282975 2181898 2130584 2128518 2223090 2052296 2020838
5436 2020838 2045606 1964106 2005891 1941808 1952565 1973737 1942195 1830753 1927864 1991361 1906141
5425 1906141 1909770 1868608 1955787 1832819 2025450 1938481 1860969 1954474 2093087 1934024 1962228
5414 1962228 1925372 1995856 1891298 1978250 2072007 1935999 2016363 1897693 1813512 1961749 1987602
$$ packed form
5491A401956N2910n5689L0534R0743k9708r2126P1254m3791o3212K1668k3696
5480A360843J0463j1661O8262R121p09n245m6572J31303N8055N2897l38655K5499
5468A313601J51718j2935J55595q9682J95783p9969N1780n7741J36941j33897
5458A631194J22131r56j09553R6104Q3882q0105R4133K95310k67956R1884P3295
5447B029363j3587N6119N7204J62537q661j01077n1314k066R4572j70794l1458
5436B020838K4768q1500M1785o4083J0757K1172l1542j11442R7111O3497q5220
5425A906141L629m1162Q7179j22968J92631q6969p7512R3505J38613j59063K8204
5414A962228l6856P0484j04558Q6952R3757j36008Q0364j18670q4181J48237K5853
$$ plain form
5403 1987602 2065074 2233736 2253116 2257800 2209238 2275996 2166714 2232217 2115819 2019865 1986585
5392 1986585 2033987 2014572 2037568 1976107 1821088 2063864 2072357 2026841 2121322 1893368 1879301
5381 1879301 2004806 2036812 2019604 1967650 1959901 1837266 1874204 1952868 1913934 1935738 2106629
5370 2106629 2113274 2122448 2038117 1919088 1960259 2172067 2288223 2295416 2239029 2089548 2123119
5359 2123119 2063429 2238574 2150324 2063395 2112014 2252461 2150563 2100880 2124177 2145134 2261537
5348 2261537 2157983 2285735 2339410 2173948 2406189 2358539 2388836 2377369 2333094 2373894 2293226
5337 2293226 2399983 2342599 2437205 2457167 2509882 2412051 2356586 2402524 2333319 2395751 2429445
5326 2429445 2491274 2431628 2472055 2477837 2511237 2450985 2541138 2581180 2673735 2571636 2465923
$$ packed form
5403A987602P7472J68662J9380M684m8562O6758j09282O5503j16398r5954l3280
5392A986585M7402j9415K2996o1461j55019K42776Q493m5516R4481k27954j4067
5381A879301J25505L2006j7208n1954p749j22635L6938P8664l8934K1804J70891
5370B106629O645R174q4331j19029M1171K11808J16156P193n6387j49481L3571
5359B123119n9690J75145q8250q6929M8619J40447j01898m9683K3297K0957J16403
5348B261537j03554J27752N3675j65462K32241m7650L0297j1467m4275M0800q0668
5337B293226J06757n7384R4606J9962N2715r7831n5465M5938o9205O2432L3694
5326B429445O1829n9646M0427N782L3400o0252R0153M0042R2555j02099j05713
$$ plain form
5315 2465923 2534468 2636854 2635124 2599355 2544047 2392395 2533575 2549204 2645886 2707542 2720972
5304 2720972 2765248 2662675 2602854 2758200 2753094 2669357 2663465 2647997 2701975 2756017 2803806
5293 2803806 2827072 2985562 3037492 2954498 2980232 2825530 2903633 3003039 3095054 3085497 3073267
5282 3073267 3127959 3177539 3147767 3059245 3193106 3258686 3099042 3024864 3079998 3100368 3163816
5271 3163816 3296158 3258781 3243893 3430443 3459259 3519965 3416498 3476018 3568122 3532332 3537198
5260 3537198 3579025 3649591 3578038 3594050 3649263 3825440 3696903 3742330 3763593 3739249 3804868
5249 3804868 3946850 3728721 3688730 3721245 3910728 4002205 4041931 4001383 4054543 4075628 4200091
5238 4200091 4266090 4211805 4242890 4410217 4432043 4460957 4526062 4692800 4981203 5059628 5274966
$$ packed form
5315B465923O8545J02386j730l5769n5308j51652J41180J5629R6682O1656J3430
5304B720972M4276j02573n9821J55346n106q3737n892j5468N3978N4042M7789
5293B803806K3266J58490N1930q2994K5734j54702P8103R9406R2015r557j2230
5282C073267N4692M9580k9772q8522J33861O5580j59644p4178N5134K0370O3448
5271C163816J32342l7377j4888J86550K8816O0706j03467N9520R2104l5790M866
5260C537198M1827P0566p1553J6012N5213J76177j28537M5427K1263k4344O5619
5249C804868J41982k18129l9991L2515J89483R1477L9726m0548N3160K1085J24463
5238D200091O5999n4285L1085J67327K1826K8914O5105J66738K88403P8425K15338
$$ plain form
5227 5274966 5283955 5283548 5170296 5073810 4860389 4984090 4975633 4976454 5101560 5359810 5561845
5216 5561845 5569155 5482543 5634988 5666773 5722074 5662670 5511275 5499381 5518972 5348300 5584426
5205 5584426 5652024 5375045 5339583 5231549 5362349 5234810 5060015 5125736 5002226 4962866
5195 4962866 5009094 4778208 4738311 4673016 4742340 4710581 4607289 4534047 4528233 4617135 4589358
5184 4589358 4566534 4503734 4409592 4235608 4375356 4479394 4354722 4337814 4279757 4352463 4472520
5173 4472520 4326214 4485196 4394297 4383009 4256879 4218993 4107848 4085090 4177145 4286442
5163 4286442 4288411 4231514 4413596 4364830 4318078 4400337 4489347 4459313 4470706 4484876 4424407
5152 4424407 4426726 4496214 4469979 4561094 4743544 4579184 4557000 4672369 4656518 4725749 4819869
$$ packed form
5227E274966Q989m07j13252r6486k13421J23701q457Q21J25106K58250K02035
5216E561845P310q6612J52445L1785N5301n9404j51395j1894J9591j70672K36126
5205E584426O7598k76979l5462j08034J30800j27539j74795O5721j23510l9360
5195D962866M6228k30886l9897o5295O9324l1759j03292p3242n814Q8902k7777
5184D589358k2824o2800r4142j73984J39748J04038j24672j6908n8057P2706J20057
5173D472520j46306J58982r0899j1288j26130l7886j11145k2758R2055J09297
5163D286442J969n6897J82082m8766m6752Q2259Q9010l0034J1393J4170o0469
5152D424407K319O9488k6235R1115J82450j64360k2184J15369j5851O9231R4120
$$ plain form
5141 4819869 4813981 4766113 4954518 4899951 5089460 5039408 5013854 5334460 5368147 5226620 5323110
5130 5323110 5399577 5359218 5424362 5501776 5627138 5623333 5679723 5686736 5675593 5694190 5790426 5814792
5118 5814792 5890080 6001333 5964313 6200356 6308628 6344332 6226522 6323301 6435248 6529571
5108 6529571 6599583 6444789 6446624 6421842 6428289 6394285 6237993 6323757 6496009 6551572 6644863
5097 6644863 6586978 6590259 6633840 6850995 6869604 6835326 6663109 6606561 6681182 6576318 6647357
5086 6647357 6522019 6604198 6595477 6573644 6554148 6405131 6243825 6301618 6288985 6251229 6344973
5075 6344973 6295498 6051082 6250406 6428405 6311693 6417545 6485891 6582621 6646541 6667699
5065 6667699 6734762 6963625 6876533 6978463 7034663 6875583 6757312 6761643 6866981 6771560 6687124
$$ packed form
5141D819869n888m7868J88405n4567J89509n0052k5554L20606L3687j41527R6490
5130E323110P6467m0359O5144P7414J25362l805N6390P013j1143J8597R6236K4366
5118E814792P5288J11253l7020K36043J08272L5704j17810R6779J11947R4323
5108F529571P0012j54794J835k4782O447l4004j56292Q5764J72252N5563R3291
5097F644863n7885L281M3581K17155J8609l4278j72217n6548P4621j04864P1039
5086F647357j25338Q2179q721k1833j9496j49017j61306N7793j2633l7756R3744
5075F344973m9475k44416J99324J77999j16712J05852O8346R6730O3920K1158
5065F667699O7063K28863q7092J01930N6200j59080j18271M331J05338r5421q4436
$$ plain form
5054 6687124 6735102 6873309 6897037 6827315 6988868 7121196 7302889 7351276 7367757 7528073
5044 7528073 7742185 7782615 8012515 7990521 7902983 7862447 7626228 7644366 7519788 7704370
5034 7704370 7588793 7572133 7484513 7597991 7626459 7522347 7591565 7590535 7874454 8111719 8206601
5023 8206601 8267589 8146669 8158916 8309652 8335496 8532781 8504194 8309633 8277922 8116699
5013 8116699 8105329 8078332 8006748 7902610 7912791 8099907 8178164 8287201 8290447 8363783 8434800
5002 8434800 8560248 8586908 8558155 8523613 8306441 8352509 8213102 8023375 8167389 8080337
4992 8080337 8004031 8055176 8133281 8081894 8176336 8384894 8308624 8234767 8340241 8302786 8261012
4981 8261012 8198613 8078843 7920543 7738081 7845082 7960026 7919067 7897292 8109069 8090505
$$ packed form
5054F687124M7978J38207K3728o9722J61553J32328J81693M8387J6481J60316
5044G528073K14112M0430K29900k1994q7538m0536k36219J8138j24578J84582
5034G704370j15577j6660q7620J13478K8468j04112O9218j030K83919K37265R4882
5023H206601O0988j20920J2247J50736K5844J97285k8587j94561l1711j61223
5013H116699j1370k6997p1584j04138J0181J87116P8257J09037L246P3336P1017
5002H434800J25448K6660k8753l4542k17172M6068j39407j89727J44014q7052
4992H080337p6306N1145P8105n1387R4442K08558p6270p3857J05474l7455m1774
4981H261012o2399j19770j58300j82462J07001J14944m0959k1775K11777j8564
$$ plain form
4971 8090505 8115152 8350319 8654183 8634324 8790793 8914188 8902471 8737506 8585774 8647265
4961 8647265 8602360 8625068 8472463 8354849 8380624 8301238 8310994 8318372 8358446 8477119 8552596
4950 8552596 8724443 8737380 8912118 8947883 8894478 8869914 8833313 8806042 8706954 8732444 8746988
4939 8746988 8586585 8661899 8771660 8529325 8367339 8511239 8556657 8789755 8822239 8840061
4929 8840061 8930666 8921376 8824930 8866435 8858854 8802141 8730841 8744982 8771146 8836207 8833130 8769126
4917 8769126 8845483 8964217 9124576 9099628 9055875 9202389 9190234 9333976 9322831 9368941 9551681
4906 9551681 9606361 9674936 9661296 9832373 10003844 10110397 10188576 10293714 10376887 10408076 10239163
4895 10239163 10187500 10176713 10038400 10111134 10115659 10028797 10122517 10264214 10219972 10321585 10439385
$$ packed form
4971H090505K4647K35167L03864j9859J56469J23395j1717j64965j51732O1491
4961H647265m4905K2708j52605j17614K5775p9386R756P378M0074J18673P5477
4950H552596J71847J2937J74738L5765n3405k4564l6601k7271r9088K5490J4544
4939H746988j60403P5314J09761k42335j61986J43900M5418K33098L2484J7822
4929H840061R0605r290r6446M1505p581n6713p1300J4141K6164O5061l077o4004
4917H769126P6357J18734J60359k4948m3753J46514j2155J43742j1145M6110J82740
4906I551681N4680O8575j3640J71077J71471J06553P8179J05138Q3173L1189j68913
4895A0239163n1663j0787j38313P2734M525q6862R3720J41697m4242J01613J17800
$$ plain form
4884 10439385 10561651 10817057 10987174 11301017 11634863 11823287 11939733 11967100 12005987 11681493
4874 11681493 11488132 11350602 11127118 11135505 11183188 11232771 11149476 11120677 11239106 11232269 11311038
4863 11311038 11347705 11531871 11563192 11668037 11804871 11816690 11735370 11634932 11731040 11679095
4853 11679095 11712189 11630956 11642117 11669888 11736212 11922931 12199569 12445038 12390781 12457487 12612430
4842 12612430 12530050 12398344 12352184 12356682 12210673 11953006 11714682 11627989 11624286 11677752 11462204
4831 11462204 11420242 11571601 11787817 11926869 12086200 12310597 12488953 12707558 13188766 13326120
4821 13326120 13163083 13097081 13151735 13075361 13043025 13032610 13115510 13112225 13322841 13295282 13363161
4810 13363161 13461741 13580832 13752735 14093393 14441620 14846852 15259977 15538129 15695956 15889684
$$ packed form
4884A0439385J22266K55406J70117L13843L33846J88424J16446K7367L8887l24494
4874A1681493j93361j37530k23484Q387M7683M9583q3295k8799J18429o837P8769
4863A1311038L6667J84166L1321J04845J36834J1819q1320j00438R6108n1945
4853A1679095L3094q1233J1161K7771O6324J86719K76638K45469n4257O6706J54943
4842A2612430q2380j31706m6160M498j46009k57667k38324q6693l703N3466k15548
4831A1462204m1962J51359K16216J39052J59331K24397J78356K18605M81208J37354
4821A3326120j63037o6002N4654p6374l2336j0415Q2900l285K10616k7559O7879
4810A3363161R8580J19091J71903L40658L48227M05232M13125K78152J57827J93728
$$ plain form
4800 15889684 16206528 16435019 16824585 17055765 17706078 18339554 18760063 19176467 19570477
4791 19570477 19900479 19986562 20191857 20525195 20706312 20989461 21420222 22002662 22715094 23363038
4781 23363038 24201277 25292084 26624603 28148838 29963240 31773628 33597491 35337344
4773 35337344 36719092 37428122 37442143 36752856 35771983 34948005 34222334 33752797 33615674
4764 33615674 33887944 34477404 35327523 36531442 38095331 40222639 42524106 44888392 46859561
4755 46859561 48061707 48557119 48060199 46914950 45255305 43419115 41488303 39372082
4747 39372082 37797737 36685324 35857121 35370630 35093929 35397390 35869300 36566422 37239895
4738 37239895 37942461 38048093 37825356 36935848 35847210 34575563 33096110 31728160 30359038
$$ packed form
4800A5889684L16844K28491L89566K31180O50313O33476M20509M16404L94010
4791A9570477L30002Q6083K05295L33338J81117K83149M30761N82440P12432O47944
4781B3363038Q38239J090807J332519J524235J814402J810388J823863J739853
4773C5337344J381748P09030J4021o89287r80873q23978p25671m69537j37123
4764C3615674K72270N89460Q50119J203919J563889K127308K301467K364286J971169
4755D6859561J202146M95412m96920j145249j659645j836190j930812k116221
4747C9372082j574345j112413q28203m86491k76701L03461M71910O97122O73473
4738C7239895P02566J05632k22737q89508j088638j271647j479453j367950j369122
$$ plain form
4729 30359038 29367691 28376773 27622326 27063014 26537124 26263599 26051447 25808290 25945828
4720 25945828 25833748 25986601 26116414 26269178 26456260 26627381 26789757 26864826 27151530 27280067
4710 27280067 27408854 27724970 28246781 28846079 29822599 30738209 31954164 32842964 33244886
4701 33244886 32996299 32294952 31452895 30728743 30107982 29719910 29406975 29366843 29540893 29879636
4691 29879636 30098347 30903159 31800527 33003833 34567813 36562977 39010962 41517224 43867807
4682 43867807 45042329 44716838 42965853 40084658 37115706 34622402 32376651 30760134
4674 30760134 29358603 28346317 27609341 27281491 27112403 27013631 27436701 28094463 28966677
4665 28966677 30084025 31160889 32105524 32662973 32122790 31114651 29577939 27795430 26080232
$$ packed form
4729C0359038r91347r90918p54447n59312n25890k73525k12152k43157J37538
4720B5945828j12080J52853J29813J52764J87082J71121J62376P5069K86704J28537
4710B7280067J28787L16116N21811N99298R76520R15610J215955Q88800M01922
4701C3244886k48587p01347q42057p24152o20761l88072l12935m0132J74050L38743
4691B9879636K18711Q04812Q97368J203306J563980J995164K447985K506262K350583
4682D3867807J174522l25491j750985k881195k968952k493304k245751j616517
4674C0760134j401531j012286p36976l27850j69088r8772M23070O57762Q72214
4665B8966677J117348J076864R44635N57449n40183j008139j536712j782509j715198
$$ plain form
4656 26080232 24660066 23382107 22481934 21684054 20932699 20646304 20190023 19775139 19714378
4647 19714378 19845724 19798284 19829787 19771686 19657284 19030520 18415081 17692520 17169726 16813733
4637 16813733 16478967 16401379 16005168 15786472 15669140 15759334 15797679 15574906 15593546 15747546
4627 15747546 15711092 15509459 15546016 15481776 15161044 14803902 14320640 13964944 13494886 13051851
4617 13051851 12683731 12434335 12389601 12174512 12231478 11982375 11879257 11623142 11579197 11451528
4607 11451528 11551271 11432199 11261757 10993928 10855786 10720613 10541145 10349907 10281079 10104309
4597 10104309 9870323 9980463 9973958 10038960 10131153 9951690 9876662 9850195 9968473 10048020 10014399
4586 10014399 10096150 10204013 10121587 10244290 10407351 10562911 10584751 10548096 10890501 11155888
$$ packed form
4656B6080232j420166j277959r00173p97880p51355k86395m56281m14884o0761
4647A9714378J31346m7440L1503n8101j14402o26764o15439p22561n22794l55993
4637A6813733l34766p7588l96211k18696j17332R0194L8345k22773J8640J54000
4627A5747546l6454k01633L6557o4240l20732l57142m83262l55696m70058m43035
4617A3051851l68120k49396m4734k15089N6966k49103j03118k56115m3945j27669
4607A1451528R9743j19072j70442k67829j38142j35173j79468j91238o8828j76770
4597A0104309k33986J10140o505O5002R2193j79463p5028k6467J18278P9547l3621
4586A0014399Q1751J07863q2426J22703J63061J55560K1840l6655L42405K65387
$$ plain form
4576 11155888 11358597 11534019 11590113 11572615 11602255 11621531 11416765 11214944 11134282 10975362
4566 10975362 11118364 11119373 11058641 11109767 11170473 11222787 11332339 11501461 11692578 11908084
4556 11908084 12288274 12388263 12506470 12660575 12864668 12882487 12894173 13001407 13069899 13079123
4546 13079123 13133356 13153981 13205802 13266784 13386868 13758141 14085001 14481086 14882542 14782319
4536 14782319 14905056 15266217 15411304 15600495 15732831 15689034 15759836 16041562 15963039 15713289
4526 15713289 15696364 15623744 15464096 15381937 15329511 15443324 15509406 15676931 15634768 15708048 15820315
4515 15820315 15917137 16184249 16202629 16092699 16125586 16372779 16495371 16676160 16855016 16977138
4505 16977138 16985628 17063221 16836074 16871008 16935354 16926707 17091469 17138391 17335637 17547395 17647098
$$ packed form
4576A1155888K02709J75422N6094j7498K9640J9276k04766k01821q0662j58920
4566A0975362J43002J009o0732N1126O0706N2314J09552J69122J91117K15506
4556A1908084L80190R9989J18207J54105K04093J7819J1686J07234O8492R224
4546A3079123N4233K0625N1821O0982J20084L71273L26860L96085M01456j00223
4536A4782319J22737L61161J45087J89191J32336m3797P0802K81726p8523k49750
4526A5713289j6925p2620j59648q2159n2426J13813O6082J67525m2163P3280J12267
4515A5820315R6822K67112J8380j09930L2887K47193J22592J80789J78856J22122
4505A6977138Q490P7593k27147L4934O4346q647J64762M6922J97246K11758R9703
$$ plain form
4494 17647098 17718302 18020058 18235048 18335178 18517322 18785395 19058162 19358091 19898444 20139118
4484 20139118 20568238 20849969 20953686 21388222 21888717 22254363 22715983 23238024 23699802
4475 23699802 24360785 24977244 25547664 26425039 27220392 28189182 29138254 30318957 31316698
4466 31316698 32508836 34306930 35992192 37788427 39706581 41260316 42662208 43736908
4458 43736908 44385925 44584832 44588330 44372118 44210913 44522437 44846076 45600861 46549259 47706596
4448 47706596 49206958 51058991 53028620 55199307 57284775 59067899 60175454 60577821
4440 60577821 60580318 60318577 59953267 59475380 58618744 57822336 57118688 56846216 56944110 56999835
4430 56999835 57447906 58161020 59031273 59620035 60069567 60273151 59899521 59314136 58497714
$$ packed form
4494A7647098P1204L01756K14990J00130J82144K68073K72767K99929N40353K40674
4484B0139118M29120K81731J03717M34536N00495L65646M61620N22041M61778
4475B3699802O60983O16459N70420Q77375P95353R68790R49072J180703R97741
4466C1316698J192138J798094J685262J796235J918154J553735J401892J074700
4458D3736908O49017J98907L498k16212j61205L11524L23639P54785R48398J157337
4448D7706596J500362J852033J969629K170687K085468J783124J107555M02367
4440F0577821K497k61741l65310m77887q56636p96408p03648k72472R7894N5725
4430E6999835M48071P13114Q70253N88762M49532K03584l73630n85385q16422
$$ plain form
4421 58497714 57576939 56282056 55496527 55122621 54537807 54441741 54336172 54431910 54573989 54961811
4411 54961811 55442241 55860594 56298870 56574261 56528867 56124524 55251356 53881385 52456837
4402 52456837 50838084 49279090 47555763 46080380 44900231 43949457 43149987 42433590 41768332
4393 41768332 41640194 41614194 41624525 41502092 41250576 40868001 40265135 39497180 38560470 37431606
4383 37431606 36317493 35446385 34444312 33690390 32974542 32342595 31954733 31529972 31175189
4374 31175189 30845090 30713346 30675340 30766609 30813746 31087442 31283084 31367446 31316891 31340187
4364 31340187 31416821 31390819 31606856 31957890 32250178 32642985 33254954 34021107 34894667 35814298
4354 35814298 37021303 38146789 39513720 41205650 43186953 45209473 46902630 47579534
$$ packed form
4421E8497714r20775j294883p85529l73906n84814r6066j05569R5738J42079L87822
4411E4961811M80430M18353M38276K75391m5394m04343q73168j369971j424548
4402E2456837j618753j558994j723327j475383j180149r50774p99470p16397o65258
4393D1768332j28138k6000J0331j22433k51516l82575o02866p67955r36710j128864
4383C7431606j114113q71108j002073p53922p15848o31947l87862m24761l54783
4374C1175189l30099j31744l8006R1269M7137K73696J95642Q4362n0555K3296
4364C1340187P6634k6002K16037L51034K92288L92807O11969P66153Q73560R19631
4354C5814298J207005J125486J366931J691930J981303K022520J693157O76904
$$ plain form
4346 47579534 47168465 45908764 44451475 43172547 42077952 41487832 41242638 41187330 41267575
4337 41267575 41537876 41885735 42342800 43224943 44435374 46293408 48531889 51266519 54421165
4328 54421165 56779344 57796892 56747336 53974645 50685546 47674218 45309846 43305923
4320 43305923 41723689 40597805 39685630 38840778 38045737 37036920 36802464 36624101 36533377
4311 36533377 37083309 37562448 38219679 38918667 39247191 38834057 37683675 36189570 34572563
4302 34572563 33122037 32135659 31357394 30746354 30181059 29875764 29879891 29646856 29639579 29566140
4292 29566140 29532287 29666736 30169932 31025723 32423482 34595375 37852222 39716376 38454353
4283 38454353 35710113 32341024 29878263 27948848 26300834 25206563 24363621 23695462
$$ packed form
4346D7579534m11069j259701j457289j278928j094595n90120k45194n5308Q0245
4337D1267575K70301L47859M57065Q82143J210431J858034K238481K734630L154646
4328E4421165K358179J017548j049556k772691l289099l011328k364372k003923
4320D3305923j582234j125884r12175q44852p95041j008817k34456j78363r0724
4311C6533377N49932M79139O57231O98988L28524m13134j150382j494105j617007
4302C4572563j450526r86378p78265o11040n65295l05295M127k33035p277p3439
4292B9566140l3853J34449N03196Q55791J397759K171893L256847J864154j262023
4283C8454353k744240l369089k462761j929415j648014j094271q42942o68159
$$ plain form
4275 23695462 23225751 22766543 22546986 22420960 22080989 21944938 22106766 22082743 22154647 22186154
4265 22186154 22143680 22045999 22252168 22474831 22692313 22945337 23165729 23203252 22919506 22581782
4255 22581782 21839097 21161719 20573694 19832360 19416715 19002107 18438014 18095192 17959184
4246 17959184 17684000 17573117 17380615 17314280 17191445 17037386 16751141 16794537 16521559 16149868
4236 16149868 16060370 15895578 15874295 15802143 15803036 16056759 16184240 16248281 15969715 15706805 15227942
4225 15227942 14703042 14225201 13810771 13462031 13333805 13163162 12969479 13029245 12804107 12702009
4215 12702009 12470339 12411669 12058042 11923834 11928144 11864636 11725228 11613157 11657190 11519663
4205 11519663 11401041 11399877 11228337 11029251 10673034 10518274 10272594 10153063 10022741 9963981
$$ packed form
4275B3695462m69711m59208k19557j26026l39971j36051J61828k4023P1904L1507
4265B2186154m2474r7681K06169K22663K17482K53024K20392L7523k83746l37724
4255B2581782p42685o77378n88025p41334m15645m14608n64093l42822j36008
4246A7959184k75184j10883j92502o6335j22835j54059k86245M3396k72978l71691
4236A6149868q9498j64792k1283p2152Q93K53723J27481O4041k78566k62910m78863
4225A5227942n24900m77841m14430l48740j28226j70643j93683N9766k25138j02098
4215A2702009k31670n8670l53627j34208M310o3508j39408j12071M4033j37527
4205A1519663j18622j164j71540j99086l56217j54760k45680j19531j30322n8760
$$ plain form
4195 9963981 9795548 9671005 9434160 9402078 9426584 9249150 9194761 9321328 9431968 9461442
4185 9461442 9429146 9488465 9470789 9554796 9481257 9748701 9937468 10055923 10110278 10153095 10288501
4174 10288501 10435349 10725987 11163235 11631826 12272347 12845424 13033741 12806162 12452961
4165 12452961 11983408 11463220 10950138 10750072 10621432 10513256 10462196 10615433 10737143 10794899
4155 10794899 11020097 11359060 11918796 12429206 12877941 13434233 14468500 15857246 17372144
4146 17372144 19442275 21692558 22781117 22735133 21522556 19498246 17352474 15737480
4138 15737480 14480370 13514713 12760760 12238457 11874112 11720590 11541205 11539572 11709632 11857357
4128 11857357 12159264 12683601 13123807 14013090 15079253 16553508 18929112 21258959 22597931
$$ packed form
4195I963981j68433j24543k36845l2082K4506j77434n4389J26567J10640K9474
4185I461442l2296N9319j7676Q4007p3539K67444J88767J18455N4355M2817J35406
4174A0288501J46848K90638M37248M68591O40521N73077J88317k27579l53201
4165A2452961m69553n20188n13082k00066j28640j08176n1060J53237J21710N7756
4155A0794899K25198L38963N59736N10410M48735N56292J034267J388746J514898
4146A7372144K070131K250283J088559m5984j212577k024310k145772j614994
4138A5737480j257110r65657p53953n22303l64345j53522j79385j633J70060J47725
4128A1857357L01907N24337M40206Q89283J066163J474255K375604K329847J338972
$$ plain form
4119 22597931 22893666 21928309 19899472 17778527 15982236 14498042 13426465 12620504 11806083
4110 11806083 11242816 10790549 10530506 10356008 10242999 10055575 9961502 10039802 10034203 10117086
4100 10117086 10375638 10908025 11493017 12321091 13009366 13404356 13276408 12747331 12288186
4091 12288186 11997797 11562587 11479542 11431636 11118246 10699116 10336011 9874105 9568762 9224390
4081 9224390 8873866 8666929 8419694 8063193 7997406 7883325 7853530 7819251 7903511 7855227
4071 7855227 8066473 8300227 8476599 8632019 9079201 9467476 9827877 10083122 9902848 9859511
4061 9859511 9658703 9356400 8973925 8559733 8221782 7924111 7731072 7473289 7314009 7235455
4051 7235455 6935809 6785526 6745873 6810070 6904118 6628645 6673008 6853317 6784267 7044286
$$ packed form
4119B2597931K95735r65357k028837k120945j796291j484194j071577q05961q14421
4110A1806083n63267m52267k60043j74498j13009j87424r4073P8300n599Q2883
4100A0117086K58552N32387N84992Q28074O88275L94990j27948n29077m59145
4091A2288186k90389m35210q3045m7906l13390m19130l63105m61906l05343l44372
4081I224390l50524k06937k47235l56501o5787j14081k9795l4279Q4260m8284
4071G855227K11246K33754J76372J55420M47182L88275L60401K55245j80274m3337
4061I859511k00808l02303l82475m14192l37951k97671j93039k57783j59280p8554
4051G235455k99646j50283l9653O4197R4048k75473M4363J80309o9050K60019
$$ plain form
4041 7044286 7308992 7276672 7453694 7739002 7826480 7894172 7807414 7724229 7271030 7040943
4031 7040943 6789266 6677706 6655075 6460512 6385165 6186637 6113455 6104489 6158580 5878265 5841454
4020 5841454 6003021 5939274 6068747 6133750 6221665 6414910 6686015 6815114 7197367 7353804
4010 7353804 7263766 7300529 7280973 7156318 7097581 6862437 6743650 6884592 6926054 6958856 6946286
3999 6946286 6870409 6877622 6966499 7017214 7212594 7268260 7244591 7583895 7535359 7623522 7711743
3988 7711743 7920926 8094929 8435154 8641429 8871547 9153589 9292662 9369452 9671685 9722521
3978 9722521 9851190 9938447 10267823 10515547 10461650 10394920 10657792 10906468 11011725 11298926
3968 11298926 11503108 11796319 12171994 12400093 12593224 12849164 12745964 12886412 13059620
$$ packed form
4041G044286K64706l2320J77022K85308Q7478O7692q6758q3185m53199k30087
4031G040943k51677j11560k2631j94563p5347j98528p3182q966N4091k80315l6811
4020E841454J61567o3747J29473O5003Q7915J93245K71105J29099L82253J56437
4010G353804r0038L6763j9556j24655n8737k35144j18787J40942M1462L2802j2570
3999F946286p5877P213Q8877N0715J95380N5666k3669L39304m8536Q8163Q8221
3988G711743K09183J74003L40225K06275K30118K82042J39073P6790L02233N0836
3978I722521J28669Q7257L29376K47724n3897o6730K62872K48676J05257K87201
3968A1298926K04182K93211L75675K28099J93131K55940j03200J40448J73208
$$ plain form
3959 13059620 13176720 13370592 13282090 13628921 13789634 13949923 13824819 13977858 14150976 14068889
3949 14068889 14131400 14139025 14280573 14449442 14441280 14507050 14560929 14537471 14537415 14522230 14433465 14503589
3937 14503589 14385061 14563618 14647691 14614376 14794815 14902345 15181983 15185746 15335854 15315010
3927 15315010 15468600 15778969 16101636 16306173 16624874 16873054 17428431 18328784 19515215
3918 19515215 21143090 23331621 24102738 24038102 24096975 23193940 21229960 19529948 18338838
3909 18338838 17360245 16389691 15762031 15100792 14642259 14332410 14033131 13587104 13335773
3900 13335773 13155014 13050903 12952249 12873439 12764831 12598751 12589233 12660398 12580984 12492544 12498382
3889 12498382 12424711 12347532 12115844 12087523 12131446 12045975 12029996 11897155 11751373 11713870 11884715
$$ packed form
3959A3059620J17100J93872q8502L46831J60713J60289j25104J53039J73118q2087
3949A4068889O2511P625J41548J68869q162O5770N3879k3458n6j5185q8765P0124
3937A4503589j18528J78557Q4073l3315J80439J07530K79638L763J50108k0844
3927A5315010J53590L10369L22667K04537L18701K48180N55377R00353J186431
3918A9515215J627875K188531P71117o4636N8873r03035j963980j700012j191110
3909A8338838r78593r70554o27660o61239m58533l09849k99279m46027k51331
3900A3335773j80759j04111r8654p8810j08608j66080r518P1165p9414q8440N838
3889A2498382p3671p7179k31688k8321M3923q5471j5979j32841j45782l7503J70845
$$ plain form
3878 11884715 11767220 11823834 11929312 11861093 12085660 12136105 12210710 12239314 12358127 12456407
3868 12456407 12540882 12668599 12854482 13132534 13131663 13359464 13639303 13845406 14096031 14379533
3858 14379533 14645217 14911557 15167132 15655518 15919833 15993924 16093858 16366799 16484881 16893632
3848 16893632 17372983 17765890 18143502 18548549 18980299 19416847 19851031 20300651 20886837
3839 20886837 21403098 21836789 22109476 22665806 23474836 24518545 25664685 26920419 28103746
3830 28103746 29300550 30411184 31583863 33584059 36052602 39351270 43925447 51217915
3822 51217915 58214487 59741382 59934512 56933859 50531507 45473923 41864533 38897423
3814 38897423 36416541 34911657 34046047 33594330 33283366 33143078 33395625 33729841 34264201
$$ packed form
3878A1884715j17495N6614J05478o8219K24567N0445P4605K8604J18813R8280
3868A2456407Q4475J27717J85883K78052q71K27801K79839K06103K50625K83502
3858A4379533K65684K66340K55575M88386K64315P4091R9934K72941J18082M08751
3848A6893632M79351L92907L77612M05047M31750M36548M34184M49620N86186
3839B0886837N16261M33691K72687N56330Q09030J043709J146140J255734J183327
3830B8103746J196804J110634J172679K000196K468543L298668M574177P292468
3822E1217915O996572J526895J93130l000653o402352n057584l609390k967110
3814C8897423k480882j504884q65610m51717l10964j40288K52547L34216N34360
$$ plain form
3805 34264201 34983810 35817008 36785121 37801464 38867275 40117534 41356755 42746780 44251761
3796 44251761 45737959 47361581 49190261 51082161 53294173 55773402 58211012 60769296
3788 60769296 63709798 66580874 69363071 72052647 74996857 77829570 80513809 83059628
3780 83059628 85438119 87883050 90159896 92441862 94869629 97475751 100009030 102789649
3772 102789649 105590239 108618818 111760487 114861670 118379762 121860862 125319455 128698033
3764 128698033 131626704 134017194 135629914 136346158 136480098 136208979 135830819 135344872 134823625
3755 134823625 134439077 134354070 134144913 134086938 133919167 133618933 133268338 133063817 132888461 132565069
3745 132565069 131879976 130821903 129079291 126835401 124018192 120613013 117304350 113650907
$$ packed form
3805C4264201P19609Q33198R68113J016343J065811J250259J239221J390025J504981
3796D4251761J486198J623622J828680J891900K212012K479229K437610K558284
3788F0769296K940502K871076K782197K689576K944210K832713K684239K545819
3780H3059628K378491K444931K276846K281966K427767K606122K533279K780619
3772A02789649K800590L028579L141669L101183L518092L481100L458593L378578
3764A28698033K928671K390490J612720P16244J33940k71119l78160m85947n21247
3755A34823625l84548q5007k09157n7975j67771l00234l50595k04521j75356l23392
3745A32565069o85093j058073j742612k243890k817209l405179l308663l653443
$$ plain form
3737 113650907 109914232 106583557 103522085 100452160 97497421 94652340 91860497 89376291
3729 89376291 87130424 84986288 82977486 81063675 79244249 77309525 75249933 73290276
3721 73290276 71286324 69520322 67960372 66432540 65078619 63920043 62951291 61891382
3713 61891382 61110043 60378790 59788962 59259844 58875116 58587530 58197866 57719041 57252713
3704 57252713 56791209 56449532 56007134 55583968 55289355 54878702 54884534 55011530 55325469 55401839
3694 55401839 55516659 56067356 56491514 56916728 57317990 57580211 57490036 57004137 55954899
3685 55954899 54724692 53084452 51465149 49723902 48001589 46569507 45080390 43808161
3677 43808161 42641343 41654077 41074915 40606515 40212702 39602656 39289845 38881250 38521728
$$ packed form
3737A13650907l736675l330675l061472l069925k954739k845081k791843k484206
3729H9376291k245867k144136k008802j913811j819426j934724k059592j959657
3721G3290276k003952j766002j559950j527832j353921j158576r68752j059909
3713F1891382p81339p31253n89828n29118l84728k87586l89664m78825m66328
3704E7252713m61504l41677m42398m23166k94613m10653N832J26996L13939P6370
3694E5401839J14820N50697M24158M25214M01262K62221r0175m85899j049238
3685E5954899j230207j640240j619303j741247j722313j432082j489117j272229
3677D3808161j166818r87266n79162m68400l93813o10046l12811m08595l59522
$$ plain form
3668 38521728 37857763 37096895 36383845 35501409 34300234 33368971 32419904 31411113 30383465
3659 30383465 29252556 28396398 27498688 26694334 25851280 25053045 24429059 23798333 23413862
3650 23413862 23069466 22811011 22590293 22269356 21954779 21542950 21173666 20920462 20678237
3641 20678237 20398047 20134408 19853280 19483158 19284566 19119372 18862379 18479654 18098649
3632 18098649 17910034 17515624 17148068 16928429 16749703 16347426 16076516 15927473 15583484
3623 15583484 15243574 15082373 14728408 14634420 14356381 14185684 13981775 13725391 13380659 13343391
3613 13343391 13166941 13171395 12881708 12494770 12328599 12162672 12037054 12023923 11726747 11566166
3603 11566166 11446260 11124131 11141398 10939686 10715583 10516288 10537253 10304815 10158188 9901926
$$ packed form
3668C8521728o63965p60868p13050q82436j201175r31263r49067j008791j027648
3659C0383465j130909q56158q97710q04354q43054p98235o23986o30726l84471
3650B3413862l44396k58455k20718l20937l14577m11829l69284k53204k42225
3641B0678237k80190k63639k81128l70122j98592j65194k56993l82725l81005
3632A8098649j88615l94410l67556k19639j78726m02277k70910j49043l43989
3623A5583484l39910j61201l53965r3988k78039j70697k03909k56384l44732l7268
3613A3343391j76450M454k89687l86938j66171j65927j25618j3131k97176j60581
3603A1566166j19906l22129J7267k01712k24103j99295K0965k32438j46627k56262
$$ plain form
3593 9901926 9835556 9744843 9596043 9408865 9490714 9612533 9487730 9444480 9246754 9249866 9162314
3582 9162314 9109400 9018419 8878473 8694875 8599599 8597096 8455720 8293488 8072295 8013237 8035053
3571 8035053 8253800 8342070 8257282 8291192 8188405 8032107 8061637 8116155 8177657 8156327 8214768
3560 8214768 8379426 8430509 8610723 8612556 8588325 8438968 8247415 8093819 7893908 7852468
3550 7852468 7767306 7833437 7549150 7497990 7442524 7450923 7568735 7524440 7312445 7234803 7380142
3539 7380142 7263737 7284580 7238150 7261486 7305429 7227630 7223571 7149515 7256127 7403779 7374227
3528 7374227 7320761 7414403 7455168 7541306 7485304 7375707 7284057 7285538 7277121 7203769 7334168
3517 7334168 7310738 7374504 7449473 7429582 7422019 7404471 7425871 7425837 7475484 7478615 7530398 7500764
$$ packed form
3593I901926o6370r0713j48800j87178Q1849J21819j24803m3250j97726L112q7552
3582I162314n2914r0981j39946j83598r5276k503j41376j62232k21193n9058K1816
3571H035053K18747Q8270q4788L3910j02787j56298K9530N4518O1502k1330N8441
3560H214768J64658N1083J80214J833k4231j49357j91553j53596j99911m1440
3550G852468q5162O6131k84287n1160n5466Q399J17812m4295k11995p7642J45339
3539G380142j16405K0843m6430K3336M3943p7799m059p4056J06612J47652k9552
3528G374227n3466R3642M0765Q6138n6002j09597r1650J481q417p3352J30399
3517G334168k3430O3766P4969j9891p563j7548K1400l4M9647L131N1783k9634
$$ plain form
3505 7500764 7597780 7785876 7728849 7741967 7721452 7956646 7932449 8030238 8103024 8185464 8289726
3494 8289726 8396411 8434471 8535855 8695193 8909905 9069354 9161173 9297651 9465537 9486471
3484 9486471 9680812 9917153 9997026 10127965 10193946 10267745 10441344 10535169 10855925 11036828
3474 11036828 11148369 11316777 11393951 11418015 11348707 11613718 11563590 11591390 11537569 11488790 11580152
3463 11580152 11711254 11915649 12226809 12455859 12544177 12860398 13243654 13505749 13971198 14596909
3453 14596909 15414570 16183247 16146228 15789160 15076769 14692650 14368348 14292175 14291615 14141296
3443 14141296 14385200 14630517 14635138 14784807 14955745 15085203 15321769 15197380 15300173 15530447
3433 15530447 15602188 15725764 15830469 15850194 15991879 16362497 16514058 16627829 16727033 16779474
$$ packed form
3505G500764R7016J88096n7027J3118k0515K35194k4197R7789P2786Q2440J04262
3494H289726J06685L8060J01384J59338K14712J59449R1819J36478J67886K0934
3484I486471J94341K36341P9873J30939O5981P3799J73599R3825L20756J80903
3474A1036828J11541J68408P7174K4064o9308K65011n0128K7800n3821m8779R1362
3463A1580152J31102K04395L11160K29050Q8318L16221L83256K62095M65449O25711
3453A4596909Q17661P68677l7019l57068p12391l84119l24302p6173n60j50319
3443A4141296K43904K45317M621J49669J70938J29458K36566j24389J02793K30274
3433A5530447P1741J23576J04705J9725J41685L70618J51561J13771R9204N2441
$$ plain form
3423 16779474 17030884 17336424 17349560 17544907 17884568 18072966 18405108 18627110 18772804 18952040
3413 18952040 19180604 19165765 19423345 19476614 19644196 19727729 19893616 20083172 20506937 20602115
3403 20602115 20915409 21253903 21386024 21755727 22163087 22417688 22712677 23100836 23673143
3394 23673143 24067532 24502011 24795618 25303389 26037894 26614877 27022422 27418087 28249315
3385 28249315 29290938 30951229 32808226 34700070 34463537 32945677 30483914 28280998
3377 28280998 26970580 25720913 24862398 24331793 23828509 23514705 23482085 23524608 23585578 23565145
3367 23565145 23688037 23746531 23879384 23979653 24232735 24575206 24686804 24867443 25111343 25420793
3357 25420793 25698063 25969456 26524324 26869316 27324421 27833874 28250317 28427317 28690483
$$ packed form
3423A6779474K51410L05540J3136J95347L39661J88398L32142K22002J45694J79236
3413A8952040K28564j4839K57580N3269J67582Q3533J65887J89556M23765R5178
3403B0602115L13294L38494J32121L69703M07360K54601K94989L88159N72307
3394B3673143L94389M34479K93607N07771P34505N76983M07545L95665Q31228
3385B8249315J041623J660291J856997J891844k36533j517860k461763k202916
3377B8280998j310418j249667q58515n30605n03284l13804l2620M2523O0970k0433
3367B3565145J22892N8494J32853J00269K53082L42471J11598J80639K43900L09450
3357B5420793K77270K71393N54868L44992M55105N09453M16443J77000K63166
$$ plain form
3348 28690483 28810612 28949270 29200942 29320043 29607272 30070664 30395428 30668068 30873094
3339 30873094 30945930 30672695 30493658 30232382 29896325 29714190 29608043 29325896 29173976 29110577
3329 29110577 28775329 28377348 27950666 27492926 27028491 26650258 26365067 26092660 25887730
3320 25887730 25675179 25339194 25135141 24782669 24562887 24295317 24131626 23619700 23499606
3311 23499606 23302846 23064134 22835723 22654563 22612421 22270832 22277148 22032018 21990972 22064470
3301 22064470 22030242 22089582 22105261 22165898 22336226 22351996 22540590 22813289 22909799 23146655
3291 23146655 23392829 23597399 23661923 24035450 24296311 24707800 25025816 25240048 25605609 25842018
3281 25842018 26254731 26755558 27174273 27568089 28001977 28408200 28712546 29063585 29540697
$$ packed form
3348B8690483J20129J38658K51672J19101K87229M63392L24764K72640K05026
3339C0873094P2836k73235j79037k61276l36057j82135j06147k82147j51920o3399
3329B9110577l35248l97981m26682m57740m64435l78233k85191k72407k04930
3320B5887730k12551l35985k04053l52472k19782k67570j63691n11926j20094
3311B3499606j96760k38712k28411j81160m2142l41589O316k45130m1046P3498
3301B2064470l4228N9340J5679O0637J70328J5770J88594K72699R6510K36856
3291B3146655K46174K04570O4524L73527K60861M11489L18016K14232L65561K36409
3281B5842018M12713N00827M18715L93816M33888M06223L04346L51039M77112
$$ plain form
3272 29540697 30253148 30605213 31050836 31594698 31913982 32372834 32950749 33414179 33842791
3263 33842791 34399473 35082099 35813086 36647602 37353965 38136606 39093087 39858420 40877412
3254 40877412 41837387 42657630 43634644 44554502 45600934 46706784 47828544 49089297 50315237
3245 50315237 51433781 52752469 53971895 55321988 56413504 57521867 58755081 59880405
3237 59880405 60987737 61983809 63078658 64137509 65334173 66576271 67866896 69115526
3229 69115526 70445834 71783812 73047439 74552502 76123732 77747457 79506349 81110106
3221 81110106 82685712 84419546 86053701 87642857 89277054 90794286 92297547 93685957
3213 93685957 94982357 96234405 97626615 98850039 100028679 100936627 101651141 102624198 103582335
$$ packed form
3272B9540697P12451L52065M45623N43862L19284M58852N77915M63430M28612
3263C3842791N56682O82626P30987Q34516P06363P82641R56481P65333J018992
3254D0877412R59975Q20243R77014R19858J046432J105850J121760J260753J225940
3245E0315237J118544J318688J219426J350093J091516J108363J233214J125324
3237E9880405J107332R96072J094849J058851J196664J242098J290625J248630
3229F9115526J330308J337978J263627J505063J571230J623725J758892J603757
3221H1110106J575606J733834J634155J589156J634197J517232J503261J388410
3213I3685957J296400J252048J392210J223424J178640R07948P14514R73057R58137
$$ plain form
3204 103582335 104360584 105269065 106214547 107306172 108338689 109266364 110238807 111098024 111788237
3195 111788237 112403572 113125737 113783703 114493410 115128975 115922312 116594877 117005908 117184982
3186 117184982 116917396 116828341 116813941 116620481 116465627 116023940 115298082 114321358 113428953 112789294
3176 112789294 112054012 111477368 110770484 110144161 109722959 109125620 108654254 108495376 107978727
3167 107978727 107285157 106437391 105495105 104575539 103179435 101782977 100149830 97967062 95763615
3158 95763615 93424359 91033765 89006562 87293984 85975009 84739295 83621342 82681132
3150 82681132 81578773 80661570 79638857 78821966 77938854 77070118 76259384 75594423 74961044
3141 74961044 74110771 73386529 72327633 71100690 69852348 68420648 67067143 65585469
$$ packed form
3204A03582335P78249R08481R45482J091625J032517R27675R72443Q59217O90213
3195A11788237O15335P22165O57966P09707O35565P93337O72565M11031J79074
3186A17184982k67586q9055j4400j93460j54854m41687p25858r76724q92405o39659
3176A12789294p35282n76644p06884o26323m21202n97339m71366j58878n16649
3167A07978727o93570q47766r42286r19566j396104j396458j633147k182768k203447
3158I5763615k339256k390594k027203j712578j318975j235714j117953r40210
3150H2681132j102359r17203j022713q16891q83112q68736q10734o64961o33379
3141G4961044q50273p24242j058896j226943j248342j431700j353505j481674
$$ plain form
3133 65585469 64273264 63003498 61436592 59881146 58179691 56375608 54557257 52950244
3125 52950244 51482710 50012254 48669792 47375238 46178882 45029279 43893446 42654385
3117 42654385 41742257 40954107 39966005 39292792 38534453 37741897 37143520 36546693 36028747
3108 36028747 35461441 34956862 34526771 33954615 33577392 33172149 32673684 32236147 31829544
3099 31829544 31644805 31231712 31048496 30733515 30494668 30218817 30125905 29950563 29697625 29389595
3089 29389595 29189375 28909117 28776630 28575144 28363313 28373682 28098562 27920026 27615830 27465056
3079 27465056 27278862 27128968 26938669 26562976 26341494 26045801 25837673 25892274 25710380 25614915
3069 25614915 25645264 25755613 25652368 25418045 25347141 25285462 25166157 25112826 25109473 25028887 25003276
$$ packed form
3133F5585469j312205j269766j566906j555446j701455j804083j818351j607013
3125E2950244j467534j470456j342462j294554j196356j149603j135833j239061
3117D2654385r12128p88150r88102o73213p58339p92556n98377n96827n17946
3108C6028747n67306n04579m30091n72156l77223m05243m98465m37537m06603
3099C1829544j84739m13093j83216l14981k38847k75851r2912j75342k52938l08030
3089B9389595k00220k80258j32487k01486k11831J0369k75120j78536l04196j50774
3079B7465056j86194j49894j90299l75693k21482k95693k08128N4601j81894r5465
3069B5614915L0349J10349j03245k34323p0904o1679j19305n3331l353q0586k5611
$$ plain form
3058 25003276 24827743 24754464 24833051 24852941 24863295 24692501 24582324 24476564 24523132 24435092
3048 24435092 24250112 24117324 24210638 24020588 23902804 23986856 23994436 23827793 24060315 24109569
3038 24109569 24227818 24306949 24398101 24484681 24433422 24371327 24168727 24157139 24165902 24209100 24283911
3027 24283911 24397355 24494274 24390881 24387866 24500804 24383122 24268121 24302370 24320909 24323220 24494039
3016 24494039 24527783 24541856 24769512 24809253 24966336 24962168 25145081 25138023 25161800 25052778 25037961
3005 25037961 25044503 25046486 25287468 25453879 25595635 25643841 25457486 25499333 25386247 25522578
2995 25522578 25578903 25591914 25795906 25855464 25859359 26033597 26167606 26162646 26403635 26392868 26567183
2984 26567183 26687793 26716437 26942868 26882082 26970677 26994408 27013794 27235935 27276715 27451285
$$ packed form
3058B5003276j75533p3279P8587J9890J0354j70794j10177j05760M6568q8040
3048B4435092j84980j32788R3314j90050j17784Q4052P580j66643K32522M9254
3038B4109569J18249P9131R1152Q6580n1259o2095k02600j1588Q763M3198P4811
3027B4283911J13444R6919j03393l015J12938j17682j15001L4249J8539K311J70819
3016B4494039L3744J4073K27656L9741J57083m168J82913p058K3777j09022j4817
3005B5037961O542J983K40982J66411J41756M8206j86355M1847j13086J36331
2995B5522578N6325J3011K03992N9558L895J74238J34009m960K40989j0767J74315
2984B6567183J20610K8644K26431o0786Q8595K3731J9386K22141M0780J74570
$$ plain form
2974 27451285 27430895 27444661 27358193 27396261 27232032 27237507 27050259 27179435 27295404 27344902 27430525
2963 27430525 27556525 27743306 27965971 28015018 28122508 28302371 28360546 28406003 28386327 28503799
2953 28503799 28640231 28658772 28589617 28758361 28955366 28991295 29131349 28938734 29008075 29202960
2943 29202960 29318353 29571734 29755161 30001097 30044178 30415408 30900378 31083754 31392920 31386026
2933 31386026 31679635 31962402 32268916 32472787 32479898 32673548 32906402 32990481 32930424 33111384
2923 33111384 33379014 33661097 33761024 33828468 34191484 34348500 34677431 35030707 35346833 35721576
2913 35721576 36011814 36488213 36864556 37271794 37833357 38366865 38853506 39278837 40061024
2904 40061024 40738454 41406300 42077149 42911705 43903779 45131454 46304931 47656488 49367958
$$ packed form
2974B7451285k0390J3766q6468L8068j64229N475j87248J29176J15969M9498Q5623
2963B7430525J26000J86781K22665M9047J07490J79863N8175M5457j9676J17472
2953B8503799J36432J8541o9155J68744J97005L5929J40054j92615O9341J94885
2943B9202960J15393K53381J83427K45936M3081L71230M84970J83376L09166o894
2933C1386026K93609K82767L06514K03871P111J93650K32854Q4079o0057J80960
2923C3111384K67630K82083R9927O7444L63016J57016L28931L53276L16126L74743
2913C5721576K90238M76399L76343M07238N61563N33508M86641M25331P82187
2904D0061024O77430O67846O70849Q34556R92074J227675J173477J351557J711470
$$ plain form
2895 49367958 51031932 52738013 54652228 56850348 58938594 60955234 62679756 64338514
2887 64338514 65591617 66575934 67437105 67913063 68378640 68694903 68891061 69006536 69233752
2878 69233752 69205683 69016866 68607798 67783249 66966927 65839574 64769115 63676687 62652856
2869 62652856 61417228 60409955 59537079 59008532 58528630 58082142 58009722 57779100 57693090
2860 57693090 57805614 57849118 58072580 58318806 58725399 59159452 59515791 59975366 60389622 60989013
2850 60989013 61649432 62155246 62777487 63525898 64312492 65071993 65858054 66898608 67768904
2841 67768904 68514754 69457827 70556552 71640954 72611557 73607855 74755670 75952468 77008716
2832 77008716 78139493 79374090 80913082 82291679 83924593 85714454 87605517 89543265
$$ packed form
2895D9367958J663974J706081J914215K198120K088246K016640J724522J658758
2887F4338514J253103R84317Q61171M75958M65577L16263J96158J15475K27216
2878F9233752k8069j88817m09068q24549q16322j127353j070459j092428j023831
2869F2652856j235628j007273q72876n28547m79902m46488p2420k30622q6010
2860E7693090J12524M3504K23462K46226M06593M34053L56339M59575M14256N99391
2850F0989013O60419N05814O22241P48411P86594P59501P86061J040554Q70296
2841F7768904P45850R43073J098725J084402R70603R96298J147815J196798J056248
2832G7008716J130777J234597J538992J378597J632914J789861J891063J937748
$$ plain form
2824 89543265 91598997 93870012 96197692 98713582 101405392 104234119 106897926 109767238
2816 109767238 112781670 115643335 118360438 121030883 123619608 126199042 128972043 131812233
2808 131812233 134460934 136743528 138867292 141331664 143901032 146682440 149796227 153001326
2800 153001326 156658733 160712825 165012963 169822199 175103142 180859358 187227356 193934325
2792 193934325 201316306 209225145 217726232 226798279 236783702 247841561 259663177 272303830
2784 272303830 286502320 302165631 319272859 337827746 357856217 378604687 399272640
2777 399272640 418669679 434419636 444248606 446263906 439897104 426928095 410581225
2770 410581225 393627009 377608849 363314770 350703719 339779703 330936825 323619935
$$ packed form
2824H9543265K055732K271015K327680K515890K691810K828727K663807K869312
2816A09767238L014432K861665K717103K670445K588725K579434K773001K840190
2808A31812233K648701K282594K123764K464372K569368K781408L113787L205099
2800A53001326L657407M054092M300138M809236N280943N756216O367998O706969
2792A93934325P381981P908839Q501087R072047R985423J1057859J1821616J2640653
2784B72303830J4198490J5663311J7107228J8554887K0028471K0748470K0667953
2777C99272640J9397039J5749957R828970K015300o366802j2969009j6346870
2770D10581225j6954216j6018160j4294079j2611051j0924016q842878p316890
$$ plain form
2763 323619935 315961594 306944534 297333115 288334528 280400180 273458443 267828748 262974584
2755 262974584 257494745 250869146 243290656 235668742 228570323 221809919 215541859 209580435
2747 209580435 204266163 199551646 195572813 191971923 188979234 186483305 184471316 182330327
2739 182330327 180351834 178344349 176526140 174879922 173446201 172806338 173076903 174786980
2731 174786980 175074602 172619638 167412200 160394459 153389858 147090509 141748762 137176330
2723 137176330 133349879 130072209 127440191 125183834 123262978 122284795 121724136 121403987
2715 121403987 121339331 121552263 122214252 122780979 123826330 125239812 126958740 129431635 131227090
2706 131227090 131637678 130753429 128520174 126597735 125382531 124800601 121871576 117014105
$$ packed form
2763C23619935p658341r017060r611419q998587p934348o941737n629695m854164
2755B62974584n479839o625599p578490p621914p098419o760404o268060n961424
2747B09580435n314272m714517l978833l600890k992689k495929k011989k140989
2739A82330327j978493k007485j818209j646218j433721o39863K70565J710077
2731A74786980K87622k454964n207438p017741p004601o299349n341747m572432
2723A37176330l826451l277670k632018k256357j920856r78183n60659l20149
2715A21403987o4656K12932O61989N66727J045351J413482J718928K472895J795455
2706A31227090M10588q84249k233255j922439j215204n81930k929025m857471
$$ plain form
2698 117014105 111831222 107258493 103434454 100313121 97486860 95133010 93157004 91263533
2690 91263533 89723325 88553459 87692708 86854871 86162657 85709169 85724994 86250558 87444500
2681 87444500 89541680 91831697 91809656 90047456 87504313 85186935 83395350 82260211
2673 82260211 81458674 80928567 80418475 80004322 79688295 79508833 79145693 78885379 78509500
2664 78509500 78237334 78151297 78216355 78387896 78734670 79374279 80273310 81387079 82102368 82846771
2654 82846771 83802099 84962037 86357692 87905120 89414782 90649193 91658896 92052732
2646 92052732 91852242 91146216 89764510 87811254 85065479 81941882 78687009 75400175
2638 75400175 72096710 68961213 66014280 63392829 61069146 58913132 56938930 55408861
$$ packed form
2698A17014105n182883m572729l824039l121333k826261k353850j976006j893471
2690I1263533j540208j169866q60751q37837o92214m53488J5825N25564J193942
2681H7444500K097180K290017k2041j762200k543143k317378j791585j135139
2673H2260211q01537n30107n10092m14153l16027j79462l63140k60314l75879
2664G8509500k72166q6037O5058J71541L46774O39609Q99031J113769P15289P44403
2654H2846771R55328J159938J395655J547428J509662J234411J009703L93836
2646I2052732k00490p06026j381706j953256k745775l123597l254873l286834
2638G5400175l303465l135497k946933k621451k323683k156014j974202j530069
$$ plain form
2630 55408861 53920626 52453841 51134523 49875152 48829697 47807712 46824125 45799042
2622 45799042 44935461 43846685 42971363 42248840 41428849 40658561 40016877 39415322 38899621
2613 38899621 38511030 37952631 37890355 37543058 37190566 36832527 36589936 36420372 36168724 35983319
2603 35983319 35837780 35708582 35573049 35375020 35196680 35058355 34978779 35089085 35060509 35063480
2593 35063480 35156887 35119678 35001459 34906522 35085964 35370033 35495453 35792780 36310939 36800879
2583 36800879 37297655 37787445 38279606 38833652 39522395 39881933 40152865 40459214 40735740
2574 40735740 41057382 41432118 42119439 42860843 43794087 44324409 44561934 44696821 44805449
2565 44805449 45115149 45674452 46261797 47056169 48097346 49185826 50616840 51922911 53485859
$$ packed form
2630E5408861j488235j466785j319318j259371j045455j021985r83587j025083
2622D5799042q63581j088776q75322p22523q19991p70288o41684o01555n15701
2613C8899621l88591n58399o2276l47297l52492l58039k42591j69564k51648j85405
2603C5983319j45539j29198j35533j98029j78340j38325p9576J10306k8576K971
2593C5063480R3407l7209j18219r4937J79442K84069J25420K97327N18159M89940
2583C6800879M96776M89790M92161N54046O88743L59538K70932L06349K76526
2574D0735740L21642L74736O87321P41404R33244N30322K37525J34887J08628
2565D4805449L09700N59303N87345P94372J041177J088480J431014J306071J562948
$$ plain form
2556 53485859 55275576 57070854 58647611 59665267 60759470 61839892 63205449 64921656
2548 64921656 66874368 69189461 71984680 74791980 77432378 79883936 82335684 84369241
2540 84369241 85742241 86957303 87928744 88725703 89905455 91188924 92688629 94467061
2532 94467061 96534300 98626189 101055807 103726033 106760018 110028987 113707848 118015594
2524 118015594 122622945 127803752 133670261 139364810 144539660 148217617 149803409 149246296
2516 149246296 146812121 143486915 140490546 138446324 137344133 137305872 138165150 139754982
2508 139754982 142071918 145101360 148791798 152844150 157221284 162136798 167058121 171717398
2500 171717398 175647926 178289091 179138646 178785834 177417215 175219610 172343349 169164697
$$ packed form
2556E3485859J789717J795278J576757J017656J094203J080422J365557J716207
2548F4921656J952712K315093K795219K807300K640398K451558K451748K033557
2540H4369241J373000J215062R71441P96959J179752J283469J499705J778432
2532I4467061K067239K091889K429618K670226L033985L268969L678861M307746
2524A18015594M607351N180807N866509N694549N174850L677957J585792n57113
2516A49246296k434175l325206k996369k044222j102191l8261Q59278J589832
2508A39754982K316936L029442L690438M052352M377134M915514M921323M659277
2500A71717398L930528K641165Q49555l52812j368619k197605k876261l178652
$$ plain form
2492 169164697 166363503 164521508 164146897 164886659 166450082 168720808 171392777 174840129
2484 174840129 178982080 183660718 188424382 193419452 198878977 204851816 211909753 220366889
2476 220366889 229981977 240567007 250423640 254897107 250471183 237804595 220686594 202636319
2468 202636319 185752471 171171058 158742686 147724217 137755884 128606038 120290556
2461 120290556 112672368 105775233 99817645 94509558 89774947 85266589 81091703 77442815
2453 77442815 73768170 70266976 67199673 63993090 61165613 58687372 56185332 53968332
2445 53968332 51977939 50055433 48117925 46196207 44467591 42957610 41541373 40157937
2437 40157937 38909044 37726893 36635945 35552389 34531172 33453160 32537534 31543298
$$ packed form
2492A69164697k801194j841995l74611P39762J563423K270726K671969L447352
2484A74840129M141951M678638M763664M995070N459525N972839P057937Q457136
2476B20366889R615088J0585030R856633M473467m425924j2666588j7118001j8050275
2468B02636319j6883848j4581413j2428372j1018469r968333r149846q315482
2461A20290556p618188o897135n957588n308087m734611m508358m174886l648888
2453G7442815l674645l501194l067303l206583k827477k478241k502040k217000
2445E3968332j990393j922506j937508j921718j728616j509981j416237j383436
2437D0157937j248893j182151j090948j083556j021217j078012r15626r94236
$$ plain form
2429 31543298 30544777 29727552 28829089 27865527 26992844 26131965 25489574 24762033 24026929
2420 24026929 23344609 22838023 22345204 21707420 21198100 20867825 20520733 20019737 19616425
2411 19616425 19340108 18871199 18269804 17887759 17459623 16970705 16546189 16322551 15887627
2402 15887627 15544858 15245653 14871540 14556572 14246849 14015924 13814798 13658133 13517848
2393 13517848 13220648 12897164 12610654 12310608 12029069 11619457 11358799 11086405 10856436
2384 10856436 10596851 10398970 10323058 10166560 9996392 9736598 9543601 9359552 9095029 8946474
2374 8946474 8789793 8788594 8641502 8364035 8157398 8094244 7831397 7753158 7617557 7548207
2364 7548207 7443324 7350056 7205606 7161684 6985734 6873724 6800415 6637519 6629083 6556049 6432348
$$ packed form
2429C1543298r98521q17225q98463r63562q72683q60879o42391p27541p35104
2420B4026929o82320n06586m92819o37784n09320l30275l47092n00996m03312
2411A9616425k76317m68909o01395l82045m28136m88918m24516k23638m34924
2402A5887627l42769k99205l74113l14968l09723k30925k01126j56665j40285
2393A3517848k97200l23484k86510l00046k81539m09612k60658k72394k29969
2384A0856436k59585j97881p5912j56498j70168k59794j92997j84049k64523j48555
2374H946474j56681j199j47092k77467k06637o3154k62847p8239j35601o9350
2364G548207j04883r3268j44450m3922j75950j12010p3309j62896q436p3034j23701
$$ plain form
2353 6432348 6299357 6354032 6288968 6281219 6146541 6003037 5913345 5763355 5692440 5635550 5700800
2342 5700800 5697449 5541797 5457020 5502837 5312589 5224247 5474437 5469867 5327459 5193992 5142960
2331 5142960 4994894 5000897 4929564 4953936 4789173 4732133 4636538 4712633 4515007 4616392 4644034
2320 4644034 4549975 4431022 4506215 4477094 4438053 4426873 4304609 4369493 4415307 4398014 4547766
2309 4547766 4453674 4454576 4412241 4484715 4440100 4270110 4257621 4264654 4323325 4284720 4217147 4009944
2297 4009944 3994874 3975306 4095317 4172832 4120184 4044239 4013638 4042865 3996271 4193608 4066471
2286 4066471 4019364 3926174 3855218 3861318 3851157 3985643 3946739 3868838 3717989 3711332 3645461
2275 3645461 3621110 3669726 3685432 3652132 3833423 3737364 3754352 3800290 3634749 3613851 3723896
$$ packed form
2353F432348j32991N4675o5064p749j34678j43504q9692j49990p0915n6890O5250
2342E700800l351j55652q4777M5817j90248q8342K50190m570j42408j33467n1032
2331E142960j48066O003p1333K4372j64763n7040r5595P6095j97626J01385K7642
2320D644034r4059j18953P5193k9121l9041j1180j22264O4884M5814j7293J49752
2309D547766r4092R02m2335P2474m4615j69990j2489P033N8671l8605o7573k07203
2297D009944j5070j9568J20011P7515n2648p5945l0601K9227m6594J97337j27137
2286D066471m7107r3190p0956O100j0161J34486l8904p7901j50849o657o5871
2275C645461k4351M8616J5706l3300J81291r6059J6988M5938j65541k0898J10045
$$ plain form
2264 3723896 3782604 3678916 3659715 3727400 3692954 3523644 3323403 3399128 3378503 3296131 3178556
2253 3178556 2924617 2888905 2790521 2773779 2823424 2793857 2688124 2630344 2694722 2671219 2600994
2242 2600994 2500277 2521929 2464006 2499553 2460807 2512392 2447979 2408795 2304825 2370233 2211087
2231 2211087 2226252 2200363 2187995 2220768 2096914 2022731 2028436 1978266 1916556 1990972 2004447
2220 2004447 2028933 1789090 1864014 1986133 1874417 1931850 1973739 1880163 1839423 1722942 1604871
2209 1604871 1621331 1688535 1715079 1806968 1818626 1739611 1599277 1581945 1617715 1600934 1575954
2198 1575954 1583339 1529481 1576130 1475724 1501762 1486876 1322099 1476336 1465065 1528356 1448891
2187 1448891 1309815 1333696 1319113 1441099 1407025 1431139 1571995 1295250 1177372 1181259 1212620
$$ packed form
2264C723896N8708j03688j9201O7685l4446j69310k00241P5725k0625q2372j17575
2253C178556k53939l5712r8384j6742M9645k9567j05733n7780O4378k3503p0225
2242B600994j00717K1652n7923L5547l8746N1585o4413l9184j03970O5408j59146
2231B211087J5165k5889j2368L2773j23854p4183N705n0170o1710P4416J3475
2220B004447K4486k39843P4924J22119j11716N7433M1889r3576m0740j16481j18071
2209A604871J6460O7204K6544R1889J1658p9015j40334j7332L5770j6781k4980
2198A575954P385n3858M6649j00406K6038j4886j64777J54237j1271O3291p9465
2187A448891j39076K3881j4583J21986l4074K4114J40856k76745j17878L887L1361
$$ plain form
2176 1212620 1130417 1231660 1202805 1164367 1128764 1297350 1098216 1042850 1160623 1190041 1131159
2165 1131159 1072530 1089181 1109525 949359 841228 1046692 1085103 973672 885989 934761 902133
2154 902133 1001790 979732 1037499 1000464 821319 849786 817058 806642 973138 1021170 945496
2143 945496 746322 823240 753041 723049 894319 807495 800234 683517 668824 637329 511377
2132 511377 585533 650082 787591 634536 761620 816864 633207 659027 771117 859910 837515
2121 837515 826368 782545 879164 783741 742571 734478 613655 627522 579412 465010 528330
2110 528330 471689 380992 524956 542547 659991 572131 677726 495291 500039 586626 505486
2099 505486 487837 485027 419809 487887 498092 411076 555115 509668 236855 348422 340835
$$ packed form
2176A212620q2203J01243k8855l8438l5603J68586j99134n5366J17773K9418n8882
2165A131159n8629J6651K0344j60166j08131K05464L8411j11431q7683M8772l2628
2154I02133R9657k2058N7767l7035j79145K8467l2728j0416J66496M8032p5674
2143I45496j99174P6918p0199k9992J71270q6824p261j16717j4693l1495j25952
2132E11377P4156O4549J37509j53055J27084N5244j83657K5820J12090Q8793k2395
2121H37515j1147m3823R6619r5423m1170q093j20823J3867m8110j14402O3320
2110E28330n6641r0697J43964J7591J17444q7860J05595j82435M748Q6587q1140
2099E05486j7649k810o5218O8078J0205q7016J44039m5447k72813J11567p587
$$ plain form
2088 340835 295894 436344 428394 489278 494076 403315 478888 377381 385199 473561 442367 551251
2076 551251 626316 351741 249096 211317 298905 320978 361432 447213 433377 369251 341804
2065 341804 270075 337335 540446 406454 380458 429355 635888 346974 335465 418381 314836
2054 314836 352582 311621 271186 283392 403380 457127 458776 389360 338566 343866 323945 269774
2042 269774 204757 190968 247378 341134 306117 352382 356134 335601 190970 298598 544537
2031 544537 418655 325404 279195 377810 131163 133928 387652 335164 288450 344110 195684
2020 195684 325558 565412 396342 219262 238674 337276 324191 295168 253761 323886 331482
2009 331482 391043 376331 442848 454708 441706 470625 311002 255807 479762 387682 373708
$$ packed form
2088C40835m4941J40450p950O0884M798r0761P5573j01507P818Q8362l1194J08884
2076E51251P5065k74575j02645l7779Q7588K2073M0454Q5781j3836o4126k7447
2065C41804p1729O7260K03111j33992k5996M8897K06533k88914j1509Q2916j03545
2054C14836L7746m0961m0435J2206J19988N3747J649o9416n0794N300j9921n4171
2042B69774o5017j3789N6410R3756l5017M6265L752k0533j44631J07628K45939
2031E44537j25882r3251m6209R8615k46647K765K53724n2488m6714N5660j48426
2020A95684J29874K39854j69070j77080J9412R8602j3085k9023m1407P0125P596
2009C31482N9561j4712O6517J1860j3002K8919j59623n5195K23955r2080j3974
$$ plain form
1998 373708 351169 255336 229043 305962 409096 377415 396465 415137 484627 441791 455879
1987 455879 422927 355855 465380 479892 512105 499738 393158 310574 401962 510095 559514
1976 559514 446122 613173 666230 804337 691648 734326 860171 836101 818492 771831 1016917
1965 1016917 962109 961204 1121183 1184806 1294815 1263045 1219647 1343950 1311493 1198533 1297836
1954 1297836 1267908 1293845 1403040 1455479 1559116 1584123 1735056 1914655 1848254 2003002
1944 2003002 2127544 2290715 2228479 2328940 2566863 2833642 3223379 3408296 3670707 4076257
1934 4076257 4365467 4748229 5267877 5742147 6199327 6604494 7012316 7828600 8894413
1925 8894413 10259114 12122289 14719284 18518070 23513186 28022710 26808555 21858497
$$ packed form
1998C73708k2539r5833k6293P6919J03134l1681J9050J8672O9490m2836J4088
1987D55879l2952o7072J09525J4512L2213j2367j06580q2584R1388J08133M9419
1976E59514j13392J67051N3057J38107j12689M2678J25845k4070j7609m6661K45086
1965A016917n4808r05J59979O3623J10009l1770m3398J24303l2457j12960R9303
1954A297836k9928K5937J09195N2439J03637K5007J50933J79599o6401J54748
1944B003002J24542J63171o2236J00461K37923K66779L89737J84917K62411M05550
1934D076257K89210L82762N19648M74270M57180M05167M07822Q16284J065813
1925H894413J364701J863175K596995L798786M995116M509524j214155m950058
$$ plain form
1917 21858497 17470212 13925764 11396158 9440764 8014339 6935085 5959010 5347609
1909 5347609 4804082 4534444 4010621 3731267 3269828 3042157 2850437 2601288 2443731 2248977
1899 2248977 2020453 1934816 1852326 1887474 1666757 1530425 1457983 1162310 1158543 1184931 1140056
1888 1140056 942713 855858 956861 972584 955257 968250 805875 743058 595830 695555 762791
1877 762791 668574 506007 552742 611877 641860 614988 474978 513627 528052 381114 471561
1866 471561 583892 536485 612557 636099 476106 518557 405160 316691 318382 364007 352660
1855 352660 389983 361027 295824 435208 316007 390893 320495 297370 344781 245266 204284
1844 204284 298931 190839 265915 224990 104760 270855 279657 185753 151819 130421 68378
$$ packed form
1917B1858497m388285l544448k529606j955394j426425j079254r76075o11401
1909E347609n43527k69638n23823k79354m61439k27671j91720k49149j57557j94754
1899B248977k28524q5637q2490L5148k20717j36332p2442k95673l767K6388m4875
1888A140056j97343q6855J01003J5723j7327J2993j62375o2817j47228R9725O7236
1877G62791r4217j62567M6735N9135K9983k6872j40010L8649J4425j46938R0447
1866D71561J12331m7407P6072K3542j59993M2451j13397q8469J691M5625j1347
1855C52660L7323k8956o5203J39384j19201P4886p0398k3125M7411r9515m0982
1844B04284R4647j08092P5076m0925j20230J66095Q802r3904l3934k1398o2043
$$ plain form
1833 68378 141209 29458 118463 131804 158805 206084 201176 253258 164536 99927 373882 314812
1821 314812 180114 167457 73086 191826 309465 278058 148579 2033 113455 248056
1811 248056 240751 202456 161637 236867 120355 -72768 -14095 211384 205719 181270 66865
1800 66865 80570 220770 191256 153173 166577 128140 208836 221944 142151 146940 181250 194430
1788 194430 -34447 22672 99132 48910 15302 -22494 48270 85501 70097 54772 116040
1777 116040 100007 51634 15790 83338 150537 183905 63190 73106 142300 128074 42099 -44889
1765 -44889 -78775 -78493 -95169 -116667 123051 254825 -4707 -35692 78523 47431 -3565
1754 -3565 155218 300374 107865 77513 66830 -3653 37560 173003 110707 75411 153327
$$ packed form
1833F8378P2831j11751Q9005J3341K7001M7279m908N2082q8722o4609K73955n9070
1821C14812j34698j2657r4371J18740J17639l1407j29479j46546J11422J34601
1811B48056p305l8295m0819P5230j16512j93123N8673K25479n665k4449j14405
1800F6865J3705J40200k9514l8083J3404l8437Q0696J3108p9793M789L4310J3180
1788A94430k28877N7119P6460n0222l3608l7796P0764L7231j5404j5325O1268
1777A16040j6033m8373l5844O7548O7199L3368j20715R916O9194j4226q5975q6988
1765d4889l3886K82j6676k1498K39718J31774k59532l0985J14215l1092n0996
1754c565J58783J45156j92509l0352j0683p0483M1213J35443o2296l5296P7916
$$ plain form
1743 153327 130460 -23995 -64633 15147 77557 1161 97807 97254 65142 61705 68175 217729
1731 217729 55735 71298 110908 177860 90067 -19433 35904 64072 153909 36303 207934
1720 207934 287660 254206 173636 160435 79211 129144 217903 176433 163195 107809 66417 -88457
1708 -88457 -83563 30224 127136 52571 100995 81396 134103 65163 70162 28176 -10149 101587
1696 101587 143578 119294 25399 168 -104633 -22082 -23437 32821 109247 208034 25078
1685 25078 40121 33919 -23393 -22914 188503 77382 -58750 -10989 -47086 -16651 61351 6116
1673 6116 -10467 150135 -63311 -38279 -44352 -108728 -58053 13128 68859 110060 79415 90485
1661 90485 72629 31039 63564 132611 73422 17947 90702 70047 -32816 -4139 151493
$$ packed form
1743A53327k2867j54455m0638P9780O2410p6396R6646n53l2112l437O470J49554
1731B17729j61994J5563L9610O6952q7793j09500N5337K8168Q9837j17606J71631
1720B07934P9726l3454q0570j3201q1224M9933Q8759m1470j3238n5386m1392j54874
1708h8457M894J13787R6912p4565M8424j9599N2707o8940M999m1986l8325J11736
1696A01587M1991k4284r3895k5231j04801Q2551j355N6258P6426R8787j82956
1685B5078J5043o202n7312M79K11417j11121j36132M7761l6097L0435P8002n5235
1673F116j6583J60602k13446K5032o073o4376N0675P1181N5731M1201l0645J1070
1661I0485j7856m1590L2525O9047n9189n5475P2755k0655j02863K8677J55632
$$ plain form
1650 151493 6312 81492 163361 2007 -40310 25502 78802 37335 -7432 -43801 106339
1639 106339 -16097 -27555 2509 -23658 -23496 -124341 -99216 92864 -6662 -28198 32013
1628 32013 182654 128721 215097 197897 148710 123252 172656 132046 -74484 -169983 -100586
1617 -100586 -84790 -199992 -182136 15734 -121769 -118206 85933 -41272 49047 43396 -56481
1606 -56481 -23058 -76933 -92921 -143121 -100590 57396 41750 63144 -39427 -119652 72232
1595 72232 38845 141548 218772 -69723 -189804 -174256 -109771 41799 -8025 -57064 -6860
1584 -6860 32627 32192 -39697 -50016 -83910 -54734 -195121 -112318 -64351 -11024 66228 -8943
1572 -8943 -28979 -56449 -54881 5907 -21986 -48429 -54117 -73465 -67251 75493 114687 97078
$$ packed form
1650A51493j45181P5180Q1869j61354m2317O5812N3300m1467m4767l6369J50140
1639A06339j22436j1458L0064k6167J62j00845K5125J92080r9526k1536O0211
1628C2013J50641n3933Q6376j7200m9187k5458M9404m0610k06530r5499O9397
1617a00586J5796j15202J7856J97870j37503L563K04139j27205R0319n651r9877
1606e6481L3423n3875j5988n0200M2531J57986j5646K1394j02571q0225J91884
1595G2232l3387J02703P7224k88495j20081J5548O4485J51570m9824m9039N0204
1584f860L9487m35p1889j0319l3894K9176j40387Q2803M7967N3327P7252p5171
1572h943k0036k7470J568O0788k7893k6443n688j9348O214J42744L9194j7609
$$ plain form
1560 97078 74549 66622 6853 83731 179380 234691 43616 -83566 -19820 44775 -83526
1549 -83526 -100178 -47285 50327 235683 146079 -20696 -108794 -100625 -31493 -40951 27355 100306
1537 100306 31975 -9382 16967 107884 18179 -36974 29053 102367 75224 -75878 5517
1526 5517 72312 127013 166835 126210 -60261 -1292 -32720 -2999 143909 170708 101790 74291
1514 74291 12860 -35848 -156491 -192667 -46395 3149 58317 19379 75581 27345 -16098
1503 -16098 58988 43747 42599 164153 -5314 -95907 -19792 -25823 39521 150587 132532 23472
1491 23472 -22356 41916 -23841 -99771 -11656 36243 -58427 -82032 16362 -120679 -96925 93160
1479 93160 77886 25983 9147 167449 64138 -87792 -96365 -74969 23090 156081 178479
$$ packed form
1560I7078k2529p927n9769P6878R5649N5311j91075j27182O3746O4595j28301
1549h3526j6652N2893R7612J85356q9604j66775q8098Q169O9132r458O8306P2951
1537A00306o8331m1357K6349R0917q9705n5153O6027P3314k7143j51102Q1395
1526E517O6795N4701L9822m0625j86471N8969l1428K9721J46908K6799o8918k7499
1514G4291o1431m8708j20643l6176J46272M9544N5168l8938N6202m8236m3443
1503a6098P5086j5241j148J21554j69467r0593P6115o031O5344J11066j8055j09060
1491B3472m5828O4272o5757p5930Q8115M7899r4670k3605R8394j37041K3754J90085
1479I3160j5274n1903j6836J58302j03311j51930q573K1396R8059J32991K2398
$$ plain form
1468 178479 -98314 -88376 12412 -33960 -8293 -91878 -10617 -38089 -12428 -43891 -6989
1457 -6989 67900 58087 -76840 -99186 -38761 -109224 -52549 -25576 -163515 -101510 -34362 13740
1445 13740 159928 152716 81910 29065 -118973 -68680 -10184 -116875 -74323 -17030 -119462
1434 -119462 -17716 57424 98958 -52639 33124 -91003 -180077 -110996 -210954 -100583 -133363
1423 -133363 40390 4992 -43693 -122669 -174037 -5777 -82490 -17036 187900 57271 -21711
1412 -21711 -119184 -21130 -106899 6743 41239 -57275 -152355 -65023 -46063 -22794 -57877 -62059
1400 -62059 -89624 -173879 -210676 -105478 4524 53175 149036 46430 -21377 -21 53065
1389 53065 -94736 -15261 73053 22804 41691 -79930 -109649 -118735 -236416 -124940 -86855
$$ packed form
1468A78479k76793R938J00788m6372K5667q3585Q1261k7472K5661l1463L6902
1457f989P4889r813j34927k2346O0425p0463N6675K6973j37939O2005O7148M8102
1445A3740J46188p212p0806n2845j48038N0293N8496j06691M2552N7293j02432
1434a19462J01746P5140M1534j51597Q5763j24127q9074O9081r9958J10371l2780
1423a33363J73753l5398m8685p8976n1368J68260p6713O5454K04936j30629p8982
1412b1711r7473R8054q5769J13642L4496r8514r5080Q7332J8960K3269l5083m182
1400f2059k7565q4255l6797J05198J10002M8651R5861j02606o7807K1356N3086
1389E3065j47801P9475Q8314n0249J8887j21621k9719r086j17681J11476L8085
$$ plain form
1378 -86855 -31345 -147604 -59797 -21012 77714 -56571 -155196 62145 57602 -22767 -77749
1367 -77749 -147246 -64361 -30347 -23430 -17481 -21718 127795 142037 -12795 -136866 -157769 -42561
1355 -42561 -17100 70889 22201 -29380 -137104 48931 49775 976 -62368 -171840 -81204 80154
1343 80154 13487 63849 -37603 -142735 -71349 -32995 97565 -127348 -53753 -116479 -10750
1332 -10750 -63893 -193959 -152754 27350 6543 -68918 -59039 52902 94707 108233 -129923
1321 -129923 -88281 -91737 -85994 87744 169101 136562 -37867 -116369 -52989 -46318 -32203 -167828
1309 -167828 -84209 -201322 -129570 -142845 38082 -38729 -7348 62592 -91083 -11151 -33457
1298 -33457 -93668 -19328 140533 -170816 -15274 -91290 -78183 -150031 21981 4750 -25024
$$ packed form
1378h6855N5510j16259Q7807L8785R8726j34285r8625K17341m543q0369n4982
1367g7749o9497Q2885L4014O917N949m237J49513J4242j54832j24071k0903J15208
1355d2561K5461Q7989m8688n1581j07724J86035Q44m8799o3344j09472R0636J61358
1343H0154o6667N0362j01452j05132P1386L8354J30560k24913P3595o2726J05729
1332a0750n3143j30066M1205J80104k0807p5461R879J11941M1805J3526k38156
1321a29923M1642l456N743J73738Q1357l2539j74429p8502O3380O671J4115j35625
1309a67828Q3619j17113P1752j3275J80927p6811L1381O9940j53675P9932k2306
1298c3457o0211P4340J59861l11349J55542p6016J3107p1848J72012j7231k9774
$$ plain form
1287 -25024 62217 10141 -6541 53571 47160 -1614 77302 93541 -1115 90176 -104625 -141049
1275 -141049 -89325 -142319 -69555 -55379 28426 -4921 -6419 75436 -85345 -50290 15015 50985
1263 50985 253916 144483 94176 64739 119680 130204 107392 88866 80111 -57692 -150440
1252 -150440 -162942 -213475 -180611 -162701 -224044 -111973 44498 -142773 -38725 97540 97242
1241 97242 27887 -7054 -11171 -171962 25604 77940 152507 -165550 -266077 -176917 24460
1230 24460 -86728 -146639 -18237 -61834 -175263 -177489 -79621 -102166 -106585 -102926 78752 75612
1218 75612 -17258 -48706 26802 -12227 174445 44672 -73483 -125373 -86618 -108271 -74264
1207 -74264 12460 -24947 64051 -35128 -46667 -25990 -18308 -57856 -187231 -110117 -60899 -83564
$$ packed form
1287b5024Q7241n2076j6682O0112o411m8774P8916J6239r4656R1291j94801l6424
1275a41049N1724n2994P2764J4176Q3805l3347j498Q1855j60781L5055O5305L5970
1263E0985K02931j09433n0307k9437N4941J0524k2812j8526q755j37803r2748
1252a50440j2502n0533L2864J7910o1343J12071J56471j87271J04048J36265k98
1241I7242o9355l4941m117j60791J97566N2336P4567l18057j00527Q9160K01377
1230B4460j11188n9911J28402m3597j13429k226R7868k2545m419L659J81678l140
1218G5612r2870l1448P5508l9029J86672j29773j18155n1890L8755k1653L4007
1207g4264Q6724l7407Q8998r9179j1539K0677P682l9548j29375P7114M9218k2665
$$ plain form
1195 -83564 -89813 -101637 -144247 -17315 110803 -10157 -4873 -375 -164396 -190364 -23891
1184 -23891 -54130 -24407 -130123 -115679 47714 19681 -99511 -10047 -84210 18706 16924
1173 16924 -147329 -7925 8984 520 -162449 -149783 -124941 9427 34470 -13586 -187950
1162 -187950 -113472 -58783 -35354 135850 -12494 -11164 -72641 -191141 -168757 -139880 -116047
1151 -116047 -128779 -75276 -102247 77057 19888 -113810 -100154 46166 12320 116527 66974
1140 66974 32013 31249 36615 56593 49970 21602 114775 30444 15890 145320 88223 162591
1128 162591 162531 43492 -78500 -19630 -70531 -13126 -99349 -79697 83635 20935 6828 18290
1116 18290 -31695 -96319 -68433 -88310 -84679 -74976 -29818 83692 -61387 -80686 9738 105935
$$ packed form
1195h3564o249j1824m2610J26932J28118j20960N284M498j64021k5968J66473
1184b3891l0239K9723j05716J4444J63393k8033j19192Q9464p4163J02916j782
1173A6924j64253J39404J6909q464j62969J2666K4842J34368K5043m8056j74364
1162a87950P4478N4689K3429J71204j48344J330o1477j18500K2384K8877K3833
1151a16047j2732N3503k6971J79304n7169j33698J3656J46320l3846J04207m9553
1140F6974l4961p64N366J9978o623k8368R3173q4331j4554J29430n7097P4368
1128A62591o0j19039j21992N8870n0901N7405q6223J9652J63332o2700j4107J1462
1116A8290m9985o4624K7886j9877L631R703M5158J13510j45079j9299R0424R6197
$$ plain form
1104 105935 88382 -22520 -73646 38728 -34630 -113899 -115121 -21401 -32730 -18930 -54900
1093 -54900 -153475 -280331 4281 92014 -16835 15648 -85557 -94326 80225 57440 -108738
1082 -108738 -128527 83034 167583 -65799 -114820 -24118 19004 14326 31117 -83624 59856
1071 59856 40876 17745 53371 78551 123910 165355 -6548 -38263 -37146 -230911 -95192
1060 -95192 -51143 -13281 -103512 -131018 -97341 -117892 -81593 -132402 -72959 -12379 -36956 -15214
1048 -15214 -99320 -153963 -30561 -101533 -56996 -44145 -45492 120364 100767 -2261 -32474
1037 -32474 101896 64324 99742 49181 119046 -63575 -83094 24789 17723 93042 -34174
1026 -34174 -61209 98159 40276 85865 140231 102896 4987 27719 -66792 -24902 -133434
$$ packed form
1104A05935j7553j10902n1126J12374p3358p9269j222R3720j1329J3800l5970
1093e4900r8575j26856K84612Q7733j08849L2483j01205q769J74551k2785j66178
1082a08738j9789K11561Q4549k33382m9021R0702M3122m678J6791j14741J43480
1071E9856j8980k3131L5626K5180M5359M1445j71903l1715J117j93765J35719
1060i5192M4049L7862r0231k7506L3677k0551L6299n0809N9443O0580k4577K1742
1048a5214q4106n4643J23402p0972M4537J2851j347J65856j9597j03028l0213
1037c2474J34370l7572L5418n0561O9865j82621j9519J07883p066P5319j27216
1026c4174k7035J59368n7883M5589N4366l7335r7909K2732r4511M1890j08532
$$ plain form
1015 -133434 -141248 92473 124366 101050 54563 -28197 -63688 -42018 60807 74458 32762
1004 32762 -27174 30896 132649 238151 195325 73673 -47318 -177622 -1703 20643 -152033
993 -152033 -19482 21777 -138548 -88217 -133938 -30320 -17531 -30801 -14853 47312 -15271
982 -15271 -18037 -47963 78340 -44341 -29535 20883 68473 53383 48383 -25676 -30647 8440
970 8440 18840 54559 -15813 -67759 -17447 -74461 -63472 909 14000 -12376 208503 -17163
958 -17163 -97993 -116720 -150460 -61037 -115673 -61565 -70141 -2019 -18814 23753 -76779 -73576
946 -73576 12311 -28734 53861 80222 -3523 138 -14382 -14912 38072 4340 -18628 -57952 -45226
933 -45226 -37291 47108 53968 7438 88431 77673 -76469 8755 -113759 -69205 40792 -77662
$$ packed form
1015a33434p814K33721L1893k3316m6487q2760l5491K1670J02825J3651m1696
1004C2762n9936N8070J01753J05502m2826j21652j20991j30304J75919K2346j72676
993a52033J32551M1259j60325N0331m5721J03618J2789j3270J5948O2165o2583
982a5271k766k9926J26303j22681J4806N0418M7590j5090n000p4059m971L9087
970H440J0400L5719p0372n1946N0312n7014J0989O4381J3091k6376K20879k25666
958a7163q0830j8727l3740Q9423n4636N4108q576O8122j6795M2567j00532L203
946g3576Q5887m1045Q2595K6361q3745L661j4520n30N2984l3732k2968l9324J2726
933d5226P935Q4399O860m6530Q0993j0758j54142Q5224j22514M4554J09997j18454
$$ plain form
921 -77662 144444 80943 -17170 81512 66232 -33910 63247 92492 7067 -19664 -103125 -161447
909 -161447 -145106 -162013 -37721 1844 -144770 -82935 104219 68031 -74644 -72257 -52327
898 -52327 -69231 -22848 -66447 -73303 -57340 -29935 -115919 16254 3553 44504 -25162 -23996
886 -23996 40184 -141652 -155763 -173288 -3575 77866 -125957 -134273 -49627 -129166 -137930 -208056
874 -208056 -36641 49189 30527 -80684 -138174 -136393 -141631 77114 -31128 -50308 75539
863 75539 110164 76855 53619 175323 83456 27142 137895 35836 -89321 -112587 -43212
852 -43212 -149601 -27837 65011 99316 -32866 16075 93270 256074 149765 67676 -44193
841 -44193 -11356 124815 112996 112747 122878 121104 24749 -2438 -5269 -70799 6427 46068 -53458
$$ packed form
921g7662K22106o3501r8113R8682j5280j00142R7157K9245q5425k6731q3461n8322
909a61447J6341j6907J24292L9565j46614O1835J87154l6188j42675K387J9930
898e2327j6904M6383m3599o856J5963K7405q5984J32173j2701M0951o9666J166
886b3996O4180j81836j4111j7525J69713Q1441k03823q316Q4646p9539q764p0126
874b08056J71415Q5830j8662j11211n7490J781n238K18745j08242j9180J25847
863G5539L4625l3309k3236J21704r1867n6314J10753j02059j25157k3266O9375
852d3212j06389J21764R2848L4305j32182M8941P7195J62804j06309q2089j11869
841d4193L2837J36171j1819k49J0131j774r6355k7187k831o5530P7226L9641r9526
$$ plain form
828 -53458 -8484 22319 151077 101184 10808 69613 34213 -49654 129049 65733 -59115
817 -59115 -5012 32966 38904 -12407 23583 -18164 -104765 -132208 -13582 -98687 -53524 117246
805 117246 116724 74200 -87004 -84671 -64784 217481 137457 134307 57354 -30551 -103171 27542
793 27542 -177619 -206327 456 -33006 27062 14100 93834 204650 74735 10142 -23294
782 -23294 -34592 -12398 -60045 -36238 46732 129500 -95771 482 76338 -28018 13184 69825
770 69825 87705 8133 8315 43036 48806 34715 49775 119086 60167 22468 26658 4698 65517
757 65517 94340 107883 40438 -75941 6020 91020 -38860 -24750 83807 112024 149188
746 149188 52559 43490 -572 45586 64736 -86948 -63976 -136292 -43970 -20651 -149599 -155726
$$ packed form
828e3458M4974L0803J28758m9893r0376N8805l5400q3867J78703o3316j24848
817e9115N4103L7978N938n1311L5990m1747q6601k7443J18626q5105M5163J70770
805A17246n22m2524j61204K333J9887K82265q0024l150p6953q7905p2620J30713
793B7542k05161k8708K06783l3462O0068j2962P9734J10816j29915o4593l3436
782b3294j1298K2194m7647K3807Q2970Q2768k25271R6253P5856j04356M1202N6641
770F9825J7880p9572J82L4721N770j4091J5060O9311n8919l7699M190k1960O0819
757F5517K8823J3543o7445j16379Q1961Q5000j29880J4110J08557K8217L7164
746A49188r6629r069m4062M6158J9150j51684K2972p2316R2322K3319j28948o127
$$ plain form
734 -155726 -18671 -47052 68164 -42505 -277538 -165672 18877 -19411 -42947 89520
724 89520 -55053 64835 -36771 -83797 -100186 -104637 -73809 4655 -11810 -56512 -39514 -43235
712 -43235 75162 131856 -31225 103858 130049 88072 62036 97039 212838 160037 173932
701 173932 153257 25971 -4461 2273 156419 87606 -5755 -23591 -64669 -22169 78738
690 78738 146562 -88489 -62579 -15150 -14563 6262 -36613 149262 190358 46633 34146 -73376
678 -73376 -175950 -25895 -94570 -84188 -60060 66382 22443 -14460 66811 34918 47447
667 47447 67980 -69429 -34453 10878 -59834 -105433 -47640 106103 75053 17947 -98826
656 -98826 32818 -192264 11754 62649 46875 -552 24784 24812 -62985 -133332 -44752 50113
$$ packed form
734a55726J37055k8381J15216j10669k35033J11866J84549l8288k3536J32467
724H9520j44573J19888j01606m7026j6389m451L0828P8464j6465m4702J6998l721
712d3235J18397N6694j63081J35083K6191m1977k6036L5003J15799n2801J3895
701A73932k0675j27286l0432O734J54146o8813r3361j7836m1078M2500J00907
690G8738O7824k35051K5910M7429N87K0825m2875J85875M1096j43725j2487j07522
678g3376j02574J50055o8675J0382K4128J26442m3939l6903Q1271l1893J2529
667D7447K0533j37409L4976M5331p0712m5599N7793J53743l1050n7106j16773
656i8826J31644k25082K04018N0895j5774m7427K5336K8q7797p0347Q8580R4865
$$ plain form
644 50113 -102451 -91681 198222 147085 1810 100266 170953 73482 77531 9298 -36763 -34735
632 -34735 -112817 -113615 98404 66541 -24014 -45193 -84561 -74354 14870 182045 178383 131476
620 131476 86864 30128 -27911 -170072 -45206 37578 7124 17779 -1869 57920 -67976
609 -67976 -115774 -33358 37916 -16221 -23640 -30693 -42579 -55444 -132844 -188037 -58922 114083
597 114083 164292 93789 100308 50038 148548 147711 137081 185650 108741 51964 9860 1582 98287
584 98287 120084 -52393 46010 -6300 -51257 30948 -84332 27843 102220 173071 112441
573 112441 6817 12366 -51757 19970 -55438 -92871 -124149 -83966 -25219 13874 51140 -5756
561 -5756 -34911 30606 147910 45269 103875 148198 153246 92932 69105 19274 -42854 -52518
$$ packed form
644E0113j52564J0770K89903n1137j45275R8456P0687r7471M049o8233m6061K028
632c4735p8082p98K12019l1863r0555k1179l9368J0207Q9224J67175l662m6907
620A31476m4612n6736n8039j42161J24866Q2784l0454J0655j9648N9789j25896
609f7976m7798Q2416P1274n4137p419p053j1886j2865p7400n5193J29115J73005
597A14083N0209p0503O519n0270R8510q37j0630M8569p6909n6777m2104q278R6705
584I8287K1797j72477R8403n2310m4957Q2205j15280J12175P4377P0851o0630
573A12441j05624N549o4123P1727p5408l7433l1278M0183N8747L9093L7266n6896
561e756k9155O5517J17304j02641N8606M4323N048o0314k3827m9831o2128r664
$$ plain form
549 -52518 121452 -72845 25060 -39409 -40928 -104395 31359 116218 94327 135530 181305 35789
537 35789 -34604 -105494 -55487 58386 54853 60302 95050 -38959 -26422 97302 -18396 -16745
525 -16745 18473 13283 51785 82896 -4583 62552 113922 175856 181661 143974 31340 -65999
513 -65999 48080 85465 -69418 -5640 18814 22195 -156550 -146015 -75733 -77852 10727 -70284
501 -70284 -28919 -7670 139557 131642 -29654 -41068 -86759 -29682 14111 80379 -40067 13652
489 13652 85561 47464 40056 102854 111701 18159 -14700 118556 -35544 -3722 193880 111592
477 111592 71050 -100639 -183313 -48376 -13340 76635 9075 108919 26668 3426 110907
466 110907 117304 38157 -4732 -206598 -106472 -11127 29279 30606 -3974 -67309 -59490 7048
$$ packed form
549e2518J73970j94297R7905o4469j519o3467J35754Q4859k1891M1203M5775j45516
537C5789p0393p0890N0007J13873l533N449L4748j34009J2537J23724j15698J651
525a6745L5218n190L8502L1111q7479O7135N1370O1934N805l7687j12634r7339
513f5999J14079L7385j54883O3778K4454L381j78745J0535P0282k119Q8579q1011
501g0284M1365K1249J47227p915j61296j1414m5691N7077M3793O6268j20446N3719
489A3652P1909l8097p408O2798Q847r3542l2859J33256j54100L1822J97602q2288
477A11592m0542j71689q2674J34937L5036Q9975o7560R9844q2251k3242J07481
466A10907O397p9147m2889k01866J00126R5345M0406J327l4580o3335P819O6538
$$ plain form
454 7048 89320 13779 -41985 -52588 -205647 -203619 -31801 -67125 -14363 75147 111838 -44967
442 -44967 -6623 -119311 -51648 22074 84817 217619 139485 112784 108685 66004 -1521 56281
430 56281 -46157 -28853 -91190 -50402 -31211 40803 97053 -8952 89927 121225 50586 46849
418 46849 -91311 -10019 13832 85885 -27852 36275 127309 113231 151119 133333 84051 19146
406 19146 -6930 -23133 -119921 70124 73566 89911 131671 13323 35902 87947 45238 225626
394 225626 193413 12174 71292 190166 65708 10748 41228 165980 122110 172335 153994
383 153994 161126 197929 107511 105923 27492 60341 164375 141093 111157 102843 132387 61629
371 61629 36292 -29192 26487 209526 225211 230816 131928 42148 113522 87186 48196 22986
$$ packed form
454G048Q2272p5541n5764j0603j53059K028J71818l5324N2762Q9510L6691j56805
442d4967L8344j12688O7663P3722O2743J32802p8134k6701m099m2681o7525N7802
430E6281j02438J7304o2337M0788J9191P2014N6250j06005R8879L1298p0639l737
418D6849j38160Q1292K3851P2053j13737O4127R1034j4078L7888j7786m9282o4905
406A9146k6076j6203r6788J90045L442J6345M1760j18348K2579N2045m2709J80388
394B25626l2213j81239N9118J18874j24458n4960L0480J24752m3870N0225j8341
383A53994P132L6803r0418j588p8431L2849J04034k3282k9936q314K9544p0758
371F1629k5337o5484N5679J83039J5685N605r8888q9780P1374k6336l8990k5210
$$ plain form
359 22986 -14543 208396 192797 71616 -15225 -4357 136684 52277 59338 103294 -60477
348 -60477 116072 206742 156579 82107 -46016 -101309 -58969 13719 56439 94965 194215 3285
336 3285 -20925 -163559 -114525 32835 192122 77329 117924 110989 159060 102155 43049 16820
324 16820 54115 181024 184314 105150 46945 -67523 19755 122203 15097 97578 57143
313 57143 45349 135500 215170 -6222 105312 153995 173386 121740 123841 30261 -118668 -52301
301 -52301 150556 184132 247591 136485 164282 68273 154407 60301 99260 137549 50946 60474
289 60474 12077 41315 66562 -31648 -8947 99219 118001 129335 176284 80889 -1192 101647
277 101647 143695 37165 78460 164386 75044 149715 91402 97602 56593 184510 109917 119729
$$ packed form
359B2986l7529K22939j5599j21181q6841J0868J41041q4407P061M3956j63771
348f0477J76549R0670n0163p4472j28123n5293M2340P2688M2720L8526R9250j90930
336C285k4210j42634M9034J47360J59287j14793M0595o935M8071n6905n9106k6229
324A6820L7295J26909L290p9164n8205j14468Q7278J02448j07106Q2481m0435
313E7143j1794R0151P9670k21392J11534M8683J9391n1646K101r3580j48929O6367
301e2301K02857L3576O3459j11106K7797r6009Q6134r4106L8959L8289q6603R528
289F0474m8397K9238K5247r8210K2701J08166J8782J1334M6949r5395q2081J02839
277A01647M2048j06530M1295Q5926q9342P4671n8313O200m1009J27917p4593R812
$$ plain form
265 119729 -12018 32948 95550 20593 112991 76401 57504 67479 42124 127659 73040 50897
253 50897 99201 44033 104950 142488 140475 75386 53016 125745 166053 94839 -66307 -9367
241 -9367 213864 117621 71364 24864 84660 141898 28236 40920 172854 84404 150467 141961
229 141961 164596 103660 106746 91923 44427 18432 56265 12935 22491 234444 173079 208089
217 208089 131417 74307 141200 117045 -41918 -66927 70094 127662 41784 152559 233245
206 233245 171501 78589 165998 231769 133803 -377 19624 28591 138481 17687 130631
195 130631 134506 96131 145827 214868 141028 1457 93372 179580 159941 196616 181282 180399
183 180399 48445 29614 88215 12399 167441 32715 -27918 162313 126207 65913 94842
$$ packed form
265A19729j31747M4966O2602p4957R2398l6590j8897R975k5355Q5535n4619k2143
253E0897M8304n5168O0917L7538k013o5089k2370P2729M0308p1214j61146N6940
241i367K23231r6243m6257m6500N9796N7238j13662J2684J31934q8450O6063q506
229A41961K2635o0936L086j4823m7496k5995L7833m3330R556K11953o1365L5010
217B08089p6672n7110O6893k4155j58963k5009J37021N7568q5878J10775Q0686
206B33245o1744r2912Q7409O5771r7966j34180K0001Q967J09890j20794J12944
195A30631L875l8375M9696O9041p3840j39571R1915Q6208j9639L6675j5334q83
183A80399j31954j8831N8601p5816J55042j34726o0633J90231l6106o0294K8929
$$ plain form
172 94842 -16710 -47273 11985 28792 99206 194865 83386 -157717 -101246 77571 186942
161 186942 172815 51851 75748 41617 179627 141534 50566 138146 143972 107765 57988 16570
149 16570 46063 106958 64330 -29265 86379 158862 87077 46876 -12545 57471 97044 27266
137 27266 43633 138688 100827 142836 227456 137677 131885 172971 140252 141225 163194 35848
125 35848 -37050 60244 93293 166122 106417 109215 151265 69502 35728 172746 55861 -50139
113 -50139 -70455 -67611 35621 96230 80926 59969 11172 34723 182580 85295 148826 129987
101 129987 126292 55785 47345 37676 144155 69299 38968 72819 113343 -13842 56658 154975
89 154975 139720 152693 37175 62273 131548 82976 186148 277795 184367 204739 102819
$$ packed form
172I4842j11552l0563N9258J6807P0414R5659j11479k41103N6471J78817J09371
161A86942j4127j20964K3897l4131J38010l8093r0968Q7580N826l6207m9777m1418
149A6570K9493O0895m2628r3595J15644P2483p1785m0201n9421P0016L9573o9778
137B7266J6367R5055l7861M2009Q4620q9779n792M1086l2719R73K1969j27346
125C5848p2898R7294L3049P2829n9705K798M2050q1763l3774J37018j16885j06000
113e0139k0316K844J03232O0609j5304k0957m8797K3551J47857r7285O3531j8839
101A29987l695p0507q440r669J06479p4856l0331L3851M0524j27185P0500R8317
89A54975j5255J2973j15518K5098O9275m8572J03172R1647r3428K0372j01920
$$ plain form
78 102819 -26400 87327 108078 48850 76312 104726 174412 159789 139899 81665 86119 18698
66 18698 135398 66844 87430 33258 109162 218187 149151 123275 206744 193017 88461 -33603
54 -33603 26566 102971 54923 103395 34892 104126 23552 96435 138228 127764 27358 157125
42 157125 229999 156420 151896 187746 151267 220724 213506 62054 83694 31109 91715 115143
30 115143 126980 33300 -8322 56715 765 54956 48633 25406 73361 102465 122074 151745
18 151745 52026 147560 128298 47152 57778 71234 103663 83404 6797 117856 162740 131735
6 131735 93397 27008 34572 128617 201473 110899
0 110899
$$ packed form
78A02819j29219J13727K0751n9228K7462K8414O9686j4623j9890n8234M454o7421
66A8698J16700o8554K0586n4172P5904J09025o9036k5876Q3469j3727j04556j22064
54c3603O0169P6405m8048M8472o8503O9234q0574P2883M1793j0464j00406J29767
42A57125P2874p3579m524L5850l6479O9457p218j51452K1640n2585O0606K3428
30A15143J1837r3680m1622O5037n5950N4191o323k3227M7955K9104J9609K9671
18A51745r9719R5534j9262q1146J0626J3456L2429k0259p6607J11059M4884l1005
6A31735l8338o6389P564R4045P2856r0574
0A10899
$$ Imaginary data points
##PAGE= N=2
##DATA TABLE= (X++(I..I)), XYDATA
$$ plain form
16383 -4059240 -4004325 -4001804 -3843227 -3827573 -3802537 -3758501 -3686919 -3636142 -3645623 -3558127 -3552145 -3362158
16371 -3362158 -3293910 -3317179 -3367346 -3349941 -3272086 -3307077 -3167843 -3146924 -2991835 -2945259 -2826394
16360 -2826394 -2868975 -2993942 -2790719 -2804599 -2701956 -2685510 -2600123 -2492071 -2448747 -2492790
16350 -2492790 -2514870 -2493718 -2540422 -2404582 -2314860 -2158742 -2134459 -2216710 -2199836 -2068316 -1960240
16339 -1960240 -1935738 -1877503 -1844624 -1812916 -1765344 -1733495 -1715061 -1691559 -1628115 -1600818 -1505046
16328 -1505046 -1392269 -1470415 -1395595 -1249895 -1213888 -1270605 -1379437 -1177336 -1077331 -1101597
16318 -1101597 -1270330 -1048402 -985694 -933903 -786042 -784262 -842052 -789045 -774235 -709601 -565594
16307 -565594 -643070 -546082 -501172 -494162 -433816 -330382 -469672 -308083 -281115 -202416 -218863
$$ packed form
16383d059240N4915K521J58577J5654K5036M4036P1582N0777r481Q7496N982J89987
16371c362158O8248k3269n0167J7405P7855l4991J39234K0919J55089M6576J18865
16360b826394m2581j24967K03223j3880J02643J6446Q5387J08052M3324m4043
16350b492790k2080K1152m6704J35840Q9722J56118K4283q2251J6874J31520J08076
16339a960240K4502N8235L2879L1708M7572L1849J8434K3502O3444K7297R5772
16328a505046J12777p8146P4820J45700L6007n6717j08832K02101J00005k4266
16318a101597j68733K21928O2708N1791J47861J780n7790N3007J4810O4634J44007
16307e65594p7476R6988M4910P010O0346J03434j39290J61589K6968P8699j6447
$$ plain form
16296 -218863 -124671 -115882 -154382 -62089 6466 -50368 -13929 115146 111946 123977 152526 236751
16284 236751 262680 346248 360213 333474 374416 362078 524791 529430 593102 668794 717306
16273 717306 697836 671208 602731 620176 741742 665851 729987 802628 754995 826949 874037
16262 874037 943345 940790 1025228 1029572 1105991 1152271 1258522 1211190 1160347 1246914 1313013 1304656
16250 1304656 1433130 1449636 1397490 1392644 1226512 1380933 1355945 1422711 1486230 1614710 1653975
16239 1653975 1651059 1617054 1688892 1648097 1703102 1770702 1638567 1841888 1793076 1903172 2041028
16228 2041028 1928428 2013427 1928912 2006615 2144426 1998229 2046044 2074793 1928452 2120309
16218 2120309 2051241 2108143 2011474 2123060 2149707 2055576 2313824 2345516 2315207 2193073 2351551
$$ packed form
16296b18863R4192Q789l8500R2293O8555n6834L6439J29075l200J2031K8549Q4225
16284B36751K5929Q3568J3965k6739M0942j2338J62713M639O3672P5692M8512
16273G17306j9470k6628o8477J7445J21566p5891O4136P2641m7633P1954M7088
16262H74037O9308k555Q4438M344P6419M6280J06251m7332n0843Q6567O6099q357
16250A304656J28474J6506n2146m846j66132J54421k4988O6766O3519J28480L9265
16239A653975k916l4005P1838m0795N5005O7600j32135K03321m8812J10096J37856
16228B041028j12600Q4999q4515P7703J37811j46197M7815K8749j46341J91857
16218B120309o9068N6902r6669J11586K6647r4131K58248L1692l0309j22134J58478
$$ plain form
16207 2351551 2273241 2342681 2431413 2337369 2339873 2416026 2455735 2488066 2515946 2630629 2602013
16196 2602013 2515902 2559664 2591807 2571881 2543850 2584717 2624468 2704969 2687541 2772430 2680094
16185 2680094 2680049 2806608 2757536 2712174 2770008 2847384 2949122 2810003 2712067 2840391 2969182
16174 2969182 2886044 2897411 2858070 2881837 2907989 2917933 2839797 2781914 2780250 3022717 3056014
16163 3056014 2960630 2804324 2891226 2972320 3033786 3131144 3043515 3097106 3079826 3158342 3116567
16152 3116567 3092124 3097165 3065859 3114177 3089315 3184950 3194016 3200717 3067632 3171220 3213828
16141 3213828 3136778 3158707 3148654 3246122 3116510 3125985 3272861 3368600 3273150 3306268 3206676
16130 3206676 3332631 3382778 3301575 3257856 3253892 3329222 3240647 3391685 3561933 3456080 3449332
$$ packed form
16207B351551p8310O9440Q8732r4044K504P6153L9709L2331K7880J14683k8616
16196B602013q6111M3762L2143j9926k8031M0867L9751Q0501j7428Q4889r2336
16185B680094m5J26559m9072m5362N7834P7376J01738j39119r7936J28324J28791
16174B969182q3138J1367l9341K3767K6152R944p8136n7883j664K42467L3297
16163C056014r5384j56306Q6902Q1094O1466R7358q7629N3591j7280P8516m1775
16152C116567k4443N041l1306M8318k4862R5635R066O701j33085J03588M2608
16141C213828p7050K1929j0053R7468j29612R475J46876R5739r5450L3118r9592
16130C206676J25955N0147q1203m3719l964P5330q8575J51038J70248j05853o748
$$ plain form
16119 3449332 3311987 3312871 3244323 3344541 3297446 3320052 3461995 3607431 3390796 3319673 3397020
16108 3397020 3627198 3547416 3359957 3341943 3482092 3434554 3548093 3474897 3404665 3482205
16098 3482205 3503146 3461519 3587827 3686797 3510041 3468841 3446953 3483909 3467403 3516133 3594759
16087 3594759 3769253 3599784 3303914 3453206 3519826 3385410 3445478 3457732 3470078 3535146
$$ packed form
16119C449332j37345Q84o8548J00218m7095K2606J41943J45436k16635p1123P7347
16108C397020K30178p9782j87459j8014J40149m7538J13539p3196p0232P7540
16098C482205K0941m1627J26308R8970j76756m1200k1888L6956j6506M8730P8626
16087C594759J74494j69469k95870J49292O6620j34416O0068J2254J2346O5068
$$ [...]
##END NTUPLES=NMR SPECTRUM
##END=
