##TITLE=1H_CG-1207-3
 CDCl3
 8 sc, 
 25.7.2024
##JCAMPDX= 6.0         $$ Bruker NMR JCAMP-DX V2.0
##DATA TYPE= NMR SPECTRUM
##DATA CLASS= NTUPLES
##ORIGIN= UXNMR, Bruker Analytische Messtechnik GmbH
##OWNER= root
$$ XWIN-NMR		Version 3.5
$$ Thu Jul 25 13:53:10 2024 Russian Standard Time (UT+4h)  she@DPX200
##.OBSERVE FREQUENCY= 200.1315
##.OBSERVE NUCLEUS= ^1H
##.ACQUISITION MODE= SIMULTANEOUS
##.ACQUISITION SCHEME= undefined
##.AVERAGES= 8
##.DIGITISER RES= 18
##SPECTROMETER/DATA SYSTEM= spect
##.PULSE SEQUENCE= zg30
##.SOLVENT NAME= D2O
##.SHIFT REFERENCE= (INTERNAL, D2O, 0, 20.4553)
##AUDIT TRAIL= $$ (NUMBER, WHEN, WHO, WHERE, WHAT)
$$ ##TITLE= Audit trail, XWIN-NMR		Version 3.5
$$ ##JCAMPDX= 5.01
$$ ##ORIGIN= Bruker BioSpin GmbH
$$ ##OWNER= she
$$ F:/spectra/data/she/nmr/H-F/1/pdata/1/auditp.txt
$$ ##AUDIT TRAIL=  $$ (NUMBER, WHEN, WHO, WHERE, WHAT)
(   1,<2024-07-25 13:51:57.46 +0400>,<she>,<DPX200>,
      <created by zg, POWCHK disabled, PULCHK disabled
       configuration hash MD5:
       00 E9 B6 7A A2 85 ED C7 34 08 36 98 17 FE 4E 26
       data hash MD5: 16K
       CF 0B E2 FD A9 E1 BD 29 15 F2 4E 95 0A 2C 0D 8E>)
(   2,<2024-07-25 13:52:01.60 +0400>,<she>,<DPX200>,
      <Start of raw data processing
       efp BC_mod = 2 LB = 0.24 FT_mod = 6 PKNL = 1 PHC0 = -25633.92 PHC1 = 9.58749 SI = 16K 
       data hash MD5: 16K
       C9 AE 47 88 8B A2 0E A2 5B 68 C5 B1 0C 56 72 A9>)
(   3,<2024-07-25 13:52:25.98 +0400>,<she>,<DPX200>,
      <pk PHC0 = -159.8864 PHC1 = 3.6 
       data hash MD5: 16K
       5B 44 FB 0B 68 F5 07 03 64 D1 CB 0D 14 4D 0E 9D>)
(   4,<2024-07-25 13:52:29.57 +0400>,<she>,<DPX200>,
      <abs ABSG = 5 
       data hash MD5: 16K
       BE 06 39 7D 18 D4 F3 62 D1 BC E9 7D 60 0B 87 B7>)
$$ ##END=
$$ 
$$ hash MD5
$$ AF 2C F5 7F 2A 64 FC 5E 98 3A 75 E1 3E FA 42 29
##$RELAX= 
##$RELAX= 
##$RELAX= 
##$RELAX= 
##$RELAX= 
##$RELAX= 
$$ Bruker specific parameters
$$ --------------------------
##$DU= <F:/spectra>
##$EXPNO= 1
##$NAME= <H-F>
##$PROCNO= 1
##$TYPE= <nmr>
##$USER= <she>
##$AMP= (0..31)
100 100 100 100 100 100 100 100 100 100 100 100 100 100 100 100 100 100 
100 100 100 100 100 100 100 100 100 100 100 100 100 100 
##$AQSEQ= 0
##$AQ_mod= 1
##$AUNM= <au_zg>
##$AUTOPOS= <>
##$BF1= 200.13
##$BF2= 200.13
##$BF3= 200.13
##$BF4= 200.13
##$BF5= 200.13
##$BF6= 200.13
##$BF7= 200.13
##$BF8= 200.13
##$BYTORDA= 1
##$CFDGTYP= 0
##$CFRGTYP= 5
##$CHEMSTR= <none>
##$CNST= (0..31)
1 1 145 1 1 1 1 1 1 1 1 1 1 1 1 1 1 1 1 1 1 1 1 1 1 1 1 1 1 1 1 1 
##$CPDPRG= <>
##$CPDPRG1= <>
##$CPDPRG2= <>
##$CPDPRG3= <>
##$CPDPRG4= <mlev>
##$CPDPRG5= <mlev>
##$CPDPRG6= <mlev>
##$CPDPRG7= <mlev>
##$CPDPRG8= <mlev>
##$CPDPRGB= <>
##$CPDPRGT= <>
##$D= (0..31)
0 1.2 0 0 0 0 0 0 0 0.06 0 0.03 0 0 0 0 0.0002 0 0 0 0 0 0 0 0 0 0 0 0 
0 0 0 
##$DATE= 1721901116
##$DBL= (0..7)
120 120 120 120 120 120 120 120 
##$DBP= (0..7)
150 150 150 150 150 150 150 150 
##$DBP07= 0
##$DBPNAM0= <>
##$DBPNAM1= <>
##$DBPNAM2= <>
##$DBPNAM3= <>
##$DBPNAM4= <>
##$DBPNAM5= <>
$$ [...]
##$SUBNAM3= <"">
##$SUBNAM4= <"">
##$SUBNAM5= <"">
##$SUBNAM6= <"">
##$SUBNAM7= <"">
##$SUBNAM8= <"">
##$SUBNAM9= <"">
##$SW= 24.0689530833862
##$SWIBOX= (0..15)
0 0 2 0 0 0 0 0 0 0 0 0 0 0 0 0 
##$SW_h= 4816.95568400771
##$TD= 16384
##$TD0= 1
##$TE= 0
##$TE2= 300
##$TE3= 300
##$TEG= 300
##$TL= (0..7)
0 120 120 120 120 120 120 120 
##$TP= (0..7)
150 150 150 150 150 150 150 150 
##$TP07= 0
##$TPNAME0= <>
##$TPNAME1= <>
##$TPNAME2= <>
##$TPNAME3= <>
##$TPNAME4= <>
##$TPNAME5= <>
##$TPNAME6= <>
##$TPNAME7= <>
##$TPOAL= (0..7)
0.5 0.5 0.5 0.5 0.5 0.5 0.5 0.5 
##$TPOFFS= (0..7)
0 0 0 0 0 0 0 0 
##$TUNHIN= 0
##$TUNHOUT= 0
##$TUNXOUT= 0
##$USERA1= <user>
##$USERA2= <user>
##$USERA3= <user>
##$USERA4= <user>
##$USERA5= <user>
##$V9= 5
##$VALIST= <valist>
##$VCLIST= <CCCCCCCCCCCCCCC>
##$VD= 0
##$VDLIST= <DDDDDDDDDDDDDDD>
##$VPLIST= <PPPPPPPPPPPPPPP>
##$VTLIST= <TTTTTTTTTTTTTTT>
##$WBST= 1024
##$WBSW= 4
##$XGAIN= (0..3)
0 0 0 0 
##$XL= 0
##$YL= 0
##$YMAX_a= 149853
##$YMIN_a= -157820
##$ZGOPTNS= <>
##$ZL1= 120
##$ZL2= 120
##$ZL3= 120
##$ZL4= 120
##$ABSF1= 20.48023
##$ABSF2= -3.588926
##$ABSG= 5
##$ABSL= 3
##$ALPHA= 0
##$AQORDER= 0
##$ASSFAC= 0
##$ASSFACI= 0
##$ASSFACX= 0
##$ASSWID= 0
##$AUNMP= <proc_1d>
##$AZFE= 0.1
##$AZFW= 0.1
##$BCFW= 0
##$BC_mod= 2
##$BYTORDP= 0
##$COROFFS= 0
##$CY= -3
##$DATMOD= 1
##$DC= 0
##$DFILT= <>
##$DTYPP= 0
##$F1P= 0
##$F2P= 0
##$FCOR= 1
##$FTSIZE= 16384
##$FT_mod= 6
##$GAMMA= 0
##$GB= 0
##$INTBC= 1
##$INTSCL= 3.70164e-10
##$ISEN= 128
##$LB= 0.24
##$LEV0= 0
##$LPBIN= 0
##$MAXI= 10000
##$MC2= 0
##$MEAN= 0
##$ME_mod= 0
##$MI= 1.114404
##$NCOEF= 0
##$NC_proc= -8
##$NLEV= 6
##$NOISF1= 3.799351
##$NOISF2= 2.8
##$NSP= 0
##$NTH_PI= 0
##$NZP= 0
##$OFFSET= 20.45526
##$PC= 1
##$PHC0= -25793.81
##$PHC1= 13.18749
##$PH_mod= 1
##$PKNL= yes
##$PPARMOD= 0
##$PSCAL= 0
##$PSIGN= 0
##$REVERSE= no
##$SF= 200.129814770778
##$SI= 16384
##$SIGF1= 3
##$SIGF2= 2
##$SINO= 5.538805
##$SIOLD= 16384
##$SREGLST= <1H.CDCl3>
##$SSB= 0
##$STSI= 16384
##$STSR= 0
##$SW_p= 4816.95568400771
##$SYMM= 0
##$S_DEV= 0
##$TDeff= 16384
##$TDoff= 0
##$TI= <>
##$TILT= no
##$TM1= 0
##$TM2= 0
##$TOPLEV= 0
##$USERP1= <user>
##$USERP2= <user>
##$USERP3= <user>
##$USERP4= <user>
##$USERP5= <user>
##$WDW= 1
##$XDIM= 16384
##$YMAX_p= 581930491
##$YMIN_p= -1769063
$$ End of Bruker specific parameters
$$ ---------------------------------
##NTUPLES= NMR SPECTRUM
##VAR_NAME=  FREQUENCY,     SPECTRUM/REAL,   SPECTRUM/IMAG
##SYMBOL=    X,             R,               I
##VAR_TYPE=  INDEPENDENT,   DEPENDENT,       DEPENDENT
##VAR_FORM=  AFFN,          ASDF,            ASDF
##VAR_DIM=   16384,         16384,           16384
##UNITS=     HZ,            ARBITRARY UNITS, ARBITRARY UNITS
##FACTOR=    0.29402158847633, 1,            1
##FIRST=     4093.70725942426, 0,            0
##LAST=      -723.248424583451, 0,           0
##MIN=       -723.248424583451, -1769063,    0
##MAX=       4093.70725942426, 581930491,    0
$$ Real data points
##PAGE= N=1
##DATA TABLE= (X++(R..R)), XYDATA
$$ [...]
5786C77143j85396k12685k74374J03406M11079N01735k87580l76867J65915j0180
5776B12196k87947J80375l7131k2770K41163j67352J49327r9575j86732j05698
5766a24144K36444J15832k06896k11161L83731j98775k48385N97591Q1538N2719
5756D78494o029j04644k43438L10687R4283r5896K3631L58752m38732k16107j39995
5745B1006Q0863k35213L62473J58161j43212k33072J68884J75162l49426K7308
5735C2934K3254k45955o5357J15704K1937R0230J61376q9053M01615k81647J39575
5724C04613O7600J41302M7150l17818l11761J13822K78437j50354K17559k74492
5714A16058J88966N6480p7289N6843J81304m18122K14643j0410k35329M67184
$$ plain form
5786 377143 191747 -20938 -295312 -191906 219173 720908 433328 56461 222376 212196
5776 212196 -75751 104624 67493 44723 285886 118534 267861 168286 -18446 -124144
5766 -124144 112300 228132 21236 -189925 193806 -4969 -253354 344237 425775 478494
5756 478494 472465 367821 124383 435070 529353 433457 457088 815840 377108 161001 21006
5745 21006 101869 -133344 229129 387290 244078 11006 179890 355052 5626 32934
5735 32934 56188 -189767 -255124 -139420 -117483 -27253 134123 45070 446685 165038 304613
5724 304613 372213 513515 560665 242847 -68914 44908 323345 172991 390550 116058
5714 116058 305024 361504 284215 341058 522362 104240 318883 308473 73144 540328
5704E40328J87722k87343l17172k12975R864K39270K69067k1385L9748M0765K71339
5693G59228j0791p7942J22896J1020j00396J8811J23061K06422j14985l73278
5683E64046o5062r6143l9179N5021J70012k13387K11373l43801N34547N1889R6413
5672I25729l18794k13683L18816K22431L2129j98230J0058J92940k98142J18912
5662G92166K40270n2524N2184k02893K44108j70408M76649J27611n6812L67738
5652A818089k06572J15343j29767n75065R703R0386l08135J28150K13901m11214
5642G44819j72659K65551L66276j31025J7105p2184L12232m0157m2823r2261j43616
5631A011258o256r9755j31548k22832Q4092o6402M8397J43428L18960k53899k89216
$$ plain form
5704 540328 728050 440707 123535 -89440 -79576 159694 428761 407376 447124 487889 759228
5693 759228 748437 670495 793391 804411 704015 722826 845887 1052309 937324 564046
5683 564046 498984 402841 363662 418683 588695 375308 586681 242880 777427 829316 925729
5672 925729 606935 393252 712068 934499 966628 768398 778456 971396 673254 792166
5662 792166 1032436 979912 1032096 829203 1073311 902903 1379552 1507163 1450351 1818089
5652 1818089 1611517 1726860 1597093 1022028 1031731 1122117 813982 942132 1156033 744819
5642 744819 572160 837711 1203987 1072962 1090067 1017883 1330115 1289958 1247135 1154874 1011258
5631 1011258 1005002 905247 773699 550867 634959 568557 616954 760382 1079342 825443 536227
5620E36227J61961L1850J10515j37365k3723L59610l61046L2124J34344m53390
5610C91107n195P136J07787l53844K34583J01311R2295J96661n75402J76156L70059
5599G42654K20780l80876L10695j97874M94981j48125k38730k53948l15581N8520
5589B92496K45408k40001p5556L55296l24895M72427n39778L54965K18483P2698
5579H31543k17854K81275j48012j02316Q8468K79001j60109J3572L24327J26998
5569A316893n4884K8732k68044J9660k10593Q022j16911Q4295L34057Q3421J4915
5558A239563q7277L06607p3063n9927r9223L71764k2550k7760J24179R1523L3205
5547A797041k42084r6473N06093k38422K01032L66041j81400K00775L35773J82226
$$ plain form
5620 536227 698188 730038 840553 703188 679465 1039075 678029 710153 844497 391107
5610 391107 385912 393048 500835 146991 381574 482885 575180 771841 196439 372595 742654
5599 742654 963434 582558 893253 695379 1190360 1042235 803505 549557 233976 292496
5589 292496 537904 297903 222347 577643 252748 725175 185397 540362 758845 831543
5579 831543 613689 894964 746952 644636 733104 1012105 851996 865568 1189895 1316893
5569 1316893 1262009 1290741 1022697 1042357 831764 839786 722875 807170 1141227 1224648 1239563
5558 1239563 1152286 1458893 1385830 1325903 1226680 1598444 1575894 1548134 1672313 1763836 1797041
5547 1797041 1554957 1458484 1964577 1726155 1927187 2293228 2111828 2312603 2648376 2830602
5537B830602L08770K70610L44534l39031R2515n6204o71413J24309J73128J5272
5527C093092M7401j06838J03080M4780J53513J06977L55155M87791K83742M01197
5517D969890J43630K92788l5570l68802q21815o23335j51650l18533r8244l98311
5507B590048J31714O20427l16493k24565K7866k62532K4068P09890M02205j08897
5497C593731q2661k72009j84420j77903k42483n91112J21217R7083k01886j68229
5487A891328n9784Q2579l35881P7770K22297J94363p7491m77601K0379j81827
5477A356132M03837M67651m46783r7130l79327O7470J56199L65490l93435J09616
5467A609720L12616j31924k83566j79900K3587K7269K42814o3746Q0729m1336
$$ plain form
5537 2830602 3139372 3409982 3754516 3415485 3508000 3451796 2780383 2904692 3077820 3093092
5527 3093092 3140493 3033655 3136735 3181515 3335028 3442005 3797160 4284951 4568693 4969890
5517 4969890 5113520 5406308 5370738 5001936 4180121 3556786 3405136 3086603 2988359 2590048
5507 2590048 2721762 3342189 3025696 2801131 2828997 2566465 2590533 3300423 3702628 3593731
5497 3593731 3511070 3239061 3054641 2876738 2634255 2043143 2164360 2261443 2059557 1891328
5487 1891328 1831544 1914123 1578242 1656012 1878309 2072672 1995181 1517580 1537959 1356132
5477 1356132 1759969 2227620 1780837 1683707 1304380 1371850 1528049 1893539 1500104 1609720
5467 1609720 1922336 1790412 1506846 1326946 1350533 1377802 1620616 1556870 1637599 1596263
5457A596263j12614K79115q9277l47562J9388L27311J89511m9861m4596m0805
5447A726873l9731K79364l8122k48405o5508L56789J52023o56907K3780M25057
5437A915213m6612O9975K6078q5943J79400p8557K2116K27291r3308j48339k60314
5426A727000J09127J28498R0544j58832J80350J31725K44757m9305n5529k02753
5416B145582l30495J26769K37508m3546n77814l4860Q7843L48002J93770J46922
5406B299681J06430k87987N8629K71760R7432L39666j68094L95805q0763R8825
5396C131384j40160k69345n6673M02414n81383j5858J06533K81405O0621L03761
5386C222699M70955r3191k44419K17485Q1497q5889P89754m02760k20735r124
$$ plain form
5457 1596263 1483649 1762764 1673487 1325925 1345313 1672624 1862135 1812274 1767678 1726873
5447 1726873 1687142 1966506 1928384 1679979 1614471 1971260 2123283 1466376 1490156 1915213
5437 1915213 1868601 1938576 1964654 1878711 2058111 1979554 2001670 2228961 2135653 1987314 1727000
5426 1727000 1836127 1964625 2055169 1896337 2076687 2208412 2453169 2403864 2348335 2145582
5416 2145582 1815087 1941856 2179364 2135818 1558004 1523144 1610987 1958989 2152759 2299681
5406 2299681 2406111 2118124 2176753 2448513 2545945 2885611 2717517 3113322 3032559 3131384
5396 3131384 2991224 2721879 2665206 3067620 2486237 2470379 2576912 2858317 2918938 3222699
5386 3222699 3693654 3600463 3356044 3573529 3655026 3569137 4358891 3956131 3735396 3726272
5376C726272J13203N19575L43457M38320j20837Q6207M65205K85302k41763R4854
5366E709795N31890K02877k6364L47438N79888N45779K18591J33362N92276P09381
5356I544913K93925L03370M99418M77299Q98836Q75689O45751N11142R47681R83536
5346A5981560Q46053J192619R82758Q73094J619176J297419K272062K473257K783390
5337C0321388M095810M657154N325885N265352L436444J024898j899212l187793
5329D9039926k964757k035075j552650j043454n36436K64719J122662J560992
5321D3855927K947234L746975M674642O491665Q265578R929602J0006847P070067
5313I6988537m78624o801802r853609r505742q070202o378066n253558l919612
$$ plain form
5376 3726272 3839475 4359050 4702507 5140827 5019990 5106197 5571402 5856704 5614941 5709795
5366 5709795 6241685 6444562 6418198 6765636 7345524 7891303 8109894 8243256 8835532 9544913
5356 9544913 9838838 10142208 10641626 11118925 12017761 12893450 13539201 14050343 14998024 15981560
5346 15981560 16827613 18020232 19002990 19876084 21495260 22792679 25064741 27537998 30321388
5337 30321388 34417198 39074352 44400237 49665589 53102033 54126931 52227719 49039926
5329 49039926 46075169 44040094 42487444 41443990 40907554 41172273 42294935 43855927
5321 43855927 46803161 50550136 55224778 61716443 69982021 79911623 89918470 96988537
5313 96988537 96509913 89708111 79854502 70348760 62278558 55900492 50646934 46727322
5305D6727322k732060k275742j356694l35668Q95159J227403K040672L085184
5297D7275576M450802M381345K512652j372051m681005o034430o056110n145818
5289C5330961m529171m223312k661760k487882k319192j350471j195923j129487
5281A5433763j338968q78411r91546n64981p07353q34029l89891o33628n34908
5272H560048m88826n40743j7750r7251j08184k51385o07685p4423j0849k54882
5262F108070j90721l95936l23940J79121k46636J6598J523j11598k67513j9181
5252D749787M0722l86888Q8336P1244m78879P9468L47834k44509L6674o9392p2591
5241D161806J31907k37011L1954N97515o7248q0778J46684p4579m28425k64635
$$ plain form
5305 46727322 43995262 41719520 40362826 40027158 40922317 42149720 44190392 47275576
5297 47275576 51726378 56107723 58620375 57248324 52567319 46532889 40476779 35330961
5289 35330961 30801790 26578478 23916718 21428836 19109644 17759173 16563250 15433763
5281 15433763 14094795 13216384 12224838 11659857 10952504 10118475 9728584 9094956 8560048
5272 8560048 8071222 7530479 7512729 7415478 7307294 7055909 6448224 6373801 6362952 6108070
5262 6108070 5917349 5521413 5197473 5376594 5129958 5146556 5148079 5036481 4768968 4749787
5252 4749787 4790509 4403621 4491957 4563201 4084322 4163790 4511624 4267115 4303789 4234397 4161806
5241 4161806 4293713 4056702 4088656 4686171 4618923 4538145 4684829 4610250 4181825 3917190
5231C917190Q2566r6320L2522j16219k21641m81543O8158k38170Q7801K64587
5221C298931j76560k40781K23658K00935o4038m73537K04711q2730k5673J06420
5211B971336l94717l66468P7011L20497m06637J65947m03202K79726j35265l7817
5201B070411L50227j2797m4091q2348k77359K16440j15096r8750L72609l5596
5191B343650K03237k49061J7941q0829n8423J51525l49493j37969L507K44632
5181B088717j50411L7393J46709m52547n9739j44938K32242K75418L524j25654
5171A850714N6112J34444k80315L4521O0607N35594n30774O8060k71917m189L61350
5160B014207J4111J45702k70320K16343l89952K44992M9750K27053L9287j37749
$$ plain form
5231 3917190 3999756 3903436 3935958 3819739 3598098 3116555 3184713 2946543 3034344 3298931
5221 3298931 3122371 2881590 3105248 3306183 3242145 2768608 2973319 2890589 2864916 2971336
5211 2971336 2576619 2210151 2287162 2607659 2201022 2366969 1963767 2243493 2108228 2070411
5201 2070411 2420638 2407841 2363750 2281402 2004043 2220483 2105387 2006637 2379246 2343650
5191 2343650 2546887 2297826 2315767 2234938 2176515 2328040 1978547 1840578 1844085 2088717
5181 2088717 1938306 1975699 2122408 1669861 1610122 1465184 1697426 1972844 1976368 1850714
5171 1850714 1906826 2041270 1760955 1795476 1856083 2391677 1860903 1928963 1657046 1652857 2014207
5160 2014207 2028318 2174020 1903700 2120043 1730091 1975083 2024833 2251886 2291173 2153424
5150B153424J78418j93904K45116k79561J97688J22301k87599J17841K78508l77954
5140B154278k32519M95561J75178M4182l7696l83032m41784M33628N99648Q0344
5130B887788k08991j63036j714K41681K68460j54355M8019O9316R8289j56394
5120B929063j2487j36304l01757L21693L59242J45041K55263l13994O3539R7882
5110C407181k99807K68277K96235L34318J49881M3944K1968l6761k32269K8808
5100C981775J27286N81965j55295L94353j63818K45938J25460o8387P25833J099352
5090F894462k6120m7475J53648m94046r0393k18621j65824L04081j86473J91172
5080F314411j26097M29433j11227m4192K61883M61487O08807M36104N34183M27411
$$ plain form
5150 2153424 2331842 2137938 2383054 2103493 2301181 2423482 2135883 2253724 2532232 2154278
5140 2154278 1921759 2417320 2592498 2636680 2598984 2215952 1774168 2207796 2807444 2887788
5130 2887788 2678797 2515761 2514047 2755728 3024188 2869833 2917852 2987168 3085457 2929063
5120 2929063 2916576 2780272 2478515 2800208 3159450 3304491 3559754 3245760 3309299 3407181
5110 3407181 3107374 3375651 3671886 4006204 4156085 4200029 4221997 4185236 3952967 3981775
5100 3981775 4109061 4691026 4535731 4930084 4766266 5012204 5137664 5069277 5795110 6894462
5090 6894462 6868342 6820867 6974515 6480469 6390076 6171455 6005631 6309712 6123239 6314411
5080 6314411 6188314 6617747 6506520 6462328 6724211 7185698 7794505 8230609 8764792 9192203
5070I192203j32498l82765k42246l84096m51648r182k09749l29811j40541Q4309
5060F993976J03327k1453p2737P3703K66793L59130Q66334M76417Q11278J74813
5050A0031581j09895n86125q58726p25252M5869m54485J7812j98477k56486j45203
5040F760613K12482k28584l29168r8530K59917J98208L57920Q0657j37342O06662
5030G682835J3510K19006p387k78594L7694L46181j13450K81656J1033K88359
5020H480843k23958M044N92600L37901M10562K24464N43824Q1429P27423l73272
5010A0805860P0526M67466J68313P00366K81257J34410N79598N34608O22528M23290
5000A4788222O94600J197124P87484O11106J008078J033670Q36523J038757J008907
$$ plain form
5070 9192203 9059705 8676940 8434694 8050598 7598950 7589768 7380019 7050208 6909667 6993976
5060 6993976 7097303 7075850 7003113 7076816 7343609 7702739 8569073 9045490 9856768 10031581
5050 10031581 9921686 9335561 8476835 7751583 7797452 7342967 7360779 7162302 6905816 6760613
5040 6760613 6973095 6744511 6415343 6316813 6576730 6774938 7132858 7213515 7076173 7682835
5030 7682835 7696345 7915351 7907964 7629370 7667064 8013245 7899795 8181451 8192484 8480843
5020 8480843 8256885 8260929 8853529 9191430 9601992 9826456 10370280 10451709 11179132 10805860
5010 10805860 10876386 11343852 11512165 12212531 12493788 12628198 13207796 13742404 14364932 14788222
5000 14788222 15482822 16679946 17467430 18078536 19086614 20120284 20956807 21995564 23004471
4991B3004471J429087J472400J507757J850001J781129K464686L110530L975123
4983D0595184M781665N768791O517233O396557L523824j340182l608282m508296
4975E8126494m094173k810901j955299j164970n25630j4111N20691K070015K275156
4966E2427272M043727N590463O719924R229108J1344377J0293571M624010m358182
4958I9914270r902687j1037556r188068p963532o645171n150343m118592k629408
4950D3278913j673051j769457m23534K72035J195425J855080K575426L654118
4942D8964955L075882J189849k261753m101566m969643n071482m221241l505433
4934B9099568k740856l003707j872712j357846j838539j076276q75415o08166
$$ plain form
4991 23004471 24433558 25905958 27413715 29263716 31044845 33509531 36620061 40595184
4983 40595184 45376849 51145640 57662873 64059430 67583254 66243072 62634790 58126494
4975 58126494 54032321 51221420 49266121 48101151 47575521 47561410 48082101 50152116 52427272
4966 52427272 56470999 62061462 68781386 78010494 89354871 99648442 104272452 99914270
4958 99914270 90011583 78974027 69785959 61822427 55177256 50026913 45908321 43278913
4950 43278913 41605862 39836405 39412871 39684906 40880331 42735411 45310837 48964955
4942 48964955 52040837 53230686 50968933 46867367 41897724 36826242 32605001 29099568
4934 29099568 26358712 23355005 21482293 20124447 18285908 17209632 16334217 15726051
4926A5726051q41054l74536n46720n89422n88781k51866o73376j68763K21167
4917A1912700l51556o71915k08566l40398j74615J13086J04227J4603j91782l7765
4907A0168019O5299k49716J81531l25038k3013j16430L12251K61617L75606l60346
4897A0289780K00544Q3073K46404L57101M07460J40870M39041J77206L34975K92652
4887A2969106R6588O14187L91703K74951N63842L02553l23978O69248L05878j15655
4877A5748423L96053M50750K746J261439N96181L32187P31155J015441O30356
4868B1164731O76456J007337Q53943Q30348R57931J499031J533924J894356K050109
4859C2468166K573335L204586M048413M292995N615459N668665M810341J949689
$$ plain form
4926 15726051 14884997 14510461 13963741 13374319 12785538 12533672 11860296 11691533 11912700
4917 11912700 11561144 10889229 10680663 10340265 10165650 10278736 10382963 10397566 10205784 10168019
4907 10168019 10233318 9983602 10165133 9840095 9817082 9700652 10012903 10274520 10650126 10289780
4897 10289780 10490324 10573397 10819801 11176902 11584362 11725232 12164273 12341479 12676454 12969106
4887 12969106 13065694 13679881 14071584 14346535 14910377 15212930 14888952 15558200 15864078 15748423
4877 15748423 16144476 16595226 16597972 17859411 18455592 18787779 19518934 20534375 21164731
4868 21164731 21841187 22848524 23702467 24532815 25490746 26989777 28523701 30418057 32468166
4859 32468166 35041501 38246087 42294500 46587495 52202954 57871619 62681960 64631649
4851F4631649j047891k458695k717489k284403j076384J208O47059Q92626J794471
4842E8382151K068284K569040M378038N414238O795883N615679L127312R78270
4834H9328895j343977k893520m106053n674711n836525m837933l682187k509860
4826E8444129j752432j423971p84980l81522O73384J731847K522879L112967K225347
4817F4367648r82720m043867o131825n995331n000100m472459l782818l058864
4809C0899664k651476k390836j794500j369537j852524j527189j364037j065229
4801A6884336r94900j445554m2146n78288p46722n90322p15961n04916j034628
4792A0230899k83684k86860k15512k27775k51298q68264l01943J274q0486l14043
$$ plain form
4851 64631649 63583758 61125063 58407574 56123171 55046787 55047995 55695054 56587680 58382151
4842 58382151 60450435 63019475 67397513 72811751 79607634 85223313 88350625 89328895
4834 89328895 87984918 85091398 80985345 75310634 69474109 64636176 60953989 58444129
4826 58444129 56691697 55267726 54482746 54101224 54774608 56506455 59029334 62142301 64367648
4817 64367648 63384928 59341061 53209236 47213905 42213805 37741346 33958528 30899664
4809 30899664 28248188 25857352 24062852 22693315 20840791 19313602 17949565 16884336
4801 16884336 15889436 14443882 14401736 13823448 13076726 12486404 11770443 11265527 10230899
4792 10230899 9947215 9660355 9444843 9217068 8965770 8097506 7795563 7796837 7716351 7402308
4782G402308j48090k45079j8163l28725n10141k40558k47128j93102J38290j66518
4772E443094J01504l67833k38073J36373j85345l52881O6899K66982j27489N4152
4762D797383p04076q153M77551m19151n15844l3847n9932Q5502j06576O9426J79375
4751C761658k08227J05386k6287j14076m08516j81760o2488L51781K25135n26444
4741B916162P3193J13061J13698l89159J55418M61387N9701q3932l24535j45427
4731B949567R5606M5241n45169J42307k92821K52891K56035j16766j10717J1138
4721B687312j2331k4204J77172J65846k9739l48439k24028k30825J75017j62306
4711B173475k66153Q6908K11046j73109K58330p3214o0431R7129j67599j21950
$$ plain form
4782 7402308 7254218 7009139 6990976 6662251 6152110 5911552 5664424 5471322 5609612 5443094
4772 5443094 5544598 5176765 4938692 5075065 4889720 4536839 4603738 4870720 4743231 4797383
4762 4797383 4093307 4085154 4562705 4143554 3627710 3593863 3533931 3619433 3512857 3582283 3761658
4751 3761658 3553431 3658817 3632530 3518454 3109938 2928178 2865690 3217471 3442606 2916162
4741 2916162 2989355 3102416 3216114 2826955 2982373 3443760 3503461 3419529 3094994 2949567
4731 2949567 3045173 3090414 2545245 2687552 2394731 2647622 2903657 2786891 2676174 2687312
4721 2687312 2674981 2650777 2827949 2993795 2964056 2615617 2391589 2160764 2335781 2173475
4711 2173475 1907322 1994230 2205276 2032167 2290497 2217283 2156852 2253981 2086382 1964432
4701A964432K5765K00687O9621n0982k47528n2074J41007j87615J13660r6737
4691A880236P8615l26l881m9770K13515m9233k4256l07687l43372k01537M75549
4680A667853n1260l69878N69928K09527m24757N8810N6605p5136j71793M314j96300
4669A277913K36141J35033K94065j00519M431M18286l98759m0925l17367J7430
4659A525729J24191m94350P7552J39010L82156J04996k54859n7404l12651K08422
4649A442792N45604J61028j56922l10193j76017q8900j63059r332O4460q8661
4639A220800Q556M35452k59847J76687J55392j29543j89024J61647J36718j60247
4629A556591J69089j95045o5847J75193j10613J80975J96932q4141j36823J82900
$$ plain form
4701 1964432 1990197 2190884 2260505 2209523 1961995 1909921 2050928 1863313 1976973 1880236
4691 1880236 1958851 1958525 1954644 1904874 2118389 2069156 2044900 1737213 1393841 1192304 1667853
4680 1667853 1616593 1246715 1816643 2026170 1601413 1660223 1716828 1641692 1469899 1474213 1277913
4669 1277913 1514054 1649087 1943152 1842633 1847064 2265350 1866591 1825666 1508299 1525729
4659 1525729 1649920 1155570 1233122 1372132 1754288 1859284 1604425 1547021 1234370 1442792
4649 1442792 1988396 2149424 1992502 1682309 1506292 1417392 1254333 1245001 1309461 1220800
4639 1220800 1229356 1664808 1404961 1581648 1737040 1607497 1418473 1580120 1716838 1556591
4629 1556591 1725680 1530635 1464788 1639981 1529368 1710343 1907275 1823134 1686311 1869211
4619A869211l39875J88745q333K93307o7507J34340o0564j38316m0240j18637
4609A712131L8447M8961k44208j08774J78899O5548r7706K11100R1674j55690
4599A740382J71962L50579k64854k16608J52318l44293N7412J33922L07908k76663
4589A812065L5345p8363o9250J40447P4337m99676j69118J87365J29107L23483
4579A885742k56284k64767J76178K93491J57595M876j8877j9597o204j12279K30581
4568B070455j27009J12216K3216j91348k37976K45471K71638k45809J18488k98952
4558A740390j23067o7182N79047k5544R1569K84658k88510L73444k40525k7155
4548B297125l1172M74297Q999j2211J20920J44734K1064K004j4502M4109j34007
$$ plain form
4619 1869211 1529336 1718081 1709748 2003055 1935548 2069888 2009324 1871008 1830768 1712131
4609 1712131 1750578 1799539 1555331 1446557 1625456 1691004 1593298 1804398 1896072 1740382
4599 1740382 1912344 2262923 1998069 1781461 1933779 1589486 1646898 1780820 2088728 1812065
4589 1812065 1847410 1769047 1699797 1840244 1914581 1414905 1245787 1433152 1562259 1885742
4579 1885742 1629458 1364691 1540869 1834360 1991955 1996831 1977954 1958357 1952153 1839874 2070455
4568 2070455 1943446 2055662 2078878 1887530 1649554 1895025 2166663 1920854 2039342 1740390
4558 1740390 1617323 1550141 2129188 2103644 2195213 2479871 2191361 2564805 2324280 2297125
4548 2297125 2265953 2740250 2749249 2737038 2857958 3002692 3023756 3025760 3011258 3055367 2921360
4537B921360m6534Q671K86863n07274p593K90210P1507q1248K20642l27693Q9861
4526B918772L58904K85933K1187j46828o9808p5218L23449j53974p8821J70689
4516C554285j21690j15521J83258J87893j24281l96717M9607r0667J01377l62614
4506B864930j90465J46299L79575j76594J70482l00911M32036l11129M08475K34939
4496C657637l10743o2989Q9434J75579m63096m2387L42950j09609k78563k01249
4486B796964m8733o5486J40356j36455J13561o2989N71741j85396j49269j12493
4476B861801j6694J75120m9891m3853O6987M49071l34109p1012J43598j68118
4466C012900j39698L4413K08777o5246J80388K17320m02311J46277K88107j745
$$ plain form
4537 2921360 2874826 2883497 3170360 2663086 2655493 2945703 3017210 2935962 3156604 2828911 2918772
4526 2918772 3277676 3563609 3584796 3437968 3368160 3292942 3616391 3462417 3383596 3554285
4516 3554285 3432595 3317074 3500332 3688225 3563944 3167227 3216834 3126167 3227544 2864930
4506 2864930 2674465 2820764 3200339 3023745 3194227 2893316 3325352 3014223 3422698 3657637
4496 3657637 3346894 3283905 3373339 3548918 3085822 3043435 3386385 3276776 2998213 2796964
4486 2796964 2748231 2682745 2823101 2686646 2800207 2737218 3308959 3123563 2974294 2861801
4476 2861801 2845107 3020227 2970336 2926483 2993470 3442541 3108432 3037420 3181018 3012900
4466 3012900 2873202 2907615 3116392 3051146 3231534 3448854 3046543 3192820 3480927 3479182
4456C479182j18688P6371J73655p3602n1376k62090M9514J81033J44586r0098
4446C508487p6962j83568R7662Q4353K0287K37477j21019k7724L32001M8300j26814
4435C792480K63899k48982m7471K94522J62561N8172k14761k28958l4136j9297
4425C778029K24397l1437J67527M4303K80121J34550j57220j77579K32353K2615
4415D517659J97803j03114R7714k90521r9980M72185K88511j01029j28186q8020
4405D763022K94008K54248j8329K84059l48096J82861Q69894k76433k73489O5883
4395E797628K46105j02828K28140K18533L15942K00610J72860K87588J15688j005
4385G479261K76265M76027L35641n9216K88388K80049K39040O36790L36018K41333
$$ plain form
4456 3479182 3360494 3436865 3610520 3536918 3485542 3223452 3272966 3453999 3598585 3508487
4446 3508487 3431525 3247957 3345619 3429972 3450259 3687736 3566717 3538993 3870994 3919294 3792480
4435 3792480 4056379 3807397 3759926 4054448 4217009 4275181 4060420 3831462 3797326 3778029
4425 3778029 4002426 3970989 4138516 4182819 4462940 4597490 4440270 4262691 4495044 4517659
4415 4517659 4715462 4612348 4710062 4419541 4319561 4791746 5080257 4979228 4851042 4763022
4405 4763022 5057030 5311278 5292949 5577008 5228912 5411773 6281667 6005234 5731745 5797628
4395 5797628 6043733 5940905 6169045 6387578 6703520 6904130 7076990 7364578 7480266 7479261
4385 7479261 7755526 8231553 8567194 8507978 8796366 9076415 9315455 9952245 10288263 10529596
4375A0529596M15433Q30115L09135K33497O91579M80672L80035M40674J251558
4366A5562294R01845N15664M36118Q13865J041319R88156J132226R52765J292439
4357B3636691J131775J882974J472297K082608K013238K491372K476933L104595
4349D0292483L249327K867978L376898L888626M205836K876388K829111L004145
4341F6590792K501451K338183K369471K238203K142829K406042K518274L285627
4333H6390872L985126M280209N683187N260275M489602M106663L203687K122693
4325A19522314J311769Q96639J42265r43488j282989o47614l77700m12534m09694
4316A17798968R9433N91507P17249N80323M91115P31020j46558k95470r35978
$$ plain form
4375 10529596 10945029 11775144 12084279 12317776 13009355 13490027 13870062 14310736 15562294
4366 15562294 16464139 16979803 17415921 18229786 19271105 20259261 21391487 22344252 23636691
4357 23636691 24768466 26651440 28123737 30206345 32219583 34710955 37187888 40292483
4349 40292483 43541810 46409788 49786686 53675312 57881148 60757536 63586647 66590792
4341 66590792 69092243 71430426 73799897 76038100 78180929 80586971 83105245 86390872
4333 86390872 90375998 94656207 100339394 105599669 110089271 114195934 117399621 119522314
4325 119522314 120834083 121730722 121872987 120929499 119646510 118998896 118621196 118208662 117798968
4316 117798968 117898401 118489908 119207157 119787480 120278595 121009615 120863057 120567587 119631609
4307A19631609k280065k771744l812690m856890m677943m604025m539962l311859
4299H8776431l170462k548799j955682k268928k580655k275108k583721k975348
4291F8417728l187165l341204l722267m200443l716891m015024l151261j980534
4283D1102939k455974k233530k149647j460873j250887j026799j342355q44329
4275B8338545p41866n30214n40919k54456n64012m10306m0749J96084K00269j10834
4265B5541542L43777O59261L59613P22776N9866M55660P22638L79932O52663R93876
4255C0891604R57012J177454J846456J192655K139800J917686L633748L252291
4247D7008706M058497N324437N529272M008721J657701l70734k578725k700458
$$ plain form
4307 119631609 117351544 114579800 110767110 105910220 101232277 96628252 92088290 88776431
4299 88776431 85605969 83057170 81101488 78832560 76251905 73976797 71393076 68417728
4291 68417728 65230563 61889359 58167092 53966649 50249758 46234734 43083473 41102939
4283 41102939 38646965 36413435 34263788 32802915 31552028 30525229 29182874 28338545
4275 28338545 27596679 27066465 26525546 26271090 25707078 25296772 25256023 25452107 25652376 25541542
4265 25541542 25885319 26544580 26904193 27626969 27686835 28142495 28865133 29245065 29897728 30891604
4255 30891604 31848616 33026070 34872526 36065181 38204981 40122667 43756415 47008706
4247 47008706 51067203 56391640 61920912 65929633 67587334 67216600 64637875 61937417
4239F1937417k092273j638072o23710j30800O06414P46289J064136K333119L683092
4230F5885612M446571M646149M324446L665301K085757k64570k543607m252119
4222G7993540n279013n833551m890914m057827k871011k073165j853440j069617
4214E0065002o21086m0845J446548J887273K033742J685248j32924k204905m109039
4205E0009014m633773m284733l894683l235437k968161k654741k101280j797835
4197B4438371j718181j003792j380403j295377p20922n45965j38135n13025p15585
4188A6406986j02715l73115J26537o49284o17510l33755o96343m82089r13865
4179A2364847l89294m96745n87992k31919l82824J75675j70478p064l09321j29699
$$ plain form
4239 61937417 59845144 58207072 57583362 57452562 58058976 58805265 59869401 62202520 65885612
4230 65885612 70332183 74978332 79302778 82968079 85053836 84789266 82245659 77993540
4222 77993540 72714527 66880976 61990062 57932235 55061224 52988059 51134619 50065002
4214 50065002 49443916 49403071 50849619 52736892 54770634 56455882 56322958 54118053 50009014
4205 50009014 45375241 41090508 37195825 33960388 30992227 28337486 26236206 24438371
4197 24438371 22720190 21716398 20335995 19040618 18319696 17773731 17635596 17122571 16406986
4188 16406986 16304271 15931156 16057693 15408409 14790899 14457144 13760801 13278712 12364847
4179 12364847 11975553 11478808 10890816 10658897 10276073 10451748 10281270 10274206 9964885 9835186
4169I835186J20924l24760j11134l99182p00702l19930m48447n03408k64255m74354
4159F409938J17376K18456j58121m72408p8406o54673k04517k867J12680l0329
4149E257129j98474j40174n3253k7044l03363N9319J92042L8022j02788k53677
4139D467739J63051n0186k58586q0763k87740J96340j00652N57278l38945l50910
4129C916626J69080R8259k77545J24226q6858k84103k13217j2284K32066K65698
4119C931948R7815l17753M2976j81857M1041l10450K69242L23817K08834j90026
4109C915587k08714k76081J18218J05822K85809R8819J24943m17004K32292j18597
4099C861094l40240M37505m51545k6543J95031N4937r7401M9650J1444k6700R3948
$$ plain form
4169 9835186 9956110 9631350 9520216 9121034 8420332 8100402 7651955 7148547 6884292 6409938
4159 6409938 6527314 6745770 6587649 6115241 6036835 5382162 5177645 5174778 5287458 5257129
4149 5257129 5058655 4918481 4865228 4838184 4534821 4594140 4786182 4824204 4721416 4467739
4139 4467739 4630790 4580604 4322018 4241255 3953515 4149855 4049203 4606481 4267536 3916626
4129 3916626 4085706 4183965 3906420 4030646 3943788 3659685 3446468 3434184 3666250 3931948
4119 3931948 4029763 3712010 3754986 3573129 3614170 3303720 3572962 3896779 4105613 3915587
4109 3915587 3706873 3430792 3549010 3654832 3940641 4039460 4164403 3747399 3979691 3861094
4099 3861094 3520854 3958359 3506814 3480271 3675302 3730239 3632838 3682488 3693932 3667232 3761180
4088C761180j95558M40621k60641K4532l26850j55232L18124J00503l16445k26245
4078C163989K95666j67936J44309j82831K00415k01905L48532k3848r347l92991
4068C174053l89138p9915p4114L98209P4749Q3093j7428n1574N3319K9335j09888
4057C090701M46025Q6457l62625k23057j77785M85701k09564k61329R4245j72433
4047B796336M04524r8721j23402k6924M47771k05307Q5272M8237j00254R3456
4037C320988k77017j42182N46871J41208j76458J94671K58411J21021k49211P9540
4027C817842J21288K96202j38587J36638j91690j77552j7518N5636j62970J63018
4017C902307J88148L8010J30099N1105J66087k20368r602K90080l12712j47666
$$ plain form
4088 3761180 3565622 4006243 3745602 3770134 3443284 3288052 3606176 3706679 3390234 3163989
4078 3163989 3459655 3291719 3436028 3253197 3453612 3251707 3600239 3576391 3567044 3174053
4068 3174053 2784915 2705000 2630886 3029095 3103844 3186937 3169509 3117935 3171254 3200589 3090701
4057 3090701 3536726 3623183 3260558 3037501 2859716 3345417 3135853 2874524 2968769 2796336
4047 2796336 3200860 3102139 2978737 2951813 3399584 3194277 3279549 3327786 3227532 3320988
4037 3320988 3043971 2901789 3448660 3589868 3413410 3608081 3866492 3987513 3738302 3817842
4027 3817842 3939130 4235332 4096745 4233383 4041693 3864141 3846623 3902259 3739289 3902307
4017 3902307 4090455 4128465 4258564 4309669 4475756 4255388 4245786 4535866 4223154 4075488
4007D075488J78207P0271J44676L61941R6268l58J27226J41808j42177o9659K0276
3996E003967O7488K49558J81598k77870j56821K90284K31434j65998j45968K4866
3986E302538O5615J60668j36956K5705J1572J35023K24770j38990P0051j36615
3976E583381J77871j59723q7653M54355N9950p6801m188L1237K43059k51325J85865
3965F156028M4079p1255j3823q906o9926L89074N38980k98223j02343n7536K7891
3954F534040K66225L0858L31517o3853J3927M14656r6543L31046J91780j38267
3944G815386k57517N00644L33643J01051K75585N23728L41791J22874r0346L95600
3934A0062439M23683M05071K09526J41692L90482L25304Q01521O15541J52308
$$ plain form
4007 4075488 4253695 4323966 4468642 4830583 4926851 4926493 5053719 5195527 5053350 4983691 5003967
3996 5003967 5071455 5321013 5502611 5224741 5067920 5358204 5589638 5423640 5277672 5302538
3986 5302538 5368153 5528821 5391865 5417570 5429142 5564165 5788935 5649945 5719996 5583381
3976 5583381 5761252 5601529 5513876 5968231 6028181 5951380 5947192 5978429 6221488 5970163 6156028
3965 6156028 6200107 6128852 6115029 6106123 6036197 6425271 6964251 6666028 6563685 6506149 6534040
3954 6534040 6800265 6831123 7162640 7098787 7112714 7527370 7430827 7761873 7953653 7815386
3944 7815386 7557869 8058513 8392156 8493207 8768792 9292520 9634311 9757185 9666839 10062439
3934 10062439 10486122 10891193 11100719 11242411 11632893 11958197 12759718 13375259 13527567
3925A3527567R24370O54385O89216P30945Q87938Q57656L05375R70720k24270
3916A9323902L99069J378673J257028J452414J295850J447606J363480O76080
3908B8594102K3506k04288j68282M22316J91308J038112J454969J733041J384701
3899C4469485J120098K63173m56837o05503r39172m9500R0355j272Q72411J581487
3889C6344725K16299P54003L75271l92181p03019O2315K36090J83793M45940j7433
3879C7505803O08877J15320J199279M49970O15847J154111J442938P87549M01013
3870D4280707k82396o94208o63469l52774M72618P54641J181497J568606J321389
3861D7586611Q32335m49862j389235j682769j750913j319005q41010k73635j38382
$$ plain form
3925 13527567 14451937 15106322 15795538 16526483 17414421 18272077 18577452 19548172 19323902
3916 19323902 19722971 21101644 22358672 23811086 25106936 26554542 27918022 28594102
3908 28594102 28617608 28413320 28245038 28667354 28858662 29896774 31351743 33084784 34469485
3899 34469485 35589583 35852756 35395919 34790416 33851244 33801744 33892099 33890827 34763238 36344725
3889 36344725 36561024 37315027 37690298 37298117 36595098 36657413 36893503 37077296 37523236 37505803
3879 37505803 38114680 38230000 39429279 39879249 40495096 41649207 43092145 43879694 44280707
3870 44280707 43998311 43304103 42640634 42287860 42760478 43515119 44696616 46265222 47586611
3861 47586611 48418946 47969084 46579849 44897080 43146167 41827162 40986152 40712517 40574135
3852D0574135O15649N67077j98153j109842k042674j918410j907355j429722j502494
3843C1648211j296447k43378k19346o33986j132165o54476r97217j177070r09622
3834B4384504p19637o97704m60495l83822j57606l52427l16676k20133K96860
3825B1372864j05521K11923K23879K97405L84102L13744M06102O06632K33128
3816B3944258J58934L41788L64575O17897N57411M61394J040073J002201M68312
3807B8956843Q21197M74959Q81859P25140J24643Q68019Q16995J014478Q02087
3798C5486220P98655J202456P07745P47106J300639R57483J211671R55714J693289
3789D5060978J487148J733681J984948R17722M82366M73321P03585R44718R60905
$$ plain form
3852 40574135 41189784 41756861 41558708 40448866 38406192 36487782 34580427 33150705 31648211
3843 31648211 30351764 30108386 29889040 29255054 28122889 27468413 26471196 25294126 24384504
3834 24384504 23664867 22967163 22506668 22122846 21965240 21612813 21296137 21076004 21372864
3825 21372864 21267343 21479266 21703145 22000550 22384652 22698396 23104498 23711130 23944258
3816 23944258 24103192 24444980 24809555 25427452 25984863 26446257 27486330 28488531 28956843
3807 28956843 29778040 30252999 31134858 31859998 31984641 32852660 33669655 34684133 35486220
3798 35486220 36284875 37487331 38195076 38942182 40242821 41200304 42411975 43367689 45060978
3789 45060978 46548126 48281807 50266755 51184477 51666843 52140164 52843749 53788467 54749372
3780E4749372R00037N78579R45615O54589Q40512Q65890M74463N33295K25124
3771F0767476R35706J009034K006308K689735K671771K722822K503839J548897
3763G6855588J735344K050316J383870P64209J051011Q86367Q23484J15982n64885
3754H5101286o29709k92611k9313n98547n60271k94130j91439n45374K33515N77752
3744H2771159K65278P87894M19341M01297K1104j44825p17348o20927j326368
3735H1856605j737017k071083k173972k171249k301482k834250k941377k397240
3727F3228935k321973j541215l56827p60195o67941p4185o89740p24195j054084
3718E5038580o50258j304511r80083n30919j185888o00774r09212o90849j172210
$$ plain form
3780 54749372 55649409 56227988 57173603 57828192 58668704 59534594 60009057 60542352 60767476
3771 60767476 61703182 62712216 64718524 67408259 70080030 72802852 75306691 76855588
3763 76855588 78590932 80641248 82025118 82789327 83840338 84726705 85550189 85666171 85101286
3754 85101286 84471577 84178966 84149653 83551106 82990835 82696705 82505266 81959892 82193407 82771159
3744 82771159 83036437 83824331 84243672 84644969 84666073 84521248 83803900 83182973 81856605
3735 81856605 80119588 78048505 75874533 73703284 71401802 68567552 65626175 63228935
3727 63228935 60906962 59365747 59008920 58248725 57580784 57506599 56816859 56092664 55038580
3718 55038580 54388322 53083811 52103728 51572809 50386921 49786147 48876935 48186086 47013876
3709D7013876j547592j469048j732533j603248j279866j477518r68790p21474
3701C6213807p31890j352240r48587r48426r21106q45895j221068o45458n24876
3692B8074261r12170l47395m45051j280815p11502j125298n80526r93338n92966
3683B1085200o30591l16048j118975q04455q89803l80277o3785n48727m23521
3674A5909018p21978o14504n38658m04598r08554l10516j87355n60261n4436O2207
3664A1670365l92077M5694l89447k85846J47867K59760m04578l82556M94j18576
3654A0151100K56204o41548n79205L24977Q7970K8078Q8621m2094k12325k29280
3644I232498K22129m69813p3818M96361K3674m29282k08036K64699j07854K96070
$$ plain form
3709 47013876 45466284 43997236 42264703 40661455 39381589 37904071 36935281 36213807
3701 36213807 35481917 34129677 33181090 32232664 31311558 30465663 29244595 28599137 28074261
3692 28074261 27162091 26814696 26369645 25088830 24377328 23252030 22671504 21678166 21085200
3683 21085200 20454609 20138561 19019586 18215131 17325328 16945051 16881266 16332539 15909018
3674 15909018 15187040 14572536 14033878 13629280 12720726 12410210 12222855 11662594 11608158 11670365
3664 11670365 11278288 11323982 10934535 10648689 10796556 11056316 10651738 10269182 10269676 10151100
3654 10151100 10407304 9765756 9186551 9511528 9599498 9627576 9716197 9674103 9461778 9232498
3644 9232498 9454627 8984814 8910996 9407357 9431031 9001749 8793713 9058412 8950558 9246628
3634I246628m73845K04450O81390M08935n05653J42247l25605n3129J12243j96725
3624I240936n3351l9394M2746J74798P2615K2326N3564r2890R4937k42485L8204
3613I312006j37214m3256n2941K92948j76907K21876L46619j50256o3180K2317
3603I572012j56214K3944L3374R1787K16519J63520o383j12569R4865l09399J09542
3592I720998K52679J22993N39635K2882l33623J07954L15737k57596q0689o6775
3582A0344195K42595R2033K8783k05860L71586k65909j28515J53591o7543j22646
3572A0442310P6247L26611K79265l71124L96980Q637J21956l71718J08425M49955
3562A1467544j62628J27424j1593J37434o6014j02094J81991L49808K79960L62052
$$ plain form
3634 9246628 8772783 8977233 9658623 10067558 9561905 9704152 9378547 9325418 9437661 9240936
3624 9240936 9187585 9148191 9190937 9365735 9438350 9460676 9514240 9421350 9516287 9273802 9312006
3613 9312006 9174792 9131536 9078595 9371543 9194636 9416512 9763131 9612875 9549695 9572012
3603 9572012 9415798 9439742 9473116 9564903 9781422 9944942 9938559 9825990 9920855 9611456 9720998
3592 9720998 9973677 10096670 10636305 10659187 10325564 10433518 10749255 10491659 10410970 10344195
3582 10344195 10586790 10678823 10707606 10501746 10873332 10607423 10478908 10632499 10564956 10442310
3572 10442310 10518557 10845168 11124433 10753309 11150289 11158926 11280882 10909164 11017589 11467544
3562 11467544 11304916 11432340 11420747 11558181 11492167 11390073 11572064 11921872 12201832 12563884
3552A2563884j23689K59919M94618l41991M88866q0754N0761M34745j63015k0479
3542A3562865p0397K29287J30532M33681L89127J5880J54051J66181j46471N8187
3532A4922923j14077O15591k50625L0727M7801M51874j18096J50101M42323j63506
3522A6015036k35877N46806J56769j43140N9915Q7783k8283j69856K77231O91885
3512A7258269Q7619J09317K97507n8506J51668M82709J87817P4249K99308M8667
3502A8938624j18429j47663j18689K01514N13442N01449k37207p1831k37642o9173
3492A9154395M43607L72174L4071K33096K23169K28985K07953M0728J27473k92349
3482B0773302p3362M1631N20410k25074K02968J80247n9421J26943N28090L56730
$$ plain form
3552 12563884 12440195 12700114 13194732 12852741 13341607 13260853 13311614 13746359 13583344 13562865
3542 13562865 13492468 13721755 13852287 14285968 14675095 14690975 14845026 15011207 14864736 14922923
3532 14922923 14808846 15424437 15173812 15204539 15252340 15704214 15586118 15736219 16178542 16015036
3522 16015036 15779159 16325965 16482734 16339594 16399509 16487292 16459009 16289153 16566384 17258269
3512 17258269 17345888 17455205 17752712 17694206 17845874 18328583 18516400 18590649 18889957 18938624
3502 18938624 18820195 18672532 18553843 18755357 19268799 19770248 19533041 19461210 19223568 19154395
3492 19154395 19598002 19970176 20004247 20237343 20460512 20689497 20897450 20938178 21065651 20773302
3482 20773302 20699940 20741571 21261981 21036907 21239875 21420122 21360701 21487644 22015734 22372464
3472B2372464M97066Q3707K00916L61546K5262P30310N86494L02037P27116M19543
3462B6306461K7940P66294L13923N08604M23093J58180J083233M27342M36178
3453C0451248O94970N56092K57150M48462M49720N60014P66947O29339J076373
3444C5890315P33855P12569R60613P21939J194085J565208J574836J817620K416027
3435D7587067K380553K963248M263081M626693N003213N652244N280153M116809
3427H1873061L414805K282524P16967o7636p89202r61226p59881k3127J140712
3418H6826997N47656P0816m79431j263343k701695l625623m566889m919320n247470
3409F4641698m465297m149191l283799k968766k411735k012824j108948j519116
$$ plain form
3472 22372464 22869530 22953237 23154153 23515699 23540961 24271271 24857765 25159802 25886918 26306461
3462 26306461 26334401 27100695 27414618 27923222 28346315 28504495 29587728 30015070 30451248
3453 30451248 31146218 31702310 31959460 32407922 32857642 33417656 34184603 34813942 35890315
3444 35890315 36624170 37336739 38297352 39019291 40213376 41778584 43353420 45171040 47587067
3435 47587067 49967620 52930868 57193949 61820642 66823855 72476099 77756252 81873061
3427 81873061 85287866 87570390 88287357 88219721 87430519 86469293 85709412 85686285 86826997
3418 86826997 87374653 87445469 86966038 85702695 83001000 79375377 74808488 69889168 64641698
3409 64641698 60176401 56027210 52743411 49774645 47362910 45350086 44241138 42722022
3401D2722022j397435r18314m34892n87403o20658j51050m9015n41884k31738
3392C7789633Q6580K1749J24630m03398J70490J57776K96889O71415K77234k64909
3382C8928089L34751K16894M40898P31721N40700J98043R94360L75812O97952
3373D3459220N17719Q53936P21069J033094O23087M23270J306455J063183J092071
3364E1093104P06482P35286J464561J067791R59333Q12318J099195J158676J485156
3355F0581902J556178J476211K071505K059819K067023J908881K491333K961173
3347G7174025K684331L562634L940317M240668M360733N351034N878120O023333
3339A13215195P278728Q327089R242299J0602841J2999962J4118276J4568590
$$ plain form
3401 42722022 41324587 40406273 39971381 39383978 38763320 38612270 38563255 38021371 37789633
3392 37789633 37876213 37897962 38022592 37619194 37789684 37947460 38244349 38915764 39192998 38928089
3382 38928089 39262840 39479734 39920632 40652353 41193053 41391096 42385456 42761268 43459220
3373 43459220 43976939 44830875 45551944 46585038 47208125 47631395 48937850 50001033 51093104
3364 51093104 51799586 52534872 53999433 55067224 56026557 56838875 57938070 59096746 60581902
3355 60581902 62138080 63614291 65685796 67745615 69812638 71721519 74212852 77174025
3347 77174025 79858356 83420990 87361307 91601975 95962708 101313742 107191862 113215195
3339 113215195 120493923 128821012 138063311 148666152 161666114 175784390 190352980
3332A90352980J4679596J3847207J2646164J0196546Q486623O249119O682293
3325B63140528P509493P648480Q053658Q080975O958761M924750L068575O06488
3317C09991708k339177l656314m149808l827501k601025j142495O0152J897099
3309B94232639M055119M861388N829421O024948N286493L394249N12639k360548
3301C21836348m779518n656188n450629k715043j62573K102742M579534M815834
3293C14570507L362625j02454m137091p751190r205125j0741114j1699462j1846305
3285B62450391j1753959j1462718j1049004r766952q680469p964709o674106o284885
3277A88813589n598119n442635n730452n673576o398977p193460p048843q092223
$$ plain form
3332 190352980 205032576 218879783 231525947 241722493 250209116 256458235 263140528
3325 263140528 270650021 278298501 286352159 294433134 301391895 306316645 309385220 309991708
3317 309991708 307652531 303996217 299846409 296018908 293417883 292275388 292335540 294232639
3309 294232639 298287758 303149146 308978567 315003515 320290008 323684257 324196896 321836348
3301 321836348 317056830 311400642 305950013 303234970 303072397 305175139 309754673 314570507
3293 314570507 317933132 317830678 313693587 305942397 296737272 285996158 274296696 262450391
3285 262450391 250696432 239233714 228184710 218417758 209737289 201772580 195098474 188813589
3277 188813589 183215470 177772835 172042383 166368807 159969830 152776370 145727527 137635304
3269A37635304q406457q305931p704447p227111o561171o690410n511598m612312
3261H2615867l585915l324908l100571k371595k210096j508621q93689r03931
3253F4716541j056166l70680j14232m22895l26630l90686q14244o11327m7942
3244F0561739m05873L46229K97025L68197R34636J094661N53037M13098k14112
3235F3948637m58461j04123J06923m87520l54082l1349k3045M00822M40209Q77009
3225F4315020J039877J407757J781273K548950L094719K679918L225580L923814
3217H4016908L598647M306519L553908L884810L930742L191093K710104L502613
3209A12695344L107323K766364L070032K505027K692400L471806L512274K467541
$$ plain form
3269 137635304 129228847 120922916 113218469 105991358 99430187 92739777 87228179 82615867
3261 82615867 79029952 75705044 72604473 70232878 68022782 66514161 65620472 64716541
3253 64716541 63660375 63289695 63175463 62752568 62425938 62035252 61221008 60609681 60561739
3244 60561739 60155866 60502095 60799120 61167317 62101953 63196614 63749651 64162749 63948637
3235 63948637 63490176 63386053 63492976 63005456 62651374 62620025 62596980 62997802 63438011 64315020
3225 64315020 65354897 66762654 68543927 71092877 74187596 76867514 80093094 84016908
3217 84016908 87615555 91922074 95475982 99360792 103291534 106482627 109192731 112695344
3209 112695344 115802667 118569031 121639063 124144090 126836490 130308296 133820570 136288111
3201A36288111J315005j28534p98513j349860k250452l404753l737397l816057
3193A22117550l762364k957145k257789r44201K98775J044302K680810L953129
3185A20173067N003971O442628P346368R128302J0452802J2072684J3126879J3125265
3177A96871966J1848377R672048P201226M306323R27501k423004n444104p275614
3169B15684719q648161r223880r183387q592155p582496p594457p334016n885456
3161A51640711m900020m640655l763666k602777k087031j086671J41608M03028
3153A33104527J142848J666988J853372J491314M68610N6320j466095k540559
3145A35777325l455665m972100o281200o241147o963038p239052o668255o736696
$$ plain form
3201 136288111 137603116 137474582 136676069 135326209 133075757 129671004 125933607 122117550
3193 122117550 118355186 115398041 113140252 112196051 112494826 113539128 116219938 120173067
3185 120173067 125177038 131619666 138966034 148094336 158547138 170619822 183746701 196871966
3177 196871966 208720343 218392391 225593617 229899940 230827441 228404437 222960333 215684719
3169 215684719 207036558 197812678 188629291 180037136 172454640 164860183 157526167 151640711
3161 151640711 146740691 142100036 138336370 135733593 133646562 132559891 132701499 133104527
3153 133104527 134247375 135914363 137767735 139259049 139727659 139783979 138317884 135777325
3145 135777325 132321660 127349560 121068360 114827213 107864175 100625123 93956868 87220172
3137H7220172o057556n313899m658483m397383l502921k716295k666048k042135
3129E5865452j477729j614212r26962p56939q96383o97158r8852m41468o04840
3120D8350909O9203k73543n3339R8265j16565R51097O13251P61916Q40987P31491
3110E1973672P09385L00913j41358j000n01187j000335j065930j432329j332272
3101D7509559j895541j517731j187122j493665j714599j220288r5728j137092
3093C7247793q37311p16278p45483r26638o25085l63299r97049Q2511n27180l40273
3083C1251708k1827k1457K08245j58509o8728L16543J05393J82819R25945J050372
3073C3770504M83446R95133J105967J163486J710537J741240J685987J925783
$$ plain form
3137 87220172 81162616 75848717 71190234 66792851 63289930 60573635 57907587 55865452
3129 55865452 54387723 52773511 51846549 51089610 50193227 49496069 49397217 48955749 48350909
3120 48350909 48420112 48146569 48093230 48191495 48074930 49026027 49639278 50401194 51242181 51973672
3110 51973672 52683057 52983970 52842612 52841612 52340425 51340090 50274160 48841831 47509559
3101 47509559 45614018 44096287 42909165 41415500 39700901 38480613 38384885 37247793
3093 37247793 36410482 35694204 34948721 34022083 33396998 33033699 32036650 32119161 31591981 31251708
3083 31251708 31229881 31208424 31416669 31258160 31189432 31505975 31611368 31794187 32720132 33770504
3073 33770504 34253950 35249083 36355050 37518536 39229073 40970313 42656300 44582083
3065D4582083J640141J881610J226630J259924J261266P50056Q84941R87587N09128
3056E4983366O11978J323581J857265J742810K314044K726061K719202L259115
3048G1537422L546025L798190M740093N158871N992894O941933P583989Q344963
3040A17644380R371371J0485817J2135005J3433341J4578458J5287171J9897564
3033B12833107K7861062L8040528N3766370P0037533O3501869J4936008m2006130
3026D38970347o2489313n2954980l9373775k8720616j9838351j3911353j0264468
3019B11417491p164940m030935l78498J921842M517116O906755R448653J2065267
3011B34702751J5129111J8740195K4971333L3548159M4723085N8199518O8510148
$$ plain form
3065 44582083 46222224 48103834 49330464 50590388 51851654 52601710 53486651 54474238 54983366
3056 54983366 55595344 56918925 58776190 60519000 62833044 65559105 68278307 71537422
3048 71537422 75083447 78881637 83621730 88780601 94773495 101715428 109299417 117644380
3040 117644380 127015751 137501568 149636573 163069914 177648372 192935543 212833107
3033 212833107 240694169 278734697 332501067 402538600 466040469 480976477 438970347
3026 438970347 376481034 323526054 284152279 255431663 235593312 221681959 211417491
3019 211417491 204252551 200221616 199843118 201764960 206282076 213188831 222637484 234702751
3011 234702751 249831862 268572057 293543390 327091549 371814634 430014152 498524300
3004D98524300O1657495K1748696l3267812o5096855o8357250n9645434m8944992
2997C06618148l9455086l2100324k6522665k2661411j8776799j5805279j3073468
2990A38223116j0514417q632142o696570n395161l719562k728494j971658l269585
2982I5295527n843419o928365o710465n651128n795172m095057l428590l374889
2974E3468442l072173k569193k537135k452252k017854k090328j773945j557394
2966C5398168j241559j518107j403377r61915j262327r62597p60515j100279r36731
2957B5250761j048810o49074p33566q34526m29407r50217n18776p88183o69780
2948A8628422n78290m11204n09860o71436p92273m10893m02449l18670k11919
$$ plain form
3004 498524300 560181795 581930491 548662679 483565824 415208574 355563140 306618148
2997 306618148 267163062 235062738 208540073 185878662 167101863 151296584 138223116
2990 138223116 127708699 119076557 112379987 106984826 103265264 100536770 98565112 95295527
2982 95295527 89452108 82523743 75813278 70162150 64366978 60271921 56843331 53468442
2974 53468442 50396269 47827076 45289941 42837689 40819835 38729507 36955562 35398168
2966 35398168 34156609 32638502 31235125 30273210 29010883 28048286 27287771 26187492 25250761
2957 25250761 24201951 23552877 22819311 21984785 21555378 20605161 20086385 19298202 18628422
2948 18628422 18050132 17638928 17129068 16457632 15665359 15254466 14852017 14533347 14321428
2939A4321428n59961J05806k16971o29713K1609j68761M9488n97234k863k48500
2929A2074328n46953k44148l11625l72596k48865o0499m26150l9427p6134j62236
2919I585695m88319n8433q9360l1424n7151l42307j26819m539n21960r9829k86596
2908G478958J98787K56539k96099k58296m17581M7025k541l84324J28115l0192
2898F720391j84209l15264j12023J98851K01981j25054j35851m50694J93992Q7160
2888F079280k45511o3603k36087J16376J23283k69048l35114j0215O0898L7441
2878E257700j99101k25602K77868k98457k76541J63780j4217k0267k88819j91034
2868D185310N77901q6868l68690j34626j5712J48825j9428m74570J86165J6193
$$ plain form
2939 14321428 13761467 13867273 13650302 13020589 13042198 12873437 12922925 12325691 12322828 12074328
2929 12074328 11527375 11283227 10971602 10599006 10350141 10289642 9863492 9824065 9747931 9585695
2919 9585695 9097376 9038943 8949583 8918159 8861008 8518701 8391882 8387343 7865383 7765554 7478958
2908 7478958 7677745 7934284 7638185 7379889 6962308 7009333 7006792 6622468 6750583 6720391
2898 6720391 6536182 6220918 6108895 6307746 6509727 6384673 6248822 5798128 5992120 6079280
2888 6079280 5833769 5770166 5534079 5650455 5773738 5504690 5169576 5159361 5220259 5257700
2878 5257700 5058599 4832997 5110865 4812408 4535867 4699647 4685430 4665163 4376344 4185310
2868 4185310 4763211 4676343 4307653 4173027 4157315 4306140 4286712 3812142 3998307 4014500
2858D014500j96348q616R5802L23315k80789m28235j06071L8340N5543m19877
2848C087564K42220K20492k63641j81476M9304k0527K05989l11948j02530j0866
2838B914581J66474L87342k77567K28920p3626j94330K24748j69732K3956K87607
2828C518373j32094J03873J97358M266l02203J01627L7452m6198j11323N86377
2818C957508K45882R7343K31497j4577j68389q5617l60259k89815j61738l54115
2808C097720k6383J60452N5129J39908K39936l80399l21371j09127P9496K30507
2798C165868N3257l92608L75945M62611K96843O62662r0107J3856j09874j40463
2788D297990j39053n80496Q9398k39014k90720m9136o54445l74856M36849O6436
$$ plain form
2858 4014500 3818152 3809536 3905338 4228653 3947864 3519629 3413558 3451898 3507441 3087564
2848 3087564 3329784 3550276 3286635 3105159 3154463 3133936 3339925 3027977 2925447 2914581
2838 2914581 3081055 3468397 3190830 3419750 3346124 3151794 3376542 3206810 3230766 3518373
2828 3518373 3386279 3490152 3687510 3691776 3389573 3491200 3528652 3482454 3371131 3957508
2818 3957508 4203390 4300733 4532230 4517653 4349264 4263647 3903388 3613573 3451835 3097720
2808 3097720 3071337 3231789 3286918 3426826 3666762 3286363 2964992 2855865 2935361 3165868
2798 3165868 3219125 2826517 3202462 3665073 3961916 4624578 4534471 4548327 4438453 4297990
2788 4297990 4158937 3578441 3667839 3428825 3138105 3088969 2434524 2059668 2496517 2562953
2778B562953j41674J37290m8763j17872l59137r6517L4464J51767m8587j23367
2768A950557K84418k4476k69910k89933k7631N6167J84724Q5616n44625o8223
2758A336684L78291r0319q8419j41193J66576m4436K75119n6053n79827M14906
2748A571329J39883j57502j8227K64396l35957l07593j33095M79035K92475k64519
2738A530225k49762N5758j82670k5650K05404O8158J33277J37301K1413m90289
2728A203165M851K6293N5999j36115M8581N8305k29887K88331o7828k55072J36855
2717A133478k0847j53946K71406K43636j77859j32042p0573l0619k16194J41624
2707I88064J41745J45101L40266l01765m9991k60998J32168p3056J59455j92457
$$ plain form
2778 2562953 2421279 2558569 2509806 2391934 2032797 1936280 1970744 2122511 2073924 1950557
2768 1950557 2234975 2210499 1940589 1650656 1623025 1679192 1863916 1949532 1404907 1336684
2758 1336684 1714975 1624656 1536237 1395044 1561620 1517184 1792303 1736250 1156423 1571329
2748 1571329 1711212 1553710 1535483 1799879 1463922 1156329 1023234 1502269 1794744 1530225
2738 1530225 1280463 1336221 1153551 1127901 1333305 1401463 1534740 1672041 1693454 1203165
2728 1203165 1208016 1234309 1290308 1154193 1202774 1261079 1031192 1319523 1251695 996623 1133478
2717 1133478 1112631 958685 1230091 1473727 1295868 1163826 1093253 1062634 846440 988064
2707 988064 1129809 1274910 1615176 1313411 1263420 1002422 1134590 1061534 1220989 1028532
2697A028532k55755O2727K09138J53842N5657k22306k57677J05777K99124k61183
2687I17876j78203L31337j69559m565j36317K32121k1799n5925K84540K09859
2677A409365j22835m89670l23399l7464L46518K10683K2315l5033J29623j36803
2667I73300r0221N188K60683m2105J4790K70032O4943L5061j7109L3102j55646
2656A352018l48395K70609k46030q3569k59557J36277m5386K84735L73406l37165
2646A096943J07643L6919m04766K01129n31167K24187O2829j10038Q7720p3738
2636F97661L53063j63723K93081m84965K34805m9942q2054q03j59464k29217L79797
2625G88239j17671K56752O3278Q2697n27456L57625r3491J87687j82984J66323
$$ plain form
2697 1028532 772777 835504 1044642 1198484 1254141 1031835 774158 879935 1179059 917876
2687 917876 739673 1071010 901451 896886 760569 992690 970891 914966 1199506 1409365
2677 1409365 1286530 796860 473461 435997 782515 993198 1015513 980480 1110103 973300
2667 973300 883079 888267 1148950 1106845 1121635 1391667 1456610 1491671 1474562 1507664 1352018
2656 1352018 1003623 1274232 1028202 944633 685076 821353 775967 1060702 1434108 1096943
2646 1096943 1204586 1241505 836739 1037868 506701 730888 793717 683679 771399 697661
2636 697661 1050724 887001 1180082 695117 929922 879980 797926 797123 637659 408442 788239
2625 788239 670568 927320 990598 1073295 545839 903464 809973 997660 814676 980999
2615I80999K43984o09343L43627q0819n15508l03284L38175M96725k9374m5709
2605H19473k4472j51721j48502o8892L15816O648R331M9650R7459Q6854J67841
2594A159485j00909J1296p7677k45159r2936J1077Q0590o9631k71813Q4927L1107
2583E20357j50334J08754J63451p8388j12464J35942l3805J43938l2197M95192
2573A160446l49372k00302K80847j122J09576m5132J71723k13766j30041j93018
2563E89839j14822R6559R7645P1362j85416J76962k67706J82318L59388l60189
2553F45940p1068K03583k8563M9473L35958N8163m64704J00469J37447r9134Q8315
2542I55879J51890J04937k4002j57223J45841k42534Q8912K6313j80047J59253
$$ plain form
2615 980999 1224983 615640 959267 878448 362940 59656 397831 894556 865182 819473
2605 819473 795001 643280 494778 425886 741702 748350 757681 807331 904790 991644 1159485
2594 1159485 1058576 1069872 992195 747036 654100 665177 745767 676136 404323 489250 520357
2583 520357 370023 478777 642228 563840 451376 587318 553513 697451 665254 1160446
2573 1160446 811074 610772 891619 890497 1000073 954941 1126664 912898 782857 589839
2563 589839 475017 571576 669221 740583 555167 732129 464423 646741 1006129 645940
2553 645940 574872 778455 749892 799365 1135323 1193486 728782 829251 966698 867564 955879
2542 955879 1107769 1212706 1188704 1031481 1177322 934788 1023700 1050013 869966 1029219
2532A029219J44744l4515K3210j1705K57525J08265R0190j6790j55463l82499
2522A052181J92892M32284m23373O7344K21983j21524K03371L25989J00534j85609
2512A866072J21526m9340K58328L84424k66336P9938r1854L92234K68955K90476
2502C254423L53541K24593l2734O51204K74292O42256L85346K05039J25058l27846
2492E755172Q9214M10073J09265j8334J67367L11852M86419P40808P34714M69190
2482I255740K43530M51631P01224R38910R04108R98736J098743J845368J635173
2473A8073163J842149J927117J157367J501215J894814K383409L819418N551555
2465C8150207Q071456J0436274J5398679K2809251J6796362r875926k2139200
$$ plain form
2532 1029219 1173963 1139448 1162658 1150953 1408478 1516743 1606933 1590143 1434680 1052181
2522 1052181 1245073 1677357 1253984 1321328 1543311 1421787 1625158 1951147 2051681 1866072
2512 1866072 1987598 1938258 2196586 2581010 2314674 2394612 2302758 2694992 2963947 3254423
2502 3254423 3607964 3832557 3799823 4451027 4725319 5367575 5752921 5957960 6083018 5755172
2492 5755172 5844386 6254459 6363724 6345390 6512757 6824609 7311028 8051836 8786550 9255740
2482 9255740 9499270 9950901 10652125 11591035 12495143 13493879 14592622 16437990 18073163
2473 18073163 19915312 21842429 22999796 24501011 26395825 28779234 32598652 38150207
2465 38150207 46221663 56657937 72056616 94865867 111662229 101786303 79647103
2458G9647103j6629965j1495831r851781o969852m975582m156691l437592k070436
2450B0059373j671783j582948k014874j624570r20137j525681p14099o98385j089681
2441H217215o59201k49688k50772l01370n70949m28409k32208j14974m78853m79514
2431D451277m59937R5103q9175j17319n19927J2528K2224l45327l16889O9275
2421B801833l3096R0173j26204J25236l10988l68775J36891J58036p56553J96543
2411A913096n9948m0785k68618J64487J51091L2093k16287n00422n3971J48066
2401A268802k12692j98990j20581l46464K10427P4613R0480J30017J74893K74772
2391A345277m17582K29522k91820l91582M75808l12372K978N0807l26342J13404
$$ plain form
2458 79647103 63017138 51521307 41669526 34699674 29724092 25567401 22129809 20059373
2450 20059373 18387590 16804642 14789768 13165198 12245061 10719380 10005281 9306896 8217215
2441 8217215 7558014 7308326 7057554 6756184 6185235 5756826 5524618 5409644 4930791 4451277
2431 4451277 3991340 4086443 3997268 3879949 3360022 3372550 3394774 3049447 2732558 2801833
2421 2801833 2768737 2858910 2732706 2857942 2546954 2178179 2315070 2473106 1716553 1913096
2411 1913096 1853148 1812363 1543745 1708232 1859323 1891416 1675129 1174707 1120736 1268802
2401 1268802 1056110 857120 736539 390075 600502 675115 765595 895612 1070505 1345277
2391 1345277 927695 1157217 865397 473815 949623 637251 640229 691036 364694 478098
2381D78098J00078l2230J76823j58496K01172m63736J62482L2127K851k26255
2371B72914L00743P9001n01657j99180L91860L6014j88594N24787k53386J6969
2361D79471k54218K79701N0184J36972k78318K2516l31474N2703J58403j95128
2351A20812J49864L66274n26958j00481K37379q6297L2773k10259J61582N18401
2341F63090J18156m34221j86003K08245k83934J51266k93657J49879L85577k3481
2331D54917O5250n75007q7927M31107J52364k08031K19589Q4596j62944j6928
2321C56986L0814j12531K2303J33721R5493k49045p679K38274j42706K02160k39223
2310C28567k50068L92412j43013K60947k70388J9591j59111L96934k23437j26238
$$ plain form
2381 478098 578176 545946 722769 564273 765445 301709 464191 496318 499169 272914
2371 272914 573657 652658 151001 -48179 343681 379695 191101 715888 462502 479471
2361 479471 225253 504954 555138 692110 413792 436308 104834 157537 315940 120812
2351 120812 270676 636950 109992 9511 246890 160593 193366 -16893 144689 663090
2341 663090 781246 347025 161022 369267 85333 236599 -57058 92821 478398 454917
2331 454917 520167 -54840 -142767 288340 440704 232673 452262 536858 373914 356986
2321 356986 387800 275269 297572 431293 526786 277741 270062 508336 365630 567790 328567
2310 328567 78499 470911 327898 588845 318457 338048 178937 575871 352434 226196
2300B26196J832j43568J11411J52990j32885j26009M11949l30039j97343o3719
2290h9185K60058j06937J33378N6441K24218l44560K44062k30071j91055L22610
2280B78959J28453r1924J6013k65624k2776N57160K4828m28565K21125L13823
2270G31472m04318l40019K79474J04420n21972K47429o6891M79407l5199k5303
2260D48500L86550k11424J06776K3425l2335Q065j07636r5967j20360J0203r6518
2249C19279m207J40134P3904n97771K40212P6456k91186J62290k28069L4203K33743
2238A58988r5742K37133J47333j63106k81506J60820Q4063k2810m47049K15383
2228f493K71514J07795q1201k55984J67075L02572q2317m08021Q4394j64880j02323
$$ plain form
2300 226196 228028 84460 195871 348861 215976 89967 501916 171877 -25466 -89185
2290 -89185 170873 63936 197314 253755 477973 133413 377475 147404 -43651 278959
2280 278959 407412 315488 331501 65877 43101 600261 625089 196524 417649 731472
2270 731472 327154 -12865 266609 371029 -150943 96486 29595 509002 473803 448500
2260 448500 835050 623626 730402 753827 721492 729557 621921 525954 405594 415797 319279
2249 319279 315072 455206 529110 -68661 171551 248007 -43179 119111 -108958 -74755 158988
2238 158988 63246 300379 447712 284606 3100 163920 247983 225173 -221876 -6493
2228 -6493 265021 372816 291615 35631 202706 505278 422961 14940 99334 -65546 -167869
2217a67869J20802n2970J14065O7527k56168K78512K17855k20615Q7449k68835
2207h0247L22237N9436l51215n8594K10581m01254J23775J54036M60868m02614
2197C7009j65924j78561M1241k2304K61067J61239j3253K09142m05605K2778J1453
2186d1718J12271l50580L71963M40060k95811j40051j54463J60820P9280L43113
2176E24884j93979j56734R0102m37925J02915J19376K31842l17835M427Q810K64074
2165B39957o4628l76149K89795N5606l99699k9658L36012K57786Q5903l6754j59395
2154A98776J31753K94203l7540m91983j83738O0438M21775j53088l32939J84784
2144I2441m5539J4723j5087K81624j68269j93938o5883J34415K18835k6684Q3550
$$ plain form
2217 -167869 -47067 -100037 14028 81555 -174613 103899 321754 101139 188588 -80247
2207 -80247 241990 301426 -49789 -108383 102198 -299056 -175281 -21245 439623 37009
2197 37009 -128915 -307476 -266235 -288539 -27472 133767 120514 329656 -75949 -53171 -41718
2186 -41718 70553 -280027 91936 531996 236185 96134 -58329 102491 181771 524884
2176 524884 330905 174171 264273 -173652 -70737 48639 280481 -37354 -32927 -24117 239957
2165 239957 175329 -200820 88975 144581 -255118 -284776 51236 309022 394925 358171 198776
2154 198776 330529 624732 587192 95209 -88529 -28091 393684 240596 -92343 92441
2144 92441 46902 61625 46538 328162 159893 -34045 -99928 34487 253322 226638 310188
2133C10188j27594J90831p0291J90094J94548m18526j87198m6685j27805r007
2123a01445J158L08611j82745q2426j02851J22131k55569M19543j38999K70358
2113B57766k77170J96092k2341J44582Q7032J99555q66366K31525O94202m27753
2103B17124J09494k56273m71213J23275M03954R8449m90853L40370n0262k98018
2093b73953N55316n5742o0620k90802O8584R1581J54503j69079J42844j78541
2083a5909L30843j69434P2978J42572l62896j85044k55011M63910J92436j21432
2073I3013j53236J86341L32985j80492k2487q7656K55903l81787J17253k19233
2063e9396N3292K38968n07695K8273J98572L50291K23633l05005l46232J79760
$$ plain form
2133 310188 182594 373425 303134 493228 687776 269250 82052 35367 -92438 -101445
2123 -101445 -100287 208324 25579 -56847 -159698 -37567 -293136 126407 -12592 257766
2113 257766 -19404 176688 154347 298929 385961 585516 -280850 -49325 644877 217124
2103 217124 326618 70345 -400868 -277593 126361 224810 -266043 74327 24065 -273953
2093 -273953 281363 225621 165001 -125801 -57217 34364 188867 19788 162632 -15909
2083 -15909 314934 145500 218478 361050 -1846 -186890 -441901 22009 214445 93013
2073 93013 -60223 126118 459103 278611 256124 168468 424371 42584 159837 -59396
2063 -59396 -6104 232864 -274831 -246558 -47986 302305 525938 220933 -125299 54461
2053E4461j16283K60072J40605l04166n7496J82620J92851o0701k27904k14023
2043a49964o932Q8122K66890m0438j56703n7888O9845K12173J7297n65468L230
2032c19836L73643J72345j53208R3003K58961K38435m83739P1300j90830q0797
2022b0723J92808k61472j3697j93625P9322Q0383l39010O14926k42491j18498
2012b22077O0412J23536J79269Q9839k90673j77721K29488l5382J73895k62674
2002a32088K98881K8759l38145K38098J46255k9448n55156R0795J85854O0338
1992e857J87403n4484K90916k75386k93108K37688l65440m2189K85023l59903
1982c95337N14374q4256k1339M8725k72281O4672K00052K9445M8186r0610m08545
$$ plain form
2053 54461 -61822 198250 338855 34689 -22807 159813 352664 291963 64059 -149964
2043 -149964 -156896 -68774 198116 157678 975 -56913 12932 225105 242402 -323066 -319836
2032 -319836 53807 226152 72944 165947 424908 663343 179604 250904 60074 -20723
2022 -20723 172085 -89387 -103084 -296709 -217387 -137004 -476014 138912 -103579 -222077
2012 -222077 -161665 -38129 141140 230979 -59694 -237415 -7927 -43309 130586 -132088
2002 -132088 166793 195552 -142593 95505 241760 212312 -342844 -252049 -66195 -5857
1992 -5857 181546 127062 417978 142592 -150516 87172 -278268 -320457 -35434 -395337
1982 -395337 119037 34781 13442 62167 -210114 -145442 54610 84055 132241 41631 -366914
1971c66914p9811M65306q9268J33922J81726k70919K37277k07338k81028Q6947
1961a90100L37375m52640N61028J28537j157k3061k93122j95458j32900M11716
1951A50218m23259L42235J36110j98189l40365R0676K540N16939l76716j17216
1941b17027J14968N7139n0571k28861N4833J06042K83204j6213j42927L43080
1931C03667K05759n0179o3262l41096p8513K51283j26478K04008k56952k12747
1921a64510M40072k46988j01795K36896k50510k54081j12817L44028M95412l79110
1911F597K80459J99374j01802j810k3540o08563q5149R8547R7363K21679k13919
1900a30764J64153q9038k73200K81074K80259L4890l56045J32092o973Q8292l10353
$$ plain form
1971 -366914 -446725 18581 -70687 63235 244961 -25958 211319 3981 -277047 -190100
1961 -190100 147275 -305365 255663 384200 383043 359982 66860 -128598 -261498 150218
1951 150218 -273041 69194 205304 7115 -333250 -242574 -240034 276905 -99811 -217027
1941 -217027 -102059 -44920 -95491 -324352 -269519 -163477 119727 103514 -39413 303667
1931 303667 509426 459247 395985 54889 -23624 227659 101181 305189 48237 -164510
1921 -164510 275562 28574 -73221 163675 -86835 -340916 -453733 -109705 385707 6597
1911 6597 287056 486430 384628 382818 359278 -249285 -334434 -235887 -138524 83155 -130764
1900 -130764 33389 -55649 -328849 -47775 232484 267374 -88671 43421 36448 124740 -185613
1889a85613J48985J69732j6730l56493L59535j20572j28839R4906J13577K37363
1879C15851l94857K78112k000r8741j41337O101k31717j94759K57381k3017K02245
1868b6738J87271k52689J49438j76545K21616L3294k63033J30909K40441l08620
1858f4656j9503M03605m8941k46219J25501j91414j43555L51581L3630j78976
1848B1053K6047n1107P272R9134r0012k42166J56565K53767k03418k251P0174
1837D5058j8741L12234l09260j18479J5938l52723k13600N73127q2639k79761
1827d28846K02547J69766J19866j35494p5065j28664K20417k28205K74603K48959
1817B39884k51063j64531N8404M2133o3846M3625p676q8749J95622l9076m4443
$$ plain form
1889 -185613 -36628 133104 116374 -240119 119416 -1156 -129995 -35089 78488 315851
1879 315851 -79006 199106 197106 98365 -42972 -36871 -268588 -463347 -205966 -228983 -26738
1868 -26738 160533 -92156 57282 -119263 102353 135647 -127386 3523 243964 -64656
1858 -64656 -84159 319446 270505 24286 149787 -41627 -185182 166399 200029 21053
1848 21053 47100 -4007 3265 102399 12387 -229779 -73214 180553 -22865 -25116 45058
1837 45058 26317 338551 29291 -89188 -73250 -425973 -639573 -66446 -149085 -428846
1827 -428846 -226299 -56533 63333 -72161 -147226 -275890 -55473 -283678 -9075 239884
1817 239884 -11179 -175710 -117306 -75173 -139019 -95394 -103070 -191819 3803 -35273 -79716
1806g9716K89395j70394k49414K29570K93674l43191m68506L42199K44660M7896
1796A36173l41958R6494K96778j32879j09039N098j42969K18177p2529l9308J22202
1785C6240k73992L12723J19875j467n61347K99269J45791n3116j19287K6777r7253
1774a65787P2618K30237K11821m75325l17497L71058k4474o1745P6163J09824
1764B6893l10163K0129J32674K12477j22610M9210L55844p88532N21540K8744
1754A26206j77547j15337k58374M91979j36948K00542l19933P7428K20162K3654
1744A31832R1025j48896l03148K41935K88735j15726P8760k27895M6376O147j62996
1733g3851j91691K83228K45070m88820J68840R7497N9893k90159K89806K96667
$$ plain form
1806 -79716 209679 39285 -210129 19441 313115 -30076 -498582 -156383 88277 136173
1796 136173 -205785 -109291 187487 54608 -54431 -49333 -192302 25875 -46654 -85962 36240
1785 36240 -237752 74971 194846 193379 -367968 -68699 77092 23976 -95311 -68534 -165787
1774 -165787 -93169 137068 348889 -126436 -443933 -72875 -97349 -159094 -82931 26893
1764 26893 -283270 -263141 -130467 82010 -40600 8610 364454 -424078 97462 126206
1754 126206 -51341 -166678 -425052 66927 -70021 130521 -189412 -111984 108178 131832
1744 131832 222857 73961 -229187 12748 301483 185757 264517 36622 82998 89145 -73851
1733 -73851 -265542 17686 262756 -226064 -57224 40273 100166 -189993 99813 396480
1723C96480j05638R9312L587l15686k27929N82401M6325q2315j78985k05498K60363
1712B72417M2575K58771n15870Q0864J80156m58789j9633J21217j48509M32087
1702B45286K29135j80632j00233J8158j65995j4394q6657j83138O51514k28518
1692A84526k30357k15054K89187j29480K13010K57750n50483Q4038m6074M9806
1682i3131K29093o16968J60084O3535l28250K32427M33079K40284K5133l40397
1672D889j20157R5281N6845L03660l70266j72655O038K71311m36854k986k48609
1661f13503P16540k71166k53557N25267p6720k09149J13440K28527l49956k86684
1651d76961k641K49154j13797K70550o5949K97747P6263m18752l577m0641M99862
$$ plain form
1723 396480 290842 390154 393741 78055 -149874 432527 478852 396537 217552 12054 272417
1712 272417 314992 573763 57893 138757 318913 -139876 -159509 -38292 -186801 245286
1702 245286 474421 293789 193556 211714 45719 31325 -55332 -238470 413044 184526
1692 184526 -45831 -260885 28302 -101178 111832 369582 -180901 -96863 -142937 -93131
1682 -93131 135962 -481006 -320922 -257387 -585637 -353210 79869 320153 345286 4889
1672 4889 -115268 -19987 36858 340518 -29748 -202403 -196365 74946 -361908 -364894 -613503
1661 -613503 103037 -168129 -421686 103581 26861 -182288 -68848 159679 -190277 -476961
1651 -476961 -479602 -230448 -344245 -73695 -139644 158103 234366 -184386 -187963 -228604 271258
1640B71258k86990l65993J70012J34254j89191k55337K44748J11983j04771j4357
1630b84384L9843q4865J66622J91584n68153J72465M59540j68748m13450K67589
1620b21957m7424J33038M3891J86820j90457j1263K45617k15674q3524J05461
1610e5472l00570p6944L28627k55820K58528k00129L84359J74224l4121k23231
1600e49j29900N9346M1603J57980P4451k38184L46511o06708k8414N12042k33805
1589d5627l47383M80680O498M1246j22811k20475j44337K87937J90345K5862J66884
1578C18819Q792l82831j40162K33798J3494j7164o10907N05533j75121J11074
1568a34675j84260j95267P70726k23416m06149M72788j03909l11659K64979N2631
$$ plain form
1640 271258 -15732 -381725 -211713 -77459 -266650 -521987 -277239 -165256 -270027 -284384
1630 -284384 -244541 -329406 -162784 28800 -539353 -366888 92652 -76096 -489546 -221957
1620 -221957 -269381 -136343 -92452 94368 -96089 -107352 138265 -77409 -160933 -55472
1610 -55472 -356042 -432986 -104359 -360179 -101651 -301780 82579 256803 222682 -549
1600 -549 -130449 -71103 -29500 128480 202931 -35253 311258 -295450 -323864 188178 -45627
1589 -45627 -393010 87670 94168 135414 12603 -207872 -352209 -64272 126073 151935 318819
1578 318819 327611 -55220 -195382 38416 51910 34746 -576161 -70628 -245749 -134675
1568 -134675 -318935 -514202 256524 33108 -373041 99747 -4162 -315821 -50842 1789
1558A789K0946j2905K5112q8454l11458L23195L32104j56229j96584j67790J67945
1547f2329j43752J65975k92781n3388L36931K9831j03169J33043J36355J94032
1537C40748l45041k12238K63752k34955K94376K57657m75766j27328j02439K13606
1527a27628K63405K57449l23215k86664L01900k31838r5904j9166j79892M27120
1517a4433k92516J43349N22549k26978j53171J0162J53669l3431Q8387j51149
1507D6438J68300k16486K86499k92867m53220L23916R5823K60557k73502J85426
1497A30884J03092j62676k9280O0366r6841L72962m88134J32237L36791j45219
1487B14182l26709m3205j22133j88873K60906M02161O4514j83496M04381j00430
$$ plain form
1558 1789 22735 9830 34942 -53512 -364970 -41775 290329 134100 -62484 -230274 -62329
1547 -62329 -206081 -40106 -332887 -386275 -49344 -19513 -122682 10361 146716 340748
1537 340748 -4293 -216531 47221 -187734 106642 364299 -111467 -238795 -341234 -127628
1527 -127628 135777 393226 70011 -216653 85247 -146591 -242495 -261661 -441553 -14433
1517 -14433 -306949 -163600 358949 131971 -21200 -11038 142631 109200 197587 46438
1507 46438 214738 -1748 284751 -8116 -461336 -137420 -41597 218960 -54542 130884
1497 130884 233976 71300 42020 102386 5545 378507 -109627 22610 359401 214182
1487 214182 -112527 -155732 -277865 -466738 -205832 196329 260843 77347 481728 381298
1477C81298J1208k24691k58523K67668l48335q9224K49236J1933J25142k01724
1467g6012L86028k62146M96630l33883l02161k3779j84425N45183M11779M3103
1457G00317k14931l68744q9500m3017J82170l64162L19840M5927J05093k02684
1447G0309l27161J0549K88530J36930j54160q22L2442J27534j61896l25872k63704
1436e67321P53476K88313m36706J78121N2936K90485j28136l14720k9999j97348
1426a10899J53779J64072Q8896j57537J8087n6814q5586j22301j29571K66274
1416B8400k63164l47059L13828j13056L57209L13546m22511j33942K6556k43992
1406d84185J81433N88107o578j83899k22053J79021j19650Q5741M66433k31991
$$ plain form
1477 381298 392506 167815 -90708 176960 -171375 -260599 -11363 570 125712 -76012
1467 -76012 310016 47870 544500 210617 -91544 -115323 -299748 245435 657214 700317
1457 700317 485386 116642 27142 -15875 166295 -197867 121973 167900 272993 70309
1447 70309 -256852 -246303 42227 179157 24997 24175 56617 184151 22255 -303617 -567321
1436 -567321 186155 474468 37762 215883 268819 559304 431168 116448 86449 -110899
1426 -110899 42880 206952 295848 138311 156398 99584 13998 -108303 -237874 28400
1416 28400 -234764 -581823 -267995 -381051 -23842 289704 -132807 -266749 -240193 -484185
1406 -484185 -302752 285355 278777 94878 -127175 51846 -67804 17937 484370 252379
1396B52379l56425j07759J1562J10304K20868k8967j30357P3426r8223J33706
1386H0514J29151m9384o7109j41569K0755J50770N4913Q7343k28688J37207j22621
1375E1282R1980k38792l5250N0942L5601L5422O1697j21702m11759N9345l7608
1364d58842M18313M4286L50209n9065J02386m69140J3272L25888p9094l64100
1354a75887J72102k3466Q5873j05590j24200J32120M1070l51933L0563O54818
1344C35470j95751j42525l48447L29653j47650j75213R2038N31553k91311l11813
1334c23996Q2968q8647J26225k82551K95988P2298J99231k84281K63810n5227
1324E818q3369k37518L32857L1516j24290K41037n2137m75115O030L73448M3692
$$ plain form
1396 252379 -104046 -211805 -200243 -89939 130929 101962 -28395 45031 -53192 80514
1386 80514 209665 160281 93172 -48397 -27642 123128 178041 265384 36696 173903 51282
1375 51282 143262 -95530 -130780 -79838 -44237 -8815 52882 -68820 -480579 -421234 -458842
1364 -458842 -40529 3757 353966 294901 397287 -71853 -58581 267307 188213 -175887
1354 -175887 -3785 -27251 58622 -46968 -171168 -39048 2022 -349911 -319348 335470
1344 335470 139719 -2806 -351253 -21600 -169250 -344463 -252425 279128 -12183 -323996
1334 -323996 -241028 -329675 -203450 -486001 -190013 -117715 81516 -202765 61045 5818
1324 5818 -77551 -315069 17788 49304 -74986 166051 113914 -361201 -355171 18277 61969
1313F1969k52717J88255K57624l67526j19075K15527J75001O8598O249r8070k48853
1302a13018K39903n2130P6880J3882Q8553j28675k87028j60894L2384o4953K99262
1291e5834M93880O4905k64209m79948j58601K60122l2805m85050M79189m1044
1281b19395k9956K53148k9560P9432J80859k30582q9204j67441n2731n6269J91978
1270a69721J37260O6697m61383K80943K8314J06099J14778J17381k21562R0441
1260H9247p1790j27598k29734l0227K19783k16736K43864J1485M29328k66868
1250E0754L92620P1568l32239j2717m62527J10212O7029L31614j75202Q7214k37755
1239a09429N6362j5490J95115k1519j565J13309j65969k21670K2373N07477n74636
$$ plain form
1313 61969 -190748 -2493 255131 -112395 -231470 -15943 159058 227656 233905 135835 -113018
1302 -113018 126885 74755 151635 165517 254070 125395 -161633 -322527 -290143 -355096 -55834
1291 -55834 438046 502951 238742 -241206 -399807 -139685 -172490 -657540 -178351 -219395
1281 -219395 -249351 3797 -25763 53669 234528 3946 -85258 -252699 -305430 -361699 -169721
1270 -169721 -32461 34236 -427147 -146204 -117890 -11791 102987 220368 -1194 89247
1260 89247 17457 -110141 -339875 -370102 -150319 -367055 -123191 -111706 317622 50754
1250 50754 443374 514942 182703 169986 -292541 -182329 -115300 216314 41112 128326 -109429
1239 -109429 -53067 -68557 126558 105039 103474 216783 50814 -170856 -148483 358994 -215642
1228b15642j58848L16581n2245J08318q2349k11483n5541m0655M64799j24322
1218e1387M4004q1728o6484L66613k97491k07119M68342K66330j41146k95390
1208D544J07543k12479J43301j18389J91703j3132k4602M7092K58386l49341j86784
1197a52158j8740J37220J20600n11562J7823N76895j64891o8241R1979J40170
1187A69095M2801J31796l57210o46660Q91549j76638j85426J06736K38680q2634
1177A32089m34624M40638l14799K04738j2817k79126L34557m28073J32959K06496
1167a7962p1478k06154L72586m17243M20129J60056k29808J56459l27145k66530
1157d27090M15993J23281P1496j56525l89252J09137M57327k65971k3339L9826
$$ plain form
1228 -215642 -374490 -57909 -110154 -1836 -84185 -295668 -351209 -391864 72935 -51387
1218 -51387 -7383 -89111 -155595 211018 -86473 -293592 174750 441080 299934 4544
1208 4544 112087 -100392 42909 -75480 116223 103091 78489 125581 383967 34626 -152158
1197 -152158 -170898 -33678 86922 -424640 -406817 170078 5187 -63054 28925 169095
1187 169095 211896 343692 -13518 -660178 231371 54733 -130693 -23957 214723 132089
1177 132089 -302535 138103 -176696 28042 15225 -263901 70656 -357417 -224458 -17962
1167 -17962 -89440 -295594 76992 -340251 79878 239934 10126 166585 -160560 -427090
1157 -427090 -11097 112184 183680 27155 -362097 -252960 204367 -61604 -84943 -45117
1147d5117l9232j68023L12768K84359j2090k54006M9504P6134m76514K63280J18036
1136A09099J89871m67685J55130P489J88164J30392K02609m78977j75119L15983
1126A76956j25255k46462L23397q2969q2834J48563j79486K98864m10406M6746
1116a32886j35357K44052J75646k79918J37699J47539l75398J44599K08626j16331
1106A8271j13332o0845J56507j6371k99794L49511j68008R4485o5291J83602j81280
1095a02545J12914L6781J86804J82547j31932J10111m89767l7559J97165q7717
1085b3198O0799N8514l15998L19215j72237R6515j98004J94572M799K25263j81139
1074F9101j75884k18492L03881K66K25620L99352k62871k26913k95386L54182
$$ plain form
1147 -45117 -84349 -252372 60396 344755 332665 78659 128163 204297 -272217 -8937 109099
1136 109099 298970 -168715 -13585 -6096 182068 312460 515069 36092 -139027 176956
1126 176956 51701 -194761 128636 45667 -37167 111396 -68090 230774 -179632 -132886
1116 -132886 -268243 -24191 151455 -128463 9236 156775 -218623 -74024 134602 18271
1106 18271 -95061 -155906 601 -15770 -315564 33947 -134061 -39576 -104867 78735 -102545
1095 -102545 10369 47150 233954 416501 284569 394680 -95087 -132646 64519 -23198
1085 -23198 37601 96115 -219883 99332 -72905 23610 -174394 20178 24977 250240 69101
1074 69101 -106783 -325275 -21394 -21128 204492 603844 340973 114060 -181326 172856
1064A72856J32857j40825M9867J55779l64531j91911p1638M09598J9779K27588
1054C99419k30892k42564K28226o8560j0412k19397L00226q1626Q5828m1812j23847
1043e411p9702q4307K45331l13023M81395k17198j80369K32581j87781L50768
1033B42284p3632m6763J29320O7881l29200l53144l8489K42809K1830L87906m59027
1022b08225K42769l6540M76374l27851j19180q5478p6141J57007n5010Q4560o00310
1011e48025N33846j1176l7367J00857J02819k00703J82460L05094n55930J73857
1001D5732k08230J62745q3369K05013J6032k82452K37638k56904J92009K32957
991B61171m87809J00793J43378p5692j85220M41560J78682l41607K22673k87876
$$ plain form
1064 172856 305713 164888 214755 370534 6003 -185908 -257546 152052 171831 399419
1054 399419 168527 -74037 154189 85629 75217 -144180 156046 74420 160248 118436 -5411
1043 -5411 -85113 -169420 75911 -237112 244283 27085 -153284 79297 -108484 242284
1033 242284 168652 121889 251209 319090 -10110 -363254 -401743 -158934 -137104 250802 -208225
1022 -208225 34544 -1996 474378 146527 27347 -58131 -134272 22735 -32275 52285 -548025
1011 -548025 -14179 -25355 -62722 38135 140954 -59749 122711 427805 -128125 45732
1001 45732 -162498 247 -83122 121891 137923 -144529 93109 -163795 28214 261171
991 261171 -226638 -125845 17533 -58159 -243379 198181 376863 35256 257929 -29947
981b9947Q9418l07596J10021J24066K820j93781K19362l99882j40064R0048L73402
970f2133O1561p9610k82751K79133L16417l17246k06462l0155Q1477M07265j06020
959F1476j18142p0930L57138N9163l58008L57364j03202k05310j00270L69820
949B49099J57549j04006k36360l17152q0590N10028q9017K49921m67896L2492
939i5932N5184L99173L7112k72763k33267j61652K61994J3017j30256P3482M3505
928a0403LK68272j47919J52691m29830J54603M12696j61949l82677j0100k14008
917c68621K80675L82372k93730j65928K5500J67375L12201k24688l38508R0957
907a32395J39036j22560k18289R0189o769p1317J67648j34197K76179K466k42011
$$ plain form
981 -29947 59471 -248125 -138104 -14038 -11218 -204999 14363 -385519 -525583 -435535 -62133
970 -62133 -572 -80182 -362933 -83800 232617 -84629 -291091 -321246 -239769 167496 61476
959 61476 -56666 -127596 229542 288705 -69303 288061 184859 -20451 -120721 249099
949 249099 406648 302642 66282 -250870 -331460 178568 89551 339472 -128424 -95932
939 -95932 -40748 358425 395537 122774 -110493 -272145 -10151 2866 -127390 -53908 -10403
928 -10403 -10400 257872 109953 262644 -167186 -12583 400113 238164 -144513 -154613 -368621
917 -368621 -87946 294426 696 -165232 -139732 27643 339844 115156 -223352 -132395
907 -132395 6641 -115919 -334208 -244019 -250788 -322105 -154457 -288654 -12475 -10009 -252020
896b52020k2635L35075J64889j03761l67902J63434p9328K47232J19957k81802
886g6861J15052O9588j35344J28467r9437k98708K26596N2326j03880J49018k2869
875C948J79609J11296j46470J58472l64722k60807Q224K19659J65181k48146J98526
864B4770l9184M3994r1194k42086J09662O06960j50013J7424j70089j40984J15904
853H5164J61464K61873J21690j13634p51217j16458M57231j2674l22579k62513
843d91653M72597N62122n8788j79230l79191m09188P5863R1048j34218N13721
833F3083l33633N24014m98927k3600j03052k2041L23135J26718k87897M53168
823B20968J05011k53745K3481q1640k965k7634J69637o0723N2340J11307j57611
$$ plain form
896 -252020 -274655 60420 225309 121548 -246354 -82920 -162248 84984 204941 -76861
886 -76861 38191 107779 -27565 100902 1465 -297243 -70647 -18321 -122201 26817 3948
875 3948 183557 294853 148383 306855 -57867 -318674 -310450 -90791 74390 -173756 24770
864 24770 -14414 29580 -61614 -303700 -194038 412922 262909 280333 110244 -30740 85164
853 85164 246628 508501 630191 516557 -234660 -351118 106113 93439 -229140 -491653
843 -491653 -19056 543066 484278 305048 -74143 -483331 -407468 -316420 -450638 63083
833 63083 -270550 253464 -245463 -269063 -372115 -394156 -71021 55697 -232200 220968
823 220968 325979 72234 95715 14075 11110 -16524 153113 92390 144730 256037 98426
812I8426n0695N2478l34861L23287k95580j60859P4070J49913N31726j48184k97609
801e7888k23229J35817l8123j07869N47888n1929j54711m4393K8580j06285L30645
790B58503k43462k41426M4897J56574L10672j00798j23734J23600r0429k01141
780a06744K91774k00650j56432j15926L75947K13164j352m1627l18743q3311L06255
769A62355K09977k11129K34780k33924j32911j35122m202k5059k20589N10429
759A54605j21002L6200l93490K84770J0375r6886J32765j4246n854K62494R3930
748C43661j39745j24528P0506K90155n09752J83370j66626J7785J56814j44582
738b2942m2338L09547K21711m97209L13070k4157k63224J17905K52417r3922m8979
$$ plain form
812 98426 47731 100209 -234652 88635 -206945 -367804 -293734 -143821 387905 239721 -57888
801 -57888 -281117 -145300 -183423 -291292 256596 204667 49956 5563 34143 -72142 258503
790 258503 15041 -226385 -181488 -24914 285758 184960 61226 184826 94397 -106744
780 -106744 185030 -15620 -172052 -287978 87969 301133 299781 258154 -60589 -143900 162355
769 162355 372332 161203 395983 162059 29148 -105974 -110176 -135235 -355824 154605
759 154605 33603 69803 -323687 -38917 -28542 -125428 7337 -6909 -12763 249731 343661
748 343661 203916 79388 149894 440049 -69703 113667 -52959 -35174 121640 -22942
738 -22942 -65280 244267 465978 -31231 281839 257682 -5542 112363 364780 270858 221879
727B21879O4215k12163o5478q9301j39944n1084j07536K25439K21748k76841P0912
716a38154j32704P8196J70400j36510J96519L14293o0958R6972o869k77011l9338
705F4836J9058p7637j31827J6584J79785K05370j58190n8206j08532m6629k89030
694c84418k9885K35527R2023J49978J31324k49363J26780O52908l19788o06459
684b01373j89076K78777n8886q8926N1574L39077k93735j92061L69815j40562
674a25376j970l0861K26096L25809j22651k72726L93433j34870J8692k93798k03977
663b22199k16864J32379J15469j17997L97298j3656L50573k01226L85114m39183
653A69708n19658P9839K67261J039J08695j74997J64876L7851j9236k1200M8410
$$ plain form
727 221879 286094 73931 8453 -80848 -220792 -271876 -379412 -153973 67775 -209066 -138154
716 -138154 -270858 -192662 -22262 -158772 37747 352040 291082 388054 381185 104174 64836
705 64836 83894 6257 -125570 -108986 70799 276169 117979 59773 -48759 -95388 -384418
694 -384418 -414303 -178776 -86753 63225 194549 -54814 71966 724874 405086 -201373
684 -201373 -390449 -111672 -170558 -259484 -207910 131167 -162568 -354629 15186 -125376
674 -125376 -127346 -158207 67889 393698 271047 -1679 391754 256884 275576 -18222 -222199
663 -222199 -439063 -306684 -191215 -309212 88086 74430 425003 223777 608891 169708
653 169708 -349950 -270111 -2850 -1811 106884 -68113 96763 134614 115378 94178 142588
642A42588O8069P3466k60133l48802J23445r964R9949M52791k01961J11222j00095
631A50575k64982J38834j78223J46044r5218j28563L11317k76125l1317j23573
621c51231L94253j21349L33246j33652o8680L21046o1620k3850r9393L4650J03135
610C26555M4713j24012O5800n824l43241k51733J25636O2109L04946k55886J1792
599c9145l53547N81471q2003J85318l18304m4421L69921j70668L21848K24776
589F75246l98389m3305K01845l74087j44964j32588P8323L26330N7176l80183
579a34596J557M35777l9370l80653L6425J10095r4034J76242n8302L04046k96036
568F1151O56186l16148o94652P2808J90671k84492J32069L12306k82375L4293
$$ plain form
642 142588 210657 284123 23990 -324812 -201367 -211331 -111382 341409 139448 250670 150575
631 150575 -114407 24427 -153796 -7752 -102970 -231533 79784 -196341 -227658 -351231
621 -351231 43022 -78327 254919 121267 52587 373633 312013 288163 188770 223420 326555
610 326555 371268 247256 313056 307232 -36009 -287742 -162106 -99997 204949 -50937 -39145
599 -39145 -392692 188779 106776 292094 -26210 -70631 299290 128622 450470 675246
589 675246 276857 233552 435397 61310 -83654 -216242 -137919 188411 245587 -134596
579 -134596 -133039 302738 263368 -117285 -80860 29235 -64799 111443 53141 357187 61151
568 61151 717337 401189 -293463 -220655 -29984 -314476 -182407 129899 -152476 -118183
558a18183Q8447L26332l49974J96912j67131L5355R0031j60499k86891L73870
548B8269r6952M5498J26657j16329K7963k96686J46486J79348j11862K50302q7917
537I4777p2672M2649l02518K94107l65561j53648K86245K79054k19442Q4844M8483
526A6318m1595J45765k94669J91757l4483K19632l0843k51170J78304j67292R0978
515B2702n138k8110n4777l8118k2791J06882L5249k4836L41485o75980k77955
504f21387N31403J94509j99660l3540J09187k71581L5242J13114k16610J97599
494a61724J33473o0997j17127N24116j47781J2598k76179j58890M67176l84436
484a69771K80657j7220k51035j93071M06372L7604J43208j27390r0353k12543
$$ plain form
558 -118183 -29736 296596 -53378 143534 -23597 11758 101789 -58710 -345601 28269
548 28269 -68683 -23185 103472 -12857 15106 -281580 -135094 44254 -67608 182694 94777
537 94777 22105 64754 -237764 56343 -309218 -462866 -176621 102433 -117009 -32165 16318
526 16318 -25277 120488 -174181 17576 -16907 202725 171882 -79288 99016 -68276 22702
515 22702 17564 -10546 -65323 -103441 -126232 -19350 15899 -8937 332548 -343432 -621387
504 -621387 -89984 104525 -95135 -128675 -19488 -291069 -255827 -142713 -359323 -161724
494 -161724 -28251 -89248 -206375 317741 169960 182558 -93621 -252511 214665 -169771
484 -169771 110886 93666 -157369 -350440 55932 93536 236744 109354 19001 -193542
474a93542J60694R5475J89835k21526k71199J20916N66103j49626n35653K17813
464b0710l3558n1607J36296q8944j26457L45132k59485k69067M76616m33754L5735
453b89803J14809K09362J39318N273l0288J13666O4709l5596P2209m71553M6266
442f1628j12217J43271k95039J7378o0127N17245j09524k03729M2418o0037M585
431a77404j54770J32900K15059L40036n19813K63525K6529r8323m2539L4311J89598
420B09109L90988k51119m92380K39421Q8960j03134r8784L09312k64842R0089
410A17620j66077j16641L19722j84908r2414L36923m0742k02200j21537k95138
400d45392K72682K66521o31222L57331M56093k3121k89361m5966p4670p113j713
$$ plain form
474 -193542 -32848 62627 252462 30936 -240263 -119347 446756 297130 -238523 -20710
464 -20710 -54268 -105875 30421 -58523 -184980 160152 -99333 -368400 108216 -325538 -289803
453 -289803 -174994 34368 173686 178959 148671 262337 327046 291450 363659 -107894 -61628
442 -61628 -173845 -30574 -325613 -308235 -368362 148883 39359 -164370 -121952 -181989 -177404
431 -177404 -332174 -199274 15785 355821 -163992 99533 126062 27739 -14800 19511 209109
420 209109 600097 348978 -143402 96019 184979 81845 -16939 292373 27531 117620
410 117620 -48457 -165098 154624 -30284 -122698 214225 173483 -28717 -150254 -445392
400 -445392 -172710 93811 -537411 -180080 276013 252892 -36469 -82435 -157105 -164218 -165931
389a65931J20489j35744J05791J77626l93301Q5832l2888M00678J24294n20807
379b33961j26228J32206M47945k64142J97061J52935r4875J17702k69789l49401
369b90547M1834L2324L98536n59563J62991J40627o8485k32689L15476J33540
359G4044o540r3209j09847l3802j14832J71336q6462k02745n4074r2894K48058
348c00967K52291p1692j19722J18380K22054k18780r9217n9289J02258K65O4076
337a10343J11242N4432k91740K78443L09579j48816J08327j16772j91854j15337
327a12839j87874Q8002N657r3109J22813N40289j77583j6440P6021J22523o00937
316b33477l29152J53774K43746K98428k5445j61705J78101J45538j92135m08253
$$ plain form
389 -165931 -45442 -181186 -75395 102231 -291070 -205238 -238126 162552 286846 -233961
379 -233961 -360189 -227983 219962 -44180 152881 305816 210941 328643 58854 -290547
369 -290547 -248713 -216389 182147 -377416 -214425 -73798 -142283 -374972 -59496 74044
359 74044 67504 -25705 -135552 -169354 -284186 -112850 -199312 -402057 -456131 -549025 -300967
348 -300967 -48676 -120368 -240090 -121710 100344 -118436 -217653 -276942 -174684 -174419 -110343
337 -110343 899 55331 -236409 42034 351613 202797 311124 194352 2498 -112839
327 -112839 -300713 -212711 -207054 -300163 -177350 362939 185356 168916 244937 367460 -233477
316 -233477 -562629 -408855 -165109 133319 107874 -53831 124270 269808 77673 -330580
306c30580j8820J47204l7254k5676O0895K28559K74279l29590K10406j71639l46076
295c38292J07941K13071J02020R6597J39069K4645q9062J3659k22687l2435J35869
284A50395M6256l43564l00382k2896L31227J69922R4881l19578J22277l70153
274d41615p5418M21652j54020J82504K205j75739k00277K1401L57580l2771J08524
263A4026j85456j3919o5458m0336L55687r9464q156K30879k2643J12576r2049
252A85687j71559j03936k1403k07794O8556K60575k40681J74441L21240J38307
242D03433p5704m14601j14918L44949l11664K46231l93288N2529M93410l59177
232a28800l09035K81076q5135K56336l0243N354k08224M6735K751N3766j60911
$$ plain form
306 -330580 -349400 -202196 -239450 -265126 -204231 24328 298607 -30983 179423 7784 -338292
295 -338292 -230351 -17280 84740 181337 320406 345051 255989 269648 46961 14526 150395
284 150395 196651 -146913 -447295 -470191 -138964 30958 125839 -193739 -71462 -441615
274 -441615 -517033 -95381 -249401 -66897 -64692 -240431 -440708 -419307 -61727 -94498 14026
263 14026 -171430 -185349 -250807 -291143 64544 -34920 -43076 187803 165160 277736 185687
252 185687 14128 -89808 -111211 -319005 -250449 10126 -230555 -56114 265126 403433
242 403433 327729 -86872 -201790 143159 -168505 77726 -315562 -263033 230377 -128800
232 -128800 -437835 -156759 -241894 14442 -15801 -10447 -218671 -171936 -169185 -115419 -276330
221b76330L09474M0212k68855K13588k36856J37250J96845j83597n6156j36868
211b61293Q7537L6546L8000R0043j44546j8135J78416j6875o2371J09417j57231
200a20492K97289k05455r4395k13471K80021r5301J34513J10255m9060k70031
190b26127j13140J06553J53244J6450k55631j95496j52746L73712O3964j44515
180c73732j42726M3894K80292j8633L38786r0366j27703J17357k25151R2544K5132
169h0306J49102j3420J00318j6134l40649k288K49646K41525j39401l19911n1549
158b23067n7555K28309N3574L2531P9591j69271j36249j03813M48211J76834n94632
147b65537K73968o7675j16498K28338k5940k39154K85320q7959r1371n1033J0390
$$ plain form
221 -276330 33144 73356 -195499 18089 -218767 -81517 115328 -68269 -124425 -261293
211 -261293 -173756 -137210 -99210 -9167 -153713 -171848 6568 -10307 -72678 36739 -120492
200 -120492 176797 -28658 -123053 -336524 -56503 -151804 -17291 92964 43904 -226127
190 -226127 -339267 -232714 -79470 -63020 -318651 -514147 -666893 -293181 -229217 -373732
180 -373732 -516458 -472564 -192272 -210905 127881 37515 -90188 27169 -197982 -105438 -80306
169 -80306 68796 55376 155694 139560 -201089 -203377 46269 287794 148393 -171518 -223067
158 -223067 -280622 -52313 1261 33792 113383 -55888 -192137 -295950 152261 329095 -265537
147 -265537 8431 -59244 -175742 52596 26656 -212498 72822 -15137 -106508 -157541 -147151
136a47151n1543K09383J69524j91153K4915j23661J44811p5915m11892K29409
126b23273K26220J51795q3597k81560k4333K25234K43620l21436J24913q9054
116e1471j23620j22381J84429p4934l65517M60872j26979k8626K69154j06698
106h5771J06917O522n08128J86185K56757K60852m274l01272J69667m7807o6219
95b6571j49305J47284o087j10147j39134J10574J56503J15727M2375j09617Q1782
84A13384n5024P5410R3533j40846m41954M07298p2498o7436R2636O557J00743
73A11803l02009L6326j51207k18992L85722J64243r0598j47516j8924k0611L4170
62b17593Q6484L7714K63280o9477l86977J79795J21772j86266j43099K8538j28145
$$ plain form
136 -147151 -198694 10689 180213 -10940 13975 -109686 35125 -40790 -452682 -223273
126 -223273 2947 154742 71145 -210415 -234748 -9514 234106 -87330 37583 -51471
116 -51471 -175091 -297472 -113043 -187977 -553494 -92622 -219601 -248227 20927 -85771
106 -85771 21146 27668 -480460 -294275 -37518 223334 219060 -82212 87455 39648 -26571
95 -26571 -175876 -28592 -34679 -144826 -283960 -173386 -16883 98844 141219 31602 113384
84 113384 58360 133770 227303 86457 -355497 51801 -20697 -88133 4503 11060 111803
73 111803 -190206 -153880 -305087 -524079 -138357 25886 -64712 -212228 -231152 -251763 -217593
62 -217593 -131109 -93395 169885 100408 -286569 -106774 14998 -171268 -314367 -285829 -413974
51d13974M4167o2985M22410Q7015j83147Q6364j41333j3772O7810J49509l09321
40b67257p3417K01827J19858q3816j87460J82569K21005p1052n5752Q207l1225
29c6513N0220r8427l04267J76073O618r229m9346J80717j287L17801k53792R4201
17G2769k6678p620j85756n151R3041K23520l06332l3578J1291m9063J03412j428
5a11573J01935j89495p0874L16769P0381
0A17143
$$ plain form
51 -413974 -369807 -432792 -10382 76633 -106514 -20150 -161483 -175255 -107445 42064 -267257
40 -267257 -340674 -138847 -18989 -102805 -290265 -107696 113309 42257 -13495 -5288 -36513
29 -36513 13707 -84720 -388987 -212914 -206296 -215525 -264871 -84154 -85441 232360 -21432 72769
17 72769 46091 38471 -147285 -152436 -59395 164125 -142207 -175785 -164494 -213557 -110145 -111573
5 -111573 -9638 -199133 -270007 46762 117143
0 117143
$$ Imaginary data points
##PAGE= N=2
##DATA TABLE= (X++(I..I)), XYDATA
16383c407721J15883j26954J92065J87615j40664J22695J51608K0765J68384l31783
$$ plain form
16383 -3407721 -3291838 -3418792 -3226727 -3039112 -3179776 -3057081 -2905473 -2884708 -2716324 -3048107
$$ [...]
##END NTUPLES=NMR SPECTRUM
##END=
