##TITLE=1H_CG-1207-2
 CDCl3
 8 sc, 
 25.7.2024
##JCAMPDX= 6.0         $$ Bruker NMR JCAMP-DX V2.0
##DATA TYPE= NMR SPECTRUM
##DATA CLASS= NTUPLES
##ORIGIN= UXNMR, Bruker Analytische Messtechnik GmbH
##OWNER= root
$$ XWIN-NMR		Version 3.5
$$ Thu Jul 25 13:43:31 2024 Russian Standard Time (UT+4h)  she@DPX200
##.OBSERVE FREQUENCY= 200.1315
##.OBSERVE NUCLEUS= ^1H
##.ACQUISITION MODE= SIMULTANEOUS
##.ACQUISITION SCHEME= undefined
##.AVERAGES= 8
##.DIGITISER RES= 18
##SPECTROMETER/DATA SYSTEM= spect
##.PULSE SEQUENCE= zg30
##.SOLVENT NAME= D2O
##.SHIFT REFERENCE= (INTERNAL, D2O, 0, 20.4508)
##AUDIT TRAIL= $$ (NUMBER, WHEN, WHO, WHERE, WHAT)
$$ ##TITLE= Audit trail, XWIN-NMR		Version 3.5
$$ ##JCAMPDX= 5.01
$$ ##ORIGIN= Bruker BioSpin GmbH
$$ ##OWNER= she
$$ F:/spectra/data/she/nmr/H-F/1/pdata/1/auditp.txt
$$ ##AUDIT TRAIL=  $$ (NUMBER, WHEN, WHO, WHERE, WHAT)
(   1,<2024-07-25 13:41:54.79 +0400>,<she>,<DPX200>,
      <created by zg, POWCHK disabled, PULCHK disabled
       configuration hash MD5:
       00 E9 B6 7A A2 85 ED C7 34 08 36 98 17 FE 4E 26
       data hash MD5: 16K
       27 5C 16 1C D4 A7 60 F5 77 3E A2 C8 7D C8 E6 CA>)
(   2,<2024-07-25 13:42:00.15 +0400>,<she>,<DPX200>,
      <Start of raw data processing
       efp BC_mod = 2 LB = 0.24 FT_mod = 6 PKNL = 1 PHC0 = -25636.23 PHC1 = 12.98749 SI = 16K 
       data hash MD5: 16K
       D1 ED 3C 4C A6 42 91 C6 59 F7 09 62 4B BB 46 1A>)
(   3,<2024-07-25 13:42:23.35 +0400>,<she>,<DPX200>,
      <pk PHC0 = 2.892552 PHC1 = -3.599999 
       data hash MD5: 16K
       F1 68 90 9A 98 1C 7C 7E 12 7D 95 8C AF 48 B3 3B>)
(   4,<2024-07-25 13:42:26.45 +0400>,<she>,<DPX200>,
      <abs ABSG = 5 
       data hash MD5: 16K
       71 F7 E5 15 6A 64 54 1A 11 03 CD 5C 38 1F 3C 21>)
$$ ##END=
$$ 
$$ hash MD5
$$ A8 AC 6B 23 52 EF 51 05 BC 1A D6 91 4F 3C 78 B7
##$RELAX= 
##$RELAX= 
##$RELAX= 
##$RELAX= 
##$RELAX= 
##$RELAX= 
$$ Bruker specific parameters
$$ --------------------------
##$DU= <F:/spectra>
##$EXPNO= 1
##$NAME= <H-F>
##$PROCNO= 1
##$TYPE= <nmr>
##$USER= <she>
##$AMP= (0..31)
100 100 100 100 100 100 100 100 100 100 100 100 100 100 100 100 100 100 
100 100 100 100 100 100 100 100 100 100 100 100 100 100 
##$AQSEQ= 0
##$AQ_mod= 1
##$AUNM= <au_zg>
##$AUTOPOS= <>
##$BF1= 200.13
##$BF2= 200.13
##$BF3= 200.13
##$BF4= 200.13
##$BF5= 200.13
##$BF6= 200.13
##$BF7= 200.13
##$BF8= 200.13
##$BYTORDA= 1
##$CFDGTYP= 0
##$CFRGTYP= 5
##$CHEMSTR= <none>
##$CNST= (0..31)
1 1 145 1 1 1 1 1 1 1 1 1 1 1 1 1 1 1 1 1 1 1 1 1 1 1 1 1 1 1 1 1 
##$CPDPRG= <>
##$CPDPRG1= <>
##$CPDPRG2= <>
##$CPDPRG3= <>
##$CPDPRG4= <mlev>
##$CPDPRG5= <mlev>
##$CPDPRG6= <mlev>
##$CPDPRG7= <mlev>
##$CPDPRG8= <mlev>
##$CPDPRGB= <>
##$CPDPRGT= <>
##$D= (0..31)
0 1.2 0 0 0 0 0 0 0 0.06 0 0.03 0 0 0 0 0.0002 0 0 0 0 0 0 0 0 0 0 0 0 
0 0 0 
##$DATE= 1721900514
##$DBL= (0..7)
120 120 120 120 120 120 120 120 
##$DBP= (0..7)
150 150 150 150 150 150 150 150 
##$DBP07= 0
##$DBPNAM0= <>
##$DBPNAM1= <>
##$DBPNAM2= <>
##$DBPNAM3= <>
##$DBPNAM4= <>
$$ [...]
##$SUBNAM3= <"">
##$SUBNAM4= <"">
##$SUBNAM5= <"">
##$SUBNAM6= <"">
##$SUBNAM7= <"">
##$SUBNAM8= <"">
##$SUBNAM9= <"">
##$SW= 24.0689530833862
##$SWIBOX= (0..15)
0 0 2 0 0 0 0 0 0 0 0 0 0 0 0 0 
##$SW_h= 4816.95568400771
##$TD= 16384
##$TD0= 1
##$TE= 0
##$TE2= 300
##$TE3= 300
##$TEG= 300
##$TL= (0..7)
0 120 120 120 120 120 120 120 
##$TP= (0..7)
150 150 150 150 150 150 150 150 
##$TP07= 0
##$TPNAME0= <>
##$TPNAME1= <>
##$TPNAME2= <>
##$TPNAME3= <>
##$TPNAME4= <>
##$TPNAME5= <>
##$TPNAME6= <>
##$TPNAME7= <>
##$TPOAL= (0..7)
0.5 0.5 0.5 0.5 0.5 0.5 0.5 0.5 
##$TPOFFS= (0..7)
0 0 0 0 0 0 0 0 
##$TUNHIN= 0
##$TUNHOUT= 0
##$TUNXOUT= 0
##$USERA1= <user>
##$USERA2= <user>
##$USERA3= <user>
##$USERA4= <user>
##$USERA5= <user>
##$V9= 5
##$VALIST= <valist>
##$VCLIST= <CCCCCCCCCCCCCCC>
##$VD= 0
##$VDLIST= <DDDDDDDDDDDDDDD>
##$VPLIST= <PPPPPPPPPPPPPPP>
##$VTLIST= <TTTTTTTTTTTTTTT>
##$WBST= 1024
##$WBSW= 4
##$XGAIN= (0..3)
0 0 0 0 
##$XL= 0
##$YL= 0
##$YMAX_a= 954835
##$YMIN_a= -933397
##$ZGOPTNS= <>
##$ZL1= 120
##$ZL2= 120
##$ZL3= 120
##$ZL4= 120
##$ABSF1= 20.47033
##$ABSF2= -3.598827
##$ABSG= 5
##$ABSL= 3
##$ALPHA= 0
##$AQORDER= 0
##$ASSFAC= 0
##$ASSFACI= 0
##$ASSFACX= 0
##$ASSWID= 0
##$AUNMP= <proc_1d>
##$AZFE= 0.1
##$AZFW= 0.1
##$BCFW= 0
##$BC_mod= 2
##$BYTORDP= 0
##$COROFFS= 0
##$CY= -3
##$DATMOD= 1
##$DC= 0
##$DFILT= <>
##$DTYPP= 0
##$F1P= 0
##$F2P= 0
##$FCOR= 1
##$FTSIZE= 16384
##$FT_mod= 6
##$GAMMA= 0
##$GB= 0
##$INTBC= 1
##$INTSCL= 3.70164e-10
##$ISEN= 128
##$LB= 0.24
##$LEV0= 0
##$LPBIN= 0
##$MAXI= 10000
##$MC2= 0
##$MEAN= 0
##$ME_mod= 0
##$MI= 1.114404
##$NCOEF= 0
##$NC_proc= -5
##$NLEV= 6
##$NOISF1= 3.799351
##$NOISF2= 2.8
##$NSP= 0
##$NTH_PI= 0
##$NZP= 0
##$OFFSET= 20.45085
##$PC= 1
##$PHC0= -25633.34
##$PHC1= 9.387491
##$PH_mod= 1
##$PKNL= yes
##$PPARMOD= 0
##$PSCAL= 0
##$PSIGN= 0
##$REVERSE= no
##$SF= 200.129815652938
##$SI= 16384
##$SIGF1= 3
##$SIGF2= 2
##$SINO= 5.538805
##$SIOLD= 16384
##$SREGLST= <1H.CDCl3>
##$SSB= 0
##$STSI= 16384
##$STSR= 0
##$SW_p= 4816.95568400771
##$SYMM= 0
##$S_DEV= 0
##$TDeff= 16384
##$TDoff= 0
##$TI= <>
##$TILT= no
##$TM1= 0
##$TM2= 0
##$TOPLEV= 0
##$USERP1= <user>
##$USERP2= <user>
##$USERP3= <user>
##$USERP4= <user>
##$USERP5= <user>
##$WDW= 1
##$XDIM= 16384
##$YMAX_p= 432329040
##$YMIN_p= -441336
$$ End of Bruker specific parameters
$$ ---------------------------------
##NTUPLES= NMR SPECTRUM
##VAR_NAME=  FREQUENCY,     SPECTRUM/REAL,   SPECTRUM/IMAG
##SYMBOL=    X,             R,               I
##VAR_TYPE=  INDEPENDENT,   DEPENDENT,       DEPENDENT
##VAR_FORM=  AFFN,          ASDF,            ASDF
##VAR_DIM=   16384,         16384,           16384
##UNITS=     HZ,            ARBITRARY UNITS, ARBITRARY UNITS
##FACTOR=    0.29402158847633, 1,            1
##FIRST=     4092.82474700148, 0,            0
##LAST=      -724.130937006226, 0,           0
##MIN=       -724.130937006226, -441336,     0
##MAX=       4092.82474700148, 432329040,    0
$$ Real data points
##PAGE= N=1
##DATA TABLE= (X++(R..R)), XYDATA
$$ [...]
$$ plain form
5837 -206372 -280963 -191297 -162473 -130319 -115960 -111382 -192874 -177720 -88553 -156278 -137401 -99929
5825 -99929 -150902 -172066 -240161 -147497 -115819 -141016 -230798 -277113 -202761 -191225 -116266 -140293
5813 -140293 -158709 -92335 -76068 -116643 -215639 -167209 -162126 -119227 -176631 -205059 -99080 -96535
5801 -96535 -113889 -57242 -147047 -112355 -93369 -47634 -40437 -81756 -79944 -23690 -134898 -195741
5789 -195741 -183129 -194843 -127734 -91910 -49359 -24817 -77683 -82836 -34499 -35518 -134816 -96659
5777 -96659 -104493 -101114 -32747 3313 -16339 -68105 -91290 -153888 -136127 -66320 -11577 -8291
5765 -8291 -134435 -45947 -87618 -91430 52744 42926 131296 111987 -9962 -8861 30279 126274
5753 126274 209767 146309 94055 130142 193118 168797 183838 155151 199184 208880 161808 194308
$$ packed form
5837b06372p4591Q9666K8824L2154J4359M578q1492J5154Q9167o7725J8877L7472
5825i9929n0973k1164o8095R2664L1678k5197q9782m6315P4352J1536P4959k4027
5813a40293j8416O6374J6267m0575r8996M8430N083M2899n7404k8428J05979K545
5801i6535j7354N6647q9805L4692J8986M5735P197m1319J812N6254j11208o0843
5789a95741J2612j1714O7109L5824M2551K4542n2866n153M8337j019r9298L8157
5777i6659p834L379O8367L6060j9652n1766k3185o2598J7761O9807N4743L286
5765h291j26144Q8488m1671l812J44174r818Q8370j9309j21949J101L9140R5995
5753A26274Q3493o3458n2254L6087O2976k4321J5041k8687M4033R696m7072L2500
$$ plain form
5741 194308 129852 136940 195802 237774 191583 215764 209019 177244 240510 287659 250062 256099
5729 256099 254791 235732 212004 232150 206932 231415 166451 131220 188611 144640 205839 177232
5717 177232 141880 146401 117620 136509 223751 214607 254475 299345 348675 332008 371812 392512
5705 392512 308461 349318 391966 415794 351425 313279 284224 166450 205758 202471 233554 283424
5693 283424 172375 206193 243268 232724 271164 252326 195307 235212 225686 225124 216693 134241
5681 134241 159155 147652 149100 99703 119408 133614 168579 187308 171010 195622 159703 254894
5669 254894 210589 156786 123779 136630 182320 177010 182390 242755 314714 270793 290471 245608
5657 245608 339457 294835 267596 274372 202817 194751 301540 242219 281527 331326 340449 288141
$$ packed form
5741A94308o4456P088N8862M1972m6191K4181o745l1775O3266M7149l7597O037
5729B56099j308j9059k3728K0146k5218K4483o4964l5231N7391m3971O1199k8607
5717A77232l5352M521k8781J8889Q7242r144L9868M4870M9330j6667L9804K0700
5705C92512q4051M0857M2648K3828o4369l8146k9055j17774L9308l287L1083M9870
5693B83424j11049L3818L7075j0544L8440j8838n7019L9905r526n62q431q2452
5681A34241K4914j1503J448m9397J9705J4206L4965J8729j6298K4612l5919R5191
5669B54894m4305n3803l3007J2851M5690n310N380O0365P1959m3921J9678m4863
5657B45608R3849m4622k7239O776p1555q066J06789n9321L9308M9799R123n2308
$$ plain form
5645 288141 269253 290795 270972 326575 308499 236452 174354 173587 268449 262887 267864 359258
5633 359258 356121 289276 283235 305985 288684 276341 284982 298918 266624 299088 343550 339377
5621 339377 296762 339085 291370 306031 422868 371290 333078 403347 369953 371233 425290 355850
5609 355850 354314 365146 323318 401532 499931 426425 391224 328993 411010 365751 367249 359784
5597 359784 410289 410629 329320 379678 480560 564331 589067 587900 624031 629602 576845 486401
5585 486401 490071 529227 490836 538405 613597 594195 548512 597530 564956 611805 551701 512449
5573 512449 599034 629172 684203 760471 677134 618668 593341 691930 670146 753242 683818 726751
5561 726751 714802 696469 725180 765270 781174 738967 827984 913190 832723 840538 939659 920313
$$ packed form
5645B88141j8888K1542j9823N5603j8076p2047o2098p67R4862n562M977R1394
5633C59258l137o6845o041K2750j7301j2343Q641J3936l2294L2464M4462m173
5621C39377m2615M2323m7715J4661J16837n1578l8212P0269l3394J280N4057o9440
5609C55850j536J0832m1828P8214R8399p3506l5201o2231Q2017m5259J498p465
5597C59784N0505L40q1309N0358J00882Q3771K4736j167L6131N571n2757r0444
5585D86401L670L9156l8391M7569P5192j9402m5683M9018l2574M6849o0104l9252
5573E12449Q6585L0138N5031P6268q3337n8466k5327R8589k1784Q3096o9424M2933
5561G26751j1949j8333K8711M0090J5904m2207Q9017Q5206q0467P815R9121j9346
$$ plain form
5549 920313 938598 1063693 1046731 1023222 930458 976543 1048611 980446 874593 975012 1067083
5538 1067083 1086494 1124493 1199689 1280966 1212318 1208089 1279319 1365703 1402293 1311785 1410787 1403972
5526 1403972 1405478 1370506 1287249 1321811 1405394 1419565 1386628 1399850 1513713 1655693 1663582
5515 1663582 1701662 1791637 1838963 1906439 2021980 1837291 1824252 1784710 1772153 1690134 1691055
5504 1691055 1721052 1720480 1701716 1792154 1856963 1877500 1986709 2095712 2236285 2311846 2295555
5493 2295555 2330524 2273636 2183534 2121901 2086301 1911538 1915622 1888801 1880537 1933355 1914737 2009356
5481 2009356 1984286 1937570 1980478 2053390 2143622 2160436 2233234 2242224 2170146 2028633 2002091
5470 2002091 1994204 1868861 1813955 1843570 1818925 1888454 1944516 1837998 1778989 1870239 1834574
$$ packed form
5549I20313J8285J25095j6962k3509r2764M6085P2068o8165j05853J00419R2071
5538A067083J9411L7999P5196Q1277o8648m229P1230Q6384L6590r0508R9002o815
5526A403972J506l4972q3257L4562Q3583J4171l2937J3222J13863J41980P889
5515A663582L8080Q9975M7326O7476J15541j84689j3039l9542j2557q2019R21
5504A691055K9997n72j8764R0438O4809K0537J09209J09003J40573P5561j6291
5493B295555L4969n6888r0102o1633l5600j74763M084k6821q264N2818j8618R4619
5481B009356k5070m6716M2908P2912R0232J6814P2798Q990p2078j41513k6542
5470B002091p887j25343n4906K9615k4645O9529N6062j06518n9009R1250l5665
$$ plain form
5459 1834574 1879655 1925480 1887261 1887421 1876404 1949292 1935460 2033599 2059608 2048098 2117142 2043679
5447 2043679 2126959 2150916 2182371 2178330 2156892 2128608 2213118 2183194 2168122 2203267 2150848 2241773
5435 2241773 2327044 2364957 2271428 2220191 2292936 2304772 2359020 2378522 2440007 2519691 2592994
5424 2592994 2610851 2575982 2664516 2716700 2728956 2746549 2788911 2769336 2755007 2740268 2769992
5413 2769992 2713865 2798351 2826108 2892170 2864356 3069378 3049278 3095271 3215093 3231507 3219759
5402 3219759 3264044 3384636 3442087 3523571 3573242 3525976 3674530 3675572 3690572 3723895 3875779
5391 3875779 3910007 3969795 4140544 4192917 4311208 4360181 4402829 4466304 4550300 4588567 4738398
5380 4738398 4877439 4963271 5046319 5115758 5256984 5443230 5506151 5646760 5768740 5924793
$$ packed form
5459A834574M5081M5825l8219J60j1017P2888j3832R8139K6009j1510O9044p3463
5447B043679Q3280K3957L1455m041k1438k8284Q4510k9924j5072L5145n2419R0925
5435B241773Q5271L7913r3529n1237P2745J1836N4248J9502O1485P9684P3303
5424B592994J7857l4869Q8534N2184J2256J7593M2362j9575j4329j4739K9724
5413B769992n6127Q4486K7757O6062k7814K05022k0100M5993J19822J6414j1748
5402C219759M4285J20592N7451Q1484M9671m7266J48554J042J5000L3323J51884
5391C875779L4228N9788J70749N2373J18291M8973M2648O3475Q3996L8267J49831
5380D738398J39041Q5832Q3048O9439J41226J86246O2921J40609J21980J56053
$$ plain form
5370 5924793 6014802 6185594 6375562 6583635 6789883 7017247 7118573 7311466 7595701 7703415
5360 7703415 7920358 8120533 8408274 8691244 8877385 9149689 9449213 9600240 9919601 10293582
5350 10293582 10628568 10995752 11481828 11951387 12404046 12903258 13542864 14084267 14742562
5341 14742562 15185989 15682857 16343313 16732854 17291539 17802668 18273834 18869777 19575698
5332 19575698 20176557 21183932 22339276 23687503 25170782 26840823 28685277 30773917
5324 30773917 33171734 35884493 38973162 42518169 46233806 49209885 50666847 50209335
5316 50209335 48369157 45933898 43469320 41568826 40341783 40075225 40396457 41330277 42720030
5307 42720030 44709047 47362691 50757255 55100488 60401629 66665579 73299262 78842674
$$ packed form
5370E924793R0009J70792J89968K08073K06248K27364J01326J92893K84235J07714
5360G703415K16943K00175K87741K82970J86141K72304K99524J51027L19361L73981
5350A0293582L34986L67184M86076M69559M52659M99212O39606N41403O58295
5341A4742562M43427M96868O60456L89541N58685N11129M71166N95943P05921
5332A9575698O00859J007375J155344J348227J483279J670041J844454K088640
5324C0773917K397817K712759L088669L545007L715637K976079J456962m57512
5316E0209335j840178k435259k464578j900494j227043k66558L21232R33820J389753
5307D2720030J989017K653644L394564M343233N301141O263950O633683N543412
$$ plain form
5299 78842674 80713439 77993664 71638899 63702767 56147919 49678985 44709007 41095771
5291 41095771 38637897 36905408 35875143 35438551 35512908 36350579 37756828 39839279 42424156
5282 42424156 45152556 46919600 46866391 44523838 40353892 35715738 31190454 27433981
5274 27433981 24386453 21799949 19624627 17889974 16498832 15415186 14591223 13811486
5266 13811486 13297545 12832746 12455664 12003631 11710878 11577926 11405440 11317989 11376531 11427871
5256 11427871 11447605 11477381 11466864 11589522 11755377 12021414 12297991 12566720 12779470 12855464
5246 12855464 12562795 12082172 11655283 11230481 10709831 10504325 10470154 10334763 10388966 10503931
5236 10503931 10677330 10980429 11366305 11691874 12268902 13144754 14055505 14995798 15923184
$$ packed form
5299G8842674J870765k719775o354765p936132p554848o468934m969978l613236
5291D1095771k457874j732489j030265m36592P4357Q37671J406249K082451K584877
5282D2424156K728400J767044n3209k342553m169946m638154m525284l756473
5274B7433981l047528k586504k175322j734653j391142j083646q23963p79737
5266A3811486n13941m64799l77082m52033k92753j32952j72486q7451N8542N1340
5256A1427871J9734K9776j0517J22658J65855K66037K76577K68729K12750P5994
5246A2855464k92669m80623m26889m24802n20650k05506l4171j35391N4203J14965
5236A0503931J73399L03099L85876L25569N77028Q75852R10751R40293R27386
$$ plain form
5227 15923184 16381450 16001267 15024871 13687283 12194622 10901520 10008578 9354183 8768891
5218 8768891 8475053 8162156 8059316 7992255 7954914 8015018 8264046 8536190 8946936 9382222
5208 9382222 9866437 10161365 10035124 9443926 8678497 7843152 7091427 6417192 5864166 5444608
5198 5444608 5122264 4843024 4604947 4448798 4394713 4324335 4159917 4148727 3984299 3936271
5188 3936271 3800115 3749071 3662275 3583208 3445470 3368722 3231853 3166937 3094959 3070453 3102630
5177 3102630 3130338 3081443 3013378 3060052 3070693 3047589 3093649 3015041 2988112 2835182 2739276
5166 2739276 2771250 2778709 2649668 2542500 2613292 2538688 2651149 2599916 2651832 2615075 2561254
5155 2561254 2557833 2569899 2524288 2666923 2667733 2677980 2673464 2622587 2681138 2709910 2648239 2626602
$$ packed form
5227A5923184M58266l80183r76396j337588j492661j293102q92942o54395n85292
5218H768891k93838l12897j02840o7061l7341O0104K49028K72144M10746M35286
5208I382222M84215K94928j26241n91198p65429q35345p51725o74235n53026m19558
5198E444608l22344k79240k38077j56149n4085p0378j64418j1190j64428m8028
5188C936271j36156n1044q6796p9067j37738p6748j36869o4916p1978k4506L2177
5177C102630K7708m8895o8065M6674J0641k3104M6060p8608k6929j52930r5906
5166B739276L1974P459j29041j07168P0792p4604J12461n1233N1916l6757n3821
5155B561254l421J2066m5611J42635Q10J0247m516n0877N8551K8772o1671k1637
$$ plain form
5143 2626602 2582587 2535787 2658290 2729592 2702388 2766750 2783773 2731963 2717515 2768814 2853337
5132 2853337 2825957 2826889 2855436 2854377 2846938 2992000 2968849 2930914 2918811 2989367 3072759 3033655
5120 3033655 3117124 3092845 3038293 3089920 3100390 3201196 3231544 3223500 3174103 3201767 3252071
5109 3252071 3268244 3211511 3305847 3372735 3383107 3449315 3553528 3454777 3443799 3549069 3552563
5098 3552563 3638069 3692850 3761064 3757099 3854589 3870291 3815801 3899725 3941646 3950157 3932787 4101719
5086 4101719 4117393 4214276 4324517 4348983 4342781 4423424 4417526 4493538 4584931 4673771 4805269
5075 4805269 4881625 4998271 5088824 5342143 5384042 5483684 5436795 5406816 5431852 5396880 5435498
5064 5435498 5526997 5569755 5628997 5693398 5758437 5747388 5768887 6018215 6228947 6277809 6466574
$$ packed form
5143B626602m4015m6800J22503P1302k7204O4362J7023n1810j4448N1299Q4523
5132B853337k7380R32K8547j059p439J45062k3151l7935j2103P0556Q3392l9104
5120C033655Q3469k4279n4552N1627J0470J00806L0348q044m9397K7664N0304
5109C252071J6173n6733R4336O6888J0372O6208J04213r8751j0978J05270L494
5098C552563Q5506N4781O8214l965R7490J5702n4490Q3924M1921Q511j7370J68932
5086D101719J5674R6883J10241K4466o202Q0643n898P6012R1393Q8840J31498
5075D805269P6356J16646R0553K53319M1899R9642m6889k9979K5036l4972L8618
5064E435498R1499M2758N9242O4401O5039j1049K1499K49328K10732M8862J88765
$$ plain form
5053 6466574 6527853 6573093 6580561 6604216 6630135 6497623 6501733 6564908 6593553 6656620 6743524 6827371
5041 6827371 6987119 7017740 7137689 7221012 7372592 7563585 7651967 7814781 7873338 7948683
5031 7948683 7941616 8060708 8094757 8211099 8322044 8373410 8586723 8854511 9123552 9102263
5021 9102263 9220818 9438514 9704545 9937198 10129153 10371326 10664966 10932338 11266998 11629302
5011 11629302 11909597 12177245 12466412 12738559 13080082 13310869 13677611 14063751 14461613
5002 14461613 14981139 15476335 15983795 16553313 17292596 17899489 18511832 19082972 19509337
4993 19509337 20077444 20575923 20925166 21416181 21763712 22270333 22848322 23408686 24074756
4984 24074756 24786221 25702205 26654310 27761894 28881374 30149639 31423455 32830358 34317521
$$ packed form
5053F466574O1279M5240P468K3655K5919j32512M110O3175K8645O3067Q6904Q3847
5041F827371J59748L0621J19949Q3323J51580J90993Q8382J62814N8557P5345
5031G948683p067J19092L4049J16342J10945N1366K13313K67788K69041k1289
5021I102263J18555K17696K66031K32653J91955K42173K93640K67372L34660L62304
5011A1629302K80295K67648K89167K72147L41523K30787L66742L86140L97862
5002A4461613N19526M95196N07460N69518P39283O06893O12343N71140M26365
4993A9509337N68107M98479L49243M91015L47531N06621N77989N60364O66070
4984B4074756P11465R15984R52105J107584J119480J268265J273816J406903J487163
$$ plain form
4975 34317521 36002977 38026607 40346137 43115259 46302653 50102285 54366409 58403266
4967 58403266 61007281 61061481 58912701 55478913 51859797 48756805 46624417 45389738
4959 45389738 44921828 45154130 45791710 47161725 49138201 51986439 55807137 60768819 67128859
4950 67128859 74590532 81259369 84331100 82033204 75387799 66884756 58493932 51374084
4942 51374084 45875695 41883722 38805430 36589982 35223810 34451383 34268734 34529664 35259306
4933 35259306 36605445 38610349 40809787 42823471 43557247 42212446 39023874 35118686
4925 35118686 31087445 27678802 24870588 22653167 20920930 19484690 18508431 17671623
4917 17671623 16912393 16367294 15915824 15599769 15325573 15105176 14924464 14734602 14598821
$$ packed form
4975C4317521J685456K023630K319530K769122L187394L799632M264124M036857
4967E8403266K604015N4200k148780l433788l619116l102992k132388j234679
4959D5389738m67910K32302O37580J370015J976476K848238L820698M961682O360040
4950F7128859P461673O668837L071731k297896o645405q503043q390824p119848
4942E1374084n498389l991973l078292k215448j366172p72427j82649K60930P29642
4933C5259306J346139K004904K199438K013684P33776j344801l188572l905188
4925C5118686m031241l408643k808214k217421j732237j436240r76259q36808
4917A7671623p59230n45099m51470l16055k74196k20397j80712j89862j35781
$$ plain form
4908 14598821 14540938 14495826 14322606 14382757 14493503 14662353 14875203 15164968 15415520 15791823
4898 15791823 16220111 16700756 17397072 18196813 19068531 19986369 20719238 21086535 20967577
4889 20967577 20401015 19908386 19495167 19113184 18909644 18791313 18961861 19169795 19538302
4880 19538302 20044297 20654477 21386695 22272915 23436532 24768316 26469928 28130169 29734816
4871 29734816 30472586 30366999 29673333 28485680 27479713 26717884 26161349 25929377 25928721 26054574
4861 26054574 26398767 26899827 27610920 28513284 29631954 30978945 32520985 34308696 36261239
4852 36261239 38354506 40467110 42483193 44599511 47151751 50058767 53223051 56064943
4844 56064943 57300435 56711930 54792881 52512854 50644134 49518587 49057174 49400460 50163241
$$ packed form
4908A4598821n7883m5112j73220O0151J10746J68850K12850K89765K50552L76303
4898A5791823M28288M80645O96316P99741Q71718R17838P32869L67297j18958
4889B0967577n66562m92629m13219l81983k03540j18331J70548K07934L68507
4880A9538302N05995O10180P32218Q86220J163617J331784J701612J660241J604647
4871B9734816P37770j05587o93666j187653j005967p61829n56535k31972o56J25853
4861B6054574L44193N01060P11093R02364J118670J346991J542040J787711J952543
4852C6261239K093267K112604K016083K116318K552240K907016L164284K841892
4844E6064943J235492n88505j919049k280027j868720j125547m61413L43286P62781
$$ plain form
4835 50163241 51248191 52788294 54919699 58042347 62153191 66958373 71227102 73323317
4827 73323317 73489415 71818023 68941152 65267689 60808857 55864188 51367239 47795479
4819 47795479 45130234 43502680 42417339 41849785 41569629 41800700 42759177 44291144 46337474
4810 46337474 47868804 47545901 44947286 40756068 35926260 31490800 27603164 24363557
4802 24363557 21763581 19680313 17985593 16403667 15119249 14104955 13204323 12355029
4794 12355029 11673351 11064212 10459564 9918305 9485736 9119123 8776987 8311085 7899486
4785 7899486 7690540 7423668 7157631 6831465 6572168 6491797 6416684 6223310 6101412 6059876
4775 6059876 6021065 6009516 5909986 5752164 5468953 5338350 5181132 4999440 4779626 4673631
$$ packed form
4835E0163241J084950J540103K131405L122648M110844M805182M268729K096215
4827G3323317J66098j671392k876871l673463m458832m944669m496949l571760
4819D7795479k665245j627554j085341n67554k80156K31071R58477J531967K046330
4810D6337474J531330l22903k598615m191218m829808m435460l887636l239607
4802B4363557k599976k083268j694720j581926j284418j014294r00632q49294
4794A2355029o81678o09139o04648n41259m32569l66613l42136m65902m11599
4785G899486k08946k66872k66037l26166k59297q0371p5113j93374j21898m1536
4775F059876l8811j1549r9530j57822k83211j30603j57218j81692k19814j05995
$$ plain form
4765 4673631 4538723 4395598 4310662 4303531 4198283 4145000 4169218 4036561 3933017 4025139 3911960
4754 3911960 3806558 3755049 3730608 3593138 3469373 3512684 3413445 3414804 3316621 3319040 3266440
4743 3266440 3157014 3094700 3177810 3106588 3071379 3144848 3172547 3222987 3106676 3089495 3090166
4732 3090166 3094174 3068161 3008883 3052399 3144874 3222728 3194674 3190640 3115514 3066229 3128494 3156179
4720 3156179 3128691 3047989 3122701 3201969 3360385 3500973 3589309 3723764 3773015 3765141 3683439
4709 3683439 3581557 3518216 3445902 3417502 3333798 3284354 3340329 3260377 3177781 3184412 3187723 3228695
4697 3228695 3333810 3342323 3451828 3537605 3763987 3951227 4123952 4483822 4768937 4940715
4687 4940715 4836546 4465420 4179638 3913249 3657035 3525478 3248210 3229483 3149805 3091241
$$ packed form
4765D673631j34908j43125q4936p131j05248n3283K4218j32657j03544R2122j13179
4754C911960j05402n1509k4441j37470j23765M3311r9239J359r8183K419n2600
4743C266440j09426o2314Q3110p1222l5209P3469K7699N0440j16311j7181O71
4732C090166M008k6013n9278M3516R2475P7854k8054m034p5126m9285O2265K7685
4720C156179k7488q0702P4712P9268J58416J40588Q8336J34455M9251p874q1702
4709C683439j01882o3341p2314k8400q3704m9444N5975p9952q2596O631L311M0972
4697C228695J05115Q513J09505Q5777K26382J87240J72725L59870K85115J71778
4687D940715j04169l71126k85782k66389k56214j31557k77268j8727p9678n8564
$$ plain form
4677 3091241 3103925 3262846 3307127 3230701 3242196 3256390 3322783 3532270 3566018 3755898 3909385
4666 3909385 4183230 4533759 4735920 4746068 4565492 4240196 3879688 3693557 3521071 3334507
4656 3334507 3172838 3096821 3028182 3067249 3018782 3078401 3197169 3184934 3110265 3089525 3126523
4645 3126523 3124328 3182552 3239030 3316364 3403141 3496271 3592897 3504255 3381754 3331342 3331557 3329728
4633 3329728 3279566 3303291 3374321 3367948 3387950 3340023 3368076 3400781 3406385 3324048 3326530 3216221
4621 3216221 3033568 3010107 3068717 2987718 3009354 3054047 2984740 3056985 3094990 3173426 3206407
4610 3206407 3329293 3351811 3382978 3406782 3415064 3516530 3513647 3586787 3498805 3537655 3411590
4599 3411590 3308967 3188609 3124583 3120386 3152896 3162993 3118451 2976571 2971979 2978206 3012334
$$ packed form
4677C091241J2684J58921M4281p6426J1495J4194O6393K09487L3748J89880J53487
4666C909385K73845L50529K02161J0148j80576l25296l60508j86131j72486j86564
4656C334507j61669p6017o8639L9067m8467N9619J18768j2235p4669k0740L6998
4645C126523k195N8224N6478P7334Q6777R3130R6626q8642j22501n0412K15j829
4633C329728n0162K3725P1030o373K0002m7927K8053L2705N604q2337K482j10309
4621C216221j82653k3461N8610q0999K1636M4693o9307P2245L8005P8436L2981
4610C206407J22886K2518L1167K3804Q282J01466k883P3140q7982L8850j26065
4599C411590j02623j20358o4026m197L2510J0097m4542j41880m592O227L4128
$$ plain form
4588 3012334 3033241 3076606 3102981 3100219 3147246 3119119 3167636 3171956 3114372 3137812 3074266 3093985
4576 3093985 3094133 3097365 3106385 3054878 3020418 3054377 3162050 3109877 3158869 3098086 3017259 2996064
4564 2996064 3011605 2956886 3076847 3079653 3092073 3096164 3099224 3198801 3123575 3148438 3286491 3301742
4552 3301742 3272096 3269328 3276981 3324484 3370348 3366840 3405111 3337278 3365223 3456744 3417817 3403773
4540 3403773 3476968 3457481 3532939 3519319 3516936 3633878 3667190 3674786 3635804 3730970 3759096 3750031
4528 3750031 3844915 3791320 3987381 3936550 3942020 3963884 3958377 4073132 4020062 4082602 4167446
4517 4167446 4154299 4098509 4124699 4130957 4077807 4142902 4232459 4196602 4311685 4301405 4315221
4506 4315221 4376321 4324290 4382294 4470747 4458890 4510499 4520338 4603239 4564087 4631227 4665341 4683045
$$ packed form
4588C012334K0907M3365K6375k762M7027k8127M8517M320n7584K3440o3546J9719
4576C093985J48L232R020n1507l4460L3959J07673n2173M8992o0783q0827k1195
4564B996064J5541n4719J19961K806J2420M091L060R9577p5226K4863J38053J5251
4552C301742k9646k768P653M7503M5864l508L8271o7833K7945R1521l8927j4044
4540C403773P3195j9487P5458j3620k383J16942L3312P596l8982R5166K8126r065
4528C750031R4884n3595J96061n0831N470K1864n507J14755n3070O2540Q4844
4517D167446j3147n5790K6190O258n3150O5095Q9557l5857J15083j0280J3816
4506D315221O1100n2031N8004Q8453j1857N1609R839Q2901l9152O7140L4114J7704
$$ plain form
4494 4683045 4626207 4709164 4769280 4734532 4790742 4802669 4898397 4997050 5085108 5091189 5169839 5193256
4482 5193256 5230559 5277453 5321506 5464558 5533235 5581485 5563391 5655462 5730531 5794059 5851992
4471 5851992 5937344 5975248 5996088 6203002 6188416 6373369 6495218 6525005 6697516 6901410
4461 6901410 7060912 7225294 7381490 7659834 7875395 7949809 7895495 7819259 7610007 7471454
4451 7471454 7397378 7269054 7273666 7261472 7266863 7313350 7314104 7368035 7384430 7374703 7426567 7425939 7528977
4438 7528977 7536436 7606025 7619245 7679139 7717150 7709424 7768034 7760010 7926105 8090857 8085691 8173689
4426 8173689 8255738 8352487 8514139 8572856 8673233 8699861 8764057 8933827 8978104 8982709 9157415
4415 9157415 9241705 9283164 9505620 9753343 9853558 10060303 10162075 10273338 10513810 10709982
$$ packed form
4494D683045n6838Q2957O0116l4748N6210J1927R5728R8653Q8058O081P8650K3417
4482E193256L7303M6894M4053J43052O8677M8250j8094R2071P5069O3528N7933
4471E851992Q5352L7904K0840K06914j4586J84953J21849K9787J72511K03894
4461F901410J59502J64382J56196K78344K15561P4414n4314p6236k09252j38553
4451G471454p4076j28324M612j2194N391M6487P54N3931J6395r727N1864o28J03038
4438G528977P459O9589J3220N9894L8011p726N8610q024J66095J64752n166Q7998
4426H173689Q2049R6749J61652N8717J00377K6628O4196J69770M4277M605J74706
4415I157415Q4290M1459K22456K47723J00215K06745J01772J11263K40472J96172
$$ plain form
4405 10709982 10926098 11080531 11241651 11428167 11606672 11813795 11965261 12253914 12484138
4396 12484138 12713185 12984998 13259646 13570880 13783158 14127061 14460781 14718666 15046845
4387 15046845 15459057 15774964 16156986 16599358 16876408 17253425 17735062 18223864 18684389
4378 18684389 19162003 19683895 20150451 20817216 21463706 22179107 22793216 23484627 24254932
4369 24254932 25152821 26186451 27434248 28706917 30292055 31731895 32318592 32528581 32431406
4360 32431406 32394144 32539107 33005374 33701336 34549261 35437646 36451987 37459046 38657545
4351 38657545 39986989 41345961 43089897 44798264 46818162 48919571 51247554 53771102
4343 53771102 56511219 59594206 62872837 66395600 69973712 73718142 77328512 80737263
$$ packed form
4405A0709982K16116J54433J61120J86516J78505K07123J51466K88653K30224
4396A2484138K29047K71813K74648L11234K12278L43903L33720K57885L28179
4387A5046845M12212L15907L82022M42372K77050L77017M81637M88802M60525
4378A8684389M77614N21892M66556O66765O46490P15401O14109O91411P70305
4369B4254932Q97889J033630J247797J272669J585138J439840N86697K09989r7175
4360C2431406l7262J44963M66267O95962Q47925Q88385J014341J007059J198499
4351C8657545J329444J358972J743936J708367K019898K101409K327983K523548
4343E3771102K740117L082987L278631L522763L578112L744430L610370L408751
$$ plain form
4335 80737263 83764557 86499234 88534865 90346476 92008311 93457359 95082407 96660442
4327 96660442 98398272 100339775 102430369 104783970 107160835 109568172 112047609 114700249
4319 114700249 117769643 121147703 124590539 127705408 130214333 131852978 132310641 131343511
4311 131343511 129084858 125804187 122115706 118124335 114138222 110657081 107719091 105510283
4303 105510283 103621338 101881598 100352085 98763553 97129382 95626910 94362441 92748196
4295 92748196 90978776 88968823 86665438 83936366 80615774 76960824 72827311 68187079
4287 68187079 63568054 59286033 55502880 52276831 49341887 46871314 44652624 42789130
4279 42789130 41005023 39456058 38097929 36766418 35550654 34408510 33430937 32631254
$$ packed form
4335H0737263L027294K734677K035631J811611J661835J449048J625048J578035
4327I6660442J737830J941503K090594K353601K376865K407337K479437K652640
4319A14700249L069394L378060L442836L114869K508925J638645M57663r67130
4311A31343511k258653l280671l688481l991371l986113l481141k937990k208808
4303A05510283j888945j739740j529513j588532j634171j502472j264469j614245
4295I2748196j769420k009953k303385k729072l320592l654950m133513m640232
4287F8187079m619025m282021l783153l226049k934944k470573k218690j863494
4279D2789130j784107j548965j358129j331511j215764j142144r77573p99683
$$ plain form
4271 32631254 31887328 31238100 30811264 30426263 30189427 30014561 29999033 30122624 30445434 30740042
4261 30740042 31241911 31836596 32463489 33188121 33834291 34390115 34837146 35312759 35727210
4252 35727210 36248180 36823569 37428339 38146806 39019678 40040911 41232400 42596648 44059065
4243 44059065 45927026 47957890 50126708 52808530 55757579 59020621 62553111 66209783
4235 66209783 69071463 70192219 69657304 67854329 65388163 63167083 61532203 60519149
4227 60519149 60142679 60214503 60515625 61247765 62582555 64595326 67188392 69982561 72548970
4218 72548970 74368538 75144581 74518924 72203010 68447919 63962669 59190694 54900444
4210 54900444 51455558 48699925 46560155 44915296 43674097 42733349 42345030 42513144 43197367
$$ packed form
4271C2631254p43926o49228m26836l85001k36836j74866j5528J23591L22810K94608
4261C0740042N01869N94685O26893P24632O46170N55824M47031M75613M14451
4252C5727210N20970N75389O04770P18467Q72872J021233J191489J364248J462417
4243D4059065J867961K030864K168818K681822K949049L263042L532490L656672
4235F6209783K861680J120756n34915j802975k466166k221080j634880j013054
4227F0519149l76470P1824L01122P32140J334790K012771K593066K794169K566409
4218G2548970J819568P76043o25657k315914l755091m485250m771975m290250
4210E4900444l444886k755633k139770j644859j241199r40748l88319J68114O84223
$$ plain form
4201 43197367 44140886 44525495 43811859 41511979 38097414 34210788 30645701 27399598 24578106
4192 24578106 22191851 20264996 18623122 17312168 16171104 15090495 14318509 13473611
4184 13473611 12843833 12238059 11762881 11315025 10846780 10471253 10211257 9824042 9515722
4175 9515722 9306249 9061580 8676095 8346615 8024523 7800405 7518127 7298242 7087391 6958079
4165 6958079 6854853 6772457 6552088 6468636 6450698 6303867 6065708 5941942 5867283 5776666
4155 5776666 5623985 5491884 5404105 5360264 5148098 4922617 4925477 4932840 4897182 4732297 4729803
4144 4729803 4642246 4668868 4626746 4373188 4324697 4385431 4362819 4344160 4240610 4212875 4243821
4133 4243821 4185021 4196057 4151031 4187884 4202641 4007095 4030421 4074841 4020123 4075365 4120818
$$ packed form
4201D3197367R43519L84609p13636k299880l414565l886626l565087l246103k821492
4192B4578106k386255j926855j641874j310954j141064j080609p71986q44898
4184A3473611o29778o05774m75178m47856m68245l75527k59996l87215l08320
4175I515722k09473k44669l85485l29480l22092k24118k82278k19885k10851j29312
4165F958079j03226q2396k20369q3452j7938j46831k38159j23766p4659r0617
4155E776666j52681j32101q7779m3841k12166k25481K860P363l5658j64885k494
4144D729803q7557K6622m2122k53558m8491O0734k2612j8659j03550k7735L0946
4133D243821n8800J1036m5026L6853J4757j95546K3326M4420n4718N5242M5453
$$ plain form
4122 4120818 4095283 3959131 3889395 3947511 3938801 3902109 3970732 3990383 3866001 3898200 3854426
4111 3854426 3884423 3809723 3816564 3836773 3962852 3893151 3830237 3894071 3945683 3939516 3895364 3903120
4099 3903120 3993702 4009613 3888620 3943724 3958061 3972284 4027246 3935533 3910686 3838996 3850972
4088 3850972 3916147 3883755 3801923 3793291 3815472 3784754 3759184 3824468 3806308 3702627 3741481
4077 3741481 3776988 3688806 3583263 3758742 3772168 3713828 3704902 3686872 3685356 3678827 3505064
4066 3505064 3535913 3534970 3481010 3522388 3554400 3599966 3499129 3518528 3591455 3576719 3552372 3587524
4054 3587524 3514745 3529680 3549180 3644354 3616320 3583182 3604366 3637594 3599853 3611314 3674445
4043 3674445 3635550 3760180 3732797 3682684 3762370 3770609 3784858 3825153 3896263 3920509 3983031
$$ packed form
4122D120818k5535j36152o9736N8116q710l6692O8623J9651j24382L2199m3774
4111C854426K9997p4700O841K0209J26079o9701o2914O3834N1612o167m4152P756
4099C903120R0582J5911j20993N5104J4337J4223N4962r1713k4847p1690J1976
4088C850972O5175l2392q1832q632K2181l0718k5570O5284j8160j03681L8854
4077C741481L5507q8182j05543J75479J3426n8340q926j8030j516o529j73763
4066C505064L0849r43n3960M1378L2012M5566j00837J9399P2927j4736k4347L5152
4054C587524p2779J4935J9500R5174k8034l3138K1184L3228l7741J1461O3131
4043C674445l8895J24630k7383n0113P9686Q239J4249M0295P1110K4246O2522
$$ plain form
4032 3983031 4063520 4058378 4104233 4161658 4183975 4156539 4267436 4221065 4200426 4285267 4248728
4021 4248728 4286014 4373673 4429866 4450995 4474356 4522405 4581861 4711573 4742609 4738287 4806368
4010 4806368 4909106 4968174 5001791 5051320 5034988 5005619 4945260 5066082 5085936 5193192 5272470
3999 5272470 5245307 5419200 5503092 5471410 5507859 5562246 5594629 5650882 5614897 5603476 5585752
3988 5585752 5739820 5732512 5758297 5798370 5776368 5810061 5901423 5935970 5955614 5948945 5993335 5954284
3976 5954284 6014147 6088930 6075357 6199435 6192013 6251381 6241098 6217046 6291559 6249165 6248964 6401663
3964 6401663 6399138 6425884 6508427 6507283 6509780 6651935 6673253 6812439 6807778 6878890 7018176 7050525
3952 7050525 7074916 7153434 7333414 7279557 7348930 7437203 7480021 7665896 7681954 7725917 7739176
$$ packed form
4032C983031Q0489n142M5855N7425K2317k7436J10897m6371k0639Q4841l6539
4021D248728L7286Q7659N6193K1129K3361M8049N9456J29712L1036m322O8081
4010D806368J02738N9068L3617M9529j6332k9369o0359J20822J9854J07256P9278
3999E272470k7163J73893Q3892l1682L6449N4387L2383N6253l5985j1421j7724
3988E585752J54068p308K5785M0073k2002L3693R1362L4547J9644o669M4390l9051
3976E954284N9863P4783j3573J24078p422N9368j0283k4052P4513m2394k01J52699
3964F401663k525K6746Q2543j144K497J42155K1318J39186m661P1112J39286L2349
3952G050525K4391P8518J79980n3857O9373Q8273M2818J85875J6058M3963J3259
$$ plain form
3941 7739176 7811379 8068224 8169013 8247555 8277310 8363742 8479755 8539758 8611671 8760001 8783384
3930 8783384 8813236 8972635 9086285 9174363 9337756 9400917 9479904 9567483 9686976 9754960 9882117
3919 9882117 9988525 10082310 10212205 10301879 10425124 10615412 10759056 10849785 11001178 11201291
3909 11201291 11395782 11584006 11791569 12040402 12225186 12495535 12689728 12996283 13161773
3900 13161773 13423035 13755895 13999126 14324551 14684725 15033386 15461960 15938758 16386191
3891 16386191 16890308 17457547 17977692 18422969 18861745 19478104 20126096 20739771 21481384
3882 21481384 22527194 23603499 24677126 25683455 26395560 27008529 27456059 27977146 28639250
3873 28639250 29649938 30816459 32285344 33854417 35456835 36546585 37025141 36960893 36617098
$$ packed form
3941G739176P2203K56845J00789P8542K9755Q6432J16013O0003P1913J48330K3383
3930H783384K9852J59399J13650Q8078J63393O3161P8987Q7579J19493O7984J27157
3919I882117J06408R3785J29895Q9674J23245J90288J43644R0729J51393K00113
3909A1201291J94491J88224K07563K48833J84784K70349J94193L06555J65490
3900A3161773K61262L32860K43231L25425L60174L48661M28574M76798M47433
3891A6386191N04117N67239N20145M45277M38776O16359O47992O13675P41613
3882B1481384J045810J076305J073627J006329P12105O12969M47530N21087O62104
3873B8639250J010688J166521J468885J569073J602418J089750M78556o4248l43795
$$ plain form
3864 36617098 36358389 36410597 36879330 37755292 38998411 40438256 41536063 41940930 41411247
3855 41411247 40134995 38627467 37252150 36318767 35847029 35859186 36179058 36598586 36724505
3846 36724505 36244915 35061427 33516975 31903450 30585271 29514644 28802320 28400544 28053523
3837 28053523 27912755 27575437 27089657 26404894 25675307 24997333 24569089 24193024 23965124
3828 23965124 23808657 23787655 23895015 24120011 24353431 24486341 24705432 25026801 25354134 25817369
3818 25817369 26209537 26660320 27259595 27852309 28421538 29078900 29769161 30398951 31014923
3809 31014923 31711683 32330928 33069765 33808647 34609682 35471592 36285016 37118507 37870263
3800 37870263 38703110 39587153 40490645 41374272 42330570 43267895 44207842 45102665 46146445
$$ packed form
3864C6617098k58709N2208M68733Q75962J243119J439845J097807M04867n29683
3855D1411247j276252j507528j375317r33383m71738J2157L19872M19528J25919
3846C6724505m79590j183488j544452j613525j318179j070627p12324m01776l47021
3837B8053523j40768l37318m85780o84763p29587o77974m28244l76065k27900
3828B3965124j56467k1002J07360K24996K33420J32910K19091L21369L27333M63235
3818B5817369L92168M50783N99275N92714N69229O57362O90261O29790O15972
3809C1014923O96760O19245P38837P38882Q01035Q61910Q13424Q33491P51756
3800C7870263Q32847Q84043R03492Q83627R56298R37325R39947Q94823J043780
$$ plain form
3791 46146445 47196508 48204092 49420937 50563260 51821663 53477064 54991706 56454743
3783 56454743 57643340 58539223 59215535 59855940 60571966 61265340 62119572 63007059 64025051
3774 64025051 64990094 65810313 66623221 67384337 67961429 68476374 69341636 70427263 72080446
3765 72080446 74190356 76592604 78951021 81177324 83026252 84611080 86112767 87280850
3757 87280850 88209231 89060550 89996152 90474856 90699842 90494980 89988363 89262141 88432619
3748 88432619 87839473 87285738 86814569 86490296 86563120 86841094 87265282 87796712 88409947 88788564
3738 88788564 89101918 88987319 88519973 87907693 87157638 86194152 84966617 83390093 81743506
3729 81743506 79570059 76957809 74255228 71629653 69454270 67690893 66374786 65409045
$$ packed form
3791D6146445J050063J007584J216845J142323J258403J655401J514642J463037
3783E6454743J188597Q95883O76312O40405P16026O93374Q54232Q87487J017992
3774F4025051R65043Q20219Q12908P61116N77092N14945Q65262J085627J653183
3765G2080446K109910K402248K358417K226303J848928J584828J501687J168083
3757H7280850R28381Q51319R35602M78704K24986k04862n06617p26222q29522
3748H8432619n93146n53735m71169l24273P2824K77974M24188N31430O13235L78617
3738H8788564L13354j14599m67346o12280p50055r63486j227535j576524j646587
3729H1743506k173447k612250k702581k625575k175383j763377j316107r65741
$$ plain form
3721 65409045 64605625 63994349 63234675 62353340 61343187 60226286 59112197 57983662 56924693
3712 56924693 56025884 55332611 54506052 53695711 52627485 51141021 49383440 47414205 45412550
3703 45412550 43529746 41907375 40452405 39180130 38009568 36824741 35736897 34668662
3695 34668662 33775710 32726584 31802303 30986780 30144532 29321470 28584907 27803186 26950244
3686 26950244 26208069 25405874 24531871 23692806 22886790 22051819 21263546 20521906 19656333
3677 19656333 18914468 18235654 17680126 17135416 16499292 15947317 15485354 14970189 14422770
3668 14422770 14118043 13734010 13368454 13051016 12736456 12338450 12004010 11810088 11586430
3659 11586430 11257323 11108919 11044336 10787739 10626499 10432579 10237006 10166585 9951425 9798370
$$ packed form
3721F5409045q03420o11276p59674q81335j010153j116901j114089j128535j058969
3712E6924693q98809o93273q26559q10341j068226j486464j757581j969235k001655
3703D5412550j882804j622371j454970j272275j170562j184827j087844j068235
3695C4668662q92952j049126r24281q15523q42248q23062p36563p81721q52942
3686B6950244p42175q02195q74003q39065q06016q34971p88273p41640q65573
3677A9656333p41865o78814n55528n44710o36124n51975m61963n15165n47419
3668A4422770l04727l84033l65556l17438l14560l98006l34440j93922k23658
3659A1586430l29107j48404o4583k56597j61240j93920j95573p0421k15160j53055
$$ plain form
3649 9798370 9755557 9640539 9695328 9594492 9380631 9455246 9396938 9258308 9226641 9142978 9047859
3638 9047859 8978222 8930160 8822948 8840416 8877399 8935379 8881223 8833597 8803194 8806626 8775960
3627 8775960 8665351 8682429 8678468 8619227 8511687 8549704 8584067 8615132 8606256 8562256 8608425
3616 8608425 8547120 8473584 8287588 8251302 8392156 8384034 8283094 8283546 8237405 8306943 8357542
3605 8357542 8404712 8364493 8363873 8410039 8408911 8422431 8532640 8475981 8504625 8585942 8621972 8591287
3593 8591287 8633092 8645826 8656662 8719352 8692086 8755305 8712303 8748865 8822244 8843775 8801556
3582 8801556 8851152 8812961 8810651 8921163 9027077 9040828 9146617 9139605 9187648 9154594 9166794
3571 9166794 9226955 9284785 9278189 9197943 9279038 9198085 9308227 9374552 9391088 9494439 9584310
$$ packed form
3649I798370m2813j15018N4789j00836k13861P4615n8308j38630l1667q3663r5119
3638I047859o9637m8062j07212J7468L6983N7980n4156m7626l0403L432l0666
3627H775960j10609J7078l961n9241j07540L8017L4363L1065q876m4000M6169
3616H608425o1305p3536j85996l6286J40854q122j00940M52m6141O9538N0599
3605H357542M7170m0219o20M6166j128J3520J10209n6659K8644Q1317L6030l0685
3593H591287M1805J2734J0836O2690k7266O3219m3002L6562P3379K1531m2219
3582H801556M9596l8191k310J10512J05914J3751J05789p012M8043l3054J2200
3571I166794O0161N7830o596q0246Q1095q0953J10142O6325J6536J03351Q9871
$$ plain form
3560 9584310 9551370 9604961 9647737 9757982 9710483 9770974 9896261 9879667 10014076 10099015 10017174
3549 10017174 10051101 10146975 10177779 10222335 10317210 10296737 10190201 10363504 10449464 10450518 10423525
3538 10423525 10511005 10584162 10718677 10769756 10831404 10915125 11053257 11108911 11159536 11195158 11328732
3527 11328732 11396994 11519069 11613189 11673438 11746845 11826115 11999302 12003004 12105645 12263302 12390287
3516 12390287 12472778 12477971 12585957 12679587 12622584 12692938 12743012 12804143 12848051 12903945 12927999
3505 12927999 12964332 12966833 13067588 13256943 13284404 13370746 13491307 13692912 13851534 13904743
3495 13904743 14055189 14359779 14449605 14539602 14542627 14495374 14414062 14499133 14533585 14459415 14531657
3484 14531657 14545555 14659828 14715100 14695755 14661418 14573091 14583749 14507445 14360677 14294656 14272502
$$ packed form
3560I584310l2940N3591M2776J10245m7499O0491J25287j6594J34409Q4939q1841
3549A0017174L3927R5874L0804M4556R4875k0473j06536J73303Q5960J054k6993
3538A0423525Q7480P3157J34515N1079O1648Q3721J38132N5654N0625L5622J33574
3527A1328732O8262J22075R4120O0249P3407P9270J73187L702J02641J57657J26985
3516A2390287Q2491N193J07986R3630n7003P0354N0074O1131M3908N5894K4054
3505A2927999L6333K501J00755J89355K7461Q6342J20561K01605J58622N3209
3495A3904743J50446L04590Q9826Q9997L025m7253q1312Q5071L4452p4170P2242
3484A4531657J3898J14273N5272j9345l4337q8327J0658p6304j46768o6021k2154
$$ plain form
3473 14272502 14196179 14071682 13996237 14021354 14089019 14148867 14107318 14142985 14156981 14239450 14365655
3462 14365655 14506483 14514210 14590290 14722531 14736398 14823872 14990150 15089595 15170910 15218282 15268421
3451 15268421 15457317 15653524 15738388 15833991 15928016 15952515 16187259 16310387 16379798 16444379
3441 16444379 16592155 16668667 16939819 17041032 17228183 17359632 17507010 17682553 17850283 18070815
3431 18070815 18212798 18367841 18558904 18609486 18745928 18922438 19073949 19236887 19378596 19658402
3421 19658402 19924151 20152773 20361981 20519377 20751927 21042819 21171817 21423048 21641837
3412 21641837 21934034 22226002 22428618 22623349 22919530 23336028 23600136 23906885 24256229
3403 24256229 24524908 24893754 25229927 25556474 25923656 26309009 26639702 26919092 27335358
$$ packed form
3473A4272502p6323j24497p5445K5117O7665N9848m1549L5667J3996Q2469J26205
3462A4365655J40828P727P6080J32241J3867Q7474J66278R9445Q1315M7372N0139
3451A5268421J88896J96207Q4864R5603R4025K4499K34744J23128O9411O4581
3441A6444379J47776P6512K71152J01213J87151J31449J47378J75543J67730K20532
3431A8070815J41983J55043J91063N0582J36442J76510J51511J62938J41709K79806
3421A9658402K65749K28622K09208J57396K32550K90892J28998K51231K18789
3412B1641837K92197K91968K02616J94731K96181M16498K64108L06749L49344
3403B4256229K68679L68846L36173L26547L67182L85353L30693K79390M16266
$$ plain form
3394 27335358 27892801 28386788 28774012 29259534 29828736 30297514 30826411 31389934 31911726
3385 31911726 32422772 32933824 33553098 34106776 34695833 35198413 35846066 36309889 36796628
3376 36796628 37425773 38054354 38694593 39400264 40022622 40660928 41481706 42220406 42924876
3367 42924876 43683638 44593910 45467999 46550976 47511933 48648667 49732622 50888018 51971095
3358 51971095 53180384 54368476 55561345 56839705 58112673 59676200 61238086 62871769
3350 62871769 64620819 66454761 68300388 70268024 72248479 74211205 76328074 78592596
3342 78592596 80752028 83014910 85462697 87765816 90210882 92782207 95327180 98147892
3334 98147892 101020140 103891324 106989147 110489672 114285327 118444225 122947745 127738359
$$ packed form
3394B7335358N57443M93987L87224M85522N69202M68778N28897N63523N21792
3385C1911726N11046N11052O19274N53678N89057N02580O47653M63823M86739
3376C6796628O29145O28581O40239P05671O22358O38306Q20778P38700P04470
3367D2924876P58762R10272Q74089J082977R60957J136734J083955J155396J083077
3358E1971095J209289J188092J192869J278360J272968J563527J561886J633683
3350F2871769J749050J833942J845627J967636J980455J962726K116869K264522
3342G8592596K159432K262882K447787K303119K445066K571325K544973K820712
3334I8147892K872248K871184L097823L500525L795655M158898M503520M790614
$$ plain form
3326 127738359 132951574 138549010 144468476 150965706 157912681 165395390 173145494 180738459
3318 180738459 187511380 193206572 197326720 200227464 202212043 203614651 204800256 206218359
3310 206218359 208238427 211227751 215594601 221282057 228261015 236192167 244372566 252021537
3302 252021537 257972112 260886081 260412010 256221984 249078054 240387794 231490879 223678923
3294 223678923 217601487 213243266 209731394 205916808 200716252 193220496 183289218 171298821
3286 171298821 157897758 144150708 131095617 119307063 109053446 100378062 93263237
3279 93263237 87223535 82630634 78875422 75637119 72411325 69217864 66150659 63092088
3271 63092088 60476503 58201334 56140896 54420001 52897186 51552300 50379298 49209726
$$ packed form
3326A27738359N213215N597436N919466O497230O946975P482709P750104P592965
3318A80738459O772921N695192M120148K900744J984579J402608J185605J418103
3310B06218359K020068K989324M366850N687456O978958P931152Q180399P648971
3302B52021537N950575K913969m74071m190026p143930q690260q896915p811956
3294B23678923o077436m358221l511872l814586n200556p495756r931278j1990397
3286A71298821j3401063j3747050j3055091j1788554j0253617q675384p114825
3279I3263237o039702m592901l755212l238303l225794l193461l067205l058571
3271F3092088k615585k275169k060438j720895j522815j344886j173002j169572
$$ plain form
3263 49209726 48217408 47320110 46432618 45764586 45237279 44732660 44367220 44127905 43884155
3254 43884155 43768342 43865382 43968411 44154653 43999316 43830231 43780198 43798215 43920058 44003026
3244 44003026 43851734 43470728 43148851 42794445 42686643 42635970 42663499 42667948 42855024 42967502
3234 42967502 43155768 43434383 43696306 44032713 44438554 44913028 45564660 46272509 47304122
3225 47304122 48471032 49501278 50373122 51171582 52039215 53163763 54414886 55974166 57773298
3216 57773298 59537712 61428226 63366762 65201338 66783577 68061999 69298872 70540663
3208 70540663 71645855 72428406 72769535 72883043 72396610 71531678 70533620 69524997 68687981
3199 68687981 67995688 67634358 67569086 67810375 68278906 69061992 70122225 71305311 72809604
$$ packed form
3263D9209726r92318q97298q87492o68032n27307n04619l65440k39315k43750
3254D3884155j15813R7040J03029J86242j55337j69085n0033J8017J21843Q2968
3244D4003026j51292l81006l21877l54406j07802n0673K7529M449J87076J12478
3234D2967502J88266K78615K61923L36407M05841M74474O51632P07849J031613
3225D7304122J166910J030246Q71844P98460Q67633J124548J251123J559280J799132
3216E7773298J764414J890514J938536J834576J582239J278422J236873J241791
3208G0540663J105192P82551L41129J13508m86433q64932r98058j008623q37016
3199F8687981o92293l61330o5272K41289M68531P83086J060233J183086J504293
$$ plain form
3190 72809604 74393021 76258883 78379654 80865018 83677911 86952631 90645105 94972514
3182 94972514 99564361 104657395 110264560 116417462 122981998 130146400 137848030 145777711
3174 145777711 153914971 161999044 169706303 176741770 182165635 185591574 186434820 184904655
3166 184904655 181390337 176245045 169763140 162144178 153670798 144971926 136327779 128062145
3158 128062145 120373725 113478708 107602547 102795022 98981060 96272359 94718114 93912128
3150 93912128 93973680 94911417 96374046 98190324 100487353 102946468 105083202 106869158 107977776
3141 107977776 108164017 107068204 104837629 101480027 97090403 92218218 86769492 81275147
3133 81275147 75896445 70843999 66154732 62063743 58561422 55567085 53052357 51090574
$$ packed form
3190G2809604J583417J865862K120771K485364K812893L274720L692474M327409
3182I4972514M591847N093034N607165O152902O564536P164402P701630P929681
3174A45777711Q137260Q084073P707259P035467N423865L425939Q43246j530165
3166A84904655l514318n145292o481905p618962q473380q698872q644147q265634
3158A28062145p688420o895017n876161m807525l813962k708701j554245q05986
3150I3912128O1552R37737J462629J816278K297029K459115K136734J785956J108618
3141A07977776J86241j095813k230575l357602m389624m872185n448726n494345
3133H1275147n378702n052446m689267m090989l502321k994337k514728j961783
$$ plain form
3125 51090574 49483401 48204731 47138427 46306346 45538592 44822343 44017074 43316248 42640883
3116 42640883 42057009 41630791 41213134 41025642 41119436 41285983 41612325 42186178 42861952 43794092
3106 43794092 44762065 45768858 46716561 47431981 48138036 48595368 48785114 48479821 47877465
3097 47877465 47060936 46077178 44895515 43835187 42841688 42004964 41404825 40859957 40451795
3088 40451795 40194635 40000058 39899202 39818475 39700024 39714902 39787461 39715420 39741374 39806728
3078 39806728 39860911 40067701 40286676 40567657 40971383 41350797 41859161 42459703 43188823 43976736
3068 43976736 44906382 46052899 47191075 48288811 49416370 50387068 50939651 51077922 51167606
3059 51167606 51197761 51263471 51569120 52054022 52753482 53710616 54778520 56192260 57733416
$$ packed form
3125E1090574j607173j278670j066304q32081p67754p16249q05269p00826o75365
3116D2640883n83874m26218m17657j87492R3794J66547L26342N73853O75774R32140
3106D3794092R67973J006793R47703P15420P06055M57332J89746l05293o02356
3097D7877465q16529r83758j181663j060328r93499q36724o00139n44868m08162
3088D0451795k57160j94577j00856q0727j18451J4878P2559p2041K5954O5354
3078C9806728N4183K06790K18975K80981M03726L79414N08364O00542P29120P87913
3068D3976736R29646J146517J138176J097736J127559R70698N52583J38271Q9684
3059E1167606L0155O5710L05649M84902O99460R57134J067904J413740J541156
$$ plain form
3050 57733416 59533420 61587638 63586459 65433967 67039099 68556018 70040810 71552130
3042 71552130 72917302 74259263 75708147 77425702 79399142 81757983 84042152 85516417
3034 85516417 85853209 85854056 86223647 87377756 89196565 91364885 93488440 95323637 97175270
3025 97175270 99040289 100976616 102945685 105165122 107513257 110165645 113517446 117857294
3017 117857294 123372958 130481323 139065913 148492836 158923584 170800601 184638411 200645808
3009 200645808 219681952 243348090 274063472 312840986 358593084 403941672 432329040
3002 432329040 424550661 382355073 325001368 269198185 223163159 187866694 160559641
2995 160559641 138731258 121110324 106540065 94451676 84480473 76255950 69409300
$$ packed form
3050E7733416J800004K054218J998821J847508J605132J516919J484792J511320
3042G1552130J365172J341961J448884J717555J973440K358841K284169J474265
3034H5516417L36792Q47L69591J154109J818809K168320K123555J835197J851633
3025I7175270J865019J936327J969069K219437K348135K652388L351801M339848
3017A17857294N515664P108365Q584590R426923J0430748J1877017J3837810J6007397
3009B00645808J9036144K3666138L0715382L8777514M5752098M5348588K8387368
3002D32329040p778379m2195588n7353705n5803183m6035026l5296465k7307053
2995A60559641k1828383j7620934j4570259j2088389r971203q224523o846650
$$ plain form
2988 69409300 63806357 59205499 55240212 52098315 49447101 47028834 44507441 41686119
2980 41686119 38810506 35878631 33359721 31209027 29321081 27561555 26128463 24879534
2972 24879534 23672316 22402756 21290769 20340624 19486555 18765823 18008520 17189065 16540191
2963 16540191 15914299 15411058 14956218 14489766 14045228 13546974 13126284 12763838 12367335
2954 12367335 12111522 11743567 11395147 11157559 10785923 10440409 10180860 9860740 9534703
2945 9534703 9246737 8911585 8696154 8485144 8204978 8039796 7792501 7565463 7451994 7377001
2935 7377001 7109279 6936010 6836767 6764678 6634078 6552914 6420431 6289149 6214188 6091148
2925 6091148 6006473 5825682 5760057 5726994 5536777 5427429 5270505 5170200 5047762 4910589
$$ packed form
2988F9409300n602943m600858l965287l141897k651214k418267k521393k821322
2980D1686119k875613k931875k518910k150694j887946j759526j433092j248929
2972B4879534j207218j269560j111987r50145q54069p20732p57303q19455o48874
2963A6540191o25892n03241m54840m66452m44538m98254m20690l62446l96503
2954A2367335k55813l67955l48420k37588l71636l45514k59549l20120l26037
2945I534703k87966l35152k15431k11010k80166j65182k47295k27038j13469p4993
2935G377001k67722j73269r9243p2089j30600q1164j32483j31282p4961j23040
2925F091148q4675j80791o5625l3063j90217j09348j56924j00305j22438j37173
$$ plain form
2915 4910589 4741431 4755481 4668078 4518994 4423719 4332445 4289295 4253229 4155299 4043785 4053666
2904 4053666 4020768 3945808 3849938 3803782 3668070 3621339 3604916 3522922 3499243 3489377 3476186
2893 3476186 3551555 3487974 3300249 3228388 3195917 3252741 3166997 3156376 3102957 2993091 3057983
2882 3057983 3014007 2886205 2947282 2844398 2753869 2720459 2638874 2549495 2528106 2523275 2413468
2871 2413468 2318279 2195211 2274213 2146246 2148147 2075965 2063182 1971333 1869269 1861319 1941802
2860 1941802 1967504 1922932 1920198 1916719 1922855 1965843 1994041 1993741 2001063 1940726 1931849 1979003 1978709
2847 1978709 2064217 1915669 1893363 1827771 1841915 1915714 1867286 1882561 1723862 1877439 1876366
2836 1876366 1901013 1860336 1792393 1814058 1645978 1728528 1711995 1726187 1850584 1851309 1805982
$$ packed form
2915D910589j69158J4050q7403j49084r5275r1274m3150l6066r7930j11514R881
2904D053666l2898p4960r5870m6156j35712m6731j6423q1994k3679r866j3191
2893C476186P5369o3581j87725p1861l2471N6824q5744j0621n3419j09866O4892
2882C057983m3976j27802O1077j02884r0529l3410q1585q9379k1389m831j09807
2871B413468r5189j23068P9002j27967J901p2182j2783r1849j02064p950Q0483
2860A941802K5702m4572k734l479O136M2988K8198l00P322o0337q877M7154k94
2847A978709Q5508j48548k2306o5592J4144P3799m8428J5275j58699J53577j073
2836A876366K4647m0677o7943K1665j68080Q2550j6533J4192J24397P25m5327
$$ plain form
2825 1805982 1737961 1753655 1706589 1689336 1710618 1621285 1729818 1692196 1600173 1643445 1597327
2814 1597327 1659109 1687168 1696995 1702623 1670941 1688784 1739524 1704616 1733329 1701770 1654533 1709397
2802 1709397 1769540 1805288 1893604 1935220 2034912 2176029 2216330 2351931 2612241 2774762 2937597
2791 2937597 3051864 2895832 2730734 2533555 2310583 2130153 1876677 1778978 1615775 1522194
2781 1522194 1448567 1330499 1235900 1304613 1235754 1089824 1113828 1071862 1151314 1076041 907602
2770 907602 1065042 1022477 868931 896154 887827 938877 877150 908930 848461 785855 809379
2759 809379 795413 747370 793817 705878 679520 636509 661476 661632 621858 694271 728111 782628
2747 782628 601618 589939 581373 594598 648489 549352 518304 562745 571231 669165 620285 558033
$$ packed form
2825A805982o8021J5694m7066j7253K1282q9333J08533l7622r2023M3272m6118
2814A597327O1782K8059R827N628l1682J7843N0740l4908K8713l1559m7237N4864
2802A709397O0143L5748Q8316M1616R9692J41117M0301J35601K60310J62521J62835
2791B937597J14267j56032j65098j97179k22972j80430k53476r7699j63203r3581
2781A522194p3627j18068r4599O8713o8859j45930K4004m1966P9452p5273j68439
2770I07602J57440m2565j53546K7223q327N1050o1727L1780o0469o2606K3524
2759H09379j3966m8043M6447q7939k6358m3011K4967J56l9774P2413L3840N4517
2747G82628j81010j1679q566J3225N3891r9137l1048M4441Q486R7934m8880o2252
$$ plain form
2735 558033 693238 642120 496490 486022 510798 465939 525976 482349 500699 463845 439457
2724 439457 551511 517787 532817 580608 517417 492869 517902 544692 538032 488721 505262 442105
2712 442105 396104 381441 455362 436267 362045 373413 456920 460931 449352 460818 460954 382837
2700 382837 332755 361343 333259 365170 395699 374396 321647 317076 279278 299037 360308 374968
2688 374968 352845 395565 387012 396937 399564 385881 302424 339486 348816 306606 353029 406252
2676 406252 343885 260110 311397 294519 325715 346635 345757 327181 321113 326548 259529 336446
2664 336446 415565 352831 409755 298314 276358 284974 220727 187656 164227 250844 324892 272524
2652 272524 288366 374708 340170 281279 306970 307635 280480 247140 291213 265638 179881 180665
$$ packed form
2735E58033J35205n1118j45630j0468K4776m4859O0037m3627J8350l6854k4388
2724D39457J12054l3724J5030M7791o3191k4548K5033K6790o660m9311J6541o3157
2712D42105m6001j4663P3921j9095p4222J1368Q3507M011j1579J1466J36p8117
2700C82837n0082K8588k8084L1911L0529k1303n2749m571l7798J9759O1271J4660
2688C74968k2123M2720q553R925K627j3683q3457L7062R330m2210M6423N3223
2676D06252o2367q3775N1287j6878L1196K0920q78j8576o068N435o7019P6917
2664C36446P9119o2734N6924j11441k1956Q616o4247l3071k3429Q6617P4048n2368
2652B72524J5842Q6342l4538n8891K5691O65k7155l3340M4073k5575q5757P84
$$ plain form
2640 180665 312172 318946 281149 252110 206867 196472 152644 191979 236027 220989 394437
2629 394437 287334 209224 176749 168532 242794 291444 233175 200292 257152 186055 145903 182107
2617 182107 208101 256106 307667 232492 195761 246638 270798 314305 294786 161195 206068
2606 206068 220341 311222 216036 243069 229714 176073 221604 204803 177339 354432 343209
2595 343209 232708 256611 190537 225592 204369 160499 209784 187485 229682 161500 185236
2584 185236 272240 198480 165091 213180 127410 194812 337689 308126 204202 204264 205112 203100
2572 203100 212853 275905 254429 202592 234733 189249 230679 334476 346457 238479 219783
2561 219783 250121 237058 275010 319728 316075 328473 279498 290887 282504 333155 306102 305441
$$ packed form
2640A80665J31507O774l7797k9039m5243j0395m3828L9335M4048j5038J73448
2629C94437j07103p8110l2475q217P4262M8650n8269l2883N6860p1097m0152L6204
2617A82107K5994M8005N1561p5175l6731N0877K4160M3507j9519j33591M4873
2606B06068J4273R0881r5186K7033j3355n3641M5531j6801k7464J77093j1223
2595C43209j10501K3903o6074L5055k1223m3870M9285k2299M2197o8182K3736
2584A85236Q7004p3760l3389M8089q5770O7402J42877k9563j03924O2Q48k012
2572B03100R753O3052k1476n1837L2141m5484M1430J03797J1981j07978j8696
2561B19783L0338j3063L7952M4718l653J2398m8975J1389q383N0651k7053o61
$$ plain form
2549 305441 374998 420556 432373 413279 371363 346494 349926 363522 349999 356793 403460 419691
2537 419691 453221 419318 401353 405628 438446 501038 575725 548149 485214 563538 629357 598969
2525 598969 490854 505886 555021 562752 655629 621460 655113 677966 800852 718206 707766
2514 707766 812281 899572 1039513 1008929 1006276 1009439 1044620 1007818 1015228 1095670 1094140 1148714
2502 1148714 1237659 1219719 1204192 1345335 1347869 1380747 1506575 1458422 1580773 1710796 1842873
2491 1842873 1970376 2039635 2152313 2254287 2330976 2331660 2388382 2549396 2650199 2777383 2871210
2480 2871210 3018003 3198639 3401979 3695496 4105634 4408165 4622989 4818159 5193976 5594622
2470 5594622 6209044 6950943 8377301 10122582 12653128 15214793 18641013 18025536 13966923
$$ packed form
2549C05441O9557M5558J1817j9094m1916k4869L432J3596j3523O794M6667J6231
2537D19691L3530l3903j7965M275L2818O2592P4687k7576o2935P8324O5819l0388
2525E98969j08115J5032M9135P731R2877l4169L3653K2853J22886q2646j0440
2514G07766J04515Q7291J39941l0584k653L163L5181l6802P410Q0442j530N4574
2502A148714Q8945j7940j5527J41143K534L2878J25828m8153J22351J30023J32077
2491A842873J27503O9259J12678J01974P6689O84N6722J61014J00803J27184R3827
2480B871210J46793J80636K03340K93517M10138L02531K14824J95170L75817M00646
2470E594622O14422P41899J426358J745281K530546K561665L426220o15477m058613
$$ plain form
2461 13966923 10598080 7825200 6324582 4982429 4165170 3463121 3144530 2766924 2554899
2452 2554899 2311151 2133667 1817967 1627799 1429085 1366959 1244756 1150547 1013982 854379
2442 854379 733397 751332 642700 611641 660821 635553 508891 656677 537474 437131
2432 437131 445847 361672 359339 402373 419944 383208 281858 311050 232941 122836 124714 156555
2420 156555 183177 144082 175070 196965 203372 182764 167813 167841 138537 119103 183516 50770
2408 50770 59691 79020 165841 136946 123085 86428 106867 172756 146840 74312 36291 69361
2396 69361 120519 39066 46079 101380 39309 71154 32936 72324 59790 101547 35636 21805
2384 21805 66576 57399 87260 61800 64142 60928 150790 87652 28083 30813 -56207 -86973 -123436
$$ packed form
2461A3966923l368843k772880j500618j342153q17259p02049l18591l77606k12025
2452B554899k43748j77484l15700j90168j98714o2126j22203r4209j36565j59603
2442H54379j20982J7935j08632l1059M9180k5268j26662J47786j19203j00343
2432D37131Q716q4175k333M3034J7571l6736j01350K9192p8109j10105J878L1841
2420A56555K6622l9095L0988K1895O407k0608j4951K8k9304j9434O4413j32746
2408E0770Q921J9329Q6821k8895j3861l6657K0439O5889k5916p2528l8021L3070
2396F9361N1158q1453P013N5301o2071L1845l8218L9388j2534M1757o5911j3831
2384B1805M4771r177K9861k5460K342l214Q9862o3138n9569K730q7020l0766l6463
$$ plain form
2371 -123436 -11287 -224 -23287 43861 64885 3582 -58184 -25282 -33979 -24965 -68752 -35724
2359 -35724 -39131 -47151 -27230 -10457 -85489 -62567 -134215 -99019 -37079 -9272 -41271 -59666
2347 -59666 -34287 -147118 -198546 -58130 -92752 -40036 -8093 -42667 -56869 -130977 -83710
2336 -83710 43670 -46022 39590 83595 41330 -30333 -133387 -118794 -122835 -95332 -141846 -141769
2324 -141769 -139017 -53714 -72772 -127143 -47154 -35049 -77135 -7220 -39178 -115364 -95341 -154692
2312 -154692 -63370 -71577 -133264 -64017 -198069 -175390 -32684 -85475 -63039 -66334 -112537 -106435
2300 -106435 -128735 -93937 -39016 -62344 -81834 -38833 -123136 -72471 -150243 -97492 -140811 -133433
2288 -133433 -103105 -100518 -51793 14172 -27065 5827 -14077 -22971 10837 37345 4771 -69932
$$ packed form
2371a23436J12149J1063k3063O7148K1024o1303o1766L2902q697R014m3787L3028
2359c5724l407q020J9921J6773p5032K2922p1648L5196O1940K7807l1999j8395
2347e9666K5379j12831n1428J40416l4622N2716L1943l4574j4202p4108M7267
2336h3710J27380q9692Q5612M4005m2265p1663j03054J4593m041K7503m6514P7
2324a41769K752Q5303j9058n4371P9989J2105m2086O9915l1958p6186K0023n9351
2312a54692R1322q207o1687O9247j34052K2679J42706n2791K2436l295m6203O102
2300a06435k2300L4798N4921k3328j9490M3001q4303N0665p7772N2751m3319P378
2288a33433L0328K587M8725O5965m1237L2892j9904q894L3808K6508l2574p4703
$$ plain form
2276 -69932 -122835 -160217 -153505 -86743 -139134 -118081 -115616 -64062 15028 -57113 -28189 48478
2264 48478 50675 -80094 -27245 4759 78882 4873 -83930 -84628 -97392 -93339 -90551 -96758 -13225
2251 -13225 476 -4557 8626 10153 -47095 -29070 -38695 -14536 -21452 -6569 23497 -39887 -80313
2238 -80313 -87244 -70054 -106675 -146742 -60881 -56576 -17661 -26857 -145760 -47367 -44541 -80784
2226 -80784 -112833 -33384 -197496 -192410 -182950 -106781 -103451 -43338 39847 -12260 -51319 -109909
2214 -109909 -52992 -138451 -83802 -78533 -139521 -188707 -160567 -120367 -10857 -92310 -124064 -154232
2202 -154232 -167497 -161264 -110357 -118452 -110076 -40640 -155608 -26994 -21174 -118601 -139919 -101867
2190 -101867 -144283 -77636 -90744 -105899 -90886 -92244 -84958 -100810 4670 -55714 -156651 -76122
$$ packed form
2276f9932n2903l7382O712O6762n2391K1053K465N1554P9090p2141K8924P6667
2264D8478K197j30769N2849L2004P4123p4009q8803o98j2764M053K788o207Q3533
2251a3225J3701n033J3183J527n7248J8025r625K4159o916J4883L0066o3384m0426
2238h0313o931J7190l6621m0067Q5861M305L8915r196j18903R8393K826l6243
2226h0784l2049P9449j64112N086R460P6169L330O0113Q3185n2107l9059n8590
2214a09909N6917q5459N4649N269o0988m9186K8140M0200J09510q1453l1754l0168
2202a54232j3265O233N0907q095Q376O9436j14968J28614N820r7427k1318L8052
2190a01867m2416O6647j3108j5155J5013j358P286j5852J05480o0384j00937Q0529
$$ plain form
2178 -76122 -32233 -57386 -97312 -146183 -80282 -91456 -108643 -115310 -119411 -71978 -55362 -156411
2166 -156411 -152416 -114894 -59485 -96217 -87778 -87307 -94637 -96467 -99648 -114828 -92732 -80464 -97870
2153 -97870 -100276 -39679 -23744 -96527 -78328 -39040 -199580 -195601 -177386 -115938 -123169 -108435
2141 -108435 -76535 -90364 -108722 -115164 -117679 -135316 -97812 -97012 -5097 20994 -75363 -54402
2129 -54402 -96336 -168634 -131997 -225243 -94947 -43752 -76069 -83064 -65523 -117490 -56408 -121209
2117 -121209 -121462 -130128 -141850 -68837 -125053 -128551 -76885 -143224 -39392 9528 -24499 -54524
2105 -54524 -74541 -82344 -152932 -111466 -109683 -45081 -46355 -53031 -105024 -28632 -70610 -114937 -126389
2092 -126389 -101197 -52410 339 -92079 -98945 -12398 -21065 -52912 -150338 -75540 -106516 -164242
$$ packed form
2178g6122M3889k5153l9926m8871O5901j1174j7187o667m101M7433J6616j01049
2166a56411L995L7522N5409l6732Q439M71p330j830l181j5180K2096J2268j7406
2153i7870k406O0597J5935p2783J8199L9288j60540L979J8215O1448p231J4734
2141a08435L1900j3829j8358o442k515j7637L7504Q00R1915K6091r6357K0961
2129e4402m1934p2298L6637r3246J30296N1195l2317o995J7541n1967O1082o4801
2117a21209k53q666j1722P3013n6216l498N1666o6339J03832M8920l4027l0025
2105e4524k0017p803p0588M1466J783O4602j274o676n1993P6392m1978m4327j1452
2092a26389K5192M8787N2749r2418o866Q6547q667l1847r7426P4798l0976n7726
$$ plain form
2080 -164242 -158737 -135251 -55385 -16890 -26051 -53932 -26195 -35810 -128639 -142792 -157780 -126684
2068 -126684 -128565 -81345 -39901 -19703 -40423 -136106 -138132 -22788 -8402 -73070 -37514 -112499
2056 -112499 -137615 -91938 -139001 -112407 -130135 -101538 -58290 -136152 -39962 -59222 -33124 26261
2044 26261 -12098 -25302 -3097 -90756 -94428 -113193 -106303 -29079 -112038 -126253 -129850 -61322
2032 -61322 -101775 -105529 -104599 -14434 -5103 -25390 -156812 -191196 -102185 -42429 -84394 -108274
2020 -108274 -50575 -34297 -36868 -117734 -165362 -128586 -189619 -90273 -61523 -143772 -151897 -60725
2008 -60725 -109620 -125821 -80714 -98500 -129346 -94037 -63979 -98035 -122701 -201398 -180001 -161210
1996 -161210 -97189 -110464 -120668 -66113 -96758 -164257 -122361 -122430 -66813 -71078 -138541 -146943 -85957
$$ packed form
2080a64242N505K3486P9866L8495r161k7881K7737r615r2829j4153j4988L1096
2068a26684j881M7220M1444K0198k0720r5683k026J15344J4386o4668L5556p4985
2056a12499k5116M5677m7063K6594j7728K8597M3248p7862R6190j9260K6098N9385
2044B6261l8359j3204K2205q7659l672j8765O890P7224q2959j4215l597O8528
2032f1322m0453l754R30R0165R331k0287j31422l4384Q9011N9756m1965k3880
2020a08274N7699J6278k571q0866m7628L6776o1033R9346K8750q2249q125R1172
2008f0725m8895j6201M5107j7786l0846L5309L0058l4056k4666p8697K1397J8791
1996a61210O4021j3275j0204N4555l0645o7499M1896o9N5617m265o7463q402O0986
$$ plain form
1983 -85957 -153625 -168303 -74902 -45970 -133787 -82036 -112162 -131339 -152672 -173570 -142222 -194831
1971 -194831 -44763 -37610 -71002 -41580 -130499 -137480 -104070 -88129 -59364 -145817 -113710 -66711
1959 -66711 -8617 -117531 -136701 -155833 -68117 -194 -75314 -49364 -113694 -73686 -50139 -32207
1947 -32207 -84784 -167858 -114044 -129058 -162032 -119049 -46369 -59306 -34232 -68042 -144420 -157486
1935 -157486 -140287 -70188 -134301 -180163 -83707 23098 -133771 -8369 -47160 -19042 -15262
1924 -15262 -125140 -151108 -43413 31002 90671 7459 -19668 -82249 -129262 -129217 -120370 -22135
1912 -22135 12269 -41656 -125509 -123895 -195741 -94609 -86195 -8685 1487 3780 -15859 -105166
1900 -105166 -81161 -73675 -66988 -130353 -118019 -87550 -56844 -66880 -161668 -96847 -73658 -4016
$$ packed form
1983h5957o7668j4678R3401K8932q7817N1751l0126j9177k1333k0898L1348n2609
1971a94831J50068P153l3392K9422q8919o981L3410J5941K8765q6453L2107M6999
1959f6711N8094j08914j9170j9132Q7716O7923p5120K5950o4330M0008K3547J7932
1947c2207n2577q3074N3814j5014l2974M2983P2680j2937K5074l3810p6378j3066
1935a57486J7199P0099o4113m5862R6456J06805j56869J25402l8791K8118L780
1924a5262j09878k5968J07695P4415N9669q3212k7127o2581m7013M5Q847R8235
1912b2135L4404n3925q3853J614p1846J01132Q414P7510J0172K293j9639q9307
1900a05166K4005P486O687o3365J2334L0469L0706j0036r4788O4821K3189O9642
$$ plain form
1888 -4016 2589 -111278 -143092 -87667 -71177 -96526 -164115 -218549 -96736 -46113 -60992 -65985
1876 -65985 -104260 -128017 -173760 -115869 23662 -161382 -77915 -44397 -178134 -105013 -50150
1865 -50150 -123117 -119113 -71673 -151008 -53600 -65649 -65948 -117114 -185372 -130381 -119672 -51543
1853 -51543 -43746 -48752 -36967 -120824 -52757 -79382 -99466 -131868 -126299 -181695 -183576 -106760 -184957
1840 -184957 -74312 -71345 6308 -5885 -71124 -90144 -67105 -85680 -94379 -28852 -53787 -15766
1828 -15766 -62570 -89624 -76387 -77824 14712 -13504 -6623 -84226 -111976 -22607 -93032 -968
1816 -968 -47976 54481 -44005 -106066 -69718 -85329 -102634 4030 -32759 -45277 -30367 -80741
1804 -80741 -87744 -110643 -100101 -128998 -117437 -123976 -228203 -127600 -52229 -115709 -55384 -915
$$ packed form
1888d016O605j13867l1814N5425J6490k5349o7589n4434J21813N0623j4879m993
1876f5985l8275k3757m5743N7891J39531j85044Q3467L3518j33737P3121N4863
1865e0150p2967M004M7440p9335R7408j2049k99n1166o8258N4991J0709O8129
1853e1543P797n006J1785q3857O8067k6625k0084l2402N569n5396j881P6816p8197
1840a84957J10645K967P7653j2193o5239j9020K3039j8575q699O5527k4935L8021
1828a5766m6804k7054J3237j437R2536k8216O881p7603k7750Q9369p0425R2064
1816i68m7008J02457r8486o2061L6348j5611j7305J06664l6789j2518J4910n0374
1804h0741p003k2899J0542k8897J1561o539j04227J00603P5371o3480O0325N4469
$$ plain form
1792 -915 -10269 -136069 -170712 -81626 -76635 -142657 -71843 -79954 -166878 -1499 -2129 -121534 -41065
1779 -41065 12489 -39921 -104245 -100272 -68391 -149103 -54786 41398 -4105 -57324 -78392 -123718
1767 -123718 -168811 -170596 -175990 -116533 -47937 -102784 -130934 -111974 -58361 -140934 -156059 -120042
1755 -120042 -55690 -18773 -106405 -83035 -83763 63432 78065 -5654 -160657 -117112 -64943 -42195
1743 -42195 -46187 16873 39400 -114329 -89090 -106290 -82002 36996 37534 115602 -31765 -73036
1731 -73036 -22647 -76895 -156389 -69139 -9119 45262 -73523 -75795 -109314 -47265 62642 -54111
1719 -54111 -59495 28853 -81850 -146564 -133178 -142227 -89214 -141958 -78634 -69227 -39847 -14060
1707 -14060 40308 25898 -39402 -28298 -14181 46766 25302 -87318 -45843 -57878 -75578 -61658
$$ packed form
1792i15r354j25800l4643Q9086M991o6022P0814q111q6924J65379o30j19405Q0469
1779d1065N3554n2410o4324L973L1881q0712R4317R6184m5503n3219k1068m5326
1767a23718m5093j785n394N9457O8596n4847k8150J8960N3613q2573j5125L6017
1755a20042O4352L6917q7632K3370p28J47195J4633q3719j55003M3545N2169K2748
1743d2195l992O3060K2527j53729K5239j7200K4288J18998N38P8068j47367m1271
1731g3036N0389n4248p9494Q7250O0020N4381j18785k272l3519O2049J09907j16753
1719e4111n384Q8348j10703o4714J3386r049N3013n2744O3324R407K9380K5787
1707a4060N4368j4410o5300J1104J4117O0947k1464j12620M1475j2035j7700J3920
$$ plain form
1695 -61658 -52322 -134661 -81138 -90973 -113672 -110308 -74595 -137764 -40965 -32604 -52664 11523 -47168
1682 -47168 -24691 -109726 -104205 -112198 -88536 9491 -10898 -680 -59135 -36100 18430 -23079
1670 -23079 -46179 -63197 -33990 -68612 -91076 -133384 -56985 -42765 -97470 -142190 -14640 -68793
1658 -68793 -60130 -58087 -75966 -38135 30023 -43875 -38352 34515 -51423 -55327 -98800 -161408 -159661
1645 -159661 -69420 -4627 -41614 -71020 -91448 -54188 -90606 -149879 -154755 -213815 -102323 -76127
1633 -76127 -31760 56222 37767 -62633 -63330 -1059 3284 -65467 -18013 -9229 -88985 -42869
1621 -42869 -1892 -30911 -26172 -28670 -34936 11311 -92764 -123746 -42283 -131584 -135770 -104544
1609 -104544 -75356 -139083 -146351 -122628 -83287 -39799 -36443 65451 -82160 -102684 -84073 -41711
$$ packed form
1695f1658R336q2339N3523r835k2699L364L5713o3169R6799Q361k0060O4187n8691
1682d7168K2477q5035N521p993K3662R8027k0389J0218n8455K3035N4530m1509
1670b3079k3100j7018K9207l4622k2464m2308P6399J4220n4705m4720J27550n4153
1658f8793Q663K043j7879L7831O8158p3898N523P2867q5938l904m3473o2608J747
1645a59661R0241O4793l6987k9406k0428L7260l6418n9273m876n9060J11492K6196
1633g6127M4367Q7982j8455j00400o97O2271M343o8751M7454Q784p9756M6116
1621d2869M0977k9019M739k498o266M6247j04075l0982Q1463q9301m186L1226
1609a04544K9188o3727p268K3723L9341M3488L356J01894j47611k0524J8611M2362
$$ plain form
1597 -41711 -124328 -79481 12915 8552 -73432 -113780 79495 34935 -61405 -57898 -74919 -68020
1585 -68020 -48576 -119798 -152962 -112885 -30624 -96385 -71238 -30450 -70075 -129794 -129314 -76129
1573 -76129 -46999 -66273 -22798 -94414 -105487 -97846 -66340 -25438 -25864 -75297 -31606 57443
1561 57443 86284 27471 -29504 -30147 -51086 -37112 -62005 41892 9079 -20717 25698 -2102
1549 -2102 -57572 -45683 -54219 -80696 -43509 -133644 -30987 -108345 -66607 -26094 46221 43245
1537 43245 -2190 -44361 -46133 -18949 6492 9522 -64132 -8817 -17883 7168 -87018 -8982
1525 -8982 101177 44486 -78297 -6133 -51655 -42391 18525 -69003 -8341 12523 22442 -64571
1513 -64571 -45442 40040 -63329 -88425 -81402 -75843 -32732 -55692 -38777 -73866 -37779 2778
$$ packed form
1597d1711q2617M4847R2396m363q1984m0348J93275m4560r6340L507j7021O899
1585f8020J9444p1222l3164M0077Q2261o5761K5147M0788l9625n9719M80N3185
1573g6129K9130j9274M3475p1616j1073P641L1506M0902m26m9433M3691Q9049
1561E7443K8841n8813n6975o43k0939J3974k4893J03897l2813k9796M6415k7800
1549b102n5470J1889q536k6477L7187r0135J02657p7358M1738M0513P2315k976
1537D3245m5435m2171j772K7184K5441L030p3654N5315r066K5051r4186P8036
1525h982J10159n6691j22783P2164m5522R264O0916q7528O0662K0864R919q7013
1513f4571J9129Q5482j03369k5096P023N559M3111k2960J6915l5089L6087M0557
$$ plain form
1501 2778 40364 67408 4777 7377 -111589 -55141 -42620 -31326 -146722 -142900 -99316 41025
1489 41025 -11076 2593 6190 -6767 -13944 -80723 -68251 -46327 -22026 -78624 21240 -14478
1477 -14478 -7163 45707 55690 105882 74018 83295 17427 -68387 -40858 -97447 -49550 -55036 -16099
1464 -16099 -28737 -28396 9904 3208 -65288 -58863 -16411 45138 -58147 -88719 -38781 -10586
1452 -10586 56904 86884 25311 -33880 -42237 -77582 3343 13534 10041 -40253 -96324 -79102
1440 -79102 -83300 -8728 -44819 -8626 8034 4874 20139 18890 -12327 -21663 -67141 18919 609
1427 609 -62558 14343 -66500 -30172 -1487 35697 -109757 -76096 -14413 44462 -25773 -55567
1415 -55567 -92393 -196357 -86017 -11658 -6438 -30282 12030 -24354 -161820 -138792 -89598
$$ packed form
1501B778L7586K7044o2631K600j18966N6448J2521J1294j15396L822M3584J40341
1489D1025n2101J3669L597j2957p177o6779J2472K1924K4301n6598R9864l5718
1477a4478P315N2870R983N0192l1864R277o5868q5814K7529n6589M7897n486L8937
1464a6099j2638L41L8300o696o8496O425M2452O1549j03285l0572M9938K8195
1452a0586O7490K9980o1573n9191q357l5345Q0925J0191l493n0294n6071J7222
1440g9102m198P4572l6091L6193J6660l160J5265j249l1217r336m5478Q6060j8310
1427F09o3167P6901q0843L6328K8685L7184j45454L3661O1683N8875p0235k9794
1415e5567l6826j03964J10340P4359N220k3844M2312l6384j37466K3028M9194
$$ plain form
1404 -89598 -96516 -71607 77277 -14903 -42848 9619 58488 2192 -35261 -45 -44227 -64731
1392 -64731 -89012 -82315 1137 -39946 -29004 -23940 -30418 -47967 -13477 -33857 -65474 -16552
1380 -16552 29103 11205 -11274 23486 28769 -28612 4409 -3462 41363 14343 34620 92034
1368 92034 -1917 35024 -76134 7847 98093 50831 -33783 58230 77217 -14896 -35562 -10339
1356 -10339 10719 18926 26569 8699 -13530 72487 50242 75580 12542 38210 22365 99390
1344 99390 40437 -27180 -45203 6376 35840 -18542 -9378 -18590 1440 84865 -74623 -28105
1332 -28105 -2979 -56507 27159 45583 -70458 -4023 59242 -12909 -33315 -88812 -42858 -48413
1320 -48413 -13 -48784 -65529 -29644 27953 -59570 -3792 -41203 -90711 -71303 -60489 -95567
$$ packed form
1404h9598o918K4909J48884r2180k7945N2467M8869n6296l7453L5216m4182k0504
1392f4731k4281O697Q3452m1083J0942N064o478j7549L4490k0380l1617M8922
1380a6552M5655j7898k2479L4760N283n7381L3021p871M4825k7020K0277N7414
1368I2034r3951L6941j11158Q3981R0246m7262q4614R2013J8987r2113k0666K5223
1356a0339K1058Q207P643j7870k2229Q6017k2245K5338o3038K5668j5845P7025
1344I9390n8953o7617j8023N1579K9464n4382R164r212K0030Q3425j59488M6518
1332b8105K5126n3528Q3666J8424j16041O6435O3265p2151k0406n5497M5954n555
1320d8413M8400m8771j6745L5885N7597q7523N5778l7411m9508J9408J0814l5078
$$ plain form
1308 -95567 -53537 16889 32478 -25771 -64849 -25578 28441 -13635 -13747 24647 13657 -8399
1296 -8399 -76052 -2352 39811 61119 -51710 -46918 -104485 -96879 -116691 -61331 -32340 -88160
1284 -88160 20458 -23348 12428 -51163 -43057 -18110 67075 64424 3847 15669 57116 36796
1272 36796 51819 7516 -40013 36855 -58838 -150568 -142581 -84715 -20168 35961 26986 -5196
1260 -5196 -41966 -11020 13553 52614 16352 38138 -16278 -14970 29980 49292 14393 -18472
1248 -18472 -4252 -51122 -3875 74982 28521 -23109 -78186 36547 25582 -36069 29374 -56872
1236 -56872 -4753 -44768 -3983 -25582 4841 70300 36770 -18639 -39687 24488 58316 14438
1224 14438 13864 37211 41754 -54639 -112828 -18408 -83607 -31022 -29220 -49966 4443 62891 164799
$$ packed form
1308i5567M2030P0426J5589n8249l9078L9271N4019m2076j12L8394j0990k2056
1296h399o7653P3700M2163K1308j12829M792n7567P606j9812N5360K8991n5820
1284h8160J08618m3806L5776o3591Q106K4947Q5185k651o0577J1822M1447k0320
1272C6796J5023m4303m7529P6868r5693r1730P987N7866O4547N6129q975l2182
1260e196l6770L0946K4573L9061l6262K1786n4416J308M4950J9312l4899l2865
1248a8472J4220m6870M7247P8857m6461n1630n5077J14733j0965o1651O5443q6246
1236e6872N2119m0015M0785k1599L0423O5459l3530n5409k1048O4175L3828m3878
1224A4438n74K3347M543r6393n8189R4420o5199N2585J802k0746N4409N8448J01908
$$ plain form
1211 164799 94175 27451 16776 43348 18876 -27018 -29742 -61333 -77584 -12224 -139251 -76806
1199 -76806 -63482 -36657 26748 12051 80604 49066 11938 15631 58536 49634 -60891 -32998
1187 -32998 2797 -48597 -53623 -16011 -86261 -98571 -17503 12653 27657 -26148 -38888 -38489
1175 -38489 -41528 10744 -51300 5948 20542 80661 36674 -89844 -83019 -15530 18670 -8124
1163 -8124 38825 37276 36554 -40477 -8484 32118 144884 121196 -10864 -41648 26508 14982
1151 14982 -23757 23367 81100 68709 118902 -7664 -2329 8168 61198 96942 -23920 -44072
1139 -44072 -30483 -12573 77309 68035 25045 29616 -28872 -39762 -47039 -51383 -85098 -68298 -32739
1126 -32739 -3314 126003 110373 -87132 -77311 -12896 26794 16201 40716 55291 8654 -70109
$$ packed form
1211A64799p0624o6724j0675K6572k4472m5894k724l1591j6251O5360j27027O2445
1199g6806J3324K6825O3405j4697O8553l1538l7128L693M2905q902j10525K7893
1187c2998L5795n1394n026L7612p0250j2310Q1068L0156J5004n3805j2740L99
1175c8489l039N2272o2044N7248J4594O0119m3987j26518O825O7489L4200k6794
1163h124M6949j549p22p7031L1993M0602J12766k3688j32060l0784O8156j1526
1151A4982l8739M7124N7733j2391N0193j26566N335J0497N3030L5744j20862k0152
1139d4072J3589J7910Q9882r274m2990M571n8488j0890p277m344l3715J6800L5559
1126c2739K9425J29317j5630j97505R821O4415L9690j0593K4515J4575m6637p8763
$$ plain form
1114 -70109 -3944 48243 68886 10556 60306 66067 2565 57868 34432 31631 36775 79644
1102 79644 10936 -56693 -45654 10429 84123 -54356 8203 52906 -1268 -63925 -32665 -7300
1090 -7300 79317 136720 31968 -47260 -37786 22286 -52934 -19040 -76300 -2005 19145 7703
1078 7703 -34786 -9314 -27547 -41486 45503 3171 -21285 -41812 27155 50818 6472 -55775
1066 -55775 -77184 -2602 -33191 -64842 -49544 13141 132287 62611 -43099 32161 -36275
1055 -36275 11042 -10696 48355 41506 52668 77166 105582 102835 53909 108789 24476 23911 50615
1042 50615 18339 -14868 -104722 11801 -83252 -39046 9881 -42124 50350 47719 68474 -12774
1030 -12774 44217 -75740 -91125 40315 51634 -50239 13050 52201 40584 27145 79983
$$ packed form
1114g0109O6165N2187K0643n8330M9750N761o3502N5303k3436k801N144M2869
1102G9644o8708o7629J1039N6083P3694j38479O2559M4703n4174o2657L1260K5365
1090g300Q6617N7403j04752p9228R474O0072p5220L3894n7260P4295K1150j1442
1078G703m2489K5472j8233j3939Q6989m2332k4456k0527O8967K3663m4346o2247
1066e5775k1409P4582l0589l1651J5298O2685J19146o9676j05710P5260o8436
1055c6275M7317k1738N9051o849J1162K4498K8416k747m8926N4880q4313n65K6704
1042E0615l2276l3207q9854J16523r5053M4206M8927n2005R2474k631K0755q1248
1030a2774N6991j19957j5385J31440J1319j01873O3289L9151j1617j3439N2838
$$ plain form
1019 79983 73921 47531 79362 142035 92294 45097 59638 57540 87975 134675 82546 41743
1007 41743 91344 38055 53884 101612 173046 152890 84355 54071 16991 76002 54072 -50469
995 -50469 -54628 -31046 13091 -3252 -76670 22687 -6023 -130169 -38347 29662 -104999 -47138
983 -47138 25776 18512 74944 109501 -2570 -55447 6393 -54078 41049 33379 34233 -47381 -10743
970 -10743 39627 64571 45365 44270 50365 2850 -26685 -66533 -44634 -63871 -38603 -18164
958 -18164 31449 26237 33745 40259 41244 9 -31357 -1927 -33276 -62234 67885 63613 75532
945 75532 -14486 -68206 -40687 -129987 -89910 -42102 -28143 -15874 -5843 -25298 21176 71877
933 71877 97069 52444 34073 123119 67684 33152 21616 14400 41235 21075 30700 128200
$$ packed form
1019G9983o062k6390L1831O2673m9741m7197J4541k098L0435M6700n2129m0803
1007D1743M9601n3289J5829M7728P1434k0156o8535l0284l7080N9011k1930j04541
995e0469m159K3582M4137j6343p3418R9357k8710j24146R1822O8009j34661N7861
983d7138P2914p264N6432L4557j12071n2877O1840o0471R5127p670Q54q1614L6638
970a0743N0370K4944j9206j095O095m7515k9535l9848K1899j9237K5268K0439
958a8164M9613n212P508O514R85m1235l1366K9430l1349k8958J30119m272J1919
945G5532r0018n3720K7519q9300M0077M7808J3959J2269J0031j9455M6474N0701
933G1877K5192m4625j8371Q9046n5435l4532j1536p216K6835k0160R625R7500
$$ plain form
921 128200 11845 -65770 8580 41895 32419 59509 57644 106306 108405 -3089 -43011 35956
909 35956 62554 111908 52316 -55950 18575 8795 39373 36226 -5803 -78984 96063 67264
897 67264 -14604 3712 42293 41561 -16650 21838 -52669 -34113 20853 56981 -12641 15944
885 15944 21009 62002 20239 1155 -551 35871 86935 1651 -49730 34487 -10421 -21023
873 -21023 59898 26126 62954 50385 80388 90820 19320 -81992 -46394 -9543 45318 2194
861 2194 -4891 -40104 38240 -35006 -84717 12495 58251 86428 -41107 -87520 -41387 -41228 28373
848 28373 56301 2715 -14979 -47239 52114 66932 105379 50759 -41673 24528 -36080 6175
836 6175 9358 -22230 -4774 -120624 -119772 59443 126363 98040 58254 92072 89551 -26156
$$ packed form
921A28200j16355p7615P4350L3315r476K7090j865M8662K099j11494l9922P8967
909C5956K6598M9354n9592j08266P4525r780L0578l147m2029p3181J75047k8799
897F7264q1868J8316L8581p32n8211L8488p4507J8556N4966L6128o9622K8585
885A5944N065M0993m1763j9084j706L6422N1064q5284n1381Q4217m4908j0602
873b1023Q0921l3772L6828j2569L0003J0432p1500j01312L5598L6851N4861m3124
861B194p085l5213P8344p3246m9711R7212M5756K8177j27535m6413M6133J59O9601
848B8373K7928n3586j7694l2260R9353J4818L8447n4620r2432O6201o0608M2255
836F175L183l1588J7456j15850Q52J79215O6920k8323l9786L3818k521j15707
$$ plain form
824 -26156 -39560 18529 -58649 30157 128579 80737 13024 81370 142396 103525 105405 61175
812 61175 -32759 20181 81823 31357 70700 54444 -87582 1503 29530 32394 66092 -17915
800 -17915 106598 91517 35597 -11379 33658 13265 -61210 -10199 20809 -27274 45307 49630
788 49630 -15529 -27492 -71561 -23140 33296 75087 80991 -22075 -13747 83680 153424 65840
776 65840 120969 117156 69455 28388 135615 138967 17751 46911 -8255 -1192 -53991 -11497
764 -11497 63328 118426 73570 22862 34702 13098 74371 98660 65278 -33158 -45936 25136
752 25136 43464 92203 11527 52464 -29174 -40247 -31962 -8681 -7498 -41861 14603 -30352
740 -30352 -48588 65668 161462 112799 103222 92779 98557 8883 28843 106518 135172 117880
$$ packed form
824b6156j3404N8089p7178Q8806R8422m7842o7713O8346O1026l8871J880m4230
812F1175r3934N2940O1642n0466L9343j6256j42026Q9085K8027K864L3698q4007
800a7915J24513j5081n5920m6976M5037k0393p4475N1011L1008m8083P2581M323
788D9630o5159j1963m4069M8421N6436M1791N904j03066Q328R7427O9744q7584
776F5840N5129l813m7701m1067J07227L352j21216K9160n5166P063n2799M2494
764a1497P4825N5098m4856n0708J1840k1604O1273K4289l3382r8436j2778P1072
752B5136J8328M8739q0676M0937q1638j1073Q285K3281J183l4363N6464m4955
740c0352j8236J14256R5794m8663r577j0443N778q9674J9960P7675K8654j7292
$$ plain form
728 117880 125379 156883 135948 94469 2639 -47051 29724 -16766 21082 -3716 -78325 -11495
716 -11495 -53556 15181 47014 7899 -28389 -40325 -29072 59679 57817 73282 24356 30448
704 30448 106664 98866 50113 39732 47462 60440 -27126 18050 154197 110751 75611 44468
692 44468 -3488 67032 26945 -48159 97622 54752 -52250 -7963 33099 38674 32197 -69523
680 -69523 30953 -7798 -28905 12589 -53401 48524 102581 67526 51889 67607 75573 23581
668 23581 32753 27468 19326 62747 74522 29523 46211 68898 121879 51177 -24724 32432 -42022
655 -42022 58742 146929 76943 67024 55807 71642 75201 24229 -42684 11983 47425 94833
643 94833 97869 118647 129373 107449 47590 25148 59328 49236 39477 48263 -685 -43564 26189
$$ packed form
728A17880P499L1504k0935m1479r1830m9690P6775m6490L7848k4798p4609O6830
716a1495m2061O8737L1833l9115l6288j1936J1253Q8751j862J5465m8926O092
704C0448P6216p798m8753j0381P730J2978q7566M5176J36147m3446l5140l1143
692D4468m7956P0520m0087p5104J45781m2870j07002M4287M1062N575o477j01720
680f9523J00476l8751k1107M1494o5990J01925N4057l5055j5637J5718P966n1992
668B3581R172n285q142M3421J1775m4999J6688K2687N2981p0702p5901N7156p4454
655d2022J00764Q8187o9986r919j1217J5835L559n0972o6913N4667L5442M7408
643I4833L036K0778J0726k1924n9859k2442L4180j0092r759Q786m8948m2879O9753
$$ plain form
630 26189 12596 16103 47259 -13122 99462 74086 39159 73761 45869 -24201 56628 71169
618 71169 -15172 -15823 -84599 -5617 -18596 16886 -62215 -64567 6066 43008 25982 35780 77647
605 77647 28178 -439 -12882 -17901 50438 32463 -3268 21867 36937 132833 61379 -23908
593 -23908 -2878 29733 25713 -18458 35167 23405 27947 37763 58467 51316 83254 44844 -16900
580 -16900 -26288 11170 33207 78597 110283 48722 38843 70104 38767 14485 73005 48817
568 48817 8067 14373 -53819 -33619 28046 -16606 89765 96517 -32189 29051 50912 1960
556 1960 -6542 -37541 -66750 -13153 -55809 53056 35626 51749 57992 -17423 15001 -50503
544 -50503 -25027 -49171 1010 -110099 -52893 -50055 420 17174 44388 69381 1099 113585
$$ packed form
630B6189j3593L507L1156o0381J12584k5376l4927L4602k7892p0070Q0829J4541
618G1169q6341o51o8776P8982j2979L5482p9101k352P0633L6942j7026R798M1867
605G7647m9469k8617j2443n019O8339j7975l5731K5135J5070R5896p1454q5287
593b3908K1030L2611m020m4171N3625j1762M542R816K0704p151L1938l8410o1744
580a6900r388L7458K2037M5390L1686o1561r879L1261l1337k4282N8520k4188
568D8817m0750O306o8192K0200O1665m4652J06371O752j28706O1240K1861m8952
556A960q502l0999k9209N3597m2656J08865j7430J6123O243p5415L2424o5504
544e0503K5476k4144N0181j11109N7206K838N0475J6754K7214K4993o8282J12486
$$ plain form
532 113585 133075 77653 51507 29769 72002 144369 46445 -73397 -62039 14410 26480 38527
520 38527 103702 84190 90611 815 35008 16914 -22179 -5243 -36832 68594 84791 28541
508 28541 70836 42294 41431 34846 -2463 33772 -11870 -44243 -24622 -21597 -67005 -14409 1044
495 1044 50452 116065 49178 63900 79641 11676 -32295 -20786 -32868 20347 -50386 -94468
483 -94468 -48060 -52441 13698 -33779 -86451 -84986 -64997 -82733 -18771 38595 97759 -25779
471 -25779 19009 10231 15630 52806 65487 -28007 -12527 -6056 5499 42984 89861 28221 63280
458 63280 52942 -9228 -35705 -43637 -18099 -24418 18128 146439 118503 47930 33678 16863
446 16863 23690 -1676 12401 -11128 -46245 -56812 10566 -5165 136639 95601 53724 108627
$$ packed form
532A13585J9490n5422k6146k1738M2233P2367r7924j19842J1358P6449J2070J2047
520C8527O5175j9512O421q9796L4193j8094l9093J6936l1589J05426J6197n6250
508B8541M2295k8542q63o585l7309L6235m5642l2373J9621L025m5408N2596J5453
495A044M9408O5613o6887J4722J5741o7965m3971J1509j2082N3215p0733m4082
483i4468M6408m381O6139m7477n2672J465J9989j7736O3962N7366N9164j23538
471b5779M4788q778N399L7176J2681r3494J5480O471J1555L7485M6877o1640L5059
458F3280j0338o2170k6477p932K5538o319M2546J28311k7936p0573j4252j6815
446A6863O827k5366J4077k3529l5117j0567O7378j5731J41804m1038m1877N4903
$$ plain form
434 108627 41573 -4046 29608 -2576 9294 -25492 46979 82001 -25134 38530 92274 135034
422 135034 62603 -82534 -14225 -22533 3006 747 115979 17574 76310 -6675 41627 136387
410 136387 103599 41071 17043 9871 -8907 53161 67035 10981 -41765 -67522 -13819 -20588
398 -20588 -4273 83411 28751 2976 627 22923 14860 292 20605 -5970 -7961 14728 86882
385 86882 3588 -31522 85214 107256 59066 38504 80602 84403 -6729 -31215 -17261 -68108
373 -68108 38751 -4528 24857 -5673 10607 742 -32616 -86179 -10760 64556 -5123 -9185
361 -9185 25586 3282 -37674 -39117 -47183 -58700 -73159 -9710 -26991 -13688 51415 15401 10046
348 10046 -9756 48364 48101 107192 86466 59440 53364 4653 57315 67109 75515 136946 131134
$$ packed form
434A08627o7054m5619L3654l2184J1870l4786P2471L5022j07135O3664N3744M2760
422A35034p2431j45137O8309q308K5539k259J15232r8405N8736q2985M8302R4760
410A36387l2788o2528k4028p172j8778O2068J3874n6054n2746k5757N3703o769
398b0588J6315Q7684n4660k5775k349K2296q063j4568K0313k6575j991K2689P2154
385H6882q3294l5110J16736K2042m8190k0562M2098L801r1132k4486J3954n0847
373f8108J06859m3279K9385l0530J6280r865l3358n3563P5419P5316o9679m062
361i185L4771k2304m0956j443q066j1517j4459O3449j7281J3303O5103l6014n355
348A0046j9802N8120k63N9091k0726k7026o076m8711N2662R794Q406O1431n812
$$ plain form
335 131134 149112 12181 69744 41984 10062 27929 -11107 21454 21585 107557 10352 19744
323 19744 -13676 -47779 26803 -3920 -56331 -45208 1366 -6635 -23876 -62411 -17157 -54936
311 -54936 -85398 -19712 18776 57529 -10565 -37124 28472 -33022 -11112 -14402 -30243 100438
299 100438 117889 148008 118402 14358 -84587 -42611 -15627 10707 10066 21096 -32035 1571
287 1571 -44440 -54593 32942 125312 28355 -63768 -114477 -65709 -5355 -31845 -30378 -54155
275 -54155 32765 -4058 -5874 -27068 -37053 17130 48477 -72099 -73581 28520 27308 2611
263 2611 -89883 -47671 66487 14544 31138 14266 93630 38530 -24079 758 18777 25091
251 25091 8312 -26742 -20734 15427 61566 96817 151809 103309 32861 -22431 -69240 -6799
$$ packed form
335A31134J7978j36931N7563k7760l1922J7867l9036L2561J31Q5972r7205R392
323A9744l3420l4103P4582l0723n2411J1123M6574q001j7241l8535M5254l7779
311e4936l0462O5686L8488L8753o8094k6559O5596o1494K1910l290j5841J30681
299A00438J7451L0119k9606j04044r8945M1976K6984K6334o41J1030n3131L3606
287A571m6011j0153Q7535R2370r6957r2123n0709M8768O0354k6490J467k3777
275e4155Q6920l6823j816k1194r985N4183L1347j20576j482J02101j212k4697
263B611r2494M2212J14158n1943J6594j6872P9364n5100o2609K4837J8019O314
251B5091j6779l5054O008L6161M6139L5251N4992m8500p0448n5292m6809O2441
$$ plain form
239 -6799 -29263 -26806 -13974 76939 32392 -25591 79356 24048 69721 85080 64834 57407
227 57407 60415 -10652 14741 18301 -61947 -36913 -30881 -15319 -32635 52100 55597 76463 76339
214 76339 11110 -3081 -9138 16202 -43927 -86852 -85878 -105015 -73906 -64010 71063 103782 16148
201 16148 26138 10336 -41243 28119 -27593 21922 35728 -66672 -35308 -21211 -80917 -51048
189 -51048 -7546 39626 39173 43351 67486 68449 43519 21719 3965 58758 88838 29879 59167
176 59167 21770 -42829 -64403 45791 24768 -87568 3903 -51718 -81114 -99749 -102379 -10119
164 -10119 51717 -48121 15040 2535 34658 8870 3959 45640 -45957 25207 89173 73625
152 73625 -20306 -67223 -52356 7182 9133 19676 28878 -15223 -24341 1649 36033 -26481 -36327
$$ packed form
239f799k2464K457J2832R0913m4547n7983J04947n5308M5673J5359k0246p427
227E7407L008p1067K5393L560q0248K5034O032J5562j7316Q4735L497K0866j24
214G6339o5229j4191o057K5340o0129m2925R74j9137L1109R896J35073L2719q7634
201A6148R990j5802n1579O9362n5712M9515J3806j02400L1364J4097n9706K9869
189e1048M3502M7172m53M178K4135R63k4930k1800j7754N4793L0080n8959K9288
176E9167l7397o4599k1574J10194k1023j12336R1471n5621k9396j8635k630R2260
164a0119O1836r9838O3161j2505L2123k5788m911M1681r1597P1164O3966j5548
152G3625r3931m6917J4867N9538J951J0543R202m4101r118K5990L4384o2514r846
$$ plain form
139 -36327 8342 11595 90424 61362 -24741 -68043 31193 -11320 -9806 -38459 -46093 -49880 -23467
126 -23467 15328 43809 46126 17173 12218 52237 65704 -15442 -83672 20868 1982 -22694
114 -22694 18222 -19976 -12014 -12307 -46119 -73923 -54215 -38443 -7676 -18615 -13884 -63320 -57103
101 -57103 -20620 -17165 22114 6331 -2805 34592 -43346 -21680 -25413 29679 5329 55250 28499
88 28499 -67 27127 -30959 33822 34813 -4696 -41148 17034 -21308 22743 26360 -59040 -38064
75 -38064 -24130 -16911 31033 36708 27931 8984 -71491 -6566 -4696 -24154 9570 -14440 34863
62 34863 -5476 63693 80392 15918 -39794 -56377 -82407 -117143 -50016 64000 40005 -33447
50 -33447 -16985 -26988 -19632 -55491 -52887 4925 -21929 15788 7192 13445 37991 -11802 26107
$$ packed form
139c6327M4669L253P8829k9062q6103m3302R9236m2513J514k8653p634l787K6413
126b3467L8795K8481K317k8953m955M0019J3467q1146o8230J04540j8886k4676
114b2694M0916l8198P962k93l3812k7804J9708J5772L0767j0939M731m9436O217
101e7103L6483L455L9279j5783r136L7397p7938K1666l733N5092k4350M9921k6751
88B8499k8566K7194n8086O4781R91l9509l6452N8182l8342M4051L617q5400K0976
75c8064J3934P219M7944N675q777j8947q0475O4925J870j9458L3724k4010M9303
62C4863m0339O9169J6699o4474n5712j6583k6030l4736O7127J14016k3995p3452
50c3447J6462j0003P356l5859K604N7812k6854L7717q596O253K4546m9793L7909
$$ plain form
37 26107 -31806 -30441 48044 -2255 -7951 -10861 -31749 66838 9754 30397 -832 -17543 8773
24 8773 6018 94878 16851 -19652 8508 -65391 -77503 26358 29626 -4002 -53404 -30742 -18720
11 -18720 -59282 -77918 -48957 27633 -18262 35048 84038 45756 -26966 -80676 -61401
0 -61401
$$ packed form
37B6107n7913J365P8485n0299n696k910k0888R8587n7084K0643l1229j6711K6316
24H773k755Q8860p8027l6503K8160p3899j2112J03861L268l3628m9402K2662J2022
11a8720m0562j8636K8961P6590m5895N3310M8990l8282p2722n3710J9275
0f1401
$$ Imaginary data points
##PAGE= N=2
##DATA TABLE= (X++(I..I)), XYDATA
$$ plain form
16383 -2255706 -2253382 -2217988 -2211614 -2189928 -2214147 -2132343 -2102666 -2104816 -2093474 -2125816 -2058739 -1964141
16371 -1964141 -2000507 -1923468 -1926211 -1897444 -1818018 -1899430 -1818017 -1810190 -1800481 -1803363 -1848398 -1806235
16359 -1806235 -1750934 -1708441 -1684032 -1704671 -1693395 -1649231 -1629892 -1635078 -1573031 -1540884 -1498204
16348 -1498204 -1451268 -1483607 -1483575 -1467731 -1390527 -1347212 -1313829 -1298597 -1406324 -1309262 -1207864
16337 -1207864 -1166806 -1230878 -1168572 -1230322 -1174008 -1113421 -1068947 -1137742 -1164817 -1060120 -1056372
16326 -1056372 -1050567 -1055407 -971675 -984183 -997158 -959663 -980783 -943628 -805297 -762685 -830130
16315 -830130 -777311 -749093 -711273 -685482 -686161 -642075 -672917 -640770 -545075 -600822 -595316 -615326
16303 -615326 -596192 -524989 -592785 -552998 -484347 -519293 -477488 -367166 -383850 -378700 -327248
$$ packed form
16383b255706K324L5394O374K1686k4219Q1804K9677k150J1342l2342O7077R4598
16371a964141l6366P7039k743K8767P9426q1412Q1413P827R709k882m5035M2163
16359a806235N5301M2493K4409k0639J1276M4164J9339n186O2047L2147M2680
16348a498204M6936l2339L2J5844P7204M3315L3383J5232j07727R7062J01398
16337a207864M1058o4072O2306o1750N6314O0587M4474o8795k7075J04697L748
16326a056372N805m840Q3732j2508j2975L7495k1120L7155J38331M2612o7445
16315h30130N2819K8218L7820K5791o79M4086l0842L2147R5695n5747N506k0010
16303f15326J9134P1203o7796L9787O8651l4946M1805J10322j6684N150N1452
$$ plain form
16292 -327248 -354825 -337839 -318256 -343132 -289509 -201128 -235873 -240356 -203715 -136436 -88674 -193865
16280 -193865 -147319 -147483 -148332 -137888 -80301 -62800 -66323 -88900 -142417 -61464 44238 31354
16268 31354 100020 43522 111587 149872 182871 131515 84061 180868 197840 195896 245077 242125
16256 242125 270967 210700 243916 223796 288967 280476 278844 324222 360098 341591 347831 398419
16244 398419 355509 397427 396575 461104 428366 384332 477395 433433 361264 408689 512888 469894
16232 469894 518992 503925 520238 632884 640740 595624 538059 584665 611157 544585 610173
16221 610173 708931 685070 707041 660687 670540 686433 714250 721033 783610 738411 715219 755602
16209 755602 780211 782086 806894 810062 843033 811080 836836 810084 861795 867386 889407 879946
$$ packed form
16292c27248k7577J6986J9583k4876N3623Q8381l4745m483L6641O7279M7762j05191
16280a93865M6546j64q49J0444N7587J7501l523k2577n3517Q0953J05702j2884
16268C1354O8666n6498O8065L8285L2999n1356m7454R6807J6972j944M9181k952
16256B42125K8842o0267L3216k0120O5171q491j632M5378L5876j8507O240N0588
16244C98419m2910M1918q52O4529l2738m4034R3063m3962p2169M7425J04199m2994
16232D69894M9098j5067J6313J12646P856m5116n7565M6606K6492o6572O5588
16221F10173R8758k3861K1971m6354R853J5893K7817O783O2577m5199k3192M0383
16209G55602K4609J875K4808L168L2971l1953K5756k6752N1711N591K2021r461
$$ plain form
16197 879946 919149 926961 904298 892482 887389 926414 1008598 941234 978236 1035107 1035943 958772
16185 958772 942844 926706 921135 1009815 1029891 1032431 999257 1022393 1054786 1038824 1034130 1073774
16173 1073774 1096213 1105955 1070081 968952 1009912 1075344 1026791 1076552 1122043 1062643 1040071
16162 1040071 1134326 1151119 1196105 1192709 1188943 1121101 1186183 1161157 1136615 1154557 1149608 1126314
16150 1126314 1220363 1248670 1128545 1143686 1117029 1102359 1146925 1203376 1238650 1289191 1341500
16139 1341500 1358658 1151340 1124947 1314457 1280783 1279238 1296035 1362535 1340372 1297690 1337543
16128 1337543 1348156 1272297 1248971 1236741 1310050 1367634 1354995 1382991 1347595 1311483 1275502
16117 1275502 1215966 1327607 1364659 1294452 1286022 1393017 1340915 1355617 1422394 1360616 1332516
$$ packed form
16197H79946L9203P812k2663j1816n093L9025Q2184o7364L7002N6871Q36p7171
16185I58772j5928j6138n571Q8680K0076K540l3174K3136L2393j5962m694L9644
16173A073774K2439R742l5874j01129M0960O5432m8553M9761M5491n9400k2572
16162A040071R4255J6793M4986l396l766o7842O5082k5026k4542J7942m949k3294
16150A126314R4049K8307j20125J5141k6657j4670M4566N6451L5274N0541N2309
16139A341500J7158k07318k6393J89510l3674j545J6797O6500k2163m2682L9853
16128A337543J0613p5859k3326j2230P3309N7584j2639K7996l5396l6112l5981
16117A275502n9536J11641L7052p0207q430J06995n2102J4702O6777o1778k8100
$$ plain form
16106 1332516 1340896 1387998 1339082 1317711 1252006 1380503 1349359 1367776 1414299 1402378 1357843
16095 1357843 1350944 1328549 1342609 1339776 1440101 1420809 1286767 1275265 1264597 1375847 1490005
16084 1490005 1472160 1427859 1394916 1458698 1427982 1371262 1413737 1314716 1418919 1508401 1481465
16073 1481465 1382969 1379310 1450341 1447240 1404698 1434954 1467534 1494610 1563187 1534067 1436057 1409430
16061 1409430 1487904 1476999 1519216 1438414 1412702 1341247 1344713 1491997 1467411 1417631 1426929
16050 1426929 1442388 1449987 1406518 1399084 1431451 1414484 1525531 1595743 1568538 1569896 1453171
16039 1453171 1397301 1471215 1457080 1456710 1476672 1471458 1447735 1531370 1508678 1448954 1463122 1456978
$$ packed form
16106A332516Q380M7102m8916k1371o5705J28497l1144J8417M6523j1921m4535
16095A357843o899k2395J4060k833J00325j9292j34042j1502j0668J11250J14158
16084A490005j7845m4301l2943O3782l0716n6720M2475r9021J04203Q9482k6936
16073A481465r8496l659P1031l101m2542L0256L2580K7076O8577k9120r8010k6627
16061A409430P8474j0905M2217q0802k5712p1455L466J47284k4586m9780R298
16050A426929J5459P599m3469p434L2367j6967J11047P0212k7205J358j16725
16039A453171n5870P3914j4135l70J9962n214k3723Q3635k2692n9724J4168o144
$$ [...]
##END NTUPLES=NMR SPECTRUM
##END=
