##TITLE=1H_CG-1207-1x
 CDCl3
 8 sc, 
 31.7.2024
##JCAMPDX= 6.0         $$ Bruker NMR JCAMP-DX V2.0
##DATA TYPE= NMR SPECTRUM
##DATA CLASS= NTUPLES
##ORIGIN= UXNMR, Bruker Analytische Messtechnik GmbH
##OWNER= root
$$ XWIN-NMR		Version 3.5
$$ Wed Jul 31 13:39:22 2024 Russian Standard Time (UT+4h)  she@DPX200
##.OBSERVE FREQUENCY= 200.1315
##.OBSERVE NUCLEUS= ^1H
##.ACQUISITION MODE= SIMULTANEOUS
##.ACQUISITION SCHEME= undefined
##.AVERAGES= 8
##.DIGITISER RES= 18
##SPECTROMETER/DATA SYSTEM= spect
##.PULSE SEQUENCE= zg30
##.SOLVENT NAME= DMSO
##.SHIFT REFERENCE= (INTERNAL, DMSO, 0, 20.2173)
##AUDIT TRAIL= $$ (NUMBER, WHEN, WHO, WHERE, WHAT)
$$ ##TITLE= Audit trail, XWIN-NMR		Version 3.5
$$ ##JCAMPDX= 5.01
$$ ##ORIGIN= Bruker BioSpin GmbH
$$ ##OWNER= she
$$ F:/spectra/data/she/nmr/H-F/1/pdata/1/auditp.txt
$$ ##AUDIT TRAIL=  $$ (NUMBER, WHEN, WHO, WHERE, WHAT)
(   1,<2024-07-31 13:37:56.71 +0400>,<she>,<DPX200>,
      <created by zg, POWCHK disabled, PULCHK disabled
       configuration hash MD5:
       00 E9 B6 7A A2 85 ED C7 34 08 36 98 17 FE 4E 26
       data hash MD5: 16K
       6A 33 89 4F 5E 16 46 0B 1E 17 17 B7 E0 9D FC 51>)
(   2,<2024-07-31 13:37:59.57 +0400>,<she>,<DPX200>,
      <Start of raw data processing
       efp BC_mod = 2 LB = 0.24 FT_mod = 6 PKNL = 1 PHC0 = -25638.89 PHC1 = 12.98749 SI = 16K 
       data hash MD5: 16K
       13 9E 44 95 01 BB 04 A3 40 8F 8F 7A 76 E9 F8 D1>)
(   3,<2024-07-31 13:38:19.53 +0400>,<she>,<DPX200>,
      <pk PHC0 = -3.773456 PHC1 = 3.6 
       data hash MD5: 16K
       11 78 FB 5E 91 07 81 51 91 22 A5 97 FA 15 34 43>)
(   4,<2024-07-31 13:38:24.14 +0400>,<she>,<DPX200>,
      <abs ABSG = 5 
       data hash MD5: 16K
       5D 1C 9B 5F 50 30 8F A7 ED AB F9 98 16 BE EC DA>)
$$ ##END=
$$ 
$$ hash MD5
$$ 63 2A 58 0F FB 3D 23 AD CD 0E 2D 0D C0 E4 7E DA
##$RELAX= 
##$RELAX= 
##$RELAX= 
##$RELAX= 
##$RELAX= 
##$RELAX= 
$$ Bruker specific parameters
$$ --------------------------
##$DU= <F:/spectra>
##$EXPNO= 1
##$NAME= <H-F>
##$PROCNO= 1
##$TYPE= <nmr>
##$USER= <she>
##$AMP= (0..31)
100 100 100 100 100 100 100 100 100 100 100 100 100 100 100 100 100 100 
100 100 100 100 100 100 100 100 100 100 100 100 100 100 
##$AQSEQ= 0
##$AQ_mod= 1
##$AUNM= <au_zg>
##$AUTOPOS= <>
##$BF1= 200.13
##$BF2= 200.13
##$BF3= 200.13
##$BF4= 200.13
##$BF5= 200.13
##$BF6= 200.13
##$BF7= 200.13
##$BF8= 200.13
##$BYTORDA= 1
##$CFDGTYP= 0
##$CFRGTYP= 5
##$CHEMSTR= <none>
##$CNST= (0..31)
1 1 145 1 1 1 1 1 1 1 1 1 1 1 1 1 1 1 1 1 1 1 1 1 1 1 1 1 1 1 1 1 
##$CPDPRG= <>
##$CPDPRG1= <>
##$CPDPRG2= <>
##$CPDPRG3= <>
##$CPDPRG4= <mlev>
##$CPDPRG5= <mlev>
##$CPDPRG6= <mlev>
##$CPDPRG7= <mlev>
##$CPDPRG8= <mlev>
##$CPDPRGB= <>
##$CPDPRGT= <>
##$D= (0..31)
0 1.2 0 0 0 0 0 0 0 0.06 0 0.03 0 0 0 0 0.0002 0 0 0 0 0 0 0 0 0 0 0 0 
0 0 0 
##$DATE= 1722418676
##$DBL= (0..7)
120 120 120 120 120 120 120 120 
##$DBP= (0..7)
150 150 150 150 150 150 150 150 
##$DBP07= 0
##$DBPNAM0= <>
##$DBPNAM1= <>
##$DBPNAM2= <>
##$DBPNAM3= <>
##$DBPNAM4= <>
$$ [...]
##$SUBNAM3= <"">
##$SUBNAM4= <"">
##$SUBNAM5= <"">
##$SUBNAM6= <"">
##$SUBNAM7= <"">
##$SUBNAM8= <"">
##$SUBNAM9= <"">
##$SW= 24.0689530833862
##$SWIBOX= (0..15)
0 0 2 0 0 0 0 0 0 0 0 0 0 0 0 0 
##$SW_h= 4816.95568400771
##$TD= 16384
##$TD0= 1
##$TE= 0
##$TE2= 300
##$TE3= 300
##$TEG= 300
##$TL= (0..7)
0 120 120 120 120 120 120 120 
##$TP= (0..7)
150 150 150 150 150 150 150 150 
##$TP07= 0
##$TPNAME0= <>
##$TPNAME1= <>
##$TPNAME2= <>
##$TPNAME3= <>
##$TPNAME4= <>
##$TPNAME5= <>
##$TPNAME6= <>
##$TPNAME7= <>
##$TPOAL= (0..7)
0.5 0.5 0.5 0.5 0.5 0.5 0.5 0.5 
##$TPOFFS= (0..7)
0 0 0 0 0 0 0 0 
##$TUNHIN= 0
##$TUNHOUT= 0
##$TUNXOUT= 0
##$USERA1= <user>
##$USERA2= <user>
##$USERA3= <user>
##$USERA4= <user>
##$USERA5= <user>
##$V9= 5
##$VALIST= <valist>
##$VCLIST= <CCCCCCCCCCCCCCC>
##$VD= 0
##$VDLIST= <DDDDDDDDDDDDDDD>
##$VPLIST= <PPPPPPPPPPPPPPP>
##$VTLIST= <TTTTTTTTTTTTTTT>
##$WBST= 1024
##$WBSW= 4
##$XGAIN= (0..3)
0 0 0 0 
##$XL= 0
##$YL= 0
##$YMAX_a= 113152
##$YMIN_a= -107631
##$ZGOPTNS= <>
##$ZL1= 120
##$ZL2= 120
##$ZL3= 120
##$ZL4= 120
##$ABSF1= 20.76817
##$ABSF2= -3.300993
##$ABSG= 5
##$ABSL= 3
##$ALPHA= 0
##$AQORDER= 0
##$ASSFAC= 0
##$ASSFACI= 0
##$ASSFACX= 0
##$ASSWID= 0
##$AUNMP= <proc_1d>
##$AZFE= 0.1
##$AZFW= 0.1
##$BCFW= 0
##$BC_mod= 2
##$BYTORDP= 0
##$COROFFS= 0
##$CY= -3
##$DATMOD= 1
##$DC= 0
##$DFILT= <>
##$DTYPP= 0
##$F1P= 0
##$F2P= 0
##$FCOR= 1
##$FTSIZE= 16384
##$FT_mod= 6
##$GAMMA= 0
##$GB= 0
##$INTBC= 1
##$INTSCL= 3.70164e-10
##$ISEN= 128
##$LB= 0.24
##$LEV0= 0
##$LPBIN= 0
##$MAXI= 10000
##$MC2= 0
##$MEAN= 0
##$ME_mod= 0
##$MI= 1.114404
##$NCOEF= 0
##$NC_proc= -6
##$NLEV= 6
##$NOISF1= 3.799351
##$NOISF2= 2.8
##$NSP= 0
##$NTH_PI= 0
##$NZP= 0
##$OFFSET= 20.21726
##$PC= 1
##$PHC0= -25642.66
##$PHC1= 16.58749
##$PH_mod= 1
##$PKNL= yes
##$PPARMOD= 0
##$PSCAL= 0
##$PSIGN= 0
##$REVERSE= no
##$SF= 200.129862398932
##$SI= 16384
##$SIGF1= 3
##$SIGF2= 2
##$SINO= 5.538805
##$SIOLD= 16384
##$SREGLST= <1H.CDCl3>
##$SSB= 0
##$STSI= 16384
##$STSR= 0
##$SW_p= 4816.95568400771
##$SYMM= 0
##$S_DEV= 0
##$TDeff= 16384
##$TDoff= 0
##$TI= <>
##$TILT= no
##$TM1= 0
##$TM2= 0
##$TOPLEV= 0
##$USERP1= <user>
##$USERP2= <user>
##$USERP3= <user>
##$USERP4= <user>
##$USERP5= <user>
##$WDW= 1
##$XDIM= 16384
##$YMAX_p= 475033702
##$YMIN_p= -366147
$$ End of Bruker specific parameters
$$ ---------------------------------
##NTUPLES= NMR SPECTRUM
##VAR_NAME=  FREQUENCY,     SPECTRUM/REAL,   SPECTRUM/IMAG
##SYMBOL=    X,             R,               I
##VAR_TYPE=  INDEPENDENT,   DEPENDENT,       DEPENDENT
##VAR_FORM=  AFFN,          ASDF,            ASDF
##VAR_DIM=   16384,         16384,           16384
##UNITS=     HZ,            ARBITRARY UNITS, ARBITRARY UNITS
##FACTOR=    0.29402158847633, 1,            1
##FIRST=     4046.07753407383, 0,            0
##LAST=      -770.87814993388, 0,            0
##MIN=       -770.87814993388, -366147,      0
##MAX=       4046.07753407383, 475033702,    0
$$ Real data points
##PAGE= N=1
##DATA TABLE= (X++(R..R)), XYDATA
$$ [...]
$$ plain form
8208 2048266 2038016 2186988 2213823 2454215 2440176 2624800 2627650 2735757 2743169 2888455 2954520
8197 2954520 3093118 3206934 3495440 3502227 4019879 3477367 2651382 3395833 3493156 3709017
8187 3709017 3867180 4044800 4021248 4204778 4384396 4454849 4646958 4779382 4920752 5126827
8177 5126827 5189307 5515669 5486038 5606377 5876053 6029183 6105792 6268218 6539290 6715943
8167 6715943 6901281 7020402 7227854 7482627 7625213 7789385 7971338 8264289 8396667 8554941
8157 8554941 8791812 8911799 9021092 9183495 9469146 9617530 9716630 9913108 10015701 10148755
8147 10148755 10212146 10224257 10199282 10304747 10429233 10494767 10510196 10373012 10443210 10559420
8137 10559420 10629305 10398210 10302936 10173706 10214565 10108763 9950945 9787819 9585324 9403294
$$ packed form
8208B048266j0250J48972K6835K40392j4039J84624K850J08107P412J45286O6065
8197B954520J38598J13816K88506O787N17652n42512q25985P44451R7323K15861
8187C709017J58163J77620k3552J83530J79618P0453J92109J32424J41370K06075
8177E126827O2480L26362k9631J20339K69676J53130P6609J62426K71072J76653
8167F715943J85338J19121K07452K54773J42586J64172J81953K92951J32378J58274
8157H554941K36871J19987J09293J62403K85651J48384R9100J96478J02593J33054
8147A0148755O3391J2111k4975J05465J24486O5534J5429j37184P0198J16210
8137A0559420O9885k31095r5274j29230M0859j05802j57818j63126k02495j82030
$$ plain form
8127 9403294 9242953 8994117 8846547 8944585 8614819 8258096 8022632 7929531 7845796 7581459
8117 7581459 7372829 7249016 6912565 6813750 6622435 6393337 6325831 6075531 5881031 5616644
8107 5616644 5621096 5560760 5328172 5115226 4798683 4618094 4523217 4564451 4368455 4222549
8097 4222549 4138967 4051860 4119529 3881933 3729214 3612755 3422019 3315680 3142262 3166640
8087 3166640 3023219 3041616 3119957 2837152 2785229 2760639 2757051 2606773 2515497 2415490 2133921
8076 2133921 2154031 2281880 2209111 2107079 2103343 1980731 2061205 2096245 1814330 1805664 1850597
8065 1850597 1796061 1690476 1550597 1481895 1496629 1494635 1430008 1513275 1468459 1341810 1364941
8054 1364941 1331775 1340818 1250272 1239911 1245981 1328814 1187143 1256653 1228303 1092084 1057989
$$ packed form
8127I403294j60341k48836j47570R8038l29766l56723k35464r3101q3735k64337
8117G581459k08630j23813l36451r8815j91315k29098o7506k50300j94500k64387
8107E616644M452o0336k32588k12946l16543j80589r4877M1234j95996j45906
8097D222549q3582q7107O7669k37596j52719j16459j90736j06339j73418K4378
8087C166640j43421J8397P8341k82805n1923k4590l588j50278r1276j00007k81569
8076B133921K0110J27849p2769j02032l736j22612Q0474L5040k81915q666M4933
8065A850597n4536j05585j39879o8702J4734j994o4627Q3267m4816j26649K3131
8054A364941l3166R043r0546j0361O070Q2833j41671O9510k8350j36219l4095
$$ plain form
8043 1057989 950255 1038739 1025061 910676 957158 1022153 968909 990008 1061292 1020705 834866
8032 834866 846371 847715 779279 794247 768652 687696 748226 692914 651331 777366 694944 689050
8020 689050 801545 713016 586783 544079 838680 759696 688035 759306 611201 485577 585844
8009 585844 622091 521140 545317 607644 539561 348462 445877 585052 558459 591990 467992
7998 467992 375816 268577 309506 353095 389865 340399 504799 427914 297322 330386 352124
7987 352124 321539 189856 195147 210546 316130 293075 336258 326288 259664 241878 390621
7976 390621 385102 386556 202526 205309 353688 510676 376307 217273 254285 434737 394953
7965 394953 346617 247047 140187 188438 291208 361951 188538 177565 20005 186162 134135
$$ packed form
8043A057989j07734Q8484j3678j14385M6482O4995n3244K1099P1284m0587j85839
8032H34866J1505J344o8436J4968k5595q0956O0530n5312m1583J26035q2422n894
8020F89050J12495q8529j26233m2704K94601p8984p1661P1271j48105j25624J00267
8009E85844L6247j00951K4177O2327o8083j91099R7415J39175k6593L3531j23998
7998D67992r2176j07239M0929M3589L6770m9466J64400p6885j30592L3064K1738
7987C52124l0585j31683N291J5399J05584k3055M3183r970o6624j7786J48743
7976C90621n519J454j84030K783J48379J56988j34369j59034L7012J80452l9784
7965C94953m8336r9570j06860M8251J02770P0743j73413j0973j57560J66157n2027
$$ plain form
7954 134135 204480 282943 112113 50190 259344 168650 203044 21089 40724 204418 176928
7943 176928 360467 293796 210047 339483 289101 184639 165545 303393 270718 47888 164647
7932 164647 181531 139198 1388 74733 86283 162381 207917 207134 162486 135846 224825 246755
7920 246755 161067 207533 284631 166718 141817 95616 199666 237403 269683 296964 76606
7909 76606 101540 85160 182306 151252 100874 116262 262114 213222 -24730 27347 234606
7898 234606 83297 99801 228562 151438 60580 40691 -6905 73442 61838 -11825 22677
7887 22677 31421 31117 32390 174614 129197 46990 4409 -34647 108304 21069 124792 203415
7875 203415 78890 74624 223482 276561 213105 195515 162944 227071 134895 69916 166178
$$ packed form
7954A34135P0345P8463j70830o1923K09154r0694L4394j81955J9635J63694k7490
7943A76928J83539o6671q3749J29436n0382j04462j9094J37848l2675k22830J16759
7932A64647J6884m2333j37810P3345J1550P6098M5536p83m4648k6640Q8979K1930
7920B46755q5688M6466P7098j17913k4901m6201J04050L7737L2280K7281k20358
7909G6606K4934j6380R7146l1054n0378J5388J45852m8892k37952N2077K07259
7898B34606j51309J6504J28761p7124r0858j9889m7596Q0347j1604p3663L4502
7887B2677Q744l04J273J42224m5417q2207m2581l9056J42951q7235J03723P8623
7875B03415j24525m266J48858N3079o3456j7590l2571O4127r2176o4979R6262
$$ plain form
7864 166178 85799 116079 102589 124996 138107 76211 130806 260299 173669 288421 226694
7853 226694 73690 70302 -17071 77714 202074 243268 183596 103424 89161 102663 150263
7842 150263 171614 275950 168572 70282 162806 149546 71611 -99523 143561 6410 -23353
7831 -23353 88261 197112 31225 84507 23711 183386 136861 -125059 -52859 -46990 52123
7820 52123 -24831 112568 139495 -65437 -6227 194392 118663 65131 161303 14672 -47236
7809 -47236 -83020 -84731 -101687 70847 3724 -23190 148174 199020 130059 -162052 -47745
7798 -47745 54009 36886 64979 130181 44358 31501 105334 -75886 -49023 11951 19329 102794
7786 102794 29059 54225 172920 142416 222846 146631 126884 50089 72633 181437 238989
$$ packed form
7864A66178q0379L0280j3490K2407J3111o1896N4595J29493q6630J14752o1727
7853B26694j53004l388q7373R4785J24360M1194n9672q0172j4263J3502M7600
7842A50263K1351J04336j07378r8290R2524j3260p7935j71134K43084j37151k9763
7831b3353J11614J08851j65887N3282o0796J59675m6525k61920P2200N869R9113
7820E2123p6954J37399K6927k04932N9210K00619p5729n3532R6172j46631o1908
7809d7236l5784j711j6956J72534o7123k6914J71364N0846o8961k92111J14307
7798d7745J01754j7123K8093O5202q5823j2857P3833j81220K6863O0974P378Q3465
7786A02794p3735K5166J18695l0504Q0430p6215j9747p6795K2544J08804N7552
$$ plain form
7775 238989 163298 101998 19768 -37882 148963 215635 40164 92102 48978 38574 -83484
7764 -83484 -173598 -119089 -44341 -3465 67559 -58407 -37704 8767 -15011 97031 -50858
7753 -50858 16629 -178015 -85796 -48953 -173774 46844 204348 196215 126167 76132 67414
7742 67414 51373 21714 52724 -38157 -83575 -52703 -103047 -86222 161863 212244 5289
7731 5289 -36902 -78289 -69916 13515 40613 -72950 -27790 -12190 13864 67619 123647 204735
7719 204735 9096 -29007 87151 73753 -32910 -84775 -31677 129803 91720 52616 -51917
7708 -51917 -53750 15619 -116075 -11759 85650 28038 -8988 73064 29262 102912 95679 223538
7696 223538 134013 81486 35677 27146 51857 126156 82861 129859 133868 228646 116650 123276
$$ packed form
7775B38989p5691o1300q2230n7650J86845O6672j75471N1938m3124j0404j22058
7764h3484r0114N4509P4748M0876P1024j25966K0703M6471k3778J12042j47889
7753e0858O7487j94644R2219L6843j24821K20618J57504q133p0048n0035q718
7742F7414j6041k9659L1010r0881m5418L0872n0344J6825K48085N0381k06955
7731E289m2191m1387Q373Q3431K7098j13563M5160J5600K6054N3755N6028Q1088
7719B04735j95639l8103J16158j3398j06663n1865N3098J61480l8083l9104j04533
7708e1917j833O9369j31694J04316R7409n7612l7026Q2052m3802P3650p233J27859
7696B23538q9525n2527m5809q531K4711P4299m3295M6998M009R4778j11996O626
$$ plain form
7684 123276 181914 140626 124091 206175 262389 140554 77047 18431 80811 141528 59083
7673 59083 106027 40119 131518 96112 -4417 -24567 -8019 -136067 37009 79344 86538
7662 86538 187792 268641 176732 128794 278806 213258 193224 211716 256823 116911 144198
7651 144198 253007 186606 54552 175507 272605 356063 289377 275198 119551 107548 165418
7640 165418 73010 184880 257259 96018 98545 157101 135123 182446 23532 -89121 3374
7629 3374 23227 66206 64510 133169 105035 98885 121554 86203 97741 46342 94429 109075
7617 109075 168557 250818 60410 17844 33913 148874 -1092 45713 127291 54003 78294
7606 78294 150295 47545 81247 88758 133387 139894 56017 -132382 16768 76733 173282 114459
$$ packed form
7684A23276N8638m1288j6535Q2084N6214j21835o3507n8616O2380O0717q2445
7673E9083M6944o5908R1399l5406j00529k0150J6548j28048J73076M2335P194
7662H6538J01254Q0849r1909m7938J50012o5548k0034J8492M5107j39912K7287
7651A44198J08809o6401j32054J20955R7098Q3458o6686j4179j55647j2003N7870
7640A65418r2408J11870P2379j61241K527N8556k1978M7323j58914j12653R2495
7629C374J9853M2979j696O8659k8134o150K2669l5351J1538n1399M8087J4646
7617A09075N9482Q2261j90408m2566J6069J14961j49966M6805Q1578p3288K4291
7606G8294P2001j02750L3702P511M4629O507q3877j88399J49150N9965R6549n8823
$$ plain form
7594 114459 11652 -50292 -52662 -41916 -49182 -14035 -55441 77355 -114374 4315 9497
7583 9497 -66923 -30996 -87187 14369 -37309 10113 431 4838 71138 15182 24069 94587
7571 94587 5600 38467 -27012 58630 52531 -35608 -14394 66114 54863 210103 203079 36389
7559 36389 62881 20154 -104129 -87719 -38461 -37181 95486 55561 120287 91727 -8373
7548 -8373 6738 -92540 10881 61688 239477 196701 -27691 78352 -34226 49954 22155
7537 22155 56248 54764 194936 125102 53490 18750 24581 -1054 10055 54147 95253 133124
7525 133124 -31169 -72228 -102671 -91547 -12338 33916 98276 46495 39252 9264 32536 91203
7513 91203 -41557 -206370 -75901 -49491 -22371 -81723 39252 91630 -11016 33341 96314
$$ packed form
7594A14459j02807o1944k370J0746p266L5147m1406J32796j91729J18689N182
7583I497p6420L5927n6191J01556n1678M7422r682M407O6300n5956Q887P0518
7571I4587q8987L2867o5479Q5642o099q8139K1214Q0508j1251J55240p024j66690
7559C6389K6492m2727j24283J6410M9258J280J32667l9925O4726k8560j00100
7548h373J5111r9278J03421N0807J77789m2776k24392J06043j12578Q4180k7799
7537B2155L4093j484J40172o9834p1612l4740N831k5635J1109M4092M1106L7871
7525A33124j64293m1059l0443J1124P9209M6254O4360n1781p243k9988K3272N8667
7513I1203j32760j64813J30469K6410K7120n9352J20975N2378j02646M4357O2973
$$ plain form
7502 96314 -31165 -88002 -33047 63541 -106114 -60184 -12559 -149666 21620 -95344 -43432
7491 -43432 -39636 -119844 -97837 -58154 -26793 2401 724 -19029 38680 21038 -119288 -225803
7479 -225803 -65592 107482 143171 205170 80415 46193 263037 107865 33764 66105 37192
7468 37192 3189 124994 88655 -25894 30761 -41836 -25946 193367 128135 33773 4244
7457 4244 -10744 -72443 -147693 53488 -40734 68008 123446 57811 176786 -79617 -214293
7446 -214293 -194707 -67850 5036 -32176 -28103 -69850 -61898 -18578 -87421 -26940 -49801 -145358
7434 -145358 -96014 -32611 35987 -29040 125590 129083 82253 111473 63252 -37561 -30098 83829
7422 83829 27058 48459 131958 210824 240723 93827 213692 224869 77193 18294 136999
$$ packed form
7502I6314j27479n6837N4955R6588j69655M5930M7625j37107J71286j16964N1912
7491d3432L796q0208K2007L9683L1361K9194j677j9753N7709j7642j40326j06515
7479b25803J60211J73074L5689O1999j24755l4222K16844j55172p4101L2341k8913
7468C7192l4003J21805l6339j14549N6655p2597J5890K19313o5232r4362k9529
7457D244j4988o1699p5250K01181r4222J08742N5438o5635J18975k56403j34676
7446b14293J9586J26857P2886l7212M073m1747P952M3320o8843O0481k2861r5557
7434a45358M9344O3403O8598o5027J54630L493m6830K9220m8221j00813P463J13927
7422H3829n6771K1401Q3499P8866K9899j46896J19865J1177j47676n8899J18705
$$ plain form
7411 136999 171899 109002 55141 112643 159766 171069 169526 89309 -18176 -13468 96146 111738
7399 111738 62919 120355 208591 190646 142853 321857 173999 131857 178025 20898 154624
7388 154624 56589 79394 292805 111669 109889 196265 322433 293304 191870 143192 -53826
7377 -53826 -47007 -43681 74156 197317 59975 54173 173617 182262 106672 -5322 -8847 131210
7365 131210 138108 50648 109711 162384 73694 89088 71907 237054 267384 242658 132820
7354 132820 6076 -16055 127486 130119 123122 189051 38700 163701 59599 69526 126618
7343 126618 40258 -59564 -78906 -103077 -538 -44974 22053 122191 207008 173784 76766
7332 76766 -28924 -21862 58381 -60345 -48252 -38148 -2675 89096 8590 -49452 41938 145058
$$ packed form
7411A36999L4900o2897n3861N7502M7123J1303j543q0217j07485M708J09614J5592
7399A11738m8819N7436Q8236j7945m7793J79004j47858m2142M6168j57127J33726
7388A54624r8035K2805K13411j81136j780Q6376J26168k9129j01434m8678j97018
7377e3826O819L326J17837J23161j37342n802J19444Q645p5590j11994l525J40057
7365A31210O898q7460N9063N2673q8690J5394j7181J65147L0330k4726j09838
7354A32820j26744k2131J43541K633o997O5929j50351J25001j04102R927N7092
7343A26618q6360r9822j9342k4171J02539m4436O7027J00138Q4817l3224r7018
7332G6766j05690P062Q0243j18726J2093J0104L5473R1771q0506n8042R1390J03120
$$ plain form
7320 145058 25945 -25755 9367 -173885 45323 -26695 -51202 23864 91662 209175 31041
7309 31041 21550 -61925 -54633 -24990 -65896 -48872 79614 47657 87095 -79654 -42270 86304
7297 86304 107676 -63461 -8115 135039 -35787 -35141 -95674 -197920 -34970 -12290 -84596
7286 -84596 -49708 -31941 55614 38024 45071 23153 38776 19632 -54372 -54701 -6248 54702
7274 54702 50785 -122839 11546 17699 -50655 -39986 -102859 -52498 -57773 -53493 37745 -81139
7262 -81139 -88033 -103839 -80037 -53103 120203 6178 -156001 -130855 -164021 -77742 -16960
7251 -16960 -128163 -125361 -89990 16009 -70164 -249343 -2987 -14856 7352 40209 -90994
7240 -90994 -85196 -110324 74636 92914 50087 -104005 -98064 -115379 -218264 -157551 -127273 -94622
$$ packed form
7320A45058j19113n1700L5122j83252K19208p2018k4507P5066O7798J17513j78134
7309C1041r491q3475P292K9643m0906J7024J28486l1957L9438j66749L7384J28574
7297H6304K1372j71137N5346J43154j70826O46o0533j02246J62950K2680p2306
7286h4596L4888J7767Q7555j7590P047k1918J5623j9144p4004l29M8453O0950
7274E4702l917j73624J34385O153o8354J0669o2873N0361n275M280R1238j18884
7262h1139o894j5806K3802K6934J73306j14025j62179K5146l3166Q6279O0782
7251a6960j11203K802L5371J05999q6173j79179K46356j1869K2208L2857j31203
7240i0994N798k5128J84960J8278m2827j54092N941j7315j02885O0713L0278L2651
$$ plain form
7228 -94622 -68492 -10186 8978 57789 -173756 -159692 -4617 -30024 40309 -59122 -137959
7217 -137959 -84078 -99177 -175784 -136668 39176 -18126 20188 -55164 -35253 -73573 -118380
7206 -118380 -41939 11777 -40171 -24786 115949 28848 31760 85158 -20460 17476 53496
7195 53496 -23895 -48240 109038 -47653 -44180 32425 124006 -42461 -18455 32560 -65231
7184 -65231 95108 51894 105048 -5691 -70 -151429 -85965 23374 48111 14034 68084
7173 68084 38895 80850 164798 22195 98053 -5443 68897 -11799 -89829 -79524 -62510
7162 -62510 63049 -85377 -150486 34112 47276 -21979 -98026 -77909 -68551 -39904 -144532
7151 -144532 -45990 -113508 -80864 -162126 -45699 59086 17128 -102254 -7815 1593 -2594
$$ packed form
7228i4622K6130N8306J9164M8811k31545J4064J55075k5407P0333r9431p8837
7217a37959N3881j5099p6607L9116J75844n7302L8314p5352J9911l8320m4807
7206a18380P6441N3716n1948J5385J40735q7101K912N3398j05618L7936L6020
7195E3496p7391k4345J57278j56691L473P6605R1581j66467K4006N1015r7791
7184f5231J60339m3214N3154j10739N621j51359O5464J09339K4737l4077N4050
7173F8084k9189M1955Q3948j42603P5858j03496P4340q0696p8030J0305J7014
7162f2510J25559j48426o5109J84598J3164o9255p6047K0117R358K8647j04628
7151a44532R8542o7518L2644q1262J16427J04785m1958j19382R4439R408m187
$$ plain form
7140 -2594 31171 -55414 -47210 40242 66841 4431 164073 120578 90664 -1370 9014 -65767
7128 -65767 -129161 -93376 -97260 -137240 27498 108615 43295 33495 68500 -139563 -45773 -107428
7116 -107428 -85980 -161207 33519 68053 -117569 -114710 -112296 -80633 -38983 17616 -29115 -112426
7104 -112426 -30132 -138129 -114814 -72696 -85869 70731 44300 -7586 -114006 -109975 14463
7093 14463 -56795 58171 7016 -28180 -87490 -104617 7532 -167019 -153856 -234736 -68568
7082 -68568 -6933 70627 -119813 -80641 7521 103816 83093 3838 122016 62464 -16133
7071 -16133 -33947 6270 -73260 -58012 -7027 94433 82884 -97247 -170245 -122676 -33335
7060 -33335 34550 -800 -156306 -85190 -65861 5380 -26334 -147627 -84193 -83378 -139002 -205368
$$ packed form
7140b594L3765q6585Q204Q7452K6599o2410J59642m3495k9914r2034J0384p4781
7128f5767o3394L5785l884l9980J64738Q1117o5320r800L5005k08063R3790o1655
7116a07428K1448p5227J94726L4534j85622K859K414L1663M1650N6599m6731q3311
7104a12426Q2294j07997K3315M2118j3173J56600k6431n1886j06420M031J24438
7093A4463p1258J14966n1155l5196n9310j7127J12149j74551J3163q0880J66168
7082f8568O1635P7560j90440L9172Q8162R6295k0723p9255J18178n9552p8597
7071a6133j7814M0217p9530J5248N0985J01460j1549j80131p2998M7569Q9341
7060c3335O7885l5350j55506P1116J9329P1241l1714j21293O3434Q15n5624o6366
$$ plain form
7048 -205368 -175061 -82447 -75891 -102577 -132707 -170375 -205035 -20274 -38536 -21887 125230
7037 125230 -114174 -31876 -81122 -73778 -128551 -44294 -158129 -258617 -292067 -160175 -14522
7026 -14522 121216 -2484 37864 -65975 -131883 -18974 107084 434 -118552 -82511
7016 -82511 -35634 -18431 -86666 -30378 -52590 -213642 -48022 -42865 -9073 69473 63784 36220
7004 36220 -83706 -50233 -159408 -203407 -98231 -40161 -74666 60480 112060 214962 195930
6993 195930 -77008 -86888 -86802 -131567 -84589 -49892 8021 -147401 -67180 35512 81501 23810
6981 23810 80325 -51647 -34492 -48043 -35288 -82557 -80783 -80895 -91431 -64056 -47837 -4834
6969 -4834 -57306 -77887 -3313 -62388 73672 -10197 80848 -154306 -287322 -240409 -80272
$$ packed form
7048b05368L0307R2614O556k6686l0130l7668l4660J84761j8262J6649J47117
7037A25230k39404Q2298m9246P344n4773Q4257j13835j00488l3450J31892J45653
7026a4522J35738j23700M0348j03839o5908J12909J26058j06650j18986L6041
7016h2511M6877J7203o8235N6288k2212j61052J65620N157L3792P8546n689k7564
7004C6220j19926L3473j09175m3999J05176N8070l4505J35146N1580J02902j9032
6993A95930k72938r880Q6m4765M6978L4697N7913j55422Q0221J02692M5989n7691
6981B3810N6515j31972J7155j3551J2755m7269J774j12j0536K7375J6219M3003
6969d834n2472k0581P4574n9075J36060q3869R1045k35154j33016M6913J60137
$$ plain form
6958 -80272 78223 -44435 -118621 -191216 -192748 -111563 -149717 11429 -25417 38899 -159936
6947 -159936 -128510 -85440 -10144 -17715 32985 -27244 -69929 -25850 -90063 -45782 -110286 -17881
6935 -17881 -123040 -71908 -53048 -78738 31588 71765 -123132 63415 16772 -35131 1321
6924 1321 57263 -68370 -190354 -166911 -193445 -314645 -245425 -78484 105997 49829 -44634
6913 -44634 42623 16410 -42827 -320 -98542 -73119 -62691 -186520 -65524 -99981 -199717
6902 -199717 -163329 -77556 -44678 -151822 -206140 -151325 -62351 39735 118585 -85165 -4615
6891 -4615 49791 156913 144006 -9027 39472 44597 44036 177359 37557 -18162 -68649 -97210
6879 -97210 -109092 -245397 -88883 -41680 -8225 -4773 -80552 28866 -12679 -28068 -82068
$$ packed form
6958h0272J58495j22658p4186p2595j532Q1185l8154J61146l6846O4316j98835
6947a59936L1426M3070P5296p571N0700o0229m2685M4079o4213M4281o4504R2405
6935a7881j05159N1132J8860k5690J10326M0177j94897J86547m6643n1903L6452
6924A321N5942j25633j21984K3443k6534j21200O9220J66941J84481n6168r4463
6913d4634Q7257k6213n9237M2507r8222K5423J0428j23829J20996l4457r9736
6902a99717L6388Q5773L2878j07144n4318N4815Q8974J02086P8850k03750Q0550
6891d615N4406J07122j2907j53033M8499N125n61J33323j39802n5719n0487k8561
6879i7210j1882j36305J56514M7203L3455L452p5779J09418m1545j5389n4000
$$ plain form
6868 -82068 -213140 -113577 -120523 -66731 -71521 -20174 -40457 19327 68428 -45956 -52331 -34450
6856 -34450 -129609 -294416 -66337 -52030 38073 59966 -8517 18399 -61820 -112805 2963
6845 2963 133195 13175 91174 -62269 30894 -45462 -88368 -4610 28061 -65257 306
6834 306 68955 57632 135914 -37683 35181 29239 47583 51516 132621 -34600 1285 -34772
6822 -34772 8138 38507 39134 -62146 -26951 -165622 -202003 -200356 4700 -9496 -89218 -10472
6810 -10472 -28158 9913 33503 10453 -23082 804 60104 -30309 -107050 -11258 -89191 35266
6798 35266 12163 5527 -24488 -14281 -7921 37667 35983 -8024 -83711 140868 80645 -62224
6786 -62224 -6857 46472 -10065 -122690 -66690 -79524 -145365 -113080 -81066 -25059 -174502
$$ packed form
6868h2068j31072R9563o946N3792m790N1347k0283N9784M9101j14384o375J7881
6856c4450r5159j64807K28079J4307R0103K1893o8483K6916q0219n0985J15768
6845B963J30232j20020P7999j53443R3163p6356m2906Q3758L2671r3318O5563
6834C06O8649j1323P8282j73597P2864n942J8344L933Q1105j67221L5885l6057
6822c4772M2910L0369O27j01280L5195j38671l6381J647K05056j4196p9722P8746
6810a0472j7686L8071K3590k3050l3535K3886N9300r0413p6741R5792p7933J24457
6798C5266k3103o636l0015J0207O360M5588j684m4007p5687K24579o0223j42869
6786f2224N5367N3329n6537j12625N6000j2834o5841L2285L2014N6007j49443
$$ plain form
6775 -174502 4035 124878 -56560 72243 9096 29773 2876 37803 143661 6094
6765 6094 -89635 -89459 -26325 -51124 -150599 -109207 -98386 -69632 37259 -81126 -104623 11202
6753 11202 -23142 -39678 -59054 -110335 -255383 -170806 -106058 -45667 -21575 145 -80998 37650
6741 37650 59511 -71908 -41901 -60544 -62907 -139704 -82145 -195513 -195847 -178318 20583 -128334
6729 -128334 -97799 -119973 -85043 -175190 -181443 -166892 32838 18154 -108279 -75131 29424
6718 29424 5092 -169246 -133246 34937 -36012 -101363 -45608 39351 -57221 -43412 12940
6707 12940 7651 -54144 58374 -26439 -141576 -55014 85382 25449 -168929 21111 -83025
6696 -83025 -64946 -44063 -160675 -28759 33639 25973 181562 182238 47342 93559 164446 31595
$$ packed form
6775a74502J78537J20843j81438J28803o3147K0677k6897L4927J05858j37567
6765F094r5729J76O3134k4799r9475M1392J0821K8754J06891j18385k3497J15825
6753A1202l4344j6536j9376n1281j45048Q4577O4748O0391K4092K1720q1143J18648
6741C7650K1861j31419L0007j8643k363p6797N7559j13368l34J7529J98901j48917
6729a28334L0535k2174L4930r0147o253J4551J99730j4684j26433L3148J04555
6718B9424k4332j74338L6000J68183p0949o5351N5755Q4959r6572J3809N6352
6707A2940n289o1795J12518q4813j15137Q6562J40396n9933j94378J90040j04136
6696h3025J8079K0883j16612J31916O2398p666J55589O76j34896M6217P0887j32851
$$ plain form
6684 31595 -79240 -217792 -28506 64698 137354 13609 -26241 63071 8743 -62253 -100210
6673 -100210 -162708 -147080 -108977 -155624 -152456 -126085 -25542 17971 56465 40667 -70760
6662 -70760 25092 -115593 -36314 -82292 -46168 -60854 11868 10147 -19029 75365 44849 13090
6650 13090 65725 10656 45844 121625 -85126 -153184 17032 84390 159751 120254 79421
6639 79421 20827 -107869 -89715 45727 93284 -612 1291 54660 -18542 -70550 33332
6628 33332 146300 8877 -82034 -3871 -104646 -130177 -117730 -51051 84069 181989 62147
6617 62147 38950 -38811 -160092 -103624 -70046 -43281 29197 53196 88254 94870 62033 -126294
6605 -126294 -187314 -93422 22508 3577 49156 -108874 -131258 -8454 -51783 90225 8365
$$ packed form
6684C1595j10835j38552J89286R3204P2656j23745l9850Q9312n4328p0996l7957
6673a00210o2498J5628L8103m6647L168K6371J00543M3513L8494j5798j11427
6662g0760R5852j40685P9279m5978L6124j4686P2722j721k9176R4394l0516l1759
6650A3090N2635n5069L5188P5781k06751o8058J70216O7358P5361l9497m0833
6639G9421n8594j28696J8154J35442M7557r3896J903N3369p3202n2008J03882
6628C3332J12968j37423r0911P8163j00775k5531J2447O6679J35120R7920j19842
6617F2147k3197p7761j21281N6468L3578K6765P2478K3999L5058O616l2837j88327
6605a26294o1020R3892J15930j8931M5579j58030k2384J22804m3329J42008q1860
$$ plain form
6594 8365 37557 8012 79694 57121 -43832 6915 90944 -12471 -106426 -141763 -139339 -112646
6582 -112646 -146259 -125914 -101925 -111036 -65566 -3949 -56607 -86823 -10283 47970 -130999 -29734
6570 -29734 21464 -8856 -83301 -23623 -37837 1995 -27282 -158259 -203592 -57037 -20659
6559 -20659 -141247 -32360 90018 125782 116325 -4335 -12966 105678 -64331 -46147 60942
6548 60942 8717 35544 -28277 42374 187638 125937 163776 -2637 38102 61708 9034
6537 9034 12434 -79948 -23546 -54301 -109768 -138379 -63682 -170798 -180171 -116264 -179016 -28690
6525 -28690 -27405 59078 -29211 -21934 -78539 -44867 39468 -482 -92474 -104331 -92311 -177681
6513 -177681 -121150 -4822 -154314 -219667 -8801 -23745 136112 -72636 -150212 28801
$$ packed form
6594H365K9192k9545P1682k2573j00953N0747Q4029j03415r3955l5337K424K6693
6582a12646l3613K0345K3989r111M5470O1617n2658l0216P6540N8253j78969J01265
6570b9734N1198l0320p4445N9678j4214L9832k9277j30977m5333J46555L6378
6559b0659j20588J08887J22378L5764r457j20660q631J18644j70009J8184J07089
6548F0942n2225K6827o3821P0651J45264o1701L7839j66413M0739K3606n2674
6537I034L400r2382N6402l0755n5467k8611P4697j07116r373O3907o2752J50326
6525b8690J285Q6483q8289P277n6605L3672Q4335l9950r1992j1857J2020q5370
6513a77681N6531J16328j49492o5353K10866j4944J59857k08748p7576J79013
$$ plain form
6503 28801 3794 30942 -9945 48736 60354 -1907 -124342 -118315 113901 -62252 -215148
6492 -215148 -95299 135875 88086 -21531 -52724 39359 -193955 -199999 -56450 -3190 121017
6481 121017 -47974 96284 -103425 -88447 -137514 -4693 79576 -61810 51475 50787 88832
6470 88832 -55366 -104625 -13533 -77498 -11427 -69614 -141626 -131302 -232937 -115231 -127426
6459 -127426 -85328 -153129 -50786 -84358 48523 6640 -52636 -68368 41218 -29479 46368
6448 46368 115970 -10300 -97456 10811 113216 -132380 -188281 -19459 -65738 -158669 -105620
6437 -105620 -27182 50373 18745 -25682 -59101 -64368 -15205 -18220 -181496 -70452 -120551 -90684
6425 -90684 -17738 -34379 -34581 -5170 -58709 53442 182218 136195 135297 63453 -17884 -159664
$$ packed form
6503B8801k5007K7148m0887N8681J1618o2261j22435O027K32216j76153j52896
6492b15148J19849K31174m7789j09617l1193R2083k33314o044J43549N3260J24207
6481A21017j68991J44258j99709J4978m9067J32821Q4269j41386J13285o88L8045
6470H8832j44198m9259R1092o3965O6071n8187p2012J0324j01635J17706j2195
6459a27426M2098o7801J02343l3572J32881m1883n9276j5732J09586p0697P5847
6448D6368O9602j26270q7156J08267J02405k45596n5901J68822m6279r2931N3049
6437a05620P8438P7555l1628m4427l3419n267M9163l015j63276J11044n0099K9867
6425i0684P2946j6641k02K9411n3539J12151J28776m6023q98p1844q1337j41780
$$ plain form
6413 -159664 -1809 -24370 -167709 -188755 -167645 -12397 -50799 -133929 -63074 54959 -847
6402 -847 60223 -52634 -161507 -244521 -75034 -68986 -10951 41067 39672 91265 -63484 -146804
6390 -146804 -32990 -65326 -100395 -97313 -137912 -29308 144818 138302 -176044 -133228 -94510
6379 -94510 -5139 25372 -101797 -90466 -88292 -38506 -7420 -109299 -20232 70910 -105085
6368 -105085 -61549 2151 30375 -5324 -714 12451 -137173 -160731 -23750 -29564 160805
6357 160805 -107018 -107978 -138574 -192591 -115063 -29202 50292 -70446 -87776 -55646 -128157 -133312
6345 -133312 -63153 19251 -56722 -138486 134314 76967 28581 23834 8820 -80906 -26924 -45304
6333 -45304 -147625 -28103 193134 163222 41124 -15342 -23145 -114753 -49004 -54196 26381
$$ packed form
6413a59664J57855k2561j43339k1046K1110J55248l8402q3130P0855J18033n5806
6402h47O1070j12857j08873q3014J69487O048N8035N2018j395N1593j54749q3320
6390a46804J13814l2336l5069L082m0599J08604J74126o516l14346M2816L8718
6379i4510Q9371L0511j27169J1331K174M9786L1086j01879Q9067R1142j75995
6368a05085M3536O3700K8224l5699M610J3165j49624k3558J36981n814J90369
6357A60805k67823r60l0596n4017P7528Q5861P9494j20738j7330L2130p2511n155
6345a33312P0159Q2404p5973q1764K72800n7347m8386m747j5014q9726N3982j8380
6333d5304j02321J19522K21237k9912j22098n6466p803r1608O5749n192Q0577
$$ plain form
6322 26381 2871 -69880 141839 111116 101380 3534 -27487 29744 27236 115457 168233 123687
6310 123687 -56161 -127682 -90521 -76680 57613 -74734 -99860 19731 6311 38339 -161407
6299 -161407 -278389 -77456 -60675 -109906 -137274 -101993 -80614 -136575 -18351 -50734 -4941
6288 -4941 -85385 -58493 507 -8966 -8255 -88863 -211710 37620 60986 109986 183835 -44188
6276 -44188 -111356 -74957 -118253 -93342 -138414 -109583 -73854 -85388 25968 -24235 -202245
6265 -202245 -83979 -29502 21855 -48316 -257939 -179218 -228324 -66944 -102210 -18032 65008
6254 65008 81811 17281 42270 73674 154196 111220 13408 -117620 47851 3665 -154618
6243 -154618 -169821 -129985 -31608 12254 180125 61872 -31068 -4734 48695 -193288 -116993
$$ packed form
6322B6381k3510p2751K11719l0723r736r7846l1021N7231k508Q8221N2776m4546
6310A23687j79848p1521L7161J3841J34293j32347k5126J19591j3420L2028j99746
6299a61407j16982K00933J6781m9231k7368L5281K1379n5961J18224l2383M5793
6288d941q0444K6892N9000r473P11q0608j22847K49330K3366M9000P3849k28023
6276d4188o7168L6399m3296K4911m5072K8831L5729j1534J11356n0203j78010
6265b02245J18266N4477N1357p0171k09623P8721m9106J61380l5266Q4178Q3040
6254F5008J6803o4530K4989L1404Q0522m2976r7812j31028J65471m4186j58283
6243a54618j5203L9836R8377M3862J67871j18253r2940K6334N3429k41983P6295
$$ plain form
6232 -116993 8704 72421 -23350 -94316 -41661 -216571 -170075 -53693 -46978 -890 90261
6221 90261 -84643 -72162 117339 -50755 -170780 -106445 -10675 127301 127175 44577 36134
6210 36134 -79417 -343 -93240 -233167 -242591 -110341 2630 23115 165688 15236 -155085
6199 -155085 -21647 -6968 21589 200597 140263 59510 28093 24069 31948 88421 36242 111970
6187 111970 73573 115544 65720 64827 -32198 -49686 4248 -96474 -20036 1131 52205 845
6175 845 6920 29185 43393 -84437 78189 93873 37346 -17764 -24465 15884 108668 153470
6163 153470 17637 80131 21114 -57236 -18478 -67072 -99154 -93288 -141277 -143678 -134204 -19548
6151 -19548 -130262 -147350 143472 64551 -4015 9286 8231 -47650 -56662 18998 60403 -2336
$$ packed form
6232a16993J25697O3717r5771p0966N2655j74910M6496J16382O715M6088R1151
6221I0261j74904J2481J89501j68094j20025O4335R5770J37976j26q2598q443
6210C6134j15551P9074r2897j39927r424J32250J12971K0485J42573j50452j70321
6199a55085J33438J4679K8557J79008o0334q0753l1417m024P879N6473n2179P5728
6187A11970l8397M1971m9824q93r7025j7488N3934j00722P6438K1167N1074n1360
6175H45O075K2265J4208j27830J62626J5684n6527n5110o701M0349R2784M4802
6163A53470j35833O2494n9017p8350L8758m8594l2082N866m7989k401R474J14656
6151a9548j10714j7088K90822p8921o8566J3301j055n5881r012P5660M1405o2739
$$ plain form
6139 -2336 66083 53277 100273 29920 12190 110518 15493 62724 29987 31113 131257 46126
6127 46126 -91215 -117542 -154638 -250723 -195458 15570 -43435 11141 36009 70133 96568
6116 96568 92048 -131945 -244426 -45529 26443 -13941 -95695 53756 125565 73314 -24961
6105 -24961 23508 39120 -25500 80273 67707 55791 -22145 -49728 37354 55493 35081 18444
6093 18444 -18235 -5772 167220 126119 113661 96948 -86900 171510 75164 6239 125139
6082 125139 25006 56001 141353 -773 -35912 53610 195882 21570 -146043 -127106 -73082
6071 -73082 -105173 -12220 65238 -47419 -228235 -92596 61698 -8126 75113 -58042 75887
6060 75887 -11797 -24830 -3626 1289 104162 -16692 53809 105965 121703 56900 -25432 -39858
$$ packed form
6139b336O8419j2806M6996p0353j7730R8328r5025M7231l2737J126J00144q5131
6127D6126j37341k6327l7096r6085N5265K11028n9005N4576K4868L4124K6435
6116I6568m520k23993j12481J98897P1972m0384q1754J49451P1809n2251r8275
6105b4961M8469J5612o4620J05773j2566j1916p7936k7583Q7082J8139k0412j6637
6093A8444l6679J2463J72992m1101j2458j6713j83848K58410r6346o8925J18900
6082A25139j00133L0995Q5352j42126l5139Q9522J42272j74312j67613J8937N4024
6071g3082l2091R2953P7458j12657j80816J35639J54294o9824Q3239j33155J33929
6060G5887q7684j3033K1204M915J02873j20854P0501N2156J5738o4803q2332j4426
$$ plain form
6048 -39858 18866 76272 143250 44707 -10179 34464 -47226 12525 22248 45906 159432 47612
6036 47612 -48534 -11789 -74583 -15514 -108629 -178837 -121502 -2749 -83291 70317 77500 69832
6024 69832 209033 105881 17638 9985 -55761 -125632 -60604 -97701 -59982 -27146 19503 -47691
6012 -47691 -93873 -71176 -145177 -169253 -122681 -52884 -46635 -56172 37600 -97724 -62580 -50918
6000 -50918 -151142 -30643 59412 -145319 -78747 -84396 -153701 -54056 9576 13564 -22915 10355
5988 10355 72049 63613 -9508 17606 102801 61671 -124297 -115494 -96248 -152857 16292 30586
5976 30586 -35375 29418 -80393 -241671 -182672 15364 -141657 -145393 -82600 -73507 -145769
5965 -145769 -123354 -55201 -1511 -176768 -130820 -45439 50029 -21063 110613 93552 45030
$$ packed form
6048c9858N8724N7406O6978r8543n4886M4643q1690N9751R723K3658J13526j11820
6036D7612r6146L6745o2794N9069r3115p0208N7335J18753q0542J53608P183p668
6024F9832J39201j03152q8243p653o5746o9871O5028l7097L7719L2836M6649o7194
6012d7691m6182K2697p4001k4076M6572O9797O249r537R3772j35324L5144J1662
6000e0918j00224J20499R0055k04731O6572n649o9305R9645O3632L988l6479L3270
5988A0355O1694q436p3121K7114Q5195m1130j85968Q803J9246n6609J69149J4294
5976C0586o5961O4793j09811j61278N8999J98036j57021l736O2793R093p2262
5965a45769K2415O8153N3690j75257M5948Q5381R5468p1092J31676j7061m8522
$$ plain form
5954 45030 3803 -113156 2298 31727 44374 -41434 -61882 66188 53682 -22508 -98898
5943 -98898 -146794 -165428 -80800 -11860 166824 40915 43615 43944 -91243 -87524 -3054 -24313
5931 -24313 -49901 -25183 -114734 7931 -34803 181511 23186 -6576 204900 208488 36541
5920 36541 73772 21410 -76223 -66818 86231 41048 7182 24110 1108 -19167 -32127 149994
5908 149994 91579 -13255 147162 60379 -42498 -30955 -46726 20280 -164721 -53739 -60563
5897 -60563 -85698 -173778 -150391 -92273 -41539 -15132 -34987 80391 33694 54206 -98793
5886 -98793 -62173 74095 137758 -95847 -32836 -28799 -113511 -141161 -40345 -13992 82174
5875 82174 66555 34535 106295 37958 81120 61303 -119245 -116960 9886 -31070 -69270 -92789
$$ packed form
5954D5030m1227j16959J15454K9429J2647q5808k0448J28070j2506p6190p6390
5943i8898m7896j8634Q4628O8940J78684j25909K700L29j35187L719Q4470k1259
5931b4313k5588K4718q9551J22665m2734K16314j58325k9762K11476L588j71947
5920C6541L7231n2362r7633R405J53049m5183l3866J6928k3002k0275j2960J82121
5908A49994n8415j04834J60417q6783j02877J1543j5771O7006j85001J10982o824
5897f0563k5135q8080K3387N8118N0734K6407j9855J15378m6697K0512j52999
5886i8793L6620J36268O3663k33605O3011M037q4712k7650J00816K6353R6166
5875H2174j5619l2020P1760o8337M3162j9817j80548K285J26846m0956l8200k3519
$$ plain form
5863 -92789 -128069 -147229 -67968 -24095 20009 72130 11298 -70409 -250956 -100136 7033
5852 7033 -75949 -57813 -50026 -90708 -129679 -25025 -2908 10808 -13999 161859 123509 7350
5840 7350 -12282 -33865 -165600 -79355 -53752 -78585 -167428 -114952 -14389 -52613 85349
5829 85349 112327 5196 -9591 -123766 -35105 50597 -9558 58705 -101972 -89324 11503
5818 11503 -11997 -30134 73748 -14916 34864 131662 33978 42748 16850 14242 -68804 35761
5806 35761 108475 113532 49949 -73662 -6039 -45344 -31261 78129 73255 31687 178010 62541
5794 62541 -80403 -9458 31711 38999 -58284 -24266 -99620 8128 6117 70976 183732 121654
5782 121654 -71176 -73147 69303 6037 79627 -10844 -45151 -63903 -60338 82564 172326
$$ packed form
5863i2789l5280j9160P9261M3873M4104N2121o0832q1707j80547J50820J07169
5852G033q2982J8136P787m0682l8971J04654K2117J3716k4807J75858l8350j16159
5840G350j9632k1583j31735Q6245K5603k4833q8843N2476J00563l8224J37962
5829H5349K6978j07131j4787j14175Q8661Q5702o0155O8263j60677J2648J00827
5818A1503k3500j8137J03882q8664M9780R6798r7684Q770k5898k608q3046J04565
5806C5761P2714N057o3583j23611O7623l9305J4083J09390m874m1568J46323j15469
5794F2541j42944P0945M1169P288r7283L4018p5354J07748k011O4859J12756o2078
5782A21654j92830j971J42450o3266P3590r0471l4307j8752L565J42902Q9762
$$ plain form
5771 172326 101030 -30137 -9483 -37755 105468 -52923 -49903 -40041 -15952 125609 2471
5760 2471 -145636 26400 86734 37699 72510 -95873 4878 36193 72551 -18559 49761
5749 49761 96763 -51257 11484 17511 -65989 -29681 7525 55208 57147 63757 -21410 15453
5737 15453 -26910 -10958 29341 779 72020 57607 -74063 -36421 -101544 78578 -96349
5726 -96349 -148039 4727 17795 -7889 -104108 -36952 -39686 -78198 -16795 -22708 74497 243099
5714 243099 95029 62518 -63004 60386 85313 147722 -25327 -18524 -3616 120505 118409
5703 118409 -2772 215963 87739 -50824 -32253 -9645 80974 57147 27554 111461 87602
5692 87602 22824 -18448 49124 12508 34731 -47981 -33133 -35367 -29441 38397 143595 63454
$$ packed form
5771A72326p1296j31167K0654k8272J43223j58391L020R862K4089J41561j23138
5760B471j48107J72036O0334m9035L4811j68383J00751L1315L6358r1110O8320
5749D9761M7002j48020O2741O027q3500L6308L7206M7683J939O610q5167L6863
5737A5453m2363J5952M0299k8562P1241j4413j31670L7642o5123J80122j74927
5726i6349n1690J52766J3068k5684r6219O7156k734l8512O1403n913R7205J68602
5714B43099j48070l2511j25522J23390K4927O2409j73049O803J4908J24121k096
5703A18409j21181K18735j28224j38563J8571K2608R0619k3827k9593Q3907k3859
5692H7602o4778m1272O7572l6616K2223q2712J4848k234N926O7838J05198q0141
$$ plain form
5680 63454 90104 158903 80221 39196 23938 -46467 -93972 -63138 -162789 -132691 -108475 3793
5668 3793 -40744 19812 30209 -51071 -96144 -51266 -769 9449 -73442 -154874 12918 145539
5656 145539 102609 52621 32039 102475 15532 -3577 -83724 238 65942 14103 34931 78650
5644 78650 61270 -90903 -119357 -117101 -129419 -27746 -35452 -62372 -52853 -68480 -11716 59937
5632 59937 151283 9701 -84968 6663 31014 -28772 121152 -62371 -70591 -7032 142257
5621 142257 29286 -78456 14838 -85262 89841 57021 -24344 -46622 77410 127585 70651
5610 70651 150735 119497 18031 -47844 -6519 -2476 93573 11689 -233848 -115422 -76878
5599 -76878 11584 -18560 -53858 -135354 9626 23668 61117 8791 -104971 -24414 56967
$$ packed form
5680F3454K6650O8799p8682m1025j5258p0405m7505L0834r9651L0098K4216J12268
5668C793m4537O0556J0397q1280m5073M4878N0497J0218q2891q1432J67792J32621
5656A45539m2930m9988k0582P0436q6943j9109q0147Q3962O5704n1839K0828M3719
5644G8650j7380j52173k8454K256j2318J01673p706k6920R519j5627N6764P1653
5632E9937R1346j41582r4669R1631K4351n9786J49924j83523q220O3559J49289
5621A42257j12971j07742R3294j00100J75103l2820q1365k2278J24032N0175n6934
5610G0651Q0084l1238j01466o5875M1325M043R6049q1884k45537J18426L8544
5599g6878Q8462l0144l5298q1496J44980J4042L7449n2326j13762Q0557Q1381
$$ plain form
5588 56967 17565 -88520 128974 185570 216337 149515 100049 73184 13547 118052 238144
5577 238144 50968 38404 -4677 98086 157048 159740 37122 -7095 81312 145331 139589
5566 139589 109013 -15981 14001 7540 -25215 -111 31835 -29797 -125774 10574 147805
5555 147805 94246 118844 84843 145480 91648 110557 248597 249075 74977 36812 78853 46364
5543 46364 99161 134451 173960 184653 91136 166691 181707 245642 411038 412210 384803 233533
5531 233533 262106 218960 305959 260362 351635 278016 337550 329484 364708 370063 397821 251020
5519 251020 243081 256629 173947 364396 442004 359140 395129 302813 255212 161084 329611
5508 329611 447242 483123 421757 197990 176659 296825 318243 228617 275009 260135 364422
$$ packed form
5588E6967l9402j06085K17494N6596L0767o6822m9466k6865n9637J04505J20092
5577B38144j87176j2564m3081J02763N8962K692j22618m4217Q8407O4019n742
5566A39589l0576j24994K9982o461l2755K5104L1946o1632r5977J36348J37231
5555A47805n3559K4598l4001O0637n3832J8909J38040M78j74098l8165M2041l2489
5543D6364N2797L5290L9509J0693r3517P5555J5016O3935J65396J172k7407j51270
5531B33533K8573m3146Q6999m5597R1273p3619N9534q066L5224N355K7758j46801
5519B51020p939J3548q2682J90449P7608q2864L5989r2316m7601r4128J68527
5508C29611J17631L5881o1366k23767k1331J20166K1418q9626M6392j4874J04287
$$ plain form
5497 364422 289272 267362 237857 251045 209720 120856 116817 140661 285388 255706 260839 364144
5485 364144 382963 266274 317790 253663 285665 174446 -110109 39663 268860 309269 110654
5474 110654 119634 192444 223027 418147 329518 71358 48949 -34841 105319 206168 94042
5463 94042 112265 121777 -27139 41996 144499 -9536 9039 191462 61957 138924 163035
5452 163035 102471 8657 -9048 183475 33589 115490 141437 163937 166909 -66047 65428
5441 65428 191366 290950 271685 16616 152859 139458 39131 151603 170685 99291 116808
5430 116808 151788 61520 104060 30199 94183 84445 15889 35662 161433 -52381 10542
5419 10542 63629 -72164 56080 81228 42316 -56021 -42135 -25970 -47867 33904 171493
$$ packed form
5497C64422p5150k1910k9505J3188m1325q8864m039K3844J44727k9682N133J03305
5485C64144J8819j16689N1516o4127L2002j11219k84555J49772K29197M0409j98615
5474A10654Q980P2810L0583J95120q8629k58160k2409q3790J40160J00849j12126
5463I4042J8223R512j48916O9135J02503j54035J8575J82423j29505P6967K4111
5452A63035o0564r3814j7705J92523j49886Q1901K5947K2500K972k32956J31475
5441F5428J25938R9584j9265k55069J36243j3401j00327J12472J9082p1394J7517
5430A16808L4980r0268M2540p3861O3984r738o8556J9773J25771k13814O2923
5419A0542N3087j35793J28244K5148l8912r8337J3886J6165k1897Q1771J37589
$$ plain form
5408 171493 -30028 -4238 241234 67536 96139 86953 211300 188607 217757 147840 76584
5397 76584 74782 34203 70837 34479 118278 198432 143832 159215 127882 89089 120113 178329
5385 178329 128284 52441 139549 152661 133079 134088 177792 105794 171709 32078 26518 28046
5373 28046 133353 54778 -15018 -1764 -123394 -63881 25833 -65754 -56728 160593 220082
5362 220082 181889 354203 131829 30386 180701 142079 86413 104811 164558 6731 72806
5351 72806 125976 148113 -1456 5626 93313 122057 185396 133854 193712 210317 261508 184081
5339 184081 237781 260179 179077 208724 52493 77452 129291 17572 15357 -35797 2134
5328 2134 119777 204972 92513 38619 120350 184964 79795 71358 131539 244175 247662 154300
$$ packed form
5408A71493k01521K5790K45472j73698K8603r186J24347k2693K9150o9917p1256
5397G6584j802m0579L6634l6358Q3799Q0154n4600J5383l1333l8793L1024N8216
5385A78329n0045p5843Q7108J3112j9582J009M3704p1998O5915j39631n560J528
5373B8046J05307p8575o9796J3254j21630N9513Q9714r1587R026K17321N9489
5362B20082l8193J72314k22374j01443J50315l8622n5666J8398N9747j57827O6075
5351G2806N3170K2137j49569P082Q7687K8744O3339n1542N9858J6605N1191p7427
5339A84081N3700K2398q1102K9647j56231K4959N1839j11719k215n1154L7931
5328B134J17643Q5195j12459n3894Q1731O4614j05169q437O0181J12636L487r3362
$$ plain form
5316 154300 103955 -37190 70011 259033 134467 186673 83969 118912 158318 84070 141232
5305 141232 147373 132832 4781 82439 87776 348908 336934 154660 248402 243812 198899 201463
5293 201463 198966 183428 183941 133728 103259 114790 106708 18873 71755 -18012 73341 21706
5281 21706 -16766 10344 128726 223436 217868 192790 133983 194539 108014 165419 353571 312461
5269 312461 164115 125349 172534 205429 216487 253157 101340 231247 192467 48166 110403
5258 110403 117290 91059 231696 273465 248961 239528 110453 283371 462539 369344 371207
5247 371207 307806 259973 205614 197841 252484 52637 135888 348393 276172 123888 -61022
5236 -61022 161451 243374 175855 153689 264199 259163 308628 358924 258360 334224 372827
$$ packed form
5316A54300n0345j41145J07201J89022j24566N2206j02704L4943L9406p4248N7162
5305A41232O141j4541j28051P7658N337K61132j1974j82274R3742m590m4913K564
5293B01463k497j5538N13n0213l0469J1531q082q7835N2882q9767R1353n1635
5281B1706l8472K7110J18382R4710n568k5078n8807O0556q6525N7405J88152m1110
5269C12461j48346l8766M7185L2895J1058L6670j51817J29907l8780j44301O2237
5258A10403O887k6231J40637M1769k4504r433j29075J72918J79168r3195J863
5247C71207o3401m7833n4359p773N4643j99847Q3251K12505p2221j52284j84910
5236f1022K22473Q1923o7519k2166J10510n036M9465N0296j00564P5864L8603
$$ plain form
5225 372827 246251 243959 268863 405345 416279 270677 287167 402333 432130 404091 373595
5214 373595 325062 233807 327220 227664 206774 377528 354198 284835 342177 315237 222239
5203 222239 431825 433727 440524 424030 430095 352782 457636 531778 431977 354543 348005 359265
5191 359265 441668 457791 368579 493278 504457 500194 443969 433907 520493 403275 523363
5180 523363 517321 395233 458493 535781 505405 424421 490872 561403 598582 518698 397288
5169 397288 612218 669904 594740 682503 508069 441586 543944 774559 771519 735591 553502
5158 553502 728022 800885 653944 669268 738735 812065 720825 801265 860887 780045 688086
5147 688086 746484 828516 914850 951884 1039684 928288 803630 813337 1002992 1030237 1045175
$$ packed form
5225C72827j26576k292K4904J36482J0934j45602J6490J15166K9797k8039l0496
5214C73595m8533r1255R3413r9556k0890J70754k3330o9363N7342k6940r2998
5203B22239K09586J902O797j6494O065p7313J04854P4142r9801p7434o538J1260
5191C59265Q2403J6123q9212J24699J1179m263n6225j0062Q6586j17218J20088
5180E23363o042j22088O3260P7288l0376q0984O6451P0531L7179p9884j21410
5169C97288K14930N7686p5164Q7763j74434o6483J02358K30615l040l5928j82089
5158E53502J74520P2863j46941J5324O9467P3330r1240Q0440N9622q0842r1959
5147F88086N8398Q2032Q6334L7034Q7800j11396j24658R707J89655K7245J4938
$$ plain form
5136 1045175 1139417 1036351 1175306 1253418 1033678 991443 957542 918490 1012204 1014559 1079426
5125 1079426 1131957 1092149 1055019 1080917 1138908 1208501 1070171 1148352 1058738 1122061 1138180
5114 1138180 1152991 1244519 1146768 1081910 1032300 1217563 1304409 1172312 1089680 1188632 1095903
5103 1095903 1204484 1252017 1167530 1295455 1327172 1252196 1258560 1264826 1324295 1481431 1451473
5092 1451473 1239936 1397884 1529690 1634219 1514818 1371862 1446340 1472452 1440470 1536299
5082 1536299 1505054 1609239 1634116 1558668 1557075 1535355 1673760 1742286 1691870 1742398 1718991
5071 1718991 1747825 1643704 1766712 1780943 1886023 1920011 1940031 2039501 1889213 1812836 1942154
5060 1942154 1932477 1947745 1905854 2018740 2039184 1888946 2048817 2006919 1974402 1876972 1991808
$$ packed form
5136A045175R4242j03066J38955P8112k19740m2235l3901l9052R3714K355O4867
5125A079426N2531l9808l7130K5898N7991O9593j38330P8181q9614O3323J6119
5114A138180J4811R1528r7751o4858m9610J85263Q6846j32097q2632R8952r2729
5103A095903J08581M7533q4487J27925L1717p4976O364O266N9469J57136k9958
5092A451473k11537J57948J31806J04529j19401j42956P4478K6112l1982R5829
5082A536299l1245J04185K4877p5448j593k1720J38405O8526n0416N0528k3407
5071A718991K8834j04121J23008J4231J05080L3988K0020R9470j50288p6377J29318
5060A942154r677J5268m1891J12886K0444j50238J59871m1898l2517r7430J14836
$$ plain form
5049 1991808 2044874 2064543 2067385 2032615 2213809 2108638 2060457 2084758 2004976 1932802 2069613
5038 2069613 2192792 2286334 2166934 2238618 2341356 2316819 2244512 2309233 2245264 2319705 2440431
5027 2440431 2395721 2615901 2651761 2621756 2773871 2687784 2682278 2710727 2699371 2793215 2916268
5016 2916268 2971701 2802675 2887411 2997931 3048302 2914120 3135212 3261306 3333341 3421940
5006 3421940 3555457 3594011 3645335 3709736 3601593 3648537 3826176 3838895 3965407 4128537
4996 4128537 4285590 4384226 4492988 4551549 4791796 4959225 5078915 5233657 5293195 5354331
4986 5354331 5625205 5731350 5923267 6203436 6487540 6662765 6989916 7225260 7481697 7749923
4976 7749923 8007617 8272718 8584824 8900788 9370329 9743737 10223616 10669575 11305057 11846842
$$ packed form
5049A991808N3066J9669K842l4770J81194j05171m8181K4301p9782p2174J36811
5038B069613J23179R3542j19400P1684J02738k4537p2307O4721o3969P4441J20726
5027B440431m4710K20180L5860l0005J52115q6087n506K8449j1356R3844J23053
5016B916268N5433j69026Q4736J10520N0371j34182K21092J26094P2035Q8599
5006C421940J33517L8554N1324O4401j08143M6944J77639J2719J26512J63130
4996D128537J57053R8636J08762N8561K40247J67429J19690J54742N9538O1136
4986E354331K70874J06145J91917K80169K84104J75225L27151K35344K56437K68226
4976G749923K57694K65101L12106L15964M69541L73408M79879M45959O35482N41785
$$ plain form
4966 11846842 12529557 13285733 14227597 14944555 15784012 16833191 18168876 19583307 21290976
4957 21290976 23466332 25934484 28561260 31122728 34096727 36995370 39587903 41855711
4949 41855711 43784118 46139576 48721681 51202982 53591902 56365567 59220975 62891962
4941 62891962 66832285 71596024 76947554 83249638 90316624 98153092 106767462 115882641
4933 115882641 126322448 138795830 153353203 170999553 193058864 221917101 261163461
4926 261163461 317471688 386236537 446226497 475033702 458128956 417373569 366544607
4919 366544607 316552218 271112694 228257096 193218042 164842206 142346104 124476256
4912 124476256 110586893 99152164 89591747 81482936 74425083 67891006 62409504 57363179
$$ packed form
4966A1846842O82715P56176R41864P16958Q39457J049179J335685J414431J707669
4957B1290976K175356K468152K626776K561468K973999K898643K592533K267808
4949D1855711J928407K355458K582105K481301K388920K773665K855408L670987
4941F2891962L940323M763739N351530O302084P066986P836468Q614370R115179
4933A15882641J0439807J2473382J4557373J7646350K2059311K8858237L9246360
4926B61163461N6308227O8764849N9989960K8807205j6904746m0755387n0828962
4919C66544607m9992389m5439524m2855598l5039054k8375836k2496102j7869848
4912A24476256j3889363j1434729r560417q108811p057853o534077n481502n046325
$$ plain form
4904 57363179 53148243 49428714 46121060 43131772 40432609 37948138 35741388 33858762
4896 33858762 31898206 30119275 28696996 27294759 25987485 24824444 23686108 22548688
4888 22548688 21433311 20556533 19657976 18838206 17996652 17197624 16518622 15841957 15132571
4879 15132571 14406286 13655744 13170607 12615409 12099002 11406957 11001975 10644327 10419548
4870 10419548 9959794 9531314 9149533 8665671 8472083 8302566 7882969 7595752 7601809 7426659
4860 7426659 7051299 6808861 6872559 6462818 6237362 6059165 5930489 5792178 5696387 5382264
4850 5382264 5344052 5215487 5254578 4984554 4873453 4763406 4712806 4596428 4464965 4388851
4840 4388851 4185248 4113141 3812405 3738561 3729074 3661943 3743777 3557317 3302089 3219702 3186594
$$ packed form
4904E7363179m214936l719529l307654k989288k699163k484471k206750j882626
4896C3858762j960556j778931j422279j402237j307274j163041j138336j137420
4888B2548688j115377q76778q98557q19770q41554p99028o79002o76665p09386
4879A5132571p26285p50542m85137n55198n16407o92045m04982l57648k24779
4870A0419548m59754m28480l81781m83862j93588j69517m19597k87217O057j75150
4860G426659l75360k42438O3698m09741k25456j78197j28676j38311r5791l14123
4850E382264l8212j28565L9091k70024j11101j10047n0600j16378j31463p6114
4840D388851k03603p2107l00736p3844r487o7131Q1834j86460k55228q2387l3108
$$ plain form
4829 3186594 3132326 3056430 2841771 3021163 3168309 2886368 2942317 2821956 2720013 2521895
4819 2521895 2496474 2509447 2675954 2609964 2447036 2488062 2300817 2343346 2438482 2411208 2378522
4808 2378522 2297583 2127931 2125704 2133380 1997824 2058717 1975357 1913899 1862429 1678496 1827951
4797 1827951 1863915 1701153 1552704 1620972 1619570 1752362 1679705 1711589 1678811 1567097 1490533
4786 1490533 1296626 1378793 1307607 1196285 1341424 1303439 1256476 1111837 1071076 1234932
4776 1234932 1273346 1288652 1137918 1155746 1286381 1210184 1149310 1089475 1199135 1152695 940365
4765 940365 1019510 1158259 1264537 1147675 1011193 1163369 1215253 1116837 1102035 1055641 1029932
4754 1029932 1082794 972091 917374 883616 888245 905030 988306 1052073 1097664 1082141 822253
$$ packed form
4829C186594n4268p5896k14659J79392J47146k81941N5949j20361j01943j98118
4819B521895k5421J2973J66507o5990j62928M1026j87245M2529R5136k7274l2686
4808B378522q0939j69652k227P676j35556O0893q3360o1458n1470j83933J49455
4797A827951L5964j62762j48449O8268j402J32792p2657L1884l2778j11714p6564
4786A490533j93907Q2167p1186j11322J45139l7985m6963j44639m0761J63856
4776A234932L8414J5306j50734J7828J30635p6197o0874n9835J09660m6440k12330
4765I40365P9145J38749J06278j16862j36482J52176N1884r8416j4802m6394k5709
4754A029932N2862j10703n4717l3758M629J6785Q3276O3767M5591j5523k59888
$$ plain form
4743 822253 820823 794245 835532 896167 823849 922963 960039 776450 820832 820927 956592 981878
4731 981878 852034 854872 868511 880193 836781 916462 897183 786341 743310 784312 718761
4720 718761 775236 895559 843272 712713 670972 776493 844218 855061 796583 767694 907617
4709 907617 774909 829154 704818 766502 822272 694858 738366 791288 786407 719903 745760
4698 745760 741183 680415 714231 788575 959949 822225 666667 636805 629543 791894 836964
4687 836964 778783 688576 633842 560896 743042 645208 555031 584649 669311 664427 807234
4676 807234 771773 597293 576121 603756 600059 695441 627039 612741 554912 578408 532234 573295
4664 573295 595722 557135 575992 726668 737339 507292 554164 650470 599775 660758 773860
$$ packed form
4743H22253j430k6578M1287O0635p2318R9114L7076j83589M4382R5J35665K5286
4731I81878j29844K838J3639J1682m3412P9681j9279j10842m3031M1002o5551
4720G18761N6475J20323n2287j30559m1741J05521O7725J0843n8478k8889J39923
4709I07617j32708N4245j24336O1684N5770j27414M3508N2922m881o6504K5857
4698G45760m577o0768L3816P4344J71374j37724j55558k9862p262J62351M5070
4687H36964n8181r0207n4734p2946J82146r7834r0177K9618Q4662m884J42807
4676H07234l5461j74480k1172K7635l697R5382o8402j4298n7829K3496m6174M1061
4664E73295K2427l8587J8857J50676J0671k30047M6872R6306n0695O0983J13102
$$ plain form
4653 773860 724074 655867 465496 423780 579059 510376 587170 576547 552308 530240 482069
4642 482069 339345 410955 614275 631122 679889 636067 546375 435382 484574 593491 575849
4631 575849 590755 626440 486833 482641 472021 567190 604099 673776 672263 561063 535963 455875
4619 455875 528350 467983 471630 564917 510774 536816 557311 665495 692916 619637 477807
4608 477807 499199 565702 562738 544193 502790 508486 503836 487422 521726 561642 527935 586226
4596 586226 549743 658341 628530 596736 672621 563464 702071 647709 667540 522923 499325
4585 499325 601041 792093 818509 736655 804995 719535 700191 809612 780953 783720 701416
4574 701416 649548 767643 839276 672964 813820 1027766 953096 894949 932576 976637 1102490
$$ packed form
4653G73860m9786o8207j90371m1716J55279o8683P6794j0623k4239k2068m8171
4642D82069j42724P1610K03320J6847M8767m3822q9692j10993M9192J08917j7642
4631E75849J4906L5685j39607m192j0620R5169L6909O9677j513j11200k5100q0088
4619D55875P2475o0367L647R3287n4143K6042K0495J08184K7421p3279j41830
4608D77807K1392O6503k964j8545m1403N696m650j6414L4304L9916l3707N8291
4596E86226l6483J08598k9811l1794P5885j09157J38607n4362J9831j44617k3598
4585D99325J01716J91052K6416q1854O8340q5460j9344J09421k8659K767q2304
4574G01416n1868J18095P1633j66312J40856K13946p4670n8147L7627M4061J25853
$$ plain form
4563 1102490 1133767 894130 1028925 1009775 1023726 888883 894409 1011228 971790 784801 982174
4552 982174 1026913 939485 1121970 1030469 964359 845252 800543 752957 850657 753438 669407
4541 669407 865120 782922 798671 734718 568521 632451 757504 605879 599852 708722 710569
4530 710569 650781 636124 847098 742578 660473 697606 664127 690851 706152 690680 611291
4519 611291 676673 761313 734941 755453 685132 690213 649834 588301 789485 762960 714796 599284
4507 599284 571591 644564 686287 785639 752573 597913 731985 925540 798411 680177 622336
4496 622336 772982 684542 712951 777150 890327 957826 756389 692609 720851 683997 792353
4485 792353 950872 856515 678055 627596 736650 720441 699555 780901 667280 692261 701325
$$ packed form
4563A102490L1277k39637J34795j9150J3951j34843N526J16819l9438j86989J97373
4552I82174M4739q7428J82485r1501o6110j19107m4709m7586R7700r7219q4031
4541F69407J95713q2198J5749o3953j66197O3930J25053j51625o027J08870J847
4530G10569n9788j4657K10974j04520q2105L7133l3479K6724J5301j5472p9389
4519F11291O5382Q4640k6372K0512p0321N081m0379o1533K01184k6525m8164j15512
4507E99284k7693P2973M1723R9352l3066j54660J34072J93555j27129j18234n7841
4496F22336J50646q8440K8409O4199J13177O7499k01437o3780K8242l6854J08356
4485G92353J58519r4357j78460n0459J09054j6209k0886Q1346j13621K4981R064
$$ plain form
4474 701325 830336 709422 709877 660487 701990 769891 808224 813091 785395 793930 853907 614446
4462 614446 589671 748403 812630 870843 758428 841640 785104 700553 678483 687241 706187
4451 706187 813503 729580 706617 736480 736613 740630 823222 786030 842395 789108 872426 964346
4439 964346 1006677 894558 850410 855662 848038 842912 916531 927904 831970 869179 937583 970638
4427 970638 972196 947957 1096042 1076139 1027796 1113713 1206774 1113616 1116931 1265742 1287379 1312768
4415 1312768 1300823 1423241 1495008 1270133 1268407 1143915 1262536 1296151 1200781 1195049 1196056
4404 1196056 1343319 1280137 1420473 1457528 1374890 1328392 1382741 1392689 1474032 1535962 1534194
4393 1534194 1530352 1583355 1546612 1553379 1665184 1681461 1628268 1719922 1859076 1859340 1977067 2096989
$$ packed form
4474G01325J29011j20914M55m9390M1503O7901L8333M867k7696Q535N9977k39461
4462F14446k4775J58732O4227N8213j12415Q3212n6536q4551k2070Q758J8946
4451G06187J07316q3923k2963K9863J33M017Q2592l7192N6365n3287Q3318R1920
4439I64346M2331j12119m4148N252p624n126P3619J1373r5934L7209O8404L3055
4427I70638J558k4239J48085j9903m8343Q5917R3061r3158L315J48811K1637K5389
4415A312768j1945J22418P1767k24875j726j24492J18621L3615r5370n732J007
4404A196056J47263o3182J40336L7055q2638m6498N4349R948Q1343O1930j768
4393A534194l842N3003l6743O767J11805J6277n3193R1654J39154K64J17727J19922
$$ plain form
4381 2096989 2211338 2212040 2319077 2270798 2331837 2584709 2616951 2669657 2738427 2994208 3151711
4370 3151711 3354043 3508270 3855514 4072928 4333534 4648706 5001761 5286377 5777929 6186045
4360 6186045 6630747 7171509 7724333 8237725 8900109 9603524 10161300 10806297 11692160 12640456
4350 12640456 13617923 14637915 15839115 17156186 18853646 20845054 22995625 25723770
4342 25723770 28717216 31765262 34566267 37083750 39914655 43216930 47420778 51370870
4334 51370870 54097649 55693895 57193574 59638121 62719384 65615109 66748630 66013561
4326 66013561 64315052 62953102 61986969 61240991 59339643 56056650 52283484 48820804
4318 48820804 45713205 42992278 39986103 36582197 33029923 29668903 26607894 23991941
$$ packed form
4381B096989J14349P02J07037m8279O1039K52872L2242N2706O8770K55781J57503
4370C151711K02332J54227L47244K17414K60606L15172L53055K84616M91552M08116
4360F186045M44702N40762N52824N13392O62384P03415N57776O44997Q85863R48296
4350A2640456R77467J019992J201200J317071J697460J991408K150571K728145
4342B5723770K993446L048046K801005K517483K830905L302275M203848L950092
4334E1370870K726779J596246J499679K444547L081263K895725J133521p35069
4326F6013561j698509j361950r66133p45978j901348l282993l773166l462680
4318D8820804l107599k720927l006175l403906l552274l361020l061009k615953
$$ plain form
4310 23991941 21425118 19029219 16893295 15402474 13979981 12637769 11719913 10832807
4302 10832807 10183619 9431680 8837121 8204070 7724370 7401591 7009566 6777200 6376349
4293 6376349 6072019 5673840 5480470 5225728 4993498 4771637 4573693 4261324 3957343 3976433
4283 3976433 3803596 3640466 3592616 3312465 3174426 2968104 2822992 2865626 2715990 2457063
4273 2457063 2428550 2395047 2289883 2272175 2089332 2109738 2130498 2224790 2116343 1898088 1754836
4262 1754836 1795445 1791985 1773663 1664200 1565290 1564208 1533300 1405050 1385520 1331837 1193145
4251 1193145 1358528 1376246 1433945 1320525 1170976 1139463 1069081 1131685 1071903 998741 1057534
4240 1057534 1124271 1038965 949171 875999 965605 963624 978722 835443 678659 720548 986462
$$ packed form
4310B3991941k566823k395899k135924j490821j422493j342212r17856q87106
4302A0832807o49188p51939n94559o33051m79700l22779l92025k32366m00851
4293F376349l04330l98179j93370k54742k32230k21861j97944l12369l03981J9090
4283C976433j72837j63130m7850k80151j38039k06322j45112M2634j49636k58927
4273B457063k8513l3503j05164j7708j82843K0406K0760R4292j08447k18255j43252
4262A754836M0609l460j8322j09463r8910j082l0908j28250j9530n3683j38692
4251A193145J65383J7718N7699j13420j49549l1513p0382O2604n9782p3162N8793
4240A057534O6737q5306q9794p3172Q9606j981J5098j43279j56784M1889K65914
$$ plain form
4229 986462 947640 921337 755610 705989 739114 720570 667986 752262 770638 817181 1055900
4218 1055900 825116 782015 859634 664597 691981 782589 719978 550806 481426 531049 591309
4207 591309 507758 539452 608564 529712 456359 564469 540117 621466 578666 543558 458083
4196 458083 398374 514138 583503 519296 515264 445418 461835 467315 473150 394013 567478 584669
4184 584669 431593 380828 284399 492365 508795 414838 378604 229787 266408 399599 415845
4173 415845 287840 439477 594456 431707 437818 423383 395719 329397 387475 379030 427574
4162 427574 364500 381238 387519 505128 524762 525292 489664 460652 378165 406852 447460 434988
4150 434988 465817 567655 659116 514443 497110 588134 452261 590805 616825 576039 688071
$$ packed form
4229I86462l8822k6303j65727m9621L3125j8544n2584Q4276J8376M6543K38719
4218A055900k30784m3101P7619j95037K7384R0608o2611j69172o9380M9623O0260
4207E91309q3551L1694O9112p8852p3353J08110k4352Q1349m2800l5108q5475
4196D58083n9709J15764O9365o4207m032o9846J6417N480N835p9137J73465J7191
4184E84669j53076n0765r6429K07966J6430r3957l6234j48817L6621J33191J6246
4173D15845j28005J51637J54979j62749O111j4435k7664o6322N8078q445M8544
4162D27574o3074J6738O281J17609J9634N30l5628k9012q2487K8687M0608j2472
4150D34988L0829J01838R1461j44673j7333R1024j35873J38544K6020m0786J12032
$$ plain form
4139 688071 775475 613938 730827 859212 885566 912019 689117 724708 784294 846853 871449
4128 871449 967150 1114675 1106464 1142607 1282077 1395742 1446917 1413801 1608590 1726535 1642340
4117 1642340 1883710 1951528 2129834 2244673 2545055 2687736 2670664 2860803 3177710 3418399
4107 3418399 3706676 3858183 4107175 4261871 4388525 4671840 4954202 5189393 5495531 5819519
4097 5819519 6044820 6327434 6474008 6662863 6825359 6940490 7170585 7139581 7319186 7439466
4087 7439466 7603121 7845958 7874460 7818173 7760240 7765115 7698400 7615519 7377062 7306085 6948062
4076 6948062 6935082 6780560 6451697 6263470 6129308 5839622 5455486 5314405 5070213 4719257
4066 4719257 4498065 4279099 4252347 3903227 3620867 3570242 3273407 3052875 2912211 2759779
$$ packed form
4139F88071Q7404j61537J16889J28385K6354K6453k22902L5591N9586O2559K4596
4128H71449R5701J47525q211L6143J39470J13665N1175l3116J94789J17945q4195
4117A642340K41370O7818J78306J14839L00382J42681j7072J90139L16907K40689
4107C418399K88277J51507K48992J54696J26654K83315K82362K35191L06138L23988
4097E819519K25301K82614J46574J88855J62496J15131K30095l1004J79605J20280
4087G439466J63655K42837K8502n6287n7933M875o6715q2881k38457p0977l58023
4076F948062j2980j54522l28863j88227j34162k89686l84136j41081k44192l50956
4066D719257k21192k18966k6752l49120k82360n0625k96835k20532j40664j52432
$$ plain form
4056 2759779 2677177 2491018 2290400 2190701 2032212 1981338 2042921 2036194 1983524 2026210 2136833
4045 2136833 2130005 2268935 2430110 2204154 2053066 1974350 1913182 1623716 1401362 1323935
4035 1323935 1204883 1068034 1022719 1086982 1063630 885893 807494 750392 753350 620217 664229
4024 664229 665313 551775 491146 441034 654660 642939 646805 496787 530213 401992 381894
4013 381894 435403 464952 444646 370554 456830 590054 589503 579353 562877 458866 492367 450359
4001 450359 273457 397903 455178 577608 444307 322506 337331 286594 356464 306170 303690
3990 303690 225302 293651 366881 297718 485096 426482 340671 203753 148069 276039 355141
3979 355141 263378 258671 316296 300752 232169 216972 213671 96516 167760 135090 273951 392482
$$ packed form
4056B759779q2602j86159k00618r9699j58489n0874O1583o727n2670M2686J10623
4045B136833o828J38930J61175k25956j51088p8716o1168k89466k22354p7427
4035A323935j19052j36849m5315O4263k3352j77737p8399n7102K958j33133M4012
4024F64229J084j13538o0629n0112K13626j1721L866j50018L3426j28221k0098
4013C81894N3509K9549k0306p4092Q6276J33224n51j0150j6476j04011L3501m2008
4001D50359j76902J24446N7275J22430j33301j21801J4825n0737O9870n0294k480
3990C03690p8388O8349P3230o9163J87378n8614q5811j36918n5684J27970P9102
3979C55141r1763m707N7625j5544o8583j5197l301j17155P1244l2670J38861J18531
$$ plain form
3967 392482 343277 326336 279936 304140 264263 297306 278711 293912 353614 459906 649480
3956 649480 567634 423624 395828 374067 408876 404126 342662 314723 332637 298261 205979 273718
3944 273718 291568 224567 188759 222947 338138 435814 264060 272566 130313 311698 197815
3933 197815 107837 249825 108332 262947 361772 294188 311398 381602 397697 423527 441422
3922 441422 256794 90994 231766 428218 243197 137993 298207 312362 333344 288630
3912 288630 386419 350434 258767 367996 312282 375588 184433 299389 339071 511847 545264
3901 545264 555525 340734 323911 214409 201220 505148 467611 499957 509033 463282 499322
3890 499322 530981 504387 558893 608837 595197 617530 653638 511946 627220 541027 536730
$$ packed form
3967C92482m9205j6941m6400K4204l9877L3043j8595J5201N9702J06292J89574
3956F49480q1846j44010k7796k1761L4809m750o1464k7939J7914l4376r2282O7739
3944B73718J7850o7001l5808L4188J15191R7676j71754Q506j42253J81385j13883
3933A97815q9978J41988j41493J54615R8825o7584J7210P0204J6095K5830J7895
3922D41422j84628j65800J40772J96452j85021j05204J60214J4155K0982m4714
3912B88630R7789l5985r1667J09229n5714O3306j91155J14956L9682J72776L3417
3901E45264J0261k14791j6823j09502j3189L03928l7537L2346R076m5751L6040
3890D99322L1659k6594N4506M9944j3640K2333L6108j41692J15274q6193m297
$$ plain form
3879 536730 599707 674869 529751 639355 523211 820088 582100 446286 669688 839439
3869 839439 829801 657834 552803 554716 694915 748246 809498 786679 667516 684643 699118
3858 699118 665977 676809 734705 825809 762754 771247 774794 557078 583762 872757 773727 694108
3846 694108 741262 773900 601889 647759 625527 586447 652063 641911 710030 680632 711823
3835 711823 816885 737336 851020 830208 743299 650727 691600 652625 743852 706572 734807
3824 734807 827310 850113 810014 854610 677782 595191 648210 657015 658871 687512 672033 791360
3812 791360 915423 844443 867893 827015 862223 899775 949510 1003241 969959 988025 951810
3801 951810 882745 962781 996320 892830 961665 963616 827083 863012 994749 938736 851397
$$ packed form
3879E36730O2977P5162j45118J09604j16144K96877k37988j35814K23402J69751
3869H39439r638j71967j05031J913J40199N3331O1252k2819j19163J7127J4475
3858F99118l3141J0832N7896R1104o3055Q493L547k17716K6684K88995r9030p9619
3846F94108M7154L2638j72011M5870k2232l9080O5616j0152O8119k9398L1191
3835G11823J05062p9549J13684k0812q6909r2572M0873l8975R1227l7280K8235
3824G34807R2503K2803m0099M4596j76828q2591N3019Q805J856K8641j5479J19327
3812G91360J24063p0980K3450m0878L5208L7552M9735N3731l3282J8066l6215
3801I51810o9065Q0036L3539j03490O8835J951j36533L5929J31737n6013q7339
$$ plain form
3790 851397 930724 919708 1130295 1168417 1194492 1060938 1093982 1271750 1284488 1444060 1455097
3779 1455097 1365610 1427525 1465858 1615019 1706824 1817603 2017543 2148715 2303314 2235842
3769 2235842 2371640 2497102 2484294 2683562 3038166 3070613 3370905 3538531 3582873 3815357
3759 3815357 4003252 4265819 4652657 5019148 5328600 5626489 5982107 6398496 6767285 7257930
3749 7257930 7741354 8425955 9031035 9761262 10538159 11466748 12522652 13719169 14672321
3740 14672321 15826644 16772490 17582021 18282743 18727187 18829666 18914965 18636680 18542397 18541375
3730 18541375 18481250 18436780 18048583 17786510 17284465 16651919 15800791 14780748 13829712 12869915
3720 12869915 11844748 10632750 9751560 8897554 8205255 7524680 6918801 6512579 6038877
$$ packed form
3790H51397P9327j1016K10587L8122K6075j33554L3044J77768J2738J59572J1037
3779A455097q9487O1915L8333J49161R1805J10779J99940J31172J54599o7472
3769B235842J35798J25462j2808J99268L54604L2447L00292J67626M4342K32484
3759C815357J87895K62567L86838L66491L09452K97889L55618M16389L68789M90645
3749G257930M83424O84601O05080P30227P76897R28589J055904J196517R53152
3740A4672321J154323R45846Q09531P00722M44444J02479Q5299k78285r4283j022
3730A8541375o0125m4470l88197k62073n02045o32546q51128j020043r51036r59797
3720A2869915j025167j211998q81190q54006o92299o80575o05879m06222m73702
$$ plain form
3711 6038877 5734989 5302368 4935363 4631956 4536469 4084472 3922760 3746592 3625125 3524432
3701 3524432 3351838 3234104 3132753 2966672 2813823 2828697 2766056 2605608 2569701 2561582
3691 2561582 2453663 2428794 2251653 2370444 2340135 2249294 2222525 2224617 2185360 2166032 2145037
3680 2145037 2123464 2074184 2073584 2113640 1919831 2004473 2013515 2127867 2056025 1955353 2074720
3669 2074720 2042690 2058824 2047859 2113001 2215389 2184543 2261266 2449863 2506836 2580514 2523126
3658 2523126 2522232 2634374 2745466 2912261 2968261 3228604 3557513 3650467 3860679 4153137
3648 4153137 4331014 4618892 4952642 5252299 5346357 5557167 5633620 5776452 5780800 5880031
3638 5880031 5902989 5831144 5824605 5907265 6011794 5929510 6064565 6201294 6493532 6517272 6610632
$$ packed form
3711F038877l03888m32621l67005l03407r5487m51997j61712j76168j21467j00693
3701C524432j72594j17734j01351j66081j52849J4874o2641j60448l5907q119
3691B561582j07919k4869j77141J18791l0309r0841k6769K092l9257j9328k0995
3680B145037k1573m9280o00M0056j93809Q4642R042J14352p1842j00672J19367
3669B074720l2030J6134j0965O5142J02388l0846P6723J88597N6973P3678n7388
3658B523126q94J12142J11092J66795N6000K60343L28909R2954K10212K92458
3648D153137J77877K87878L33750K99657R4058K10810P6453J42832M348R9231
3638E880031K2958p1845o539Q2660J04529q2284J35055J36729K92238K3740R3360
$$ plain form
3627 6610632 7040228 7327410 7552892 7878605 8284513 8588347 9162870 9744932 10352866 10992071
3617 10992071 11638113 12430391 13136983 14209251 15192718 16452064 17750071 19412110 20971951
3608 20971951 22558616 24436258 26039713 27513473 28825409 29982535 30791244 31529881
3600 31529881 31931292 31979891 31933975 31784217 31689791 31578163 31166581 30774622 30281910 29658002
3590 29658002 28700602 27676146 26434912 24979557 23494052 21925740 20332858 18710766
3582 18710766 17289592 16020530 14709495 13377180 12247270 11218307 10628917 10048472
3574 10048472 9353385 8767598 8380432 8050236 7681098 7345500 7157762 6900222 6830044 6813681
3564 6813681 6513531 6425276 6309161 6180586 6194382 6256945 6358274 6525438 6632464 6757093
$$ packed form
3627F610632M29596K87182K25482L25713M05908L03834N74523N82062O07934O39205
3617A0992071O46042P92278P06592J072268R83467J259346J298007J662039J559841
3608B0971951J586665J877642J603455J473760J311936J157126Q08709P38637
3600C1529881M01411M8599m5916j49758r4426j11628m11582l91959m92712o23908
3590B9658002r57400j024456j241234j455355j485505j568312j592882j622092
3582A8710766j421174j269062j311035j332315j129910j028963n89390n80445
3574A0048472o95087n85787l87166l30196l69138l35598j87738k57540p0178j6363
3564F813681l00150q8255j16115j28575J3796O2563J01329J67164J07026J24629
$$ plain form
3554 6757093 6886763 6939996 6963783 7125980 7126693 7122003 7072464 7076405 6824064 6735475 6578112
3543 6578112 6423257 6347956 6293193 6337293 6258645 6225796 6177897 6196835 6383151 6506029 6776440
3532 6776440 6969031 7029882 7295197 7602592 7873354 8208768 8609044 8965232 9432418 10062773
3522 10062773 10698130 11246109 11841622 12458052 13376971 14262693 15161616 16311466 17606033
3513 17606033 19005753 20464382 22167729 24237507 26228903 28365700 30554636 32642490
3505 32642490 34419139 35685989 36816092 37444721 37782745 38079206 38095788 38085930 38045871 37666048
3495 37666048 37357034 36421822 35281133 34038432 32382804 30466753 28306029 26284043
3487 26284043 23978984 21963727 20039481 18077703 16451030 15117538 13952071 12767001
$$ packed form
3554F757093J29670N3233K3787J62197P13m690m9539L941k52341q8589j57363
3543F578112j54855p5301n4763M4100p8648l2849m7899J8938J86316J22878K70411
3532F776440J92591O0851K65315L07395K70762L35414M00276L56188M67186O30355
3522A0062773O35357N47979N95513O16430R18919Q85722Q98923J149850J294567
3513A7606033J399720J458629J703347K069778J991396K136797K188936K087854
3505C2642490J776649J266850J130103O28629L38024K96461J6582r858m0059l79823
3495C7666048l09014r35212j140689j242701j655628j916051k160724k021986
3487B6284043k305059k015257j924246j961778j626673j333492j165467j185070
$$ plain form
3479 12767001 11688143 10774498 10021176 9488602 8827259 8551687 8017485 7642453 7145591
3470 7145591 6762919 6596875 6442961 6103390 5824480 5613482 5494515 5375755 5187943 4958824
3460 4958824 4870372 4739705 4682987 4604537 4455846 4499191 4430624 4351107 4176266 4176918 4228911
3449 4228911 4168114 4123091 4127851 4130925 4116192 4183526 4406733 4445994 4432687 4546633 4752435
3438 4752435 4740778 4685068 4600637 4589770 4393939 4388511 4375760 4329633 4146544 3933305 3918541
3427 3918541 3882109 3844993 3940978 3825604 3824432 3748399 3771300 3926343 4074463 4209204 4425327
3416 4425327 4556681 4671394 4813694 4927226 5131963 5481024 5770117 6008813 6311984 6629899
3406 6629899 6924554 7369990 7918486 8360018 8995128 9673012 10361568 10855798 11512643 12132749
$$ packed form
3479A2767001j078858r13645p53322n32574o61343k75572n34202l75032m96862
3470G145591l82672j66044j53914l39571k78910k10998j18967j18760j87812k29119
3460D958824q8452j30667n6718p8450j48691M3345o8567p9517j74841O52N1993
3449D228911o0797m5023M760L074j4733O7334K23207L9261j3307J13946K05802
3438D752435j1657n5710q4431j0867j95831n428j2751m6127j83089k13239j4764
3427C918541l6432l7116R5985j15374j172p6033K2901J55043J48120J34741K16123
3416D425327J31354J14713J42300J13532K04737L49061K89093K38696L03171L17915
3406F629899K94655M45436N48496M41532O35110O77884O88556M94230O56845O20106
$$ plain form
3396 12132749 12744382 13056670 13228229 13298590 13308380 13212803 12898684 12461225 12043779 11658893
3386 11658893 11326300 11056157 10804734 10780939 10749057 11007395 11323184 11462306 11802718 12052523
3376 12052523 12478227 12481544 12570401 12635459 12345552 12015690 11655455 10932215 10226498 9556079
3366 9556079 8653792 8031696 7353584 6878501 6378500 5875698 5310878 5058335 4710843 4490789
3356 4490789 4096998 4003450 3795650 3594882 3473600 3437358 3339036 3141755 3144515 3097640 3047857
3345 3047857 2945954 2807641 2911156 2831031 2757980 3019394 3132515 3212498 3351007 3357114
3335 3357114 3402312 3480156 3536660 3667903 3734882 3730700 3606025 3566743 3343969 3267406 3010841
3324 3010841 2904176 2558170 2416677 2317444 2193511 1973819 1937421 1875523 1816586 1751486
$$ packed form
3396A2132749O11633L12288J71559P0361R790r5577l14119m37459m17446l84886
3386A1658893l32593k70143k51423k3795l1882K58338L15789J39122L40412K49805
3376A2052523M25704L317Q8857O5058k89907l29862l60235p23240p05717o70419
3366I556079r02287o22096o78112m75083n00001n02802n64820k52543l47492k20054
3356D490789l93791r3548k07800k00768j21282l6242r8322j97281K760m6875m9783
3345C047857j01903j38313J03515q0125p3051K61414J13121P9983J38509O107
3335C357114M5198P7844N6504J31243O6979m182j24675l9282k22774p6563k56565
3324C010841j06665l46006j41493r9233j23933k19692l6398o1898n8937o5100
$$ plain form
3314 1751486 1721551 1660839 1635129 1624366 1511935 1611825 1429012 1459868 1489385 1540819 1482551
3303 1482551 1456051 1399507 1469883 1497677 1264233 1314085 1394747 1341757 1327502 1320099 1520100
3292 1520100 1545383 1495822 1396468 1445122 1460261 1395536 1367526 1299075 1311807 1323682 1335056
3281 1335056 1483616 1561498 1436431 1416338 1502177 1618323 1576991 1552132 1451243 1630347
3271 1630347 1704934 1616648 1473381 1551372 1604037 1649974 1741830 1806027 1627947 1642920 1875622
3260 1875622 1907833 1918418 1946287 2054613 1992204 2102374 2147883 2213178 2103326 2267839 2386237
3249 2386237 2430406 2643400 2814102 2943805 3113335 3219103 3293449 3467646 3606196 3694770
3239 3694770 3814116 4037097 4328657 4663773 4884783 5132527 5425781 5976400 6498829 7030365
$$ packed form
3314A751486k9935o0712k5710j0763j12431R9890j82813L0856K9517N1434n8268
3303A482551k6500n6544P0376K7794k33444M9852Q0662n2990j4255p403K00001
3292A520100K5283m9561r9354M8654J5139o4725k8010o8451J2732J1875J1374
3281A335056J48560P7882j25067k0093Q5839J16146m1332k4859j00889J79104
3271A630347P4587q8286j43267P7991N2665M5937R1856O4197j78080J4973K32702
3260A875622L2211J0585K7869J08326o2409J10170M5509O5295j09852J64513J18398
3249B386237M4169K12994J70702J29703J69530J05768P4346J74197J38550Q8574
3239C694770J19346K22981K91560L35116K21010K47744K93254N50619N22429N31536
$$ plain form
3229 7030365 7664965 8234297 8938396 9722907 10484255 11191622 12020083 12715593 13514499 14394267
3219 14394267 15222581 16070833 16987438 17976631 19169214 20387677 22097407 24011063 26109829
3210 26109829 28474492 31209507 34337706 37902539 42092118 46899398 53067451 60106999
3202 60106999 68390918 76721291 83258723 86386168 85909935 82783826 78056335 72227788
3194 72227788 65256844 57789861 50784275 44643222 39390711 34833426 31038131 27923695
3186 27923695 24971880 22755836 20647756 18918406 17506431 16242752 14901131 13897328
3178 13897328 13052438 12274598 11602491 10737789 10268868 9578329 9092459 8506820 8103670
3169 8103670 7738447 7372539 6903447 6650590 6366224 6034884 5798965 5527659 5238471 5044648
$$ packed form
3229G030365O34600N69332P04099P84511P61348P07367Q28461O95510P98906Q79768
3219A4394267Q28314Q48252R16605R89193J192583J218463J709730J913656K098766
3210B6109829K364663K735015L128199L564833M189579M807280O168053P039548
3202F0106999Q283919Q330373O537432L127445m76233l126109m727491n828547
3194G2227788o970944p466983p005586o141053n252511m557285l795295l114436
3186B7923695k951815k216044k108080j729350j411975j263679j341621j003803
3178A3897328q44890p77840o72107q64702m68921o90539m85870n85639m03150
3169H103670l65223l65908m69092k52857k84366l31340k35919k71306k89188j93823
$$ plain form
3159 5044648 4870246 4676758 4548427 4315117 4129937 3968380 3784820 3577297 3545997 3422326
3149 3422326 3164344 3016744 2925360 2780523 2730349 2682844 2657341 2597680 2379429 2345500 2270760
3138 2270760 2185938 2082400 2103848 1942778 1932919 1858227 1685220 1745944 1759841 1770243 1520543
3127 1520543 1466108 1459713 1483710 1558331 1551827 1459270 1404136 1442115 1440342 1394915 1363643 1287051
3115 1287051 1111984 1156434 1039753 1050071 920120 938331 1145530 1180941 1230893 914880
3105 914880 892047 827921 923628 942052 926484 930833 909964 690764 851512 902114 768586
3094 768586 830179 810588 782234 697208 479595 676930 702008 730392 833234 651334 581615
3083 581615 668045 753152 695597 712374 838516 639538 788600 683697 676197 616443 391908
$$ packed form
3159E044648j74402j93488j28331k33310j85180j61557j83560k07523l1300j23671
3149C422326k57982j47600r1384j44837n0174m7505k5503n9661k18251l3929p4740
3138B270760q4822j03538K1448j61070r859p4692j73007O0724J3897J0402k49700
3127A520543n4435o395K3997P4621o504r2557n5134L7979j773m5427l1272p6592
3115A287051j75067M4450j16681J0318j29951J8211K07199L5411M9952l16013
3105I14880k2833o4126R5707J8424j5568M349k0869k19200J60748N0602j33528
3094G68586O1593j9591k8354q5026k17613J97335K5078K8384J02842j81900o9719
3083E81615Q6430Q5107n7555J6777J26142j98978J49062j04903p500n9754k24535
$$ plain form
3072 391908 419635 535493 631404 512247 586490 623980 500159 388929 475790 552919 521620
3061 521620 371903 368442 297249 356973 446429 478454 397348 418893 317412 303607 367394
3050 367394 403599 501774 382271 317398 396465 412939 604561 448792 329700 401238 456089
3039 456089 274570 228709 258935 386785 343058 398444 356173 367763 334368 282138 366320
3028 366320 268003 306214 268722 209614 173209 325499 377846 377410 353403 362402 328902 326613
3016 326613 400534 342617 359101 306023 341387 356526 252092 467351 394545 319601 353155
3005 353155 287914 300084 250570 313941 419215 424234 387051 268371 309255 318163 310110 359775
2993 359775 454656 453129 409646 590053 658065 671113 708144 577617 623868 612973 617082 534534
$$ packed form
3072C91908K7727J15858R5911j19157P4243L7490j23821j11230Q6861P7129l1299
3061E21620j49717l461p1193N9724Q9456L2025q1106K1545j01481j3805O3787
3050C67394L6205R8175j19503o4873P9067J6474J91622j55769j19092P1538N4851
3039D56089j81519m5861L0226J27850m3727N5386m2271J1590l3395n2230Q4182
3028C66320r8317L8211l7492n9108l6405J52290N2347m36k4007Q999l3500k289
3016C26613P3921n7917J6484n3078L5364J5139j04434K15259p2806p4944L3554
3005C53155o5241J2170m9514O3371J05274N019l7183j18680M0884Q908q053M9665
2993C59775R4881j527m3483J80407O8012J3048L7031j30527M6251j0895M109q2548
$$ plain form
2981 534534 607516 601276 523260 550371 323739 306694 232706 213401 238743 402045 339588
2970 339588 249900 222008 180467 162873 379114 370380 284652 224096 288017 300187 174782
2959 174782 185025 339846 257236 246288 291821 198358 322704 164842 148252 156715 203106
2948 203106 152279 96551 71832 201767 29086 -38091 11962 6993 142253 144993 275846
2937 275846 222919 174193 100036 118142 27089 101519 221284 174323 190475 64562 180460
2926 180460 104372 130532 35583 19738 81924 16794 156705 142249 98786 121595 235738
2915 235738 104799 41342 -12546 193829 289238 206561 45919 1053 213284 -31979 127
2904 127 200450 225166 197527 85032 -108716 31600 53641 73 95679 179744 128361
$$ packed form
2981E34534P2982o240p8016K7111k26632j7045p3988j9305K5342J63302o2457
2970C39588q9688k7892m1541j7594K16241q734q5728o0556O3921J2170j25405
2959A74782J0243J54821q2610j0948M5533r3463J24346j57862j6590Q463M6391
2948B03106n0827n5728k4719J29935j72681o7177N0053m969J35260K740J30853
2937B75846n2927m8726p4157J8106r1053P4430J19765m6961J6152j25913J15898
2926A80460p6088K6160r4949j5845O2186o5130J39911j4456m3463K2809J14143
2915B35738j30939o3457n3888K06375R5409q2677j60642m4866K12231k45263L2106
2904A27K00323K4716k7639j12495j93748J40316K2041n3568R5606Q4065n1383
$$ plain form
2893 128361 166119 228426 87327 81539 252066 146232 140233 122754 172946 142484 145578 221246
2881 221246 145245 194584 6265 94879 115971 73660 177428 53710 46842 -29761 28592
2870 28592 44624 81867 63357 109916 24363 -5219 -9561 71038 267787 124119 45566 70681
2858 70681 119303 59989 14911 120049 119609 147172 129188 29897 -54658 34296 157569 -10162
2846 -10162 -105105 -157342 -100708 -78204 30972 24120 171130 49479 -137837 -52827 -47905
2835 -47905 -53514 79073 60797 145678 181520 104511 34164 134756 85089 144098 96129 88729
2823 88729 67813 35888 -14525 -57291 53926 100170 350400 238140 258126 203029 109143
2812 109143 152368 191256 4415 -16103 135809 159981 174451 20295 192925 248286 188998
$$ packed form
2893A28361L7758O2307j41099n788J70527j05834n999j7479N0192l0462L094P5668
2881B21246p6001M9339j88319Q8614K1092m2311J03768j23718o868p6603N8353
2870B8592J6032L7243j8510M6559q5553k9582m342Q0599J96749j43668p8553K5115
2858G0681M8622n9314m5078J05138m40K7563j7984r9291q4555Q8954J23273j67731
2846a0162r4943n2237N6634K2504J09176o852J47010j21651j87316Q5010M922
2835d7905n609J32587j8276Q4881L5842p7009p0347J00592m9667N9009m7969p400
2823H8729k0916l1925n0413m2766J11217M6244K50230j12260J9986n5097r3886
2812A09143M3225L8888j86841k0518J51912K4172J4470j54156J72630N5361n9288
$$ plain form
2801 188998 58870 10787 -7684 -124400 49514 129331 -14537 87765 85894 63970 45435
2790 45435 46469 -27842 -29002 88370 149803 247171 136444 147443 132871 80522 -14763 52916
2778 52916 235046 84867 38578 -1899 105510 -89 10328 -75867 37421 148362 147396
2767 147396 207048 117731 24128 37566 224959 141945 52088 8216 151747 171843 128398
2756 128398 89879 -51593 41712 60043 63847 42974 -32289 -100998 -13347 -6377 33516 187017
2744 187017 -2654 -98495 -88758 143416 60438 28149 135189 100863 -4470 25636 51897
2733 51897 -30401 -34267 97760 61501 82905 58621 144821 94977 14838 78001 117710 168854
2721 168854 79955 -94932 81187 -52482 4546 -25682 149783 99052 41833 4775 31730
$$ packed form
2801A88998j30128m8083j8471j16716J73914P9817j43868J02302j871k1924j8535
2790D5435J034p4311j160J17372O1433R7368j10727J0999j4572n2349r5285O7679
2778E2916J82130j50179m6289m0477J07409j05599J0417q6195J13288J10941r66
2767A47396N9652q9317r3603J3438J87393q3014q9857m3872J43531K0096m3445
2756A28398l8519j41472R3305J8331L804k0873p5263o8709Q7651O970L9893J53501
2744A87017j89671r5841R737K32174q2978l2289J07040l4326j05333L0106K6261
2733E1897q2298l866J32027l6259K1404k4284Q6200m9844q0139O3163L9709N1144
2721A68854q8899j74887J76119j33669N7028l0228J75465n0731n7219l7058K6955
$$ plain form
2710 31730 42998 -5252 66150 227005 307735 183924 29617 42338 173404 104501 45972
2699 45972 -11541 77536 63913 60826 -113096 -20123 62863 -74504 -119430 6949 98745
2688 98745 59367 94928 11561 122494 1980 15939 4445 22111 37742 -89099 41833
2677 41833 69283 41692 11435 32905 68988 81438 62480 -46732 -6541 45356 132658 123991
2665 123991 11948 53109 -79005 61255 97778 116610 55300 -11973 -17993 107743 76709
2654 76709 156120 135418 232509 169106 167873 208952 206019 300394 238904 229930 227502 265381 295040
2641 295040 374661 499256 425323 443972 529626 591937 590906 674044 714668 760203 801601 1055338
2629 1055338 1032685 1123646 1310470 1583075 1947749 2524495 2989876 3375810 3062557 2765183
$$ packed form
2710C1730J1268m8250P1402J60855Q0730j23811j54307J2721J31066o8903n8529
2699D5972n7513Q9077j3623l087j73922R2973Q2986j37367m4926J26379R1796
2688I8745l9378L5561q3367J10933j20514J3959j1494J7666J5631j26841J30932
2677D1833K7450k7591l0257K1470L6083J2450j8958j09212M0191N1897Q7302q667
2665A23991j12043M1161j32114J40260L6523J8832o1310o7273o020J25736l1034
2654G6709P9411k0702R7091o3403j233M1079k933R4375o1490q974k428L7879K9659
2641B95040P9621J24595p3933J8649Q5654O2311j031Q3138M0624M5535M1398K53737
2629A055338k2653R0961J86824K72605L64674N76746M65381L85934l13253k97374
$$ plain form
2619 2765183 2558669 2370313 2239696 1634343 1293908 1052956 975209 983320 842581 723206
2609 723206 725819 691324 619965 605544 506258 455427 467759 464023 382570 321423 383866 384087
2597 384087 368826 339046 256817 324912 309153 321414 293619 229164 297348 236892 138072 165561
2585 165561 63188 79585 60233 183118 127266 71225 217547 206575 251586 62741 28355
2574 28355 172950 219468 -426 68351 71998 223400 162822 94006 130284 41965 122941
2563 122941 285482 182151 78217 106600 84154 89526 140760 4320 181456 126459 72710
2552 72710 143665 118432 59821 85791 10512 71499 168937 163365 -20016 50278 101547 116862
2540 116862 144217 149172 -20484 142393 14197 -46042 -8557 -79452 -98610 38893 83709
$$ packed form
2619B765183k06514j88356j30617o05353l40435k40952p7747Q111j40739j19375
2609G23206K613l4495p1359j4421r9286n0831J2332l736q1453o1147O2443K21
2597C84087j5261k9780q2229O8095j5759J2261k7795o4455O8184o0456r8820K7489
2585A65561j02373J6397j9352J22885n5852n6041J46322j0972M5011j88845l4386
2574B8355J44595M6518k19894O8777L647J51402o0578o8816L6278q8319Q0976
2563A22941J62541j03331j03934K8383k2446N372N1234j36440J77136n4997n3749
2552G2710P0955k5233n8611K5970p5279O0987R7438n572j83381P0294N1269J5315
2540A16862K7355M955j69656J62877j28196o0239L7485p0895j9158J37503M4816
$$ plain form
2529 83709 118233 153084 116678 61637 15462 -97651 -78965 99209 8392 9325 9251 44298
2517 44298 -6300 85855 118556 114567 -17317 -28953 63991 89582 92375 103019 64052 106944
2505 106944 126883 -74212 38354 117579 121262 55980 -15960 125485 30397 -10798 -7045
2494 -7045 149827 101278 -17327 -108737 -10669 -112013 57647 78654 -50670 -18529 93279
2483 93279 38031 103461 177756 157568 82124 89909 36735 -54730 -28973 61375 -45929 -130917
2471 -130917 -172848 -193673 24724 20048 72683 74429 62358 39262 -21925 19414 85970 13748
2459 13748 45666 -21076 56063 21297 -26912 5448 -28768 -17341 -148212 -105435 -84756 -67691
2447 -67691 102838 -31055 109948 75657 -23068 104187 136807 31327 128599 69662 -42311
$$ packed form
2529H3709L4524L4851l6406n5041m6175j13113J8686J78174r0817R33p4L5047
2517D4298n0598R2155L2701l989j31884j1636R2944K5591K793J0644l8967M2892
2505A06944J9939k01095J12566P9225L683o5282p1940J41445r5088m1195L753
2494g045J56872m8549j18605r1410R8068j01344J69660K1007j29324L2141J11808
2483I3279n5248O5430P4295k0188p5444P785n3174r1465K5757R0348j07304q4988
2471a30917m1931k0825K18397m676N2635J746j2071k3096o1187M1339O6556p2222
2459A3748L1918o6742P7139l4766m8209L2360l4216J1427j30871M2777K0679J7065
2447f7691J70529j33893J41003l4291r8725J27255L2620j05480R7272n8937j11973
$$ plain form
2436 -42311 108427 2498 121554 70870 14725 -95338 23301 40321 -99728 60056
2426 60056 -25245 -22742 43600 23705 19283 42233 109460 21781 -26469 246255 239829 18935
2414 18935 -12488 -27828 -12729 11956 -30632 -62912 24231 103920 142663 81384 11584 71989
2402 71989 21193 -229756 -292497 -200581 62016 93853 5680 120428 58715 17162 39593
2391 39593 3545 46533 -1424 31157 -21952 44551 43577 -57240 -38326 142089 93850 34674
2379 34674 -15153 -24180 -49133 -75148 -20563 -4565 -28215 -25869 -10067 61763 166741 -27816
2367 -27816 -98868 39386 89002 179641 179011 51191 -3244 2761 -72744 -42665 -54402 -14584
2355 -14584 -49305 -58325 -83389 -12238 -177547 -22012 -10157 -107904 -54687 -78712 51937
$$ packed form
2436d2311J50738j05929J19056n0684n6145j10063J18639J7020j40049J59784
2426F0056q5301K503O6342j9895m422K2950O7227q7679m8250K72724o426k20894
2414A8935l1423j5340J5099K4685m2588l2280Q7143P9689L8743o1279o9800O0405
2402G1989n0796k50949o2741R1916K62597L1837q8173J14748o1713m1553K2431
2391C9593l6048M2988m7957L2581n3109O6503r74j00817J8914J80415m8239n9176
2379C4674m9827r027k4953k6015N4585J5998k3650K346J5802P1830J04978j94557
2367b7816p1052J38254M9616R0639o30j27820n4435O005p5505L0079j1737L9818
2355a4584l4721r020k5064P1151j65309J55535J1855r7747N3217k4025J30649
$$ plain form
2344 51937 20309 49580 -37562 -115747 -58575 9504 29255 47874 -30068 10437 -42068 -110231
2332 -110231 -136212 -56817 -156380 48855 -125275 7040 89698 42690 39904 -593 -80661
2321 -80661 92276 32335 30752 -61728 -74599 25274 -51230 -78525 -82132 -43306 -167978 -61273
2309 -61273 131459 118516 11566 52097 -38856 -91805 62975 38576 -198546 -194915 -110245
2298 -110245 -22023 -127431 -71137 -185808 -137170 -54239 -106762 -32370 -40034 89480 146488
2287 146488 72959 45131 86072 -34596 53786 85079 -60844 -29792 42360 -22664 -99273
2276 -99273 -37333 120513 87691 -63794 -39500 45850 149474 181029 62061 70657 -62893
2265 -62893 -29318 -64141 31491 67845 5833 111448 35620 -96906 57842 -76577 -109277
$$ packed form
2344E1937l1628K9271q7142p8185N7172O8079J9751J8619p7942M0505n2505o8163
2332a10231k5981P9395r9563K05235j74130J32315Q2658m7008k786m0497q0068
2321h0661J72937n9941j583r2480j2871R9873p6504k7295l607L8826j24672J06705
2309f1273J92732j2943j06950M0531r0953n2949J54780k4399k37122L631Q4670
2298a10245Q8222j05408N6294j14671M8638Q2931n2523P4392p664J29514N7008
2287A46488p3529k7828M0941j20668Q8382L1293j45923L1052P2152o5024p6609
2276i9273O1940J57846l2822j51485K4294Q5350J03624L1555j18968Q596j33550
2265f2893L3575l4823R5632L6354o2012J05615p5828j32526J54748j34419l2700
$$ plain form
2254 -109277 -33775 81342 189373 -25625 -91863 198333 209160 49423 49070 -32366 22201
2243 22201 26542 1137 -11671 39902 -204164 -36370 49753 16346 7468 -71595 -93530 -65840
2231 -65840 -111942 -29413 -25478 33136 62099 44674 89857 105118 1496 60404 50989 102907
2219 102907 -36281 -67942 -70477 -17226 104662 81514 61912 33954 2707 -133168 -156399
2208 -156399 -139913 -76238 -78270 -24423 -46493 3926 44755 21983 -38461 -41727 -39530 -64093
2196 -64093 -28409 96326 79291 -90987 -33033 35683 -15839 -147823 -100896 31887 68299
2185 68299 -75605 -149287 -202640 42567 199143 57711 -12670 15085 -69923 -106487 -79744
2174 -79744 55410 104282 55252 65786 41445 63438 -16031 4696 -60787 4914 -61414 -27397
$$ packed form
2254a09277P5502J15117J08031k14998o6238K90196J0827j59737l53q1436N4567
2243B2201M341k5405j2808N1573k44066J67794Q6123l3407q878p9063k1935K7690
2231f5840m6102Q2529L935N8614K8963j7425M5183J5261j03622N8908r415N1918
2219A02907j39188l1661k535N3251J21888k3148j9602k7958l1247j35875k3231
2208a56399J6486O3675k032N3847k2070N0419M0829k2772o0444l266K197k4563
2196f4093L5684J24735j7035j70278N7954O8716n1522j31984M6927J32783L6412
2185F8299j43904p3682n3353K45207J56576j41432p0381K7755q5008l6564K6743
2174g9744J35154M8872m9030J0534k4341K1993p9469K0727o5483O5701o6328L4017
$$ plain form
2162 -27397 -41473 -111081 -133470 -182729 -74696 119989 -107526 -123907 -109328 -92253 49927
2151 49927 -109493 -111083 -116393 -103569 -111833 -75589 4109 37076 -18755 31336 -80668 -44208
2139 -44208 -145695 -64962 -92418 -84377 -14392 106411 -14198 -130818 -11073 -8568 -76323
2128 -76323 -73532 35243 -5111 -41947 -52744 -3964 -111394 28092 45366 80129 54479
2117 54479 128202 120000 117786 -19327 -46263 -28844 -54912 -105337 -72705 -60032 -9885 -21851
2105 -21851 -64523 -79768 -143698 -128820 -226001 -188399 -108423 1987 -98822 -177962 -126710
2094 -126710 -94374 6758 10601 63353 57985 -6670 -102004 4691 106963 135372 80609
2083 80609 853 -175043 -63467 -33940 132280 55215 -25208 -236170 -111564 78485 51478
$$ packed form
2162b7397j4076o9608k2389m9259J08033J94685k27515j6381J4579J7075J42180
2151D9927j59420j590n310J2824q264L6244P9698L2967n5831N0091j12004L6460
2139d4208j01487Q0733k7456Q041O9985J20803j20609j16620J19745K505o7755
2128g6323K791J08775m0354l6836j0797M8780j07430J39486J7274L4763k5650
2117E4479P3723q202k214j37113k6936J7419k6068n0425L2632J2673N0147j1966
2105b1851m2672j5245o3930J4878r7181L7602P9976J10410j00809p9140N1252
2094a26710L2336J01132L843N2752n368o4655r5334J06695J02272K8409n4763
2083H0609p9756j75896J11576K9527J66220p7065q0423k10962J24606J90049k7007
$$ plain form
2072 51478 -30915 96682 -21353 -49399 -1624 -32903 20326 32589 -12682 -23007 -33605
2061 -33605 -4845 -72775 -272334 -236767 -220608 -13497 -113657 -72154 -76095 -21773 -37872
2050 -37872 -6316 -131758 -216003 -193872 -150452 -133718 -140801 -91065 -48634 -86301 45612 -54508
2038 -54508 39306 -7497 204522 20042 -14278 -244 -33643 -120004 -46368 -11083 47342
2027 47342 -35189 36400 -54105 -4138 42251 42567 -1339 -140917 -38101 -54325 -71074 -8175
2015 -8175 -59627 -130398 -67892 28774 11647 -21489 -17657 -61955 -21671 -90346 15747 -40084
2003 -40084 -86426 -17510 -96804 -88017 68430 73200 3319 93410 75990 -87519 78701 141675
1991 141675 41058 92589 197579 83867 -10014 -85095 49987 98152 71463 9691 79523
$$ packed form
2072E1478q2393J27597j18035k8046M7775l1279N3229J2263m5271j0325j0598
2061c3605K8760o7930j99559L5567J6159K07111j00160M1503l941N4322j6099
2050c7872L1556j25442q4245K2131M3420J6734p083M9736M2431l7667J31913j00120
2038e4508R3814m6803K12019j84480l4320J4034l3399q6361P3636L5285N8425
2027D7342q2531P1589r0505M9967M6389L16m3906j39578J02816j6224j6749O2899
2015h175n1452p0771O2506R6666j7127l3136L832m4298M0284o8675J06093n5831
2003d0084m6342O8916p9294Q787J56447M770o9881R0091j7420j63509J66220O2974
1991A41675j00617N1531J04990j13712r3881p5081J35082M8165k6689o1772O9832
$$ plain form
1980 79523 -86315 -28727 -93997 46922 -79148 43509 31392 -5110 36326 -14236 11803
1969 11803 58726 -19633 -22211 -29955 -3368 42115 -8982 191896 66862 18427 -24140 -62875
1957 -62875 21242 -35618 -116883 -141361 -114285 -37227 -184084 -75104 -117677 -97866 83491
1946 83491 44445 197324 234757 255791 80252 -14087 10156 77416 150486 115272 -11716
1935 -11716 -77768 -80033 -210386 -80233 -34669 -36083 18713 133165 154633 174906 149561 -90376
1923 -90376 -135173 -202009 -168185 -20712 36357 -21976 -115093 -9100 -4703 21842 12781 140543
1911 140543 -16302 5736 30232 -61120 -55611 27682 55003 -166865 -207901 -84881 -9104
1900 -9104 -168898 -82062 -32091 -6647 -18763 -67071 -26703 -2107 -3638 55102 3790 -35462
$$ packed form
1980G9523j65838N7588o5270J40919j26070J22657j2117l6502M1436n0562K6039
1969A1803M6923p8359k578p744K6587M5483n1097K00878j25034m8435m2567l8735
1957f2875Q4117n6860q1265k4478K7076P7058j46857J08980m2573J9811J81357
1946H3491l9046J52879L7433K1034j75539r4339K4243O7260P3070l5214j26988
1935a1716o6052k265j30353J30153M5564j414N4796J14452K1468K0273k5345k39937
1923i0376m4797o6836L3824J47473N7069n8333r3117J05993M397K6545r061J27762
1911A40543j56845K2038K4496r1352N509Q3293K7321k21868m1036J23020P5777
1900i104j59794Q6836M9971K5444j2116m8308M0368K4596j531N8740n1312l9252
$$ plain form
1888 -35462 -147275 -200264 -89046 51349 42116 -69927 -39660 10420 151761 192769 197943
1877 197943 40761 -77437 -186810 -25397 3996 18040 59543 46560 134540 -66731 -90578
1866 -90578 35509 -9152 177973 156542 58253 -33864 19805 -13910 -92795 -14260 -190020
1855 -190020 -41780 -26266 -8003 29337 63608 46011 -19033 129685 89495 57087 16693
1844 16693 65552 87372 42605 45490 30763 -56684 -133543 -92729 -92024 -41953 -119259 -114644 8918
1831 8918 41497 126278 3187 -65113 -168524 -115768 -32212 30314 68835 50429 123944 38888
1819 38888 31716 44680 64062 -45962 -80771 -120664 -117053 150929 119268 57540 96120 -50382
1807 -50382 -10700 63998 49130 65432 -46566 -79645 56868 37860 -25760 -88169 -129737
$$ packed form
1888c5462j11813n2989J11218J40395r233j12043L0267N0080J41341M1008N174
1877A97943j57182j18198j09373J61413K9393J4044M1503j2983Q7980k01271k3847
1866i0578J26087m4661J87125k1431r8289r2117N3669l3715p8885P8535j75760
1855a90020J48240J5514J8263L7340L4271j7597o5044J48718m0190l2408m0394
1844A6693M8859K1820m4767K885j4727q7447p6859M0814P05N0071p7306M615J23562
1831H918L2579Q4781j23091o8300j03411N2756Q3556O2526L8521j8406P3515q5056
1819C8888p172J2964J9382j10024l4809l9893L611K67982l1661o1728L8580j46502
1807e0382L9682P4698j4868J6302j11998l3079J36513j9008o3620o2409m1568
$$ plain form
1796 -129737 -203015 -167889 -79069 75287 14125 -171773 -65803 -18573 -31455 -81393 79189
1785 79189 132992 37982 -91388 -23432 92654 65270 24922 7771 102022 81432 -31353
1774 -31353 -60418 -87959 -189865 -118682 -41899 25048 -134077 -17061 -125202 -170062 70003
1763 70003 132836 138082 -50269 -1220 174908 12753 -97805 -129619 -54635 -71556 -103843
1752 -103843 138441 50754 -197729 -89106 78221 -15948 22019 -93209 -31123 27807 66795
1741 66795 -146343 -166269 -138019 -3838 79458 63574 70192 -72315 -257651 -82720 63108
$$ packed form
1796a29737p3278L5126Q8820J54356o1162j85898J05970M7230j2882m9938J60582
1785G9189N3803r5010j29370O7956J16086k7384m0348j7151R4251k0590j12785
1774c1353k9065k7541j01906P1183P6783O6947j59125J17016j08141m4860K40065
1763G0003O2833N246j88351M9049J76128j62155j10558l1814P4984j6921l2287
1752a03843K42284q7687k48483J08623J67327r4169L7967j15228O2086N8930L8988
1741F6795k13138j9926K8250J34181Q3296j5884O618j42507j85336J74931J45828
$$ [...]
##END NTUPLES=NMR SPECTRUM
##END=
