##TITLE=1H_CG-1207-1
 CDCl3
 8 sc, 
 25.7.2024
##JCAMPDX= 6.0         $$ Bruker NMR JCAMP-DX V2.0
##DATA TYPE= NMR SPECTRUM
##DATA CLASS= NTUPLES
##ORIGIN= UXNMR, Bruker Analytische Messtechnik GmbH
##OWNER= root
$$ XWIN-NMR		Version 3.5
$$ Thu Jul 25 13:48:34 2024 Russian Standard Time (UT+4h)  she@DPX200
##.OBSERVE FREQUENCY= 200.1315
##.OBSERVE NUCLEUS= ^1H
##.ACQUISITION MODE= SIMULTANEOUS
##.ACQUISITION SCHEME= undefined
##.AVERAGES= 8
##.DIGITISER RES= 18
##SPECTROMETER/DATA SYSTEM= spect
##.PULSE SEQUENCE= zg30
##.SOLVENT NAME= D2O
##.SHIFT REFERENCE= (INTERNAL, D2O, 0, 20.4802)
##AUDIT TRAIL= $$ (NUMBER, WHEN, WHO, WHERE, WHAT)
$$ ##TITLE= Audit trail, XWIN-NMR		Version 3.5
$$ ##JCAMPDX= 5.01
$$ ##ORIGIN= Bruker BioSpin GmbH
$$ ##OWNER= she
$$ F:/spectra/data/she/nmr/H-F/1/pdata/1/auditp.txt
$$ ##AUDIT TRAIL=  $$ (NUMBER, WHEN, WHO, WHERE, WHAT)
(   1,<2024-07-25 13:47:09.17 +0400>,<she>,<DPX200>,
      <created by zg, POWCHK disabled, PULCHK disabled
       configuration hash MD5:
       00 E9 B6 7A A2 85 ED C7 34 08 36 98 17 FE 4E 26
       data hash MD5: 16K
       5C B4 3B 4B 9C 98 0C 2F 03 6E C4 D5 2B 33 89 05>)
(   2,<2024-07-25 13:47:11.50 +0400>,<she>,<DPX200>,
      <Start of raw data processing
       efp BC_mod = 2 LB = 0.24 FT_mod = 6 PKNL = 1 PHC0 = -25633.34 PHC1 = 9.38749 SI = 16K 
       data hash MD5: 16K
       F6 95 A7 3C DA 16 C5 97 BE 77 E5 49 AD 09 88 B5>)
(   3,<2024-07-25 13:47:41.56 +0400>,<she>,<DPX200>,
      <pk PHC0 = -0.5837426 PHC1 = 0.1999997 
       data hash MD5: 16K
       EE C0 A4 DB 31 63 62 93 15 B7 29 01 DB 35 B3 F4>)
(   4,<2024-07-25 13:47:45.73 +0400>,<she>,<DPX200>,
      <abs ABSG = 5 
       data hash MD5: 16K
       B1 85 3A F1 DD 01 C8 25 CE EA 26 02 60 E8 1A C2>)
$$ ##END=
$$ 
$$ hash MD5
$$ C3 6C DA 28 B2 C8 36 9D D6 8E 74 7C 14 30 C3 AA
##$RELAX= 
##$RELAX= 
##$RELAX= 
##$RELAX= 
##$RELAX= 
##$RELAX= 
$$ Bruker specific parameters
$$ --------------------------
##$DU= <F:/spectra>
##$EXPNO= 1
##$NAME= <H-F>
##$PROCNO= 1
##$TYPE= <nmr>
##$USER= <she>
##$AMP= (0..31)
100 100 100 100 100 100 100 100 100 100 100 100 100 100 100 100 100 100 
100 100 100 100 100 100 100 100 100 100 100 100 100 100 
##$AQSEQ= 0
##$AQ_mod= 1
##$AUNM= <au_zg>
##$AUTOPOS= <>
##$BF1= 200.13
##$BF2= 200.13
##$BF3= 200.13
##$BF4= 200.13
##$BF5= 200.13
##$BF6= 200.13
##$BF7= 200.13
##$BF8= 200.13
##$BYTORDA= 1
##$CFDGTYP= 0
##$CFRGTYP= 5
##$CHEMSTR= <none>
##$CNST= (0..31)
1 1 145 1 1 1 1 1 1 1 1 1 1 1 1 1 1 1 1 1 1 1 1 1 1 1 1 1 1 1 1 1 
##$CPDPRG= <>
##$CPDPRG1= <>
##$CPDPRG2= <>
##$CPDPRG3= <>
##$CPDPRG4= <mlev>
##$CPDPRG5= <mlev>
##$CPDPRG6= <mlev>
##$CPDPRG7= <mlev>
##$CPDPRG8= <mlev>
##$CPDPRGB= <>
##$CPDPRGT= <>
##$D= (0..31)
0 1.2 0 0 0 0 0 0 0 0.06 0 0.03 0 0 0 0 0.0002 0 0 0 0 0 0 0 0 0 0 0 0 
0 0 0 
##$DATE= 1721900828
##$DBL= (0..7)
120 120 120 120 120 120 120 120 
##$DBP= (0..7)
150 150 150 150 150 150 150 150 
##$DBP07= 0
##$DBPNAM0= <>
##$DBPNAM1= <>
##$DBPNAM2= <>
##$DBPNAM3= <>
##$DBPNAM4= <>
$$ [...]
##$SUBNAM3= <"">
##$SUBNAM4= <"">
##$SUBNAM5= <"">
##$SUBNAM6= <"">
##$SUBNAM7= <"">
##$SUBNAM8= <"">
##$SUBNAM9= <"">
##$SW= 24.0689530833862
##$SWIBOX= (0..15)
0 0 2 0 0 0 0 0 0 0 0 0 0 0 0 0 
##$SW_h= 4816.95568400771
##$TD= 16384
##$TD0= 1
##$TE= 0
##$TE2= 300
##$TE3= 300
##$TEG= 300
##$TL= (0..7)
0 120 120 120 120 120 120 120 
##$TP= (0..7)
150 150 150 150 150 150 150 150 
##$TP07= 0
##$TPNAME0= <>
##$TPNAME1= <>
##$TPNAME2= <>
##$TPNAME3= <>
##$TPNAME4= <>
##$TPNAME5= <>
##$TPNAME6= <>
##$TPNAME7= <>
##$TPOAL= (0..7)
0.5 0.5 0.5 0.5 0.5 0.5 0.5 0.5 
##$TPOFFS= (0..7)
0 0 0 0 0 0 0 0 
##$TUNHIN= 0
##$TUNHOUT= 0
##$TUNXOUT= 0
##$USERA1= <user>
##$USERA2= <user>
##$USERA3= <user>
##$USERA4= <user>
##$USERA5= <user>
##$V9= 5
##$VALIST= <valist>
##$VCLIST= <CCCCCCCCCCCCCCC>
##$VD= 0
##$VDLIST= <DDDDDDDDDDDDDDD>
##$VPLIST= <PPPPPPPPPPPPPPP>
##$VTLIST= <TTTTTTTTTTTTTTT>
##$WBST= 1024
##$WBSW= 4
##$XGAIN= (0..3)
0 0 0 0 
##$XL= 0
##$YL= 0
##$YMAX_a= 986686
##$YMIN_a= -1007915
##$ZGOPTNS= <>
##$ZL1= 120
##$ZL2= 120
##$ZL3= 120
##$ZL4= 120
##$ABSF1= 20.45085
##$ABSF2= -3.618305
##$ABSG= 5
##$ABSL= 3
##$ALPHA= 0
##$AQORDER= 0
##$ASSFAC= 0
##$ASSFACI= 0
##$ASSFACX= 0
##$ASSWID= 0
##$AUNMP= <proc_1d>
##$AZFE= 0.1
##$AZFW= 0.1
##$BCFW= 0
##$BC_mod= 2
##$BYTORDP= 0
##$COROFFS= 0
##$CY= -3
##$DATMOD= 1
##$DC= 0
##$DFILT= <>
##$DTYPP= 0
##$F1P= 0
##$F2P= 0
##$FCOR= 1
##$FTSIZE= 16384
##$FT_mod= 6
##$GAMMA= 0
##$GB= 0
##$INTBC= 1
##$INTSCL= 3.70164e-10
##$ISEN= 128
##$LB= 0.24
##$LEV0= 0
##$LPBIN= 0
##$MAXI= 10000
##$MC2= 0
##$MEAN= 0
##$ME_mod= 0
##$MI= 1.114404
##$NCOEF= 0
##$NC_proc= -5
##$NLEV= 6
##$NOISF1= 3.799351
##$NOISF2= 2.8
##$NSP= 0
##$NTH_PI= 0
##$NZP= 0
##$OFFSET= 20.48023
##$PC= 1
##$PHC0= -25633.92
##$PHC1= 9.58749
##$PH_mod= 1
##$PKNL= yes
##$PPARMOD= 0
##$PSCAL= 0
##$PSIGN= 0
##$REVERSE= no
##$SF= 200.1298097729
##$SI= 16384
##$SIGF1= 3
##$SIGF2= 2
##$SINO= 5.538805
##$SIOLD= 16384
##$SREGLST= <1H.CDCl3>
##$SSB= 0
##$STSI= 16384
##$STSR= 0
##$SW_p= 4816.95568400771
##$SYMM= 0
##$S_DEV= 0
##$TDeff= 16384
##$TDoff= 0
##$TI= <>
##$TILT= no
##$TM1= 0
##$TM2= 0
##$TOPLEV= 0
##$USERP1= <user>
##$USERP2= <user>
##$USERP3= <user>
##$USERP4= <user>
##$USERP5= <user>
##$WDW= 1
##$XDIM= 16384
##$YMAX_p= 442112912
##$YMIN_p= -473432
$$ End of Bruker specific parameters
$$ ---------------------------------
##NTUPLES= NMR SPECTRUM
##VAR_NAME=  FREQUENCY,     SPECTRUM/REAL,   SPECTRUM/IMAG
##SYMBOL=    X,             R,               I
##VAR_TYPE=  INDEPENDENT,   DEPENDENT,       DEPENDENT
##VAR_FORM=  AFFN,          ASDF,            ASDF
##VAR_DIM=   16384,         16384,           16384
##UNITS=     HZ,            ARBITRARY UNITS, ARBITRARY UNITS
##FACTOR=    0.29402158847633, 1,            1
##FIRST=     4098.70460033244, 0,            0
##LAST=      -718.251083675269, 0,           0
##MIN=       -718.251083675269, -473432,     0
##MAX=       4098.70460033244, 442112912,    0
$$ Real data points
##PAGE= N=1
##DATA TABLE= (X++(R..R)), XYDATA
$$ [...]
5771f3058l2347J3105n3165r775K2696P8620O6108r8124o3092M5363P8830J1905
5759b934p9969L5718j5540N7231n9223K2620r425Q6708m1039m6k068J9447k9217
5746a7737j6374L7023L2629N1325p0566k9857M048K5067K3390j5794j4839P2468
5734H0783N453K2663l666K157P3827J9950k6817n5316K4083L8665R728r30N6137
5721B46717M4519M8480M9550o876N5381N1081j3402M9006L8462j141p1710J8515
5709E08582M3544J04163J841l4091M1806O1037K3493P930J7619j2683J7557k9858
5697G50940Q130J2283L2354K3535o321l9627P8320L3536o2971L0303N2745r1611
5685H21616o3464n9932l620L7755m6843o4605l4412m3020J3624L1308m1672l3609
$$ plain form
5771 -63058 -95405 -82300 -135465 -145240 -122544 -43924 22184 -75940 -139032 -93669 -14839 -2934
5759 -2934 -82903 -47185 -62725 -5494 -64717 -42097 -51522 35186 -5853 -5899 -7967 11480 -17737
5746 -17737 -34111 2912 35541 86866 16300 -13557 -9509 15558 38948 23154 8315 80783
5734 80783 86236 108899 105233 107390 181217 201167 174350 119034 143117 181782 191510 190580 246717
5721 246717 291236 339716 389266 382390 437771 488852 475450 524456 562918 561777 490067 508582
5709 508582 552126 656289 658130 624039 665845 726882 750375 758305 775924 763241 780798 750940
5697 750940 759070 771353 803707 827242 820921 781294 859614 893150 830179 860482 913227 821616
5685 821616 758152 698220 694600 732355 685512 620907 586495 543475 557099 588407 546735 513126
5673E13126o7189k6348m4441L9120l6775k9833M780n1428k5905K0578K3377J3472
5661C32534k9931K5578Q997o4674l4518K6876N394l1324R57N3668K7235o358J5080
5648C29514O82r1066q2838Q8874j2946Q7257q6969M4945O0928L5452K1818N3190
5636D48841r2224k1561M5069p5156K2368k9369J7268M1022R661l6647J6679j88
5624C45763J378n9775P3144J3786k1259P1460p7493K0308P161L1510P764r5745
5612C18002R5449N3929j7981m434J05748N548J349n2870k7290l920p770J2463
5600D78223R1299j7241L4761J4892j4271l3376m3947N418J3746P8620n5351M0466
5588E93239l6699l2952N0350M0867n6208L5320j6077N0930L8838l3451m1204k0863
$$ plain form
5673 513126 445937 419589 375148 414268 377493 347660 352440 301012 275107 295685 319062 332534
5661 332534 302603 328181 337178 272504 237986 264862 270256 238932 239889 293557 320792 314434 329514
5648 329514 330196 239130 156292 245166 232220 319477 232508 277453 338381 373833 395651 448841
5636 448841 356617 335056 380125 304969 327337 297968 315236 356258 365919 329272 345951 345763
5624 345763 347141 287366 360510 374296 353037 424497 347004 367312 374473 405983 413747 318002
5612 318002 413451 467380 449399 444965 550713 556261 557610 504740 477450 473530 465760 478223
5600 478223 569522 552281 587042 601934 587663 554287 510340 515758 529504 608124 552773 593239
5588 593239 556540 523588 573938 614805 558597 593917 577840 628770 667608 634157 592953 572090
5576E72090J5408n6677m9933O0423P4143l896J8786k4788N4018k2990K7099O2339
5564G26022j477m1932N0533N6664K2251k1901n9994K5115q6159r470O6658r1131
5552F35179n423L0142N5399m6836n1539J15001M6492O220r1901K0699J00514K6052
5540H39999p4249k6039N1989M3064k7768l7983o1952P9044J298K4094k0228k8455
5528G62814o851M7920P4601n1206J239m1470K9790j303Q2993P4108L4425L4181
5516A041241o2616l2254o6810P3370l00P793P6333o4733p280Q3762K8832L9391
5504A116729P271L9621O5035K2846K6651l4969J5949o0289J8808L7845l9410m6853
5492A169234P179k8640P2012L1067k0916m1244J2365j6875L0086R2467P6547l9731
$$ plain form
5576 572090 587498 530821 480888 541311 615454 611558 630344 605556 659574 636584 663683 726022
5564 726022 724545 682613 733146 789810 812061 790160 730166 755281 669122 659652 726310 635179
5552 635179 629756 659898 715297 668461 616922 731923 778415 784635 692734 713433 813947 839999
5540 839999 765750 739711 791700 834764 806996 769013 707061 786105 787403 811497 791269 762814
5528 762814 755963 803883 878484 827278 828517 787047 816837 815534 898527 972635 1007060 1041241
5516 1041241 978625 946371 879561 952931 952631 960424 1036757 972024 964744 1048506 1077338 1116729
5504 1116729 1124000 1163621 1228656 1251502 1278153 1243184 1259133 1198844 1217652 1255497 1216087 1169234
5492 1169234 1176413 1147773 1219785 1250852 1229936 1188692 1201057 1184182 1214268 1306735 1383282 1343551
5480A343551j8905Q219L7156P719N1534K1366J9797r64K0878l7011k5355m188
5468A423797M3292o3405n7201J45932M1930N422J1308j2534K8193k7892n4219
5457A484623J04689P7755J16405n3629m0251N5223j9031k4148j7998o0143P7539
5446A701034L1958k1548O5781L9635p526l606j4712M4024l767m780Q130J7846
5434A852469k9788M4693l7566M5634N4375n1283q2487K7294K0973P2333r918K0473
5422A927202K2256M7944n4362j1610J7504M2996o236j4982K4977k2797L7046L3637
5410B043575n9088j5792N8752Q0228n968r994N6726L3931P2142n1378n1469N7548
5398B209213J26724K603J2179M0237j4376j6692J10485N2983p931P392O9063k911
$$ plain form
5480 1343551 1324646 1332865 1370021 1377740 1429274 1450640 1470437 1469473 1490351 1453340 1427985 1423797
5468 1423797 1467089 1403684 1346483 1492415 1534345 1539767 1551075 1538541 1566734 1538842 1484623
5457 1484623 1589312 1667067 1783472 1729843 1689592 1744815 1725784 1701636 1683638 1623495 1701034
5446 1701034 1732992 1711444 1777225 1816860 1809334 1805728 1791016 1835040 1831273 1826493 1834623 1852469
5434 1852469 1822681 1867374 1829808 1875442 1929817 1878534 1796047 1823341 1844314 1916647 1906729 1927202
5422 1927202 1949458 1997402 1943040 1931430 1948934 1991930 1985694 1970712 1995689 1972892 2009938 2043575
5410 2043575 1984487 1968695 2027447 2107675 2101707 2091713 2148439 2182370 2254512 2203134 2151665 2209213
5398 2209213 2335937 2338540 2350719 2390956 2376580 2359888 2470373 2523356 2515425 2522817 2591880 2588969
5386B588969O0434J20944L8741r770J1761o4081Q0003M2865K8432P9816k6802
5375B951312M3537L6110O4176j5O0911J24818m0608L6252J1927J12906L1824P3957
5363C507107N9367J40861N0277M704p4922L4643J21564P3869j8984J40754J80044
5352D219284l1601P4786J23361k160R4634J63002N4195J00318J03712J29430O3804
5341E092765Q9177J75832J26533J10028P0628J38737J07804J18176J74262J61883
5331F365825J46662J14086K26724K05627J52057K58390K37849K35540K75536J75011
5321H393307K68081K86566K85648K73998L03187L42701M33508M04368N39424N59815
5311A2090603N53421O99121O39252N37004M84166M43233O09955N93457M98704
$$ plain form
5386 2588969 2649403 2770347 2809088 2799318 2811079 2746998 2827001 2869866 2898298 2978114 2951312
5375 2951312 2994849 3030959 3095135 3095120 3156031 3280849 3240241 3276493 3288420 3401326 3433150 3507107
5363 3507107 3566474 3707335 3757612 3762316 3687394 3722037 3843601 3917470 3898486 4039240 4219284
5352 4219284 4187683 4262469 4385830 4383670 4478304 4641306 4695501 4795819 4899531 5028961 5092765
5341 5092765 5181942 5357774 5484307 5594335 5664963 5803700 5911504 6029680 6203942 6365825
5331 6365825 6512487 6626573 6853297 7058924 7210981 7469371 7707220 7942760 8218296 8393307
5321 8393307 8661388 8947954 9233602 9507600 9810787 10153488 10586996 10991364 11530788 12090603
5311 12090603 12644024 13343145 13982397 14519401 15003567 15446800 16056755 16650212 17148916
5302A7148916P80500P18512P85946Q86721J128968J146797J239774J498246J650635
5293B6985015K034604K305099K684175L108133L609912L980240L767763K758445
5285E1233386J324899j11577j009639j643342j667979j486675r65678n13733J57787
5276D5317449P53494J342767J993992K664094L603202M629645N607166O624004
5268G2535813O525253M576729J103242k276052m620844o093525o513506n993109
5260E9244001n044399l980285k947014k128240j283820m67570J50487P50344J718931
5251D6012435K091724K423174K192038Q40424q81456k344742l297857l953161
5243D3082579m001966l614453l185956k766896k154739j718291j354771j020477
$$ plain form
5302 17148916 17929416 18647928 19433874 20320595 21449563 22596360 23836134 25334380 26985015
5293 26985015 29019619 31324718 34008893 37117026 40726938 44707178 48474941 51233386
5285 51233386 52558285 52446708 51437069 49793727 48125748 46639073 45673395 45159662 45317449
5276 45317449 46070943 47413710 49407702 52071796 55674998 60304643 65911809 72535813
5268 72535813 79061066 83637795 84741037 82464985 77844141 71750616 65237110 59244001
5260 59244001 54199602 50219317 47272303 45144063 43860243 43392673 43543160 44293504 46012435
5251 46012435 48104159 50527333 52719371 53559795 52678339 50333597 47035740 43082579
5243 43082579 39080613 35466160 32280204 29513308 27358569 25640278 24285507 23265030
5235B3265030p81470o33784n35251k72182k25142p6069j52019j93978l35537m97806
5225A9561792n09974n09713m24298l14304j10827L4792J60193K07508M76256O62406
5215A9233831N92553N21224K99512q050j02284l67212m50715n59498n73290m53710
5205A8132361m47119k65525k53555r6616R8836K72357M47768P26521R26813J132126
5195B0673967J260768J297106Q26348j49236p57515j213473j576713j601657j512002
5186A7247593j302033j050613p65064o24530m06246k01746p7043o1021J83926
5177A2943223L51749M79136N36977N21183K64790j00722m22349p98428r85437
5168A2790122j040891r98870q57846n98099n78360m69696l81346l38639m34510
$$ plain form
5235 23265030 22483560 21849776 21314525 21042343 20817201 20741132 20589113 20395135 20059598 19561792
5225 19561792 19051818 18542105 18117807 17803503 17692676 17727468 17887661 18095169 18571425 19233831
5215 19233831 19826384 20347608 20647120 20639070 20536786 20169574 19718859 19159361 18586071 18132361
5205 18132361 17685242 17419717 17166162 17069546 17168382 17440739 17888507 18615028 19541841 20673967
5195 20673967 21934735 23231841 24058189 23908953 23151438 21937965 20361252 18759595 17247593
5186 17247593 15945560 14894947 14129883 13505353 13099107 12897361 12820318 12759297 12943223
5177 12943223 13294972 13774108 14311085 14832268 15097058 14996336 14573987 13775559 12790122
5168 12790122 11749231 10750361 9892515 9294416 8716056 8246360 7865014 7526375 7091865
5159G091865j72224j63708k21447k02344k22807j54361j61668j53910j02055j91427
5149E345914r7479j28665j00459l6868l9256L2532l8835K5440j07350q6171p0016
5138D698787p9750j06026j23187q8828m4169r2222q1265o5319j18843j03445M519
5127C800252j8027J3669o1964q6937K3322J4775k4335p275K5919L3932j44292
5116C569039p1157O2147n1899k6889L2918r8021l9919l4951n1651M4784j2329
5105C322072K8295k704J9032j09159L0004J02078J5227M9805m3516M754N5100
5094C470988J0316l5965Q4505K4471J4342M3481m5178o3834m6990j5276m558Q9756
5082C526058M5135J9159L5432n1921J5116K1081Q8705N025Q5161P9941k7272P6009
$$ plain form
5159 7091865 6919641 6755933 6534486 6332142 6109335 5954974 5793306 5639396 5537341 5345914
5149 5345914 5248435 5119770 5019311 4982443 4943187 4975719 4936884 4962324 4854974 4768803 4698787
5138 4698787 4619037 4513011 4389824 4300996 4256827 4164605 4083340 4018021 3899178 3795733 3800252
5127 3800252 3782225 3795894 3733930 3646993 3670315 3685090 3660755 3653480 3679399 3713331 3569039
5116 3569039 3497882 3560029 3508130 3481241 3514159 3416138 3376219 3341268 3289617 3334401 3322072
5105 3322072 3350367 3347663 3366695 3257536 3287540 3389618 3404845 3454650 3411134 3415888 3470988
5094 3470988 3481304 3445339 3529844 3554315 3568657 3612138 3566960 3503126 3456136 3440860 3436302 3526058
5082 3526058 3571193 3590352 3625784 3573863 3588979 3610060 3698765 3703790 3788951 3868892 3841620 3917629
5070C917629j0441p873N2124J0946j2316o0849K1848J29850k0017O022M3884M6163
5058D116970J03574Q6043O1210J07101J07977j5179P6609J0204M2064R2173P172
5047D795918R223k5781J42657Q1073N6896L9372P4239M668J19533J89650j256
5036E486192N2665R9944N4185M1235N4990J7669j3805Q7210O0291J04044M9520
5025F094140M0065J42349R5896L1906N1902J34371Q5939K3836R1859K6126K6127
5014F844516n806P9162P9713J3162P3051L2452R7316O7376J66073J26930J14553
5003G688498J72627J73386J23067J43320J01959J12682J46191K83917J58680J70040
4993I274367J26768J91052J79135J92530L81493J21380K77654K99339L68408L79228
$$ plain form
5070 3917629 3907188 3899315 3951439 3962385 3950069 3889220 3911068 4040918 4020901 4026923 4070807 4116970
5058 4116970 4220544 4306587 4367797 4474898 4582875 4567696 4644305 4654509 4696573 4788746 4795918
5047 4795918 4805141 4779360 4922017 5003090 5059986 5099358 5173597 5178265 5297798 5487448 5486192
5036 5486192 5538857 5638801 5692986 5734221 5789211 5806880 5793075 5880285 5940576 6044620 6094140
5025 6094140 6134205 6276554 6372450 6404356 6456258 6590629 6676568 6700404 6792263 6818389 6844516
5014 6844516 6838710 6917872 6997585 7010747 7083798 7116250 7213566 7280942 7447015 7573945 7688498
5003 7688498 7861125 8034511 8157578 8300898 8402857 8515539 8661730 8945647 9104327 9274367
4993 9274367 9401135 9592187 9771322 9963852 10345345 10466725 10744379 11043718 11412126 11791354
4983A1791354L26914M18174M27764M49815N26050N68974N28347O26489P07154
4974A6371035O55448O48151M20806L48178J64708R1140L4370J49473K12429L25095
4964A9420833M25758N94209N37687N89241P46304P99158R08785R07292J069279
4955B5998546J092237J096633J053857Q37321O76078O80246P30251P09794R52380
4946C3827343J276310J517460J851647K305717K752105L220935L714259M236456
4938E4702232M120085K899240R17999q25449j847054k432429k347022k195947
4930E2991655j680024r40233l35421L26022J030282J783562K741199L710647M714593
4921F4342282N835325O806932O392291L307374q94672m038572o154156p163865
$$ plain form
4983 11791354 12118268 12536442 12964206 13414021 13940071 14509045 15037392 15663881 16371035
4974 16371035 17026483 17674634 18095440 18443618 18608326 18699466 18733836 18883309 19095738 19420833
4964 19420833 19846591 20440800 20978487 21567728 22314032 23113190 24021975 24929267 25998546
4955 25998546 27090783 28187416 29241273 30078594 30754672 31434918 32165169 32874963 33827343
4946 33827343 35103653 36621113 38472760 40778477 43530582 46751517 50465776 54702232
4938 54702232 58822317 61721557 62639556 61814107 59967053 57534624 55187602 52991655
4930 52991655 51311631 50371398 50035977 50361999 51392281 53175843 55917042 59627689 64342282
4921 64342282 70177607 76984539 83376830 86684204 85789532 81750960 75596804 68432939
4913F8432939o787174n819278m802667l653398k699074k080661j302864o67069
4905D0620754j73209N86582J108909J605824J934963J821205O34792j006093k319130
4896D4814597l018298l400485l319473k867261k304675j871445j391947j162447
4888B5478566r53891p12965m41325m43479n00264m10776m56641m23280l76442
4879B0759503m86330l34831j81068Q189K9182J39812K53743L55603M79150M71291
4869B1494244O28294O44622Q28197R93843J146574J041004O59937N32006N01835
4860B8470556M58583N05912J97580j65706l30943n27622n85496m84278m16767
4851B7121819k01022M4410K42827L63327O42982Q43222J016195J178240J174758
$$ plain form
4913 68432939 61645765 55826487 51023820 47370422 44671348 42590687 41287823 40620754
4905 40620754 40447545 41034127 42143036 43748860 45683823 47505028 48139820 47133727 44814597
4896 44814597 41796299 38395814 35076341 32209080 29904405 28032960 26641013 25478566
4888 25478566 24524675 23811710 23370385 22926906 22426642 22015866 21559225 21135945 20759503
4879 20759503 20273173 19938342 19757274 19765463 19794645 19934457 20188200 20543803 21022953 21494244
4869 21494244 22122538 22767160 23595357 24589200 25735774 26776778 27436715 27968721 28470556
4860 28470556 28929139 29435051 29632631 29466925 29135982 28608360 28022864 27538586 27121819
4851 27121819 26920797 26965207 27208034 27571361 28214343 29057565 30073760 31252000 32426758
4842C2426758J314399J555865J861661J783159J040922J50729m80438r21721j150981
4833C7580353j087695q80264m89759j65353J68273N85548Q84411J042087J336982
4824C8974583J592701J987899K236076K674412L235306L756802M028737L919371
4816F2405887K970511J210042l41274j395501j705045j555393j025040l54070
4808F0210117K24510P85756J403077K071530L294906M390839O144931N815697
4800H4341363K460100O13643j359545k926401l485000m235313m905038m855934
4792F5647875m452144l707328k747237j967544j424542r38341m00147K89457R03537
4783E1203586J454157J719780J037752n74897k253916l292739l791797l786107
$$ plain form
4842 32426758 33741157 35297022 37158683 38941842 39982764 40133493 39653055 38731334 37580353
4833 37580353 36492658 35612394 35122635 34957282 35125555 35711103 36595514 37637601 38974583
4824 38974583 40567284 42555183 44791259 47465671 50700977 54457779 58486516 62405887
4816 62405887 65376398 66586440 66245166 64849665 63144620 61589227 60564187 60210117
4808 60210117 60434627 61220383 62623460 64694990 67989896 72380735 78525666 84341363
4800 84341363 86801463 87415106 86055561 83129160 79644160 75408847 70503809 65647875
4792 65647875 61195731 57488403 54741166 52773622 51349080 50410739 50010592 50300049 51203586
4783 51203586 52657743 54377523 55415275 54840378 52586462 49293723 45501926 41715819
4775D1715819l531311l100959k706101k397196k312922j979830j805871j613451
4767B2268178j354233j256980j154389j036107q85060p67255p84995o12738m72612
4758A3943809m93952m71762m74932l74567l81391k85525k96841j95113k50892
4749A0718834j73111m3362j40699M6090K7089Q3022R5846L4391j74162k40789
4739A0233149l46180m56644n06647m62245l71348l28527k79062j48013j66491
4730G167992k93439j18138q9406r0170p913r4431j08505j21336j47121j30169
4720E967364j52304j4195m5482l4654p3081n7990l6910p0978j3639n1749p4902
4709E341480n1875q8206n3619k7664l0558m6256L8544j7541Q380m1408j9056n5622
$$ plain form
4775 41715819 38184508 35083549 32377448 29980252 27667330 25687500 23881629 22268178
4767 22268178 20913945 19656965 18502576 17466469 16581409 15814154 15029159 14416421 13943809
4758 13943809 13449857 12978095 12503163 12128596 11747205 11461680 11164839 10969726 10718834
4749 10718834 10545723 10502361 10361662 10407752 10434841 10517863 10613709 10648100 10473938 10233149
4739 10233149 9886969 9430325 8923678 8461433 8090085 7761558 7482496 7334483 7167992
4730 7167992 6874553 6756415 6667009 6576839 6568926 6474495 6365990 6244654 6097533 5967364
4720 5967364 5815060 5800865 5755383 5720729 5647648 5589658 5552748 5481770 5468131 5416382 5341480
4709 5341480 5289605 5201399 5147780 5120116 5089558 5043302 5081846 5064305 5072685 5031277 5012221 4956599
4697D956599N6011M6315k410k7791K9161J59268Q0171L2427J1145N7862J6634
4686E415392P9416R9188O5276K7041K09800K15429K35977J92858J22841K4511
4676F687729j33960j72847n9528j58311j80658r5213K0470l2871J6692N5811J27593
4665F074907O3247Q5347J82438K02975J34853K20760K72320M24509N80948P11788
4655H954092O33016K54332j48262m02481m74815n81620n50698m53985k09422j77234
4645F842923k25748J7236O1127M9683J8165n5033J58165J38457J55601K74476
4635G435052L50076M30156O31794Q44740Q77861M25545L5056j88310l39948m61493
4625A0040529m83487m73716m11259l62139l03079k98661j84806q567j13575j39976
$$ plain form
4697 4956599 5012610 5058925 5056515 5028724 5057885 5217153 5297324 5329751 5340896 5398758 5415392
4686 5415392 5494808 5593996 5659272 5686313 5896113 6111542 6347519 6540377 6663218 6687729
4676 6687729 6553769 6380922 6321394 6163083 5982425 5887212 5907682 5874811 5891503 5947314 6074907
4665 6074907 6138154 6223501 6405939 6608914 6743767 6964527 7236847 7661356 8242304 8954092
4655 8954092 9587108 9841440 9693178 9290697 8815882 8234262 7683564 7229579 7020157 6842923
4645 6842923 6617175 6634411 6695538 6745221 6763386 6708353 6866518 7004975 7160576 7435052
4635 7435052 7785128 8215284 8847078 9691818 10569679 10995224 11030280 10841970 10502022 10040529
4625 10040529 9557042 9083326 8672067 8309928 8006849 7708188 7523382 7514815 7401240 7261264
4615G261264J3350M5570m0748J38234K54663K17998J95968L75194L96582L38643
4605I196718K69850J69942K11175J18969J24400J4179j94062k61374l92307m58144
4595H799346m31140l30684l77147k89785k33038k68267j41354m4104j13459O232
4585F576600Q6036l5056P0286J30418J56826J58373K16540J02313K98305J94143
4575G954784L7800j12246k70458k63704l64234l16702l28394k88088l26576j75143
4565E547039j48151j48226j05718l3305P467o3945l8721o3097j9639L3031j3177
4554D953558Q2288r309m4319J3157M7560L31m9706p515q6791j26896n2390n6609
4542D663359l1736m2412j24270o8013P270l970j66272Q610o2464r1131N5263L7664
$$ plain form
4615 7261264 7274614 7320184 7279436 7417670 7672333 7890331 8086299 8461493 8858075 9196718
4605 9196718 9466568 9636510 9847685 9966654 10091054 10105233 9911171 9649797 9257490 8799346
4595 8799346 8368206 8037522 7660375 7370590 7137552 6869285 6727931 6683827 6570368 6576600
4585 6576600 6662636 6627580 6697866 6828284 6985110 7143483 7360023 7462336 7760641 7954784
4575 7954784 7992584 7880338 7609880 7346176 6981942 6665240 6336846 6048758 5722182 5547039
4565 5547039 5398888 5250662 5144944 5111639 5119106 5055161 5016440 4953343 4933704 4966735 4953558
4554 4953558 5035846 5026537 4982218 4995375 5042935 5043266 4993560 4986045 4899254 4772358 4719968 4663359
4542 4663359 4631623 4589211 4464941 4396928 4404198 4400228 4233956 4242566 4180102 4088971 4144234 4181898
4530D181898p2182j4499O2651O5987P4014O6006J5337N1417K3652m6756J3277
4519D420802L6988k4698m6934r0619K4747l714J9975M1579R7231j7579P1627j8650
4507D510755m0951R4026k7287k1075M252N5936M8596P5769O21q1056l8243P0876
4495D652219K2009j108K7186R1398N1583J0821J9344K8364N9351M2914j4439O0041
4483E049683r0072N8280K5938K6332K3154K3014j5246L2670L4561j968J64656
4472E331002o4790O6135J17256N3047J20373O0889P3161N9331J36104j756L8630
4461E989382Q9848Q8849M6439O0376Q6479J01871J60160R1880N2404Q0716K03930
4450G052334J39643J01889J13509J38452L6840J07917J23556J52106L4051J28799
$$ plain form
4530 4181898 4109716 4095217 4157868 4223855 4297869 4363875 4379212 4430629 4454281 4407525 4420802
4519 4420802 4457790 4433092 4386158 4295539 4320286 4316572 4336547 4378126 4475357 4457778 4529405 4510755
4507 4510755 4469804 4563830 4536543 4515468 4519720 4575656 4624252 4700021 4700642 4619586 4581343 4652219
4495 4652219 4674228 4673120 4700306 4791704 4843287 4854108 4873452 4901816 4961167 5004081 4989642 5049683
4483 5049683 4959611 5017891 5043829 5070161 5093315 5116329 5101083 5133753 5168314 5166346 5331002
4472 5331002 5266212 5332347 5449603 5502650 5623023 5683912 5757073 5816404 5952508 5950752 5989382
4461 5989382 6079230 6168079 6214518 6274894 6361373 6463244 6623404 6715284 6767688 6848404 7052334
4450 7052334 7191977 7293866 7407375 7545827 7582667 7690584 7814140 7966246 8000297 8129096
4440H129096K10347J02042J09313Q6128J91363J42710J81042J26057J53033K18699
4430I649830J67483J55201J83875L3273J32571J09615K56811K01971J96799M29409
4420A1516838N25978O12876Q27244P98474J17803l10062j32919k46765o88399
4411A3021068p42711m73159o01406m93307l13669k28905j45870k51873j28877
4402I641291l5081Q011R9m2191J1589L0057n0831J39226Q3385O7855p290J9608
4390I865728K7404J31204J06102M0121K03028J41217J03536J13633R6072J50167
4380A0978212J38147J52285J48614J25712J31155K51863K13535J85053N4319K29349
4370A2608244L46452J93404J90485K16916K42667K30441K80438K62317L40962
$$ plain form
4440 8129096 8339443 8441485 8550798 8636926 8828289 8970999 9152041 9278098 9431131 9649830
4430 9649830 9817313 9972514 10156389 10189662 10322233 10431848 10688659 10890630 11087429 11516838
4420 11516838 12042816 12655692 13482936 14281410 14399213 14089151 13956232 13709467 13021068
4411 13021068 12278357 11805198 11203792 10710485 10396816 10167911 10022041 9770168 9641291
4402 9641291 9606210 9614221 9614320 9572129 9583718 9613775 9562944 9702170 9785555 9853410 9846120 9865728
4390 9865728 9893132 10024336 10130438 10170559 10373587 10514804 10618340 10731973 10828045 10978212
4380 10978212 11116359 11268644 11417258 11542970 11674125 11925988 12139523 12324576 12378895 12608244
4370 12608244 12954696 13148100 13338585 13555501 13798168 14028609 14309047 14571364 14912326
4361A4912326L40506L43766L22658L37172M43695M30306M51427L68215M50173
4352A8400244N25933M96876N40987N83723N35938N98811N22310O25176P15742
4343B3545740P13902P70325J009916R76549R20269Q52217R40124J041085J153831
4334C1923958J328498J500534J865446K217577K713270L377187K878276Q55473
4326D8660219Q17674R79529K20756J01713O14967J013781J523659K009589K298438
4317E8240325K814408L128339L545081L987176M286331M504640M762550M677498
4309H9946348M186033L714313L114579K544194K167348J926587J851163K001554
4301A11452119K040017K316884K595363K697543K951956L418629L908209M476889
$$ plain form
4361 14912326 15252832 15596598 15919256 16256428 16700123 17130429 17581856 17950071 18400244
4352 18400244 18926177 19423053 19964040 20547763 21083701 21682512 22204822 22829998 23545740
4343 23545740 24259642 25029967 26039883 27016432 27936701 28788918 29729042 30770127 31923958
4334 31923958 33252456 34752990 36618436 38836013 41549283 44926470 47804746 48660219
4326 48660219 49477893 50457422 50678178 50779891 51394858 52408639 53932298 55941887 58240325
4317 58240325 61054733 64183072 67728153 71715329 76001660 80506300 85268850 89946348
4309 89946348 94132381 97846694 100961273 103505467 105672815 107599402 109450565 111452119
4301 111452119 113492136 115809020 118404383 121101926 124053882 127472511 131380720 135857609
4293A35857609N058649N758279O183458N910266M966040K804911o7068k729632
4285A63742512m804006n653268n647585n054099m086343l153980k309176j717891
4277A31316164j299891j157808j245924j317487j524827j586640j705016j894888
4269A19583683k222110k784418l528045m454377n230839n505710n503627n351562
4261H5002995m798449m255913l738748l416445l041656k826848k691650k508062
4253E7725224k479656k448491k342661k149649j895703j760996j561228j382303
4245D1704537j158109r54745q63815o35641n34641m36748l50561j87965j05356
4236C6476956N8365J22373L54346L59632M51836M49518M19090M31977K84216L86827
$$ plain form
4293 135857609 140916258 146674537 152857995 158768261 163734301 166539212 166472144 163742512
4285 163742512 158938506 153285238 147637653 142583554 138497211 135343231 133034055 131316164
4277 131316164 130016273 128858465 127612541 126295054 124770227 123183587 121478571 119583683
4269 119583683 117361573 114577155 111049110 106594733 101363894 95858184 90354557 85002995
4261 85002995 80204546 75948633 72209885 68793440 65751784 62924936 60233286 57725224
4253 57725224 55245568 52797077 50454416 48304767 46409064 44648068 43086840 41704537
4245 41704537 40546428 39591683 38727868 38092227 37557586 37120838 36770277 36582312 36476956
4236 36476956 36535321 36657694 37012040 37371672 37823508 38273026 38692116 39124093 39408309 39795136
4226C9795136M00436N42893N66538O55313Q60209Q55699P79554Q41356R39737
4217D6236871J133322J156174J424527J590748J763078J853134K201116K436281
4209E9795251K825966L216834L694317L837127L421109K245904L92953j055338
4201G8374123j943181k217564j827551j527959j012496o87734l59263K67631R19154
4192F9985160J852421K648972L083103K981168K628440J811260L92020j316771
4184H4065773k933213m196322m889222m979993m430961l639852k978576k526372
4176E3491262j919402j546764r68572k16120L61342O75866N40506l34965j717220
4167D8365933k806175l471533l753696l524914l187011k590391k272012k034189
$$ plain form
4226 39795136 40195572 40738465 41305003 41960316 42820525 43676224 44455778 45297134 46236871
4217 46236871 47370193 48526367 49950894 51541642 53304720 55157854 57358970 59795251
4209 59795251 62621217 65838051 69532368 73369495 76790604 79036508 79429461 78374123
4201 78374123 76430942 74213378 72385827 70857868 69845372 69157638 68798375 69066006 69985160
4192 69985160 71837581 74486553 77569656 80550824 83179264 84990524 85382544 84065773
4184 84065773 81132560 76936238 72047016 67067023 62636062 58996210 56017634 53491262
4176 53491262 51571860 50025096 49056524 48840404 49201746 49877612 50418118 50083153 48365933
4167 48365933 45559758 42088225 38334529 34809615 31622604 29032213 26760201 24726012
4159B4726012j709852j522661j360023j119848j058660r65343q19219p14182p07460
4150A4748764n92403n14465n13382m67492m01441m34527l94228m03007l17678
4141A0710141l30028k80237k77312k47442j84517k73558j25749k36010j73797
4132H581491k28646j87455k16669j46983j78867j50369j27407j32709q8016j07454
4122G016916j31418j04126j10384n9463j73766q6608p5252o2789n8680j07826
4112F046604r4489m1805k8188q9926j14088j6093m5152o5282o2578q6995L2356
4101E434364J0045k2674r2841j7359l693L6114p469k4160J6021l1699l880n204
4089E287565k8386j4666k7773r0668n6789N5110L5855K6454n3966k5491o024l610
$$ plain form
4159 24726012 23016160 21493499 20133476 19013628 17954968 16989625 16170406 15456224 14748764
4150 14748764 14156361 13641896 13128514 12661022 12259581 11825054 11430826 11027819 10710141
4141 10710141 10380113 10099876 9822564 9575122 9390605 9117047 8991298 8755288 8581491
4132 8581491 8352845 8165390 7948721 7801738 7622871 7472502 7345095 7212386 7124370 7016916
4122 7016916 6885498 6781372 6670988 6611525 6437759 6351151 6275899 6213110 6154430 6046604
4112 6046604 5952115 5910310 5882122 5792196 5678108 5662015 5616863 5551581 5489003 5402008 5434364
4101 5434364 5444409 5421735 5328894 5311535 5307842 5343956 5336487 5312327 5328348 5296649 5292769 5287565
4089 5287565 5259179 5244513 5216740 5126072 5069283 5124393 5160248 5186702 5132736 5107245 5101221 5097611
4077E097611m0195o0532L3080K1795M6867L2327j7032m1566k1602M2023l5745
4066E057031M086m6334Q234m0250o4229m4293l4459K5751m8735o8194L0859K8589
4054D808056k9049k3591o0432k1572L7351j8562r4437q9199M0736L1187J2400
4043D592888p0881L7395j21035k2465N9020n8750k3327j6712l1073l4543o4542
4032D245975N6040O4005l4110Q238m7050N1688N7219J6026M1851m9797l5375R731
4020D384441J6996l9328m6399K1700R1408l2463l2031o11K2119O7030P2495Q8451
4008D613808N084M1237K0089P9439N422N6096L4434M3493P5251M6382j6201K2195
3996E026729J42577O4080n567M7050K8248R6903N4414M6887n1014M3391J00714
$$ plain form
4077 5097611 5057416 4996884 5029964 5051759 5098626 5130953 5113921 5072355 5050753 5092776 5057031
4066 5057031 5061117 5014783 5023017 4982767 4918538 4874245 4839786 4865537 4816802 4748608 4779467 4808056
4054 4808056 4779007 4755416 4694984 4673412 4710763 4692201 4597764 4508565 4549301 4580488 4592888
4043 4592888 4522007 4559402 4438367 4415902 4474922 4416172 4392845 4376133 4345060 4310517 4245975
4032 4245975 4302015 4366020 4331910 4340148 4293098 4344786 4402005 4418031 4459882 4410085 4374710 4384441
4020 4384441 4401437 4362109 4315710 4337410 4428818 4396355 4364324 4363713 4385832 4452862 4525357 4613808
4008 4613808 4618892 4660129 4680218 4759657 4765079 4821175 4855609 4899102 4974353 5020735 5004534 5026729
3996 5026729 5169306 5233386 5227819 5274869 5303117 5400020 5454434 5501321 5450307 5493698 5594412
3985E594412Q3406J10828K2368L1507J01567O7364R8272O7378Q9042J563O5891
3974F333598M5046J34177P7983L0644m472J925Q683L8214P5227J7142p164Q9930
3962F840933J52466J3974J06590J16324O9553M3260m768L6251J51747n4465L8599
3951G510464J00897M237N9429L1432q6561M7697L9063M2564j1266K0767Q1266
3940G839989p543n4849K7309N5031P3940N6271j5029J94872M0005M2467O004J06876
3928H365343O2197K1222R1309K7024N710N5640N9038N6360J20396L381K0288J05363
3916H993271N0713L4630N6456O8533J36569J36619o910Q4380K3649L4550J11446
3905I723906P5839N3140N6146J97765J28218j1687M3421J20181J00921O6478k773
$$ plain form
3985 5594412 5677818 5788646 5811014 5842521 5944088 6011452 6109724 6177102 6266144 6267707 6333598
3974 6333598 6378644 6512821 6590804 6621448 6616976 6618901 6627584 6665798 6741025 6758167 6751003 6840933
3962 6840933 6993399 7007373 7113963 7230287 7299840 7343100 7338332 7374583 7526330 7471865 7510464
3951 7510464 7611361 7615598 7675027 7706459 7619898 7667595 7706658 7749222 7737956 7758723 7839989
3940 7839989 7832446 7777597 7804906 7859937 7933877 7990148 7975119 8169991 8209996 8252463 8258467 8365343
3928 8365343 8427540 8448762 8540071 8567095 8572805 8628445 8687483 8743843 8864239 8867620 8887908 8993271
3916 8993271 9043984 9078614 9135070 9203603 9340172 9476791 9469881 9554261 9577910 9612460 9723906
3905 9723906 9799745 9852885 9909031 10106796 10235014 10223327 10266748 10386929 10487850 10554328 10551555
3894A0551555Q0858J17344R1345R7390J37275J07267J67457M9106J17774J23261
3884A1640632J08000J82109K03665J47137J77062K51032K72816J95904K19629
3875A3397986K47713K68583L36793L06885M31301L83959M68585N08133N03245
3866A6853183N20276M75092O30248O27060N94864P46111P82273Q22701R10696
3857B2962504J039951J138002J059898J094589R13931P24670P04431P28125R12078
3848C1278179J092222J237827J503023J658303J531203J118963N34664J32247
3840D0086631m407j3998J98980M53426Q29498J156168J314073J059369L90143
3831D5469883m67994j109992j382862j279226q97784n48745k39831J39056J84286
$$ plain form
3894 10551555 10632413 10749757 10841102 10938492 11075767 11183034 11350491 11399597 11517371 11640632
3884 11640632 11748632 11930741 12134406 12281543 12458605 12709637 12982453 13178357 13397986
3875 13397986 13645699 13914282 14251075 14557960 14989261 15373220 15841805 16349938 16853183
3866 16853183 17373459 17848551 18478799 19105859 19700723 20446834 21229107 22051808 22962504
3857 22962504 24002455 25140457 26200355 27294944 28208875 28933545 29637976 30366101 31278179
3848 31278179 32370401 33608228 35111251 36769554 38300757 39419720 39954384 40086631
3840 40086631 40082224 40068226 40267206 40720632 41550130 42706298 44020371 45079740 45469883
3831 45469883 45001889 43891897 42509035 41229809 40332025 39783280 39543449 39682505 39866791
3822C9866791o1518n21749j109589j487368j574195j376620j129519r08869n80532
3813C1116832l89257l12839l37324m46337p06508o47749p11052n38036m01514
3804B6626216k94771j16557L0659M8039J22054J44899K51634K70409L09162M37891
3794B7829635M12975O49644M86726O84770O15160P53141Q18773O97395O61656
3785C3609875O70570P58901P33489Q60946R19362R28411Q65342R53747Q63009
3776D1163652Q41118R81568J094258J155767J045520J086751J153138J278893
3768D9800665J322337J281987J334047J385558J315021J568269J640608J664475
3760F1312967J664288J448888J214720J226843J090570J069306J085533J219341
$$ plain form
3822 39866791 39805273 39283524 38173935 36686567 35112372 33735752 32606233 31697364 31116832
3813 31116832 30727575 30414736 30077412 29631075 28924567 28276818 27565766 27027730 26626216
3804 26626216 26331445 26214888 26245547 26293586 26415640 26560539 26812173 27082582 27391744 27829635
3794 27829635 28242610 28892254 29378980 30063750 30678910 31432051 32250824 32948219 33609875
3785 33609875 34280445 35039346 35772835 36633781 37553143 38481554 39346896 40300643 41163652
3776 41163652 42004770 42986338 44080596 45236363 46281883 47368634 48521772 49800665
3768 49800665 51123002 52404989 53739036 55124594 56439615 58007884 59648492 61312967
3760 61312967 62977255 64426143 65640863 66867706 67958276 69027582 70113115 71332456
3752G1332456J347392J386103J358389J454242J333557J268468J231729J149293
3744H1861629J268549J495214J826542K189766K525925K786522K662180K259589
3736I8875916K266321J997485J798708J730890J622954J580833J253605P98089
3728A11924801K87465K6442j79666l29033k09371k28073l7193K11055M02064N88264
3718A12456755Q60220R60930P54707O61503J77763j61071l92383k89359m51161
3709A14577904p52297r58697j241313j667583k123068k378982k368129k239665
3701A00848170k034538j739572j549580j512948j272113j207104j350668j502040
3693H8679607j626611j511755j580952j388667j249879j152728r52065j043570
$$ plain form
3752 71332456 72679848 74065951 75424340 76878582 78212139 79480607 80712336 81861629
3744 81861629 83130178 84625392 86451934 88641700 91167625 93954147 96616327 98875916
3736 98875916 101142237 103139722 104938430 106669320 108292274 109873107 111126712 111924801
3728 111924801 112212266 112238708 112059042 111730009 111520638 111292565 111255372 111466427 111868491 112456755
3718 112456755 113316975 114277905 115032612 115694115 115871878 115710807 115318424 115029065 114577904
3709 114577904 113825607 112866910 111625597 109958014 107834946 105455964 103087835 100848170
3701 100848170 98813632 97074060 95524480 94011532 92739419 91532315 90181647 88679607
3693 88679607 87052996 85541241 83960289 82571622 81321743 80169015 79216950 78173380
3685G8173380j286755j565953j968889k151708k240756k260799k175368k178697
3677F2344455k060919j854051j817423j660554j603989j506931j488758j418045
3669D8933785j425939j258743j249892j168410j113092j178789j177558j078882
3661C9282480j075661j136426j132903j195085j200242j154845j123262j052207
3653C0211849r56153r34846r81662q59757q31139q23413p53992p40088o66139
3644B2664660o58680n77238n68923n45009n30899m70228n12114n32456m39107
3635A7830006l99818l73221l55857m12698k74043k81300k60320j69769j80443
3626A5122537j77633k74544k21691j83610j86471k74813j47755q9354j52786r5127
$$ plain form
3685 78173380 76886625 75320672 73351783 71200075 68959319 66698520 64523152 62344455
3677 62344455 60283536 58429485 56612062 54951508 53347519 51840588 50351830 48933785
3669 48933785 47507846 46249103 44999211 43830801 42717709 41538920 40361362 39282480
3661 39282480 38206819 37070393 35937490 34742405 33542163 32387318 31264056 30211849
3653 30211849 29255696 28320850 27339188 26479431 25648292 24824879 24070887 23330799 22664660
3644 22664660 22005980 21428742 20859819 20314810 19783911 19313683 18801569 18269113 17830006
3635 17830006 17430188 17056967 16701110 16288412 16014369 15733069 15472749 15302980 15122537
3626 15122537 14944904 14670360 14448669 14265059 14078588 13803775 13656020 13566666 13413880 13318753
3616A3318753p2538j56980m6343o1116j36269o2589j1674j42547p6162l9521j59522
3605A2353492J0443n4009n0262n3009l8425J09602q2803O0642p6741O6613J1114
3594A2256657k8907p0338k7736l0350J7711j5141l0409k7589m1257o800n2510
3583A1943331n3531n1258q606p4447o5900n910K5584P979k3829l636K6534L008
3571A1719319J11334k3904N1174J1140M8982J12150Q360l847l6516O5389J07226
3560A2170807M8364J46900L0118L4651O2542J26248j1270N6693K2158j5715K5409
3549A2696905N6744%j5723j6908l4263M3915M7564M5237P9589O578N451N5614
3537A2970703O7600M6948k6206j2588J17369O1280R4247J2653J01585M1067Q062
$$ plain form
3616 13318753 13246215 13089235 13042892 12981776 12845507 12782918 12771244 12628697 12552535 12513014 12353492
3605 12353492 12363935 12309926 12259664 12206655 12168230 12277832 12195029 12255671 12178930 12245543 12256657
3594 12256657 12227750 12157412 12129676 12099326 12117037 12101896 12071487 12043898 12002641 11995841 11943331
3583 11943331 11889800 11838542 11829936 11755489 11689589 11683679 11709263 11717242 11693413 11689777 11716311 11719319
3571 11719319 11830653 11806749 11857923 11869063 11918045 12030195 12038555 12034708 11998192 12063581 12170807
3560 12170807 12219171 12366071 12396189 12430840 12493382 12619630 12608360 12665053 12687211 12671496 12696905
3549 12696905 12753649 12753649 12737926 12721018 12686755 12730670 12778234 12823471 12903060 12909638 12915089 12970703
3537 12970703 13038303 13085251 13059045 13046457 13163826 13225106 13319353 13332006 13433591 13474658 13482720
3526A3482720J11097P2619N6031N1777M2420R1620J54P7570M0510J17667J18182
3515A4262367n2624J2312P4718J1459J18170O0140J06251O0184R6375J37275R1904
3504A4978531R0221J13501P4544O9060O8922m2613J94220M8543L0630N3295J06440
3493A5785294L0719Q5889J65734r678N9295M3476Q8278J5315l6949J9063M1924
3482A6288360N0623O9739P4008L1642Q6165J70910L9588M0677J29707M7573J33009
3471A7162001O5853O9094J49729K78227J11808J04870q1482J9764k7512m8974
3461A7803378n0931q804K0061J7653M7863N2523K7863m8827n2953j16524j44026
3450A7547276j85028j22479k25186k10149l3883o9153J2978o9332k8364k0711
$$ plain form
3526 13482720 13593817 13666436 13722467 13774244 13816664 13908284 13908438 13986008 14026518 14144185 14262367
3515 14262367 14209743 14222055 14296773 14308232 14426402 14486542 14592793 14652977 14749352 14886627 14978531
3504 14978531 15068752 15182253 15256797 15325857 15394779 15352166 15546386 15594929 15625559 15678854 15785294
3493 15785294 15816013 15901902 16067636 16057958 16117253 16160729 16249007 16264322 16227373 16246436 16288360
3482 16288360 16338983 16408722 16482730 16514372 16600537 16771447 16811035 16851712 16981419 17028992 17162001
3471 17162001 17227854 17296948 17446677 17724904 17836712 17941582 17860100 17879864 17852352 17803378
3461 17803378 17752447 17743643 17763704 17781357 17829220 17881743 17909606 17860779 17807826 17691302 17547276
3450 17547276 17362248 17239769 17014583 16804434 16770551 16701398 16714376 16645044 16616680 16595969
3440A6595969J5634J37163M8945J6946M1952K9797P6043J10732J4459O9718J63521
3429A7320879Q927O3174N2538R1198O6983Q5726N0034J2212R4487J26182J20114
3418A8092454J12449J05653P8683J23609R3791P1660J26495J99558R3269J65422
3408A9263043J47769J09457J51638J65688K08129K06420J20834J26514R5378K35202
3398B0830072J74125J99700J99512J74678K26865K85156K51638K45565K29616
3389B2816927J95481K13771K81636K81539K71859K41401K70118K30337L20834
3380B5123903K63067K93309L77715L25396K80413K33212L54921L99295L41460
3371B7992691L40746M60235L67085M28136N21603N17334N25590N77069N99891
$$ plain form
3440 16595969 16611603 16748766 16797711 16814657 16856609 16886406 16962449 17073181 17087640 17157358 17320879
3429 17320879 17329806 17392980 17445518 17536716 17603699 17689425 17739459 17751671 17846158 17972340 18092454
3418 18092454 18204903 18310556 18389239 18512848 18606639 18678299 18804794 19004352 19097621 19263043
3408 19263043 19410812 19520269 19671907 19837595 20045724 20252144 20372978 20499492 20594870 20830072
3398 20830072 21004197 21203897 21403409 21578087 21804952 22090108 22341746 22587311 22816927
3389 22816927 23012408 23226179 23507815 23789354 24061213 24302614 24572732 24803069 25123903
3380 25123903 25386970 25680279 26057994 26383390 26663803 26897015 27251936 27651231 27992691
3371 27992691 28333437 28793672 29160757 29588893 30110496 30627830 31153420 31730489 32330380
3362C2330380O31240O20533O72886N45601L84180M95601M38542M16838L83541
3353C6919342L32110M78860L87754N53070M59238L94693O08716N01313M16350
3344D1051446N86090M75354N32761O24962O81540Q09954Q61698Q80594Q51124
3335D7355523Q13008Q61395Q81942R78623J007987J133682J310617J302593J365536
3326E7010906J351099J519174J623165J668333J829404J996271J894206J909730
3318G0802288K089268K254707K323764K443043K458077K555096K705403K810217
3310I0441863K962203L122582L401708L727596M105522M525851M815249N123045
3302A22225619N327359N405416N126320M701855L870690L141157K731029K527467
$$ plain form
3362 32330380 32961620 33582153 34255039 34800640 35184820 35680421 36118963 36535801 36919342
3353 36919342 37251452 37730312 38118066 38671136 39130374 39525067 40133783 40635096 41051446
3344 41051446 41637536 42112890 42645651 43270613 43952153 44762107 45623805 46504399 47355523
3335 47355523 48168531 49029926 49911868 50890491 51898478 53032160 54342777 55645370 57010906
3326 57010906 58362005 59881179 61504344 63172677 65002081 66998352 68892558 70802288
3318 70802288 72891556 75146263 77470027 79913070 82371147 84926243 87631646 90441863
3310 90441863 93404066 96526648 99928356 103655952 107761474 112287325 117102574 122225619
3302 122225619 127552978 132958394 138084714 142786569 146657259 149798416 152529445 155056912
3294A55056912L246040M135627N213924O110340O624908O902632O914666O616938
3286B00821987O179749N994943O144947O682720P590934Q550618R393882R677888
3278B61037668Q803272P021906M131040O64659k788886n304046o842120p186101
3270B59537392o931065o396356n930915n945678o895643q578616j0544621j2586973
3262A95727525j3915518j4507662j4260664j3212681j1680699j0211574q822654
3255A09116073p401581o399382n453703m583942l739086l083586k513638j769604
3247G4171551q69731q29965j856313k462626k747408k794850k777612k344186
3239E7488860j891427j547073j349199j074573r17070o87644n77323m20067l52029
$$ plain form
3294 155056912 158302952 162438579 167652503 173762843 180387751 187290383 194205049 200821987
3286 200821987 207001736 212996679 219141626 225824346 233415280 241965898 251359780 261037668
3278 261037668 269840940 276862846 280993886 281658545 278869659 273565613 266723493 259537392
3270 259537392 252606327 246209971 240279056 234333378 227437735 218859119 208314498 195727525
3262 195727525 181812007 167304345 153043681 139831000 128150301 117938727 109116073
3255 109116073 101714492 95315110 89861407 85277465 81538379 78454793 75941155 74171551
3247 74171551 73301820 72471855 70615542 68152916 65405508 62610658 59833046 57488860
3239 57488860 55597433 54050360 52701161 51626588 50709518 50021874 49444551 49024484 48672455
3230D8672455k23421J5558K20129L24511P58380J058849J525920K072669K910929
3221E7335979J877275q37889j875647k478385k330309j785194j184431q90502
3213D7830897o25942n69945m18762l13824j31118L733J00771K37254O00615Q72930
3203D7586609J277321J769073K659573J735940l16884o88990j158837o68461j61176
3194E2034168K92025N97140O87561O06569O37593O72706N68639N43460O23206
3185E7263067Q04385J078196J217301J467667J496427J196274Q62466M53839M9218
3176F5888840n40669q92430j063710j029986q60108n85583j19963K42694O77011
3167F1716096J050070J417827J757343K081056K543307K881728L341557L816496
$$ plain form
3230 48672455 48449034 48464592 48684721 49009232 49767612 50826461 52352381 54425050 57335979
3221 57335979 59213254 58375365 56499718 54021333 51691024 49905830 48721399 47830897
3213 47830897 47204955 46635010 46216248 45902424 45771306 45775039 45875810 46113064 46713679 47586609
3203 47586609 48863930 50633003 53292576 55028516 54711632 54022642 52863805 52195344 52034168
3194 52034168 52326193 52923333 53610894 54217463 54855056 55527762 56096401 56639861 57263067
3185 57263067 58067452 59145648 60362949 61830616 63327043 64523317 65385783 65839622 65888840
3176 65888840 65348171 64455741 63392031 62362045 61501937 60916354 60796391 61039085 61716096
3167 61716096 62766166 64183993 65941336 68022392 70565699 73447427 76788984 80605480
3159H0605480M172167M529318M955785N113946N255690N504542N760144O040222
3151A21937294O060812N866696N717115N688539N866135O295568O373602N783337
3143A69589098M785346L245135J260610p90653k684594m382617o170170p618585
3135A57233570q593963r236821r011057q577608p779069o828551n748604m695066
3127I6762831l647129k715757j795007r55816k48121N07726J120177J808965K308178
3118I3146047K528663K683864K599754K187772J610013O49558l97938j513619
3110A03494114k745657l733216m455159n012200n119369n147033m873592m283345
3102F8124543l959069l351389k903419k624228k261388j885736j718936j548238
$$ plain form
3159 80605480 84777647 89306965 94262750 99376696 104632386 110136928 115897072 121937294
3151 121937294 127998106 133864802 139581917 145270456 151136591 157432159 163805761 169589098
3143 169589098 174374444 177619579 178880189 178089536 175404942 171022325 164852155 157233570
3135 157233570 148639607 139402786 130391729 121814121 114035052 107206501 101457897 96762831
3127 96762831 93115702 90399945 88604938 87649122 87401001 87908727 89028904 90837869 93146047
3118 93146047 95674710 98358574 100958328 103146100 104756113 105405671 105007733 103494114
3110 103494114 100748457 97015241 92560082 87547882 82428513 77281480 72407888 68124543
3102 68124543 64165474 60814085 57910666 55286438 53025050 51139314 49420378 47872140
3094D7872140j503400j275742j136328j005935q09518p92621n70145m85368k09000
3085D0084083j07251J42130K53693M84026P56942J020247J176236J341680J267876
3076D6419662J183667R30875O76551L55399K0136j49554m41143o16782q60000
3067D7518811q10553q86207r61372r19181j000859r41312r22417p69020o55710
3058C9652180l93479j87089j79497J27426R1446K80373M12634M46603M92688N18387
3048D1261672O87859P90169Q75458J011585J064839R22623O28737M31522l4092
3039D7640372j92994q9293o0605K21023L82794P00012Q36594Q91636R87695Q62357
3029E2179591J025086J063452J039463J161239J303946J119227J120654J062636
$$ plain form
3094 47872140 46368740 45092998 43956670 42950735 42141217 41348596 40778451 40293083 40084083
3085 40084083 39976832 40118962 40372655 40856681 41613623 42633870 43810106 45151786 46419662
3076 46419662 47603329 48534204 49210755 49566154 49586290 49436736 48995593 48378811 47518811
3067 47518811 46708258 45822051 44860679 43941498 42940639 41999327 41076910 40307890 39652180
3058 39652180 39258701 39071612 38892115 39019541 39110987 39391360 39803994 40250597 40743285 41261672
3048 41261672 41949531 42739700 43615158 44626743 45691582 46614205 47242942 47674464 47640372
3039 47640372 47447378 47358085 47297480 47518503 47901297 48601309 49437903 50329539 51317234 52179591
3029 52179591 53204677 54268129 55307592 56468831 57772777 58892004 60012658 61075294
3021F1075294R41998R69107J050597J122410J420476J862494K413153K721159
3013G3576688J694164N37520q8307k0536P86379J585734K090766K675469L120952
3004H5958829L350172L653522L995022M271106M662405N215047N907085O233224
2996A23246412O416709O753706P418411Q292677R442265J0914296J2602654J4664966
2988A99752096J6839074J9282316K2746010K7089647L2521544L8910890M3877908
2981D01019485L5582638N510789k8120466m8914584n4796391m9358187l9894827
2974B21028457l1315108k5272173k1003062j7550768j4591302j2082302j0068660
2967H9145082q542051p141532o225987n317925m647092m009750l503385l227958
$$ plain form
3021 61075294 62017292 62986399 64036996 65159406 66579882 68442376 70855529 73576688
3013 73576688 75270852 75808372 75720065 75699529 76485908 78071642 80162408 82837877 85958829
3004 85958829 89309001 92962523 96957545 101228651 105891056 111106103 117013188 123246412
2996 123246412 129663121 136416827 143835238 152127915 161570180 172484476 185087130 199752096
2988 199752096 216591170 235873486 258619496 285709143 318230687 357141577 401019485
2981 401019485 436602123 442112912 413992446 365077862 310281471 260923284 221028457
2974 221028457 189713349 164441176 143438114 125887346 111296044 99213742 89145082
2967 89145082 80603031 73461499 67235512 61917587 57270495 53260745 49757360 46529402
2959D6529402k884319k656212k427916k224763k071559j830497j706570j607075
2951B9120491j474911j354390j321636j180426j213820r90574r10815q67219p64780
2942A9041920p56873o44055p18352o74924n29310m85835n09007n11607n24562
2933A3687395m63138m34955m07657m04191l10134l19271l24118l09397l30143
2924A0384391l34800k70564k69400k85819k36334l20343k73049k35511k98159
2915G860412l09743j99747j56369j94232j49346k42569j67073j70886j07343m6469
2905F116635k14345r5530j10915j10668j50012m8103j18872j08507j17026j14809
2895D927848j24882q7151q6431r5467j88416j06038r8568j38097K7407j30395
$$ plain form
2959 46529402 43645083 40988871 38560955 36336192 34264633 32434136 30727566 29120491
2951 29120491 27645580 26291190 24969554 23789128 22575308 21584734 20673919 19806700 19041920
2942 19041920 18285047 17640992 16922640 16247716 15718406 15232571 14723564 14211957 13687395
2933 13687395 13224257 12789302 12381645 11977454 11667320 11348049 11023931 10714534 10384391
2924 10384391 10049591 9779027 9509627 9223808 8987474 8667131 8394082 8158571 7860412
2915 7860412 7550669 7350922 7194553 7000321 6850975 6608406 6441333 6270447 6163104 6116635
2905 6116635 5902290 5806760 5695845 5585177 5435165 5387062 5268190 5159683 5042657 4927848
2895 4927848 4802966 4715815 4629384 4533917 4345501 4239463 4140895 4002798 4030205 3899810
2885C899810j16379j2502l3128j04619j10722j03516p2426j04938l7475j3081
2875C191024p7137n6376n5565r8972l6455p7318J2427p3642j00827n9902R4995
2864B662252l4905J4285l5927k0314n2169j34360L3722R37q9203p8339o6369j27060
2852B072550M3966N0341p5019Q293N0832L4083l3600l1548j31322k7913l0250
2841A930413o6580L1286r9320p1968q5565k7936p5618m3190J2984N3223j2108
2830A545621j31553K467j05878J09635N7944j20185K5476k0863q027o1703L150
2819A296084M34m997J2582K6840j9440p477p1809J2720K4930r1688p7827J25235
2807A225587M5326m6734p2965k8753k010k0167N9646p45P968l9118l8954M5226
$$ plain form
2885 3899810 3783431 3770929 3737801 3633182 3522460 3418944 3346518 3241580 3204105 3191024
2875 3191024 3113887 3057511 3001946 2902974 2866519 2789201 2801628 2727986 2627159 2567257 2662252
2864 2662252 2627347 2641632 2605705 2585391 2533222 2398862 2432584 2433521 2344318 2265979 2199610 2072550
2852 2072550 2116516 2166857 2091838 2100131 2150963 2185046 2151446 2119898 1988576 1960663 1930413
2841 1930413 1863833 1895119 1795799 1723831 1638266 1610330 1534712 1491522 1504506 1557729 1545621
2830 1545621 1414068 1416535 1310657 1420292 1478236 1358051 1383527 1362664 1354637 1292934 1296084
2819 1296084 1296518 1291521 1304103 1330943 1311503 1304026 1232217 1244937 1269867 1178179 1100352 1225587
2807 1225587 1270913 1224179 1151214 1122461 1120451 1100284 1159930 1159185 1167153 1128035 1089081 1134307
2795A134307l460M2208K4181N1640J781p4913L5061m9742M6165J6461M3039m550
2783A262178N4181L4123L9530P2909J15882L6379m6449J17612N2734R1832J41883
2772A972794Q5818J72972J44770J96915N5184j10754k40559k31686j49850k25035
2762A670569k58490l6721m8248k09936j80530l1321r4481j10469Q766l1812Q8569
2751G65896p6543n0022q1828P657o1643n5743k5061J9943N4589l0893n1679m7854
2739C66819J2810m4540n8411j4179k2647M8211n0880L8803p8047L2751R638K017
2727B42345K3045j07394O4332k1381P7025M5357j74l2790r6049k0205j8645L2074
2715A87540j4635O410N5439m1412m0674n1841m2293P818N6237l8617m604k3149
$$ plain form
2795 1134307 1130847 1173055 1197236 1248876 1250657 1175744 1210805 1161063 1207228 1223689 1266728 1262178
2783 1262178 1316359 1350482 1390012 1462921 1578803 1615182 1568733 1686345 1739079 1830911 1972794
2772 1972794 2058612 2231584 2376354 2573269 2628453 2517699 2277140 2045454 1895604 1670569
2762 1670569 1412079 1375358 1327110 1117174 936644 905323 810842 700373 709139 677327 765896
2751 765896 689353 639331 557503 565160 503517 447774 422713 442656 497245 466352 414673 366819
2739 366819 379629 335089 276678 262499 239852 288063 237183 275986 197939 230690 240328 242345
2727 242345 265390 157996 222328 200947 277972 323329 323155 290365 194316 174111 155466 187540
2715 187540 172905 179315 234754 193342 152668 100827 58534 66352 122589 83972 79368 56219
2703E6219N444q076p743J2045k921j8230J5924Q0321q4840Q6977r395m6125m5213
2690C4387l5168M2423m4508K6733o47O8273m6302O062l6043r1059Q5748M0321
2678E0220n9069n7219M7876J821N83o01J1896L231k216m8255L1039Q0090l2678
2665B6718n7722R430j7672K8562J892M1841r827m5724j9077K6877K8047J2821
2653B6166J76n0366j6010K2532l9860L5601M2307o1336o0105J5186Q9249L2659
2641C6199N0552q2175P545k8284O4033J2578p0632n2292N3743n0342j7879J3378
2629f3576L0879j9150q928P117j5143L4995p8767k5424L3957l6838L7274o8954
2617a72558N7832J5532l1540q580L6733O3527K6826q2167j6708O6064m6025J6569
$$ plain form
2703 56219 61663 53587 45844 57889 54968 36738 52662 132983 48143 135120 125725 79600 34387
2690 34387 -781 41642 -2866 23867 23220 91493 45191 51253 15210 -75849 9899 50220
2678 50220 -8849 -66068 -18192 -16371 -15788 -16389 -4493 -1262 -3478 -51733 -20694 59396 26718
2665 26718 -31004 -21574 -39246 -10684 -8792 33049 23222 -22502 -41579 -14702 13345 26166
2653 26166 26342 -24024 -40034 -17502 -57362 -21761 20546 -40790 -100895 -85709 3540 36199
2641 36199 86751 4576 12121 -16163 47870 60448 -10184 -62476 -8733 -59075 -76954 -63576
2629 -63576 -32697 -51847 -60775 -53658 -68801 -33806 -112573 -137997 -104040 -140878 -103604 -172558
2617 -172558 -114726 -99194 -130734 -139314 -102581 -39054 -12228 -94395 -111103 -45039 -91064 -74495
2605g4495l313l6809j379q762M0677m4705m3966K3301Q194O2676K0111l8128M0877
2592e5721p2899l0901O0274k0545L0146L2522Q465j26621J1725K7385k953l3734
2580a72857j8157O896j3117j1235N3338L2754N9107k5322j0575N950L7982l6660
2568i1896k2777K9829J8698j3270Q202J1307o8052l336N780N734P2668n289K3791
2555b8611p2108J5007j112n7968L8407L9012n6723n8888L1373R9974k3389L7282
2543c7744L2266m0826K2102K5908l3726o2347m0654q411R5262m7106J4755L0552
2531d9969m3095L4616O7601o5379m0840L8448j5561L0732k415K1348k24l6842
2519f1580L6029L8999r865K1308l393m8720N4403p589K7377K5397M0816J096p2442
$$ plain form
2605 -74495 -77808 -114617 -115996 -124758 -84081 -128786 -172752 -149451 -141257 -78581 -58470 -96598 -55721
2592 -55721 -128620 -159521 -99247 -119792 -89646 -57124 -48659 -175280 -163555 -136170 -139123 -172857
2580 -172857 -191014 -184118 -197235 -208470 -155132 -122378 -63271 -88593 -99168 -93218 -55236 -91896
2568 -91896 -114673 -84844 -66146 -79416 -71214 -59907 -127959 -131295 -125515 -119781 -47113 -52402 -28611
2555 -28611 -100719 -85712 -86824 -144792 -106385 -67373 -124096 -182984 -151611 -51637 -75026 -37744
2543 -37744 -5478 -46304 -24202 1706 -32020 -94367 -135021 -143432 -48170 -95276 -80521 -49969
2531 -49969 -93064 -58448 9153 -56226 -97066 -58618 -74179 -43447 -45862 -24514 -24738 -61580
2519 -61580 -25551 13448 3583 24891 21498 -27222 27181 19592 46969 72366 113182 114278 41836
2506D1836J7605J043M1448P655j8499L2082K4878k1787J07592L5737J8788p0162
2494B18216M5554R35L112K4778k1815O7581l9423O5886N9107k2454J0570L3253
2482D45300m7494N5473k243K2577j1096J18138O0445J0578K7402N0584N0274L4835
2470H14773J55951K0685J10662J23684J05388Q4598J06999J48707J13692K40601
2460B025740K17492J49795J65533K23717K29830K57749J29577K34392K60653M99329
2450D393807M43441P75211Q00264J253351J721290L139329J533040j720343k411440
2441I927950k587834j717018j127399p81709o84989m44796l63544j94066j95617
2432A830978k09268j51007k10206k08165o4382r3377r2665q1062j41406k803m5579
$$ plain form
2506 41836 59441 60484 101932 109587 91088 123170 148048 126261 233853 269590 288378 218216
2494 218216 263770 264705 267817 292595 270780 338361 298938 364824 423931 401477 412047 445300
2482 445300 397806 453279 451036 473613 462517 580655 641100 651678 679080 729664 779938 814773
2470 814773 970724 991409 1102071 1225755 1331143 1415741 1522740 1671447 1785139 2025740
2460 2025740 2243232 2393027 2558560 2782277 3012107 3269856 3399433 3633825 3894478 4393807
2450 4393807 4837248 5612459 6412723 7666074 9387364 12526693 14059733 12339390 9927950
2441 9927950 7340116 5623098 4495699 3713990 3029001 2584205 2220661 2026595 1830978
2432 1830978 1621710 1470703 1260497 1052332 987950 894573 801908 720846 579440 576637 531058
2421E31058q2965l280p3570J1970m6554m1041k7948J3033n6585L2233n4356j12902
2409H9093q2334R4089j0531M4519M6688j22390n5173N5000l0651q9111k445O8456
2397E210M2023q8385m972L6214n2182M5842J1521q5927q576O2684p8761L4411
2385h0898o3534K981M5235k534O0630n9229q956J523k1514N4987N1827j08078
2373a27560J4966m5338j0210j8072M1352O3744l5343K1850K1517j3878p1909k779
2361a61660K3500j4829m1521j6912K0098L2997L2975k2153O014o1846J0310L7059
2349a55968m539j9851N9274r031q878Q009r0538N7760K5203l2180K2058j034L0528
2336a19187l8369M5478k6526k8056k1596K3796l372K0655l2564j7216K5844J4387
$$ plain form
2421 531058 448093 444813 371243 383213 336659 295618 267670 280703 224118 256351 201995 89093
2409 89093 6759 100848 90317 134836 181524 59134 3961 58961 28310 -60801 -63246 5210
2397 5210 47233 -41152 -46124 -9910 -62092 -16250 -4729 -90656 -99232 -36548 -115309 -80898
2385 -80898 -144432 -141451 -96216 -98750 -38120 -97349 -106305 -104782 -126296 -71309 -19482 -127560
2373 -127560 -112594 -157932 -168142 -186214 -144862 -81118 -116461 -94611 -73094 -86972 -158881 -161660
2361 -161660 -138160 -152989 -194510 -211422 -191324 -158327 -125352 -147505 -141491 -203337 -193027 -155968
2349 -155968 -160507 -180358 -121084 -130115 -138993 -130984 -221522 -163762 -138559 -170739 -148681 -149715 -119187
2336 -119187 -157556 -112078 -138604 -166660 -188256 -164460 -167832 -147177 -179741 -196957 -171113 -156726
2324a56726J4422k3715R933m1079K2579J4419l3041o186r135O3908l0639r077
2312a84337J0253J2405m9647N7250l6239j6775O321M7121O7592o929k0378j22587
2300b35950J33106l0826p7105L5094n932k413j7883Q4539M245o3848k4321Q2751
2288a18543m0263M037K1703K8185n7338J0622j695l5004m388L00K6989j8884R4014
2275i0265p8601M015M7079K1573m6583J2530J3436r7037n8726J62397l473n3467
2263a67122N3571j4167J4909l3803p1799M6205k9046p2326K2802Q6799k5267j8285
2251b07529J044O326L7412j5943Q4761J8279K6562j00288J2826M1905n9966K873
2239a51738K912K3782p82L537j4870p266P009K1112K2237K4090m6238O965n1596
$$ plain form
2324 -156726 -142304 -166019 -156086 -197165 -174586 -160167 -193208 -199394 -208529 -144621 -175260 -184337
2312 -184337 -174084 -161679 -211326 -154076 -190315 -207090 -200769 -153648 -86056 -92985 -113363 -235950
2300 -235950 -102844 -133670 -210775 -175681 -181613 -184026 -201909 -117370 -113125 -176973 -201294 -118543
2288 -118543 -158806 -154769 -133066 -104881 -162219 -151597 -153292 -188296 -192684 -192384 -165395 -184279 -90265
2275 -90265 -168866 -164851 -117772 -96199 -142782 -130252 -116816 -213853 -272579 -110182 -113655 -167122
2263 -167122 -113551 -127718 -112809 -146612 -218411 -172206 -201252 -273578 -250776 -163977 -189244 -207529
2251 -207529 -206485 -200159 -162747 -178690 -93929 -75650 -49088 -149376 -136550 -94645 -154611 -151738
2239 -151738 -148826 -125044 -125826 -122289 -137159 -144425 -137416 -116304 -94067 -69977 -116215 -109250 -160846
2226a60846l608q0337Q9435l4715R519J7463j4565k7743o265K1850q907q136O927
2213a99928n8172N8159k5089L6357L8434K829m672j6001J1403J1142j2376K182
2201a55732k1837M9166k6381m8258Q2795m4558r9746N3490J02773n4647L1152
2190a31783m678J6143l5038j5103P884k3494J1434O9580m037r3943M1786j5212
2178a76461l2511L2779L6902j7324n9904P1223L5933M3394o9866K5641n3768m0625
2166b04587o214R9382K0813m3881J0719J3510n6808L969L3818N044n0926L0462
2154a44699n9817J4382J6937R924k6973O9219j8638j5499p987K5052m0777l555
2142a82431J5073P483J7106o5799N2658Q5022L4040p1179O037l0481l3543l465
$$ plain form
2226 -160846 -164454 -244791 -155356 -190071 -180552 -163089 -177654 -205397 -211662 -189812 -198719 -206855 -199928
2213 -199928 -258100 -199941 -225030 -188673 -150239 -147410 -152082 -168083 -156680 -145538 -157914 -155732
2201 -155732 -177569 -128403 -154784 -203042 -120247 -164805 -264551 -211061 -108288 -162935 -131783
2190 -131783 -136461 -120318 -155356 -170459 -162575 -186069 -174635 -105055 -109092 -203035 -161249 -176461
2178 -176461 -208972 -176193 -139291 -156615 -216519 -145296 -109363 -65969 -135835 -110194 -163962 -204587
2166 -204587 -210801 -111419 -90606 -134487 -123768 -110258 -167066 -163097 -129279 -124235 -175161 -144699
2154 -144699 -204516 -190134 -173197 -163273 -190246 -121027 -139665 -155164 -163151 -138099 -178876 -182431
2142 -182431 -167358 -159875 -142769 -208568 -155910 -70888 -36848 -108027 -101990 -132471 -166014 -169479
2130a69479p284Q7678j0466j3967M2618o1360M2680K3937n1784l5501P484L1765
2118a13679j5466l0900K815m7335M5938K8771k1726N9251j3886M6554m1312k1661
2106a22636k7929p639L9000K6303l2077l1734M6407k1879o0808k398N3505K6837
2094a15048P3868J7302o7364K9467k2966K9355m2615j09403L4058m2049L7469
2083a77926O5441J5374J2289m6416j6960N9037q8471J09625q1057l5104M0654
2072a43514J2109J0296Q539K413k8400N116N6265m1950l6743k5403P8600R022
2060i3650m1716q0020N5102O2514o1161M409l6551N4660K9196k2249R2966n4950
2048i1450L3331p8088m9939O5965n0895M0293L3081M628o1809L6021P000K0060
$$ plain form
2130 -169479 -176763 -89085 -99551 -113518 -70900 -132260 -89580 -65643 -117427 -152928 -145444 -113679
2118 -113679 -129145 -160045 -157230 -204565 -158627 -129856 -151582 -92331 -106217 -59663 -100975 -122636
2106 -122636 -150565 -158204 -119204 -92901 -124978 -156712 -110305 -132184 -192992 -195390 -141885 -115048
2094 -115048 -41180 -23878 -91242 -61775 -84741 -55386 -98001 -207404 -173346 -215395 -177926
2083 -177926 -112485 -97111 -84822 -131238 -148198 -89161 -177632 -68007 -149064 -184168 -143514
2072 -143514 -131405 -121109 -112570 -110157 -138557 -133441 -77176 -119126 -155869 -181272 -102672 -93650
2060 -93650 -135366 -215386 -160284 -97770 -158931 -154522 -191073 -136413 -107217 -129466 -36500 -91450
2048 -91450 -58119 -136207 -186146 -120181 -171076 -130783 -97702 -93074 -154883 -118862 -111862 -91802
2036i1802l4313K1314O0820r0343o0106N7114J9985L6669M2692j5855m7376n1705
2024a52906m4165P9136K7044Q603n0699P064k3689l6887r159O9184j6399j1964
2012a54837K7360k0237Q379j7588O9804K4784j7390k0539O6621L693M0399j51643
2000a41194j8771J08400R564o0908O9402k4527Q599q254j4310M9037k3323m5581
1988i1866k8545k8516m8338L8450p182O7985L9879j4307p0110m662k1021M1348
1976a26885m5171P0544K1808k669l5201j1788P2659L5898r13k5043l824j5336
1964f5921m1813J7249J6400M299N790L9808k433r2544m0408K8972L8650L7842
1952e4109M858J026k4657m518k24L7026M5643L9029R537o4216j1146j9850k2068
$$ plain form
2036 -91802 -126115 -104801 -43981 -134324 -194430 -137316 -117331 -80662 -37970 -53825 -101201 -152906
2024 -152906 -197071 -117935 -90891 -82288 -132987 -125923 -149612 -186499 -195658 -126474 -142873 -154837
2012 -154837 -127477 -147714 -139335 -156923 -87119 -62335 -79725 -100264 -33643 -29950 10449 -141194
2000 -141194 -159965 -51565 -42001 -102909 -33507 -58034 -49435 -57689 -71999 -22962 -46285 -91866
1988 -91866 -120411 -148927 -197265 -158815 -165997 -98012 -58133 -72440 -142550 -147212 -168233 -126885
1976 -126885 -172056 -101512 -79704 -82373 -117574 -129362 -56703 -20805 -21718 -46761 -50585 -65921
1964 -65921 -107734 -90485 -74085 -69786 -63996 -24188 -26621 -119165 -159573 -130601 -91951 -54109
1952 -54109 -49251 -48225 -72882 -77400 -77624 -40598 5045 44074 53611 -10605 -21751 -41601 -63669
1939f3669l4413K9143R463k3121p612O8726R9393j24129o2174j0728Q028p859
1927a18952N9795J8264n1429N3089R459J7211o065l0630k7832P6907l5591p073
1915d2847j0020O361Q771j1886r206N030O5082k5557m7807J1238M943r074p8931
1902a33903O9482l4096r932L9496j890L3731j8550N583m469l2049L7536N6799
1890G738L0428p5341l6955P2368k3307n7181n8959r046J00732m0175N677M4325
1878c9696m8975L5984J8310l6711M7081L0671j35524P3808n4219K9264j9286j0533
1866a09826K5460j0783J6787L37n0436l8524M8845P4323J6972L8021M4925n3516
1854B585l5884j6055n7663Q8783k9723j887L0740q3324O2008L5757l6417n705
$$ plain form
1939 -63669 -98082 -68939 -59476 -82597 -90209 -21483 77910 -46219 -108393 -119121 -111093 -118952
1927 -118952 -59157 -40893 -92322 -39233 -29774 -12563 -18628 -49258 -77090 -183 -35774 -42847
1915 -42847 -52867 -46506 -37735 -49621 -58827 -53797 11285 -14272 -62079 -50841 -45898 -54972 -133903
1902 -133903 -64421 -98517 -108449 -68953 -70843 -37112 -55662 -50079 -54548 -86597 -49061 7738
1890 7738 38166 -37175 -74130 -1762 -25069 -82250 -141209 -150255 -49523 -89698 -84021 -39696
1878 -39696 -88671 -52687 -34377 -71088 -24007 6664 -128860 -55052 -109271 -80007 -99293 -109826
1866 -109826 -84366 -95149 -78362 -78025 -128461 -166985 -118140 -43817 -26845 11176 56101 2585
1854 2585 -33299 -49354 -107017 -18234 -47957 -49844 -19104 -102428 -40420 -4663 -41080 -46785
1842d6785M2607p3006j6248N066l410L0785J5182J6630n056j8362R8189j9524
1830B6068l1498n0062n566j4558p0408Q4867K2947J8344j584n0197J5456Q508
1818d7683K0832l4649r2377P7591P3857o9089N1354r085K3644k9614r5307L361
1806a27165P2062k4708M3007r0838N3938L9122o0179N5428k4579k0912L2003J1664
1794d1157J827K0120k3112j9084K7064p53l3664r296l5674K9741K9143q50M243
1781e1452N7143p2492J9115k0692l4178M0568O8361n4740K0515n4752O9173M905
1769h526j1098J9964j5614o0531J1141M4711l0978n626P2957n917p737M3969j10586
1756f3871Q0486l1314N221Q044j17333j3959L2869N9175n71J4838L2999k4015
$$ plain form
1842 -46785 -4178 -77184 -93432 -88366 -91776 -60991 -45809 -29179 -34235 -52597 45592 26068
1830 26068 -5430 -55492 -61058 -75616 -146024 -61157 -38210 -19866 -21450 -71647 -56191 -47683
1818 -47683 -26851 -61500 -153877 -76286 -2429 -71518 -20164 -29249 -5605 -35219 -130526 -127165
1806 -127165 -55103 -79811 -36804 -127642 -73704 -34582 -94761 -39333 -63912 -84824 -52821 -41157
1794 -41157 -39330 -19210 -42322 -61406 -34342 -35095 -68759 -78055 -113729 -83988 -54845 -55695 -51452
1781 -51452 5691 -66801 -47686 -68378 -102556 -61988 6373 -48367 -27852 -82604 -13431 -8526
1769 -8526 -19624 340 -15274 -75805 -64664 -19953 -50931 -56557 16400 10483 2746 46715 -63871
1756 -63871 16615 -14699 -9478 -1434 -118767 -132726 -99857 -40682 -41253 -26415 6584 -17431
1744a7431m033m5486J578J1010N4302K6111n2110L7478J1347j9201N3391J7950
1732G4906K2915j04414J7101n6625N070K5087o0124K0486P46K9960Q9769l2445
1720C2432n3943j6376l476J8207L5240m3366p1789M3427R6718J2425n8802r6644
1708a05947J9167J26405K5399J5582p1983K5458o5116m7617P1398K8009p085J9455
1696C3125j6575M5604J305j00148l2062J4839K3774m0187M3501l5538L2926M3635
1684A4199K1992j09449M2983Q0064l7739J0784j8042O025q957l6698N3370l5537
1672a7005J1531m1041k8474P6417J8113M034K2925k371l1908j5085k4554L8874
1660A1456n3475M1644R111l0962j590P8649j8057j04459q603N7842L3129k075
$$ plain form
1744 -17431 -21464 -66950 -65372 -54362 -60 26051 -26059 11419 22766 3565 56956 74906
1732 74906 97821 -6593 10508 -46117 -41047 -15960 -76084 -55598 -54852 -24892 64877 32432
1720 32432 -21511 -37887 -41363 -23156 12084 -31282 -103071 -59644 37074 49499 -9303 -105947
1708 -105947 -86780 39625 65024 80606 8623 34081 -31035 -78652 -7254 20755 13670 33125
1696 33125 16550 62154 63459 -36689 -68751 -53912 -30138 -70325 -26824 -62362 -29436 14199
1684 14199 36191 -73258 -30275 49789 12050 22834 4792 10817 1860 -34838 18532 -17005
1672 -17005 -5474 -46515 -74989 1428 19541 23575 46500 44129 12221 -2864 -27418 11456
1660 11456 -42019 -375 8736 -22226 -23816 54833 36776 -67683 -76286 -18444 14685 12610
1648A2610j6719N4176l8886K4301l1689J5741j0546m0396J6273M4916L3900l7243
1636B6438o5883M254q86K0027N5531p6441O3495k3268o03k9212L1353N5073l9697
1623B0181O849l9872M2997J1370k3859n360K8027j3012J627k578j1298j7929n9365
1610f2222P7427o2115M2953L4218n6740Q0580o4789N0386N4883m5430l2715m1800
1598b5364J3764K0621K8913j4526q6635k0633k9584J10930N084L0849p718o155
1586A9546m8388K7489J5200j7063M908nK712O2886K1428m6838l7181P2528k4291
1573E2931o0586K6793n8427L7874j6068M659N1462L6804l0285k0429J4080p835
1561C0973n0934M0870J0490K1630r9372P4119j8761k3973M3482o2946P5415k0197
$$ plain form
1648 12610 -4109 50067 11181 35482 3793 19534 8988 -31408 -15135 29781 63681 26438
1636 26438 -39445 -35191 -36077 -16050 39481 -36960 26535 3267 2664 -26548 4805 59878 20181
1623 20181 27030 -12842 30155 41525 17666 12306 40333 27321 28948 26370 15072 -2857 -62222
1610 -62222 15205 -46910 -3957 30261 -26479 54101 -10688 39698 94581 49151 16436 -25364
1598 -25364 -11600 9021 37934 23408 -63227 -83860 -113444 -2514 2570 33419 25701 19546
1586 19546 -28842 -1353 13847 -3216 1692 1687 4399 67285 88713 41875 4694 77222 52931
1573 52931 -7655 19138 -39289 -1415 -17483 -12824 38638 75442 45157 24728 38808 30973
1561 30973 -19961 20909 31399 53029 -46343 27776 9015 -14958 28524 -34422 40993 20796
1549B0796m1316M9793p3327J4010l911L7701j8053R347M8425m4546J4072M8000
1537F0991p3774k3019M6989j2362n8598K5281K7677L2495O5341o1270L986L1371
1525F5108j1849k4260j1295l5774j7809j0234J9866N7296J9161p650j8687m764
1513A9109j05019M7935J3233R684K7497k1841O059Q821k174j3569N0811o4690
1501b4144K6555N3624k0643K0318K4428o1088l2711K6367K2607o5964k7232L4941
1489b2942j7061Q0794K2744j47067O7604M1134M521L4361q35q41k9245J2820N1287
1476I7274p9906M4487l5945o3343P4077l6712n8301K9498R214O3336J7784m2326
1464A9137R2558n7187l6774n7699K4934L5340o903Q1961j7736m1636N1553n3468
$$ plain form
1549 20796 -20520 29273 -44054 -30044 -33955 3746 -14307 -4960 43465 -1081 12991 60991
1537 60991 -12783 -35802 11187 -1175 -59773 -34492 -6815 25680 91021 29751 33737 65108
1525 65108 53259 28999 17704 -18070 -35879 -46113 -26247 31049 50210 42560 23873 19109
1513 19109 -85910 -37975 -24742 -15058 12439 -9402 -3343 5478 3304 -10265 40546 -24144
1501 -24144 2411 56035 35392 55710 80138 19050 -13661 12706 35313 -30651 -57883 -22942
1489 -22942 -40003 40791 63535 -83532 -15928 25206 29727 64088 63253 62412 33167 45987 97274
1476 97274 17368 61855 25910 -37433 36644 -68 -58369 -28871 -19657 43679 61463 19137
1464 19137 111695 54508 17734 -39965 -15031 20309 13406 95367 77631 35995 87548 34080
1452C4080r3446N3647O2482K0031j3190l3651Q4912n2981J6166q9080m462K3616
1440H124o2039L0321M0291N7875J0580m5875k3004l6561L1890L9408l3267K5878
1428D3621N3581j9216o7811O299j9842l7763L6603O0485P949o0125j7588O0675
1416D6868L9121M6988m9241m1679J1890j2154r300n764n463P0405j6480m8535
1404B6656q4519K9192M5303j999j247O7257K3318n2385o642l2968M2821j8690
1392C6097l5746K7866K9702L8188p908J8387n6587J6965k3449k7042k9887N1314
1380C7900m1035J8946m2889L3436j8310n85P9196j7889o697j3105n0789k3354
1368d5175J00390n0018r410M719O3895j0615M7114j10303l13L3620m7776M1665
$$ plain form
1452 34080 -59366 -5719 56763 76794 63604 29953 114865 61884 78050 -11030 -15492 8124
1440 8124 -53915 -23594 16697 74572 85152 39277 16273 -20288 11602 51010 17743 43621
1428 43621 97202 77986 10175 16474 -3368 -41131 -4528 55957 63906 3781 -13807 46868
1416 46868 85989 132977 83736 42057 53947 41793 32493 26729 21266 91671 75191 26656
1404 26656 -57863 -28671 16632 14633 13386 80643 103961 51576 44934 11966 54787 36097
1392 36097 351 28217 57919 96107 88199 106586 49999 66964 43515 16473 -13414 37900
1380 37900 -3135 15811 -27078 6358 -11952 -12537 66659 48770 42073 28968 -21821 -45175
1368 -45175 55215 5197 -4213 506 64401 53786 100900 -9403 -9716 23904 -23872 17793
1356A7793l5905J9306k0760j0069O0656l0352O7945o293n6476J8423k0520o5704
1344f1956L8824N1878j3229K2508K451K6154q124j929J9457m4827j8307P3159
1332H6059l2015k5876l6824L4375J03659l9207n6654l4263J7554R813j3741K0846
1320C3726L3196O5910l6633n5483M5823j5264j5977J1298J7576J6888q2707j6322
1308B031K4712Q818k3478P4542J0776k741q4703N4414L1949n1860j8912n6997
1296c1449l0487L9584P4015k5641J9906M8409N189n5602l9685N9175m2003j31251
1284a09840J65913m283n9316k4009P480M4814K3186n7499K1618J2774R0662K5261
1272A36761r9952l7831k2400L6659l1927J2856O2028m065j622l1768r298j8186
$$ plain form
1356 17793 -18112 1194 -19566 -29635 31021 669 68614 62321 5845 24268 3748 -61956
1344 -61956 -23132 28746 15517 38025 40476 66630 58506 56577 76034 31207 12900 86059
1332 86059 54044 28168 -8656 25719 129378 90171 33517 -746 16808 26621 12880 33726
1320 33726 66922 132832 96199 40716 86539 71275 55298 66596 84172 101060 18353 2031
1308 2031 26743 35561 12083 86625 97401 94660 9957 64371 96320 44460 25548 -31449
1296 -31449 -61936 -22352 51663 26022 45928 94337 99526 43924 4239 63414 21411 -109840
1284 -109840 56073 51790 -7526 -31535 -24055 20759 43945 -13554 8064 20838 111500 136761
1272 136761 36809 -1022 -23422 13237 -18690 -5834 56194 52129 50507 18739 9441 -8745
1260h745K2971N9344n0829K6463m3169M6519k2332n806N1906n0968L562l5009
1248f093J6853K0537j1224L7805o1966N803k6090J2910J03343n7179p0135O6474
1236C1038K2375N240j2541M0340l345n6316K7747J7080J3069o0678K0129K3362
1224F7500L1137j264j4671k9252l8128j4420Q9198K5094n6447K7383L5654l2711
1212H9073l3851l421L2821j5974M2990m6289Q373l2691m9832M6466r916m4066
1200a6317K2860J4361j4927P3371M2760j8781l3512n4069L3459m3438K4897L3153
1188F3817k5777J9355j5505J7482n2911M3730O5867k360o18l1414j4396l2088
1176C5182k84L3903j2047Q090l880o6786L1928M0746M4446j07895N2706J5345
$$ plain form
1260 -8745 14226 73570 22741 49204 6035 52554 30222 24416 76322 25354 28916 -6093
1248 -6093 10760 31297 20073 57878 -4088 1715 -24375 -11465 91878 34699 -35436 31038
1236 31038 53413 58653 46112 86452 83107 26791 54538 71618 84687 24009 44138 67500
1224 67500 98637 97373 82702 53450 15322 902 90100 115194 58747 86130 121784 89073
1212 89073 55222 51801 84622 68648 111638 65349 73722 41031 -8801 37665 27749 -16317
1200 -16317 6543 20904 5977 79348 122108 103327 69815 15746 49205 5767 30664 63817
1188 63817 38040 57395 41890 59372 6461 50191 116058 113698 113080 81666 67270 35182
1176 35182 34898 68801 56754 64844 60964 -5822 26106 66852 111298 3403 56109 71454
1164G1454L297K191o0288J15695r5303O9239m3934l4930R667j1424l090j3236
1152I338O4440J5124L1211l6842j6562r805P657p759q1079J2475m1687J16817
1140F3328O0051k7772o476n7362k40J9497K8883J7754k5192l6581k8187N2337
1128F0040j4184m5859N9753m0054k2443N3337l2025J2238J1436M3550j6330j0540
1116E8919n3313P3412o1030K596N0633k0741p2342k6118M6537k9456q463N3881
1104A4515m8497n9145M8145Q5100R1589k8336K1082k891k0410j2397n3498l5348
1092i1L5140j1789o349J03880p3111q437K8717K2422m5954Q731J11825k7784p1003
1079F6197n3784L0344r5054K5609M1976N5081O2258n6294K9133p504o1044k6631
$$ plain form
1164 71454 74751 76942 16654 132349 37046 106285 62351 27421 37088 25664 22574 9338
1152 9338 73778 88902 120113 83271 66709 56904 64561 56802 -24277 -11802 -53489 63328
1140 63328 123379 95607 89131 31769 31529 51026 79909 97663 72471 35890 7703 60040
1128 60040 45856 -3 59750 19696 -2747 50590 18565 30803 42239 85789 69459 58919
1116 58919 5606 79018 17988 20584 71217 50476 -21866 -47984 -1447 -30903 -39366 14515
1104 14515 -33982 -93127 -44982 40118 131707 103371 124453 121562 101152 88755 35257 -91
1092 -91 35049 23260 16911 120791 47680 39243 67960 90382 44428 53159 164984 137200 66197
1079 66197 12413 42757 -52297 -26688 15288 70369 132627 76333 105466 97962 36918 10287
1067A0287J106J46M5687j0613K3699l241m0916k6199p654J13100r7603K4572M2504
1054G4875O3689n3316j10379L5327Q868M1364k5573o5201K9395N9846O2720J3117
1042A34732o6167L4173J0668j9555o0616L4522O8550r8539K5050k1204M556P9654
1030A25824m0685q423J5889n1102Q5318q0048m2239k6336m882J2789J19276k5758
1018G9623j22438J142R2961K0420p2083k1134J21931R914p5423O0847J0848K4723
1006A31331q2739L330J3841J3505n7263M5702M5948j894l7147j9978k8089Q5590
994A12137J8686j29905j8203J19424N8244r2796l9243j7737N2922p655n204o5365
982a4695J5273N7710L6166M4812m1760j5992m3833j1357j2175M8566R812j8843
$$ plain form
1067 10287 11393 11539 57226 46613 70312 67071 26155 -44 -7698 105402 7799 32371 74875
1054 74875 138564 85248 -25131 10196 19064 60428 34855 -30346 -951 58895 121615 134732
1042 134732 68565 102738 113406 93851 33235 67757 136307 37768 62818 41614 46170 125824
1030 125824 85139 76716 92605 41503 126821 46773 4534 -21802 -26684 -13895 105381 79623
1018 79623 -42815 -41673 51288 71708 -375 -21509 100422 110336 34913 95760 106608 131331
1006 131331 48592 51922 65763 79268 22005 67707 113655 111761 74614 54636 26547 112137
994 112137 130823 918 -17285 102139 160383 67587 28344 10607 63529 55874 50670 -14695
982 -14695 578 58288 94454 139266 97506 81514 37681 26324 14149 62715 72527 53684
970E3684l2147O919Q9624K1034O7510m7858o4937k7648L8608m1090j4044L3199
958H2854q3641J624O334k1100P1079n2675K5006n4021J8795L1771j782K2666j01838
945e4928L5207O0446K4303p3176p429J7640K1346M4620j02209J9301N3592j8509
933B0204l3822O5880L2114m0109l3678p0262O2494L9471J7447o2559M9186n735
921D0631M15N7274J8060J0111q6896r9552R0464L8152k1395n979n9142M0345m1329
908a8841K6350J5421J3210N9006l6338n3427l7048P3355j5454j1885p510R56l9362
895c1567O273Q7892J7882J3902l0211j0797J6071o1447J5043n65L7020k534o6293
882i331j7843M5890o9284L7902L2126j8534L0128R042o6270K2788N235Q9948p1634
$$ plain form
970 53684 21537 28456 118080 139114 206624 158766 93829 66181 104789 63699 49655 82854
958 82854 -787 837 7171 -13929 57150 4475 29481 -24540 -5745 26026 24244 46910 -54928
945 -54928 -19721 40725 65028 -8148 -15577 2063 23409 68029 -34180 -14879 38713 20204
933 20204 -13618 52262 84376 44267 10589 -59673 2821 42292 59739 -2820 46366 40631
921 40631 41046 98320 116380 126491 39595 -59957 30507 68659 47264 41285 -17857 22488 -18841
908 -18841 7509 22930 36140 95146 58808 5381 -31667 41688 26234 14349 6839 7795 -31567
895 -31567 -25294 62598 80480 94382 64171 53374 69445 7998 23041 22476 59496 56962 -9331
882 -9331 -27174 18716 -50568 -12666 19460 926 31054 40096 -26174 -3386 1849 91797 20163
869B0163N529R6940J9831j19313q9911j089O5896J00231l8728j3944P0124l4668
857H1061j11372Q1029L6223N2202j8428r2419j5631Q218O7320L4491j0155n6679
845E5860n6430p108K2513n9705l2817K3381L5207M3608p9685N1396J4601N3684
833F4505j1001j1388m5972L0325n404l6944o454O9061J6415L1188N70n7743j4622
820B2536M712Q584k3725l3478P2054n4536O4310n14k2636n5624L3161n2749j5529
807e3434M8779M719K2355m4633L3735N3261k1663M6406K057m5378m195J6635l8826
794A9818P2332M5222l1604q586r1981M8202R475N796p8716K6169J8026m963r373
781A9817K4247m9580K9793O6932J1963m2550n0335Q2428n4592o8105J3609L5938
$$ plain form
869 20163 25692 122632 142463 23150 -66761 -67850 -1954 98277 59549 45605 115729 81061
857 81061 -30311 50718 86941 139143 120715 28296 12665 20883 88203 122694 112539 55860
845 55860 -570 -7678 14835 -44870 -77687 -54306 -19099 24509 -55176 -3780 10821 64505
833 64505 53504 42116 -3856 26469 21065 -15879 -22333 46728 63143 94331 94901 37158 22536
820 22536 27248 35832 12107 -21371 50683 -3853 60457 59943 37307 -18317 14844 -37905 -53434
807 -53434 -4655 64 22419 -22214 11521 64782 43119 89525 91582 46204 42009 58644 19818
794 19818 92150 137372 105768 97182 5201 53403 62878 68674 -10042 16127 34153 29190 19817
781 19817 44064 -5516 24277 91209 103172 60622 10287 92715 38123 -29982 -16373 19565
769A9565k4435l0909N0602o6529K7709J02496n8616k0949r911N3240L3445j9810
757E5898k1627j6105K8265M1432l0332j5559J9629P984K3368p5617n6242n0810
745h9716P1520m5808K9756K6382O9493j9349j9529m5052K5442L5674L859L9059
733H1731k2575n7823j470J7166K1177J6156k5673l2651P158L6398l3217p3492
721f7115M567j2959J16643M016J814R6287o4948k8764k7563l4111N9068J353q9022
708d0734K1874J7961K6399q445N4232m5449o8326J7370J4448J6725J2496l382
696A5169M246j588k651k548M9933N5281l4467l2109l2417P576K0918p760k126
683C7457n7180K6349m5884M2281K0812J6931j07602N9316J9030o9253k0781j6848
$$ plain form
769 19565 -4870 -35779 14823 -51706 -23997 78499 19883 -1066 -10977 42263 75708 55898
757 55898 34271 18166 46431 87863 57531 41972 61601 69585 92953 17336 -38906 -89716
745 -89716 -18196 -64004 -34248 -7866 61627 42278 22749 -22303 3139 38813 42672 81731
733 81731 59156 1333 -137 17029 38206 54362 28689 -3962 3196 39594 6377 -67115
721 -67115 -62548 -75507 41136 45152 46966 143253 78305 49541 21978 -12133 46935 48288 -40734
708 -40734 -18860 -899 25500 17055 71287 25838 -42488 -25118 -10670 6055 18551 15169
696 15169 19415 17827 15176 12628 62561 117842 83375 51266 18849 26425 47343 39583 37457
683 37457 -19723 6626 -39258 3023 23835 40766 -66836 -7520 11510 -57743 -78524 -95372
671i5372K4895J06520P382O8k3687j6371k2410p511j9914P3224m238m0075K8140
658A0651N5006K4363l5846j5215o0286j3109P556R0903m9655j7636J1551q840
646e57K9409k3324J8561J8360n656L2904q9370l6416R4524k0287j4294j0013M503
633a656j8864K3611O3282l5622q1108J9478M1033j2717Q4689l3323J5842p5048
621a0403q313L5471l8178n6106Q9759j7406Q145L8210J9290r5307m6509r253J5564
608g5036R924P4602J2666p8245L0742o240J971M7277j3655l7495K521L231L1566
595C829N1756j0475j1126j8211L2853N211m2279o430k9686K9992J7754n5539j8292
582e0643J4224k4675M6106K7422n055p588k5489j5550L5046L5029l3914j2606
$$ plain form
671 -95372 -70477 36043 43425 43493 19806 3435 -18975 -26486 -46400 26824 22586 -17489 10651
658 10651 65657 90020 54174 38959 -21327 -34436 -26880 64023 14368 -3268 8283 -557
646 -557 28852 5528 24089 42449 36793 69697 -19673 -56089 38435 18148 3854 -6159 -1656
633 -1656 -20520 3091 66373 30751 -50357 -30879 10154 -2563 82126 48803 64645 -10403
621 -10403 -18716 16755 -21423 -77529 12230 -5176 2969 41179 60469 -34838 -81347 -90600 -75036
608 -75036 -65112 9490 22156 -56089 -25347 -31587 -29616 17661 4006 -33489 -30968 -27737 3829
595 3829 55585 45110 33984 15773 48626 53837 11558 5128 -24558 5434 23188 -32351 -50643
582 -50643 -36419 -61094 -14988 12434 7379 -209 -25698 -41248 -6202 28827 -5087 -17693
570a7693J653K5901k2674k6736K2979m2161K7964N6254P555m5470L871L8090q0988
557e1455N1055J9881l7108L5822l6701K4017K3847m1056m1470j5847K0201j8204
545f7018K3148m1926K3317k5067L1060P2200l2954J3851l3382K4530n435L8177
533B0501J7782r5181K8946r064M1571J9226j07830l0164L1537J8121K7734R4443
521E7622o346j7499m5702j3548q4234K0777L0019K2102K0237P8935m9170J4016
509B7209p1644k7588P7175K6591o4633J7158k6858l6407L4805j11214M6351P426
497a01629j8953J30719k0607j8450o7089k2081Q0020l604p066J0696j7721r725
485f5490J8623J0788L6294J0104o8027k8299L279P856O3922M8512j43435Q841
$$ plain form
570 -17693 -16040 9861 -12813 -39549 -16570 -58731 -30767 25487 33042 -12428 -8557 29533 -51455
557 -51455 -400 19481 -17627 18195 -18506 5511 29358 -11698 -53168 -69015 -48814 -67018
545 -67018 -43870 -85796 -62479 -87546 -56486 15714 -17240 -3389 -36771 -12241 -17676 20501
533 20501 38283 -56898 -27952 -37016 4555 23781 -84049 -114213 -82676 -64555 -36821 57622
521 57622 51276 33777 -11925 -25473 -109707 -88930 -58911 -36809 -16572 62363 13193 27209
509 27209 -44435 -72023 5152 31743 -32890 -15732 -42590 -78997 -44192 -155406 -109055 -101629
497 -101629 -120582 10137 -10470 -28920 -96009 -118090 -38070 -41674 -48740 -38044 -55765 -65490
485 -65490 -46867 -36079 215 10319 -57708 -86007 -82728 -74872 -10950 37562 -105873 -97032
473i7032M7038M8654k9151l6179K1420l9353K2209o043M7898k3436k8431p5065
461a47471J29668J7782J6837j4215l0413r149n465Q980K4394o5966K2978N5225
449C185k62l5650K050K8068M3066n3040n9140O6533j5569L335L2739q7485M5987
436b6183Q024j6982m3701l1937R989k827Q9074J6721M4740l8983m1674k4658J758
423e6639K7017q2956J9235J7517q247o0946M1364N0965K7157R039j20479N5510
411h1463J6673j1763p614J3462q21O8381m4581j165m5200m0171j3647K0141r971
398a37739K6946L1534M03j6337m201M716M6632k6794J3804L1237M6196J67o6608
385e0044O108j9894M9510j2757m1881J3489M6K1395j988r9409M7823l1057j0346
$$ plain form
473 -97032 -49994 -1340 -30491 -66670 -45250 -84603 -62394 -68437 -20539 -43975 -72406 -147471
461 -147471 -17803 -21 16816 2601 -27812 -36961 -42426 -33446 -9052 -75018 -52040 3185
449 3185 2923 -32727 -30677 -2609 40457 -12583 -71723 -5190 -20759 -17424 15315 -72170 -26183
436 -26183 -18159 -35141 -78842 -110779 -100790 -103617 -14543 2178 46918 7935 -33739 -58397 -56639
423 -56639 -29622 -112578 -93343 -75826 -84073 -145019 -103655 -52690 -25533 -16494 -136973 -81463
411 -81463 -64790 -76553 -84167 -70705 -71526 -3145 -47726 -48891 -94091 -134262 -147909 -127768 -137739
398 -137739 -110793 -79259 -78856 -95193 -99394 -94678 -48046 -74840 -61036 -29799 16397 16564 -50044
385 -50044 -43936 -63830 -14320 -27077 -68958 -55469 -55423 -34028 -36016 -135425 -87602 -118659 -129005
372a29005J1123N3437j1350p4740K2281N9168Q365r385l9145M6119J1925N938
360d5269j635l5365l0463Q843L3486m9877m927L0774J1371o385P2277j720k4519
347d3409k1096K2323l3501N428j0996m3780N1097n8102K9935n0951L2653K7750
335i2649L486m7794p860L5146J9385L4002o2629O3092J2716j1958n2038m7576
323a54677Q883Q9330j3334n6548O6649q7054o028Q103J1437j2101n577Q2234M678
310f4005o205M4631n1712l651n6n5502R118O9992J823M2554Q8111q8895r0481
297a04278n9380P3688N3428l4596m836p2400K8151K2039l7246J5738l011L5061
285h7642j8354l3945N7110j5071R163Q609N3647N1908o1296n6153l7651L3108
$$ plain form
372 -129005 -117882 -64445 -75795 -150535 -128254 -69086 -60721 -70106 -109251 -63132 -51207 -45269
360 -45269 -46904 -82269 -112732 -103889 -70403 -120280 -125207 -94433 -83062 -89447 -17170 -18890 -43409
347 -43409 -64505 -42182 -75683 -70255 -81251 -125031 -73934 -132036 -102101 -153052 -120399 -92649
335 -92649 -89163 -136957 -144817 -109671 -90286 -56284 -118913 -55821 -43105 -55063 -107101 -154677
323 -154677 -145794 -56464 -69798 -126346 -59697 -146751 -152779 -144676 -133239 -145340 -150917 -68683 -64005
310 -64005 -70210 -25579 -77291 -80942 -80998 -136500 -127382 -57390 -55567 -13013 75098 -13797 -104278
297 -104278 -163658 -89970 -36542 -71138 -75974 -148374 -120223 -98184 -135430 -119692 -122703 -87642
285 -87642 -105996 -139941 -82831 -97902 -88739 -80130 -26483 25425 -35871 -92024 -129675 -96567
273i6567l5678M8350o0184L9643l7399M172P440M1714m2731n4537M7574Q4349
261e3854k2081J2872P045K0587o6916m0116Q1410q525L0063q8028J0372j7736
249a34907J7896m8988N5384k8957L3772j4222k9071N8385m1331K2506k6958J8590
237a17901J6536j6890M4671q0673L1214J7729P8294l6310p0560L7102n9536j6542
225a72866L7096J4837p174k3160k7610o6524K0336M3476N3472M1124j6633K0032
213h3594k7567L2601m5201J8090q703k8606J104m330L6724n7065m225N2081M8275
200g0416N225p305l0967j3896m5095m1693J09494Q656L0928m9934j0742K7078
188h8667n9092m0065K7685j5560J8383J8780J3541O239l9235Q2094Q400p5712
$$ plain form
273 -96567 -132245 -83895 -144079 -104436 -141835 -137663 -130223 -88509 -131240 -185777 -138203 -53854
261 -53854 -75935 -63063 -56018 -35431 -102347 -142463 -61053 -69578 -39515 -127543 -117171 -134907
249 -134907 -117011 -165999 -110615 -139572 -105800 -120022 -149093 -90708 -132039 -109533 -136491 -117901
237 -117901 -101365 -118255 -73584 -154257 -123043 -105314 -27020 -63330 -133890 -96788 -156324 -172866
225 -172866 -135770 -120933 -128107 -151267 -178877 -245401 -225065 -181589 -128117 -86993 -103626 -83594
213 -83594 -111161 -78560 -123761 -105671 -114374 -142980 -141876 -146206 -109482 -166547 -170772 -118691 -70416
200 -70416 -65191 -72496 -103463 -117359 -162454 -204147 -94653 -85997 -55069 -105003 -115745 -88667
188 -88667 -147759 -187824 -160139 -175699 -157316 -138536 -124995 -118756 -157991 -75897 -67497 -143209
176a43209N836L1795J1619j6473k1500N1511k8125k3612Q9739l2695j728n0275
164a27117M5374N665o2626k807K9846R275p5916K8944N0150m2492J7166M4743
152g9795n1634j1546j2852N5723J5279p661N4502o7999l9319l3410k0522M0606
140a58628O3202l9116M3713l5218j12171J00753N944J3322P0863o4592o74k9307
128a41909J1899j6768p750K9520K2829J1040l9475Q003M380l8836q353K3201k5746
115a67965K2051l9871o0071O858L757J3907M6115J5442j5407k1369m2737M4290
103a95000N2924J9756L9041p6399n491k2759M6673j8622M1834j3945k8837J815
91a59010J7865J0489R300J4946j5760J2211k9306J8116m3105j0787Q4869m8891
$$ plain form
176 -143209 -137373 -105578 -93959 -110432 -131932 -80421 -108546 -132158 -42419 -75114 -76842 -127117
164 -127117 -81743 -76078 -138704 -141511 -111665 -102390 -178306 -149362 -99212 -141704 -124538 -79795
152 -79795 -131429 -142975 -155827 -100104 -84825 -92486 -37984 -105983 -145302 -178712 -199234 -158628
140 -158628 -95426 -134542 -90829 -126047 -238218 -137465 -131521 -118199 -47336 -111928 -112602 -141909
128 -141909 -130010 -146778 -154528 -125008 -102179 -91139 -130614 -122611 -118231 -157067 -165420 -142219 -167965
115 -167965 -145914 -185785 -245856 -238998 -235241 -221334 -175219 -159777 -175184 -196553 -239290 -195000
103 -195000 -142076 -122320 -83279 -159678 -165169 -187928 -141255 -159877 -118043 -131988 -160825 -159010
91 -159010 -141145 -130656 -121356 -106410 -122170 -109959 -139265 -121149 -164254 -175041 -90172 -139063
79a39063k5111j9188P251J7853K0085J3321k929k9853K1740j2549K9715K5628
67i3100m6250j6611L0044n4031M0040j4929L6247o0927p998Q901N1794J6709o0447
54a70558K0766K8848k4627o4000M5241N754N191j181P0417m2047l1646o196J2032
41a52006P322k6312J427L8956k8604l8444k003L5701k3647N222O6952n963m3229
28a64628N7944m3502l233m8856k0617Q795M0330O582n887J2266L1268j4797k5776
15a70111J9885n6978O537L0615j7617M3497J9640q784l011m7472m170J2655K3128
2a52186j6510L2793
0a35903
$$ plain form
79 -139063 -164174 -183362 -176111 -158258 -138173 -124852 -127781 -157634 -135894 -148443 -118728 -93100
67 -93100 -139350 -155961 -125917 -179948 -139908 -154837 -118590 -179517 -187515 -178614 -126820 -110111 -170558
54 -170558 -149792 -120944 -145571 -209571 -164330 -158576 -153385 -154566 -84149 -126196 -157842 -164038 -152006
41 -152006 -144684 -170996 -169569 -130613 -159217 -197661 -199664 -163963 -187610 -182388 -115436 -121399 -164628
28 -164628 -106684 -150186 -153419 -202275 -222892 -214097 -173767 -167185 -173072 -160806 -129538 -144335 -170111
15 -170111 -150226 -207204 -200667 -170052 -187669 -144172 -124532 -133316 -136327 -183799 -187969 -175314 -152186
2 -152186 -168696 -135903
0 -135903
$$ Imaginary data points
##PAGE= N=2
##DATA TABLE= (X++(I..I)), XYDATA
16383b107161N2188K9869J6740J9351R420J8799M7240L735N4171l2687k738j2923
16371a903996O2864M7941L836N150K1258K5391N6880N0531r782M1472L8579L2893
16359a526983l4641k70J03244K3206m7157J4892K3827P7576p943k2665J6530J6246
16347a364138K0612K9870K7944P9623K9648J365P124K952N9962J6937o1371L7308
16335a112164N9140K307R593K5646M2758j5824p744J271M8472K0232M6958l1360
16323i10715n4777P8791O6648J0774N1368Q8361j8831K0012J0382m2539M2038
16312f58488K0430P156K9029Q4093j3504k9294M7593k3575J5836j849L5342N4459
16300d32772N9674m2067j5329R780M7622P4114K7543l3171l1785j1550J17756
$$ plain form
16383 -2107161 -2054973 -2025104 -2008364 -1989013 -1979593 -1960794 -1913554 -1909819 -1855648 -1888335 -1891073 -1903996
16371 -1903996 -1841132 -1793191 -1789355 -1784205 -1762947 -1737556 -1680676 -1630145 -1639927 -1598455 -1559876 -1526983
16359 -1526983 -1561624 -1561894 -1458650 -1435444 -1482601 -1467709 -1443882 -1366306 -1374249 -1396914 -1380384 -1364138
16347 -1364138 -1343526 -1313656 -1285712 -1206089 -1176441 -1175076 -1167952 -1165000 -1105038 -1088101 -1149472 -1112164
16335 -1112164 -1053024 -1050717 -1041124 -1015478 -972720 -988544 -996288 -995017 -946545 -926313 -879355 -910715
16323 -910715 -965492 -886701 -820053 -809279 -757911 -669550 -688381 -668369 -657987 -700526 -658488
16312 -658488 -638058 -630902 -601873 -517780 -531284 -560578 -512985 -536560 -520724 -522573 -487231 -432772
16300 -432772 -373098 -415165 -430494 -420714 -373092 -298978 -271435 -304606 -336391 -347941 -230185
16289b30185J2026l4058O0765q412O8571m4434j4155Q8474o7573Q868L7737M8832
16277g3544J5458J2360j3456K6120K2265O1745K547j8216P0351k3843r479K8438
16265A00746L0848J3489l3475k2410N609O0139l760O2143m3627k6183P4142P0746
16253B88407K306L3076M6281n1107k2924R528K2262M6167j1990N3252N8379J2786
16241D86423J646L1282j07942k1781L3841K8696L7661R056N2920o8236J40250
16230F23816l5003j06333J1230Q6658L4613J7940m386p468P934K7436P635O7084
16218G31156O111J4796k4364O808K1265j1894j420M5790k7160o5217M8701K8497
16206G73069k2087Q9092M475J4273o9309Q3444O267k8551N312J713J063j7103
$$ plain form
16289 -230185 -218159 -252217 -191452 -199864 -131293 -175727 -189882 -101408 -168981 -160113 -122376 -73544
16277 -73544 -58086 -45726 -59182 -33062 -10797 50948 53495 35279 105630 81787 72308 100746
16265 100746 131594 145083 111608 89198 94807 154946 151186 213329 169702 143519 217661 288407
16253 288407 290713 323789 370070 318963 296039 305567 327829 373996 362006 415258 473637 486423
16241 486423 488069 519351 411409 389628 423469 452165 489826 498882 551802 483566 623816
16230 623816 588813 482480 493710 580368 614981 632921 628535 621067 629001 656437 664072 731156
16218 731156 737267 752063 727699 734507 755772 743878 742458 788248 761088 695871 744572 773069
16206 773069 750982 840074 844549 858822 789513 872957 879224 850673 855985 857698 858761 841658
16194H41658L8541q835J9896P3687K257m672M6847O93j0455k7068L1891j7164
16182I87276M4668L8956j9562k257n1700K8723Q935L9688j2619l451K910J8841
16170A080408J101o9058K0414J9497M3165R181K1768m6920M5105K2802O477l3189
16158A120751J3831j7761O8671j1014M8767J9406o0126J7164l937m1797K0317
16147A174272j7013L355K6970M1632L687Q683l7057K6771k7629k3284L4930L34
16135A215651J6707R3901L5350q3617p0612j4180M3636M1413o702r167o894j6223
16123A239263Q3454k5348K95P1154r071p8332m1203R1171k476n7535O1158l6109
16111A296421L5430m8399Q2369k7638k1795M7012K4445m9085l0165l487O4004
$$ plain form
16194 841658 880199 871364 891260 964947 967204 962532 1009379 1010072 999617 972549 1004440 987276
16182 987276 1031944 1070900 1051338 1049081 997381 1026104 1035039 1074727 1062108 1058657 1061567 1080408
16170 1080408 1081509 1012451 1032865 1052362 1095527 1104708 1126476 1079556 1124661 1147463 1153940 1120751
16158 1120751 1134582 1116821 1185492 1174478 1223245 1242651 1182525 1199689 1195752 1153955 1174272
16147 1174272 1157259 1160614 1187584 1229216 1232903 1241586 1204529 1231300 1203671 1180387 1215317 1215651
16135 1215651 1232358 1326259 1361609 1277992 1207380 1193200 1236836 1278249 1271547 1262380 1255486 1239263
16123 1239263 1322717 1297369 1297664 1368818 1359747 1281415 1240212 1331383 1328907 1271372 1332530 1296421
16111 1296421 1331851 1283452 1365821 1338183 1316388 1363400 1387845 1338760 1308595 1305108 1369112
16100A369112n4816K0036J5754L4210J3669n0903K843n20N9603l7531j5004l5759
16088A320694J01564k143p4967n0536j9423L8990J19217K0985j05998J3556N7910
16077A419849J2372m4813L0373m433M4573q898J9616q5185N258n34r095L6303
16065A415386l4249M1614n1880J07593l0004K834k459K9890n2698m248o6485O783
16053A362077R0338K5624j685k4698K6917j6595P8858j6739k1414j8459o898m0665
16041A436661J5933j636n4210M3040j1567L6664J6357J7421K95n4597J0733O5770
16029A520864K4403j8632n0749o9196J8763o6579P3445M1692n8359M6349l5785
16018A426216j01K8950P9415k3578n1404L6245J4832j5516O7687J6162p0057j06939
$$ plain form
16100 1369112 1314296 1334332 1350086 1384296 1397965 1347062 1349905 1349385 1408988 1371457 1356453 1320694
16088 1320694 1422258 1420115 1345148 1294612 1275189 1314179 1433396 1454381 1348383 1361939 1419849
16077 1419849 1432221 1387408 1417781 1413348 1457921 1449023 1468639 1383454 1388712 1388178 1379083 1415386
16065 1415386 1381137 1422751 1370871 1478464 1448460 1451294 1448835 1478725 1426027 1421779 1355294 1362077
16053 1362077 1452415 1478039 1476354 1451656 1478573 1461978 1540836 1524097 1502683 1484224 1477326 1436661
16041 1436661 1452594 1450958 1396748 1439788 1428221 1464885 1481242 1498663 1498958 1444361 1455094 1520864
16029 1520864 1545267 1526635 1475886 1406690 1425453 1358874 1432319 1474011 1415652 1462001 1426216
16018 1426216 1426115 1455065 1534480 1510902 1459498 1495743 1510575 1495059 1562746 1578908 1508851 1401912
$$ [...]
##END NTUPLES=NMR SPECTRUM
##END=
