##TITLE=1H_CG-1206-A3
 CDCl3
 8 sc, 
 27.6.2024
##JCAMPDX= 6.0         $$ Bruker NMR JCAMP-DX V2.0
##DATA TYPE= NMR SPECTRUM
##DATA CLASS= NTUPLES
##ORIGIN= UXNMR, Bruker Analytische Messtechnik GmbH
##OWNER= root
$$ XWIN-NMR		Version 3.5
$$ Thu Jun 27 14:27:28 2024 Russian Standard Time (UT+4h)  she@DPX200
##.OBSERVE FREQUENCY= 200.1313
##.OBSERVE NUCLEUS= ^1H
##.ACQUISITION MODE= SIMULTANEOUS
##.ACQUISITION SCHEME= undefined
##.AVERAGES= 8
##.DIGITISER RES= 18
##SPECTROMETER/DATA SYSTEM= spect
##.PULSE SEQUENCE= zg30
##.SOLVENT NAME= CDCl3
##.SHIFT REFERENCE= (INTERNAL, CDCl3, 0, 15.4538)
##AUDIT TRAIL= $$ (NUMBER, WHEN, WHO, WHERE, WHAT)
$$ ##TITLE= Audit trail, XWIN-NMR		Version 3.5
$$ ##JCAMPDX= 5.01
$$ ##ORIGIN= Bruker BioSpin GmbH
$$ ##OWNER= she
$$ F:/spectra/data/she/nmr/H-F/1/pdata/1/auditp.txt
$$ ##AUDIT TRAIL=  $$ (NUMBER, WHEN, WHO, WHERE, WHAT)
(   1,<2024-06-27 14:26:12.29 +0400>,<she>,<DPX200>,
      <created by zg, POWCHK disabled, PULCHK disabled
       configuration hash MD5:
       00 E9 B6 7A A2 85 ED C7 34 08 36 98 17 FE 4E 26
       data hash MD5: 16K
       2C 46 1E B4 42 F1 88 9E 09 19 18 00 5E FB 92 DE>)
(   2,<2024-06-27 14:26:15.79 +0400>,<she>,<DPX200>,
      <Start of raw data processing
       efp BC_mod = 2 LB = 0.24 FT_mod = 6 PKNL = 1 PHC0 = -25321.02 PHC1 = 12.78748 SI = 16K 
       data hash MD5: 16K
       DF 58 C4 51 BE 2E 52 E0 0D AF D8 34 BD 5B 1E 6F>)
(   3,<2024-06-27 14:26:35.46 +0400>,<she>,<DPX200>,
      <pk PHC0 = 2.078001 PHC1 = 1.2 
       data hash MD5: 16K
       E3 E6 6B 4E C7 A0 73 06 46 BA 8C 83 65 2E A1 89>)
(   4,<2024-06-27 14:26:38.90 +0400>,<she>,<DPX200>,
      <abs ABSG = 5 
       data hash MD5: 16K
       3B FE 0D F5 37 2A 9E BB 5A 6F 0B D1 7E 78 E5 D2>)
$$ ##END=
$$ 
$$ hash MD5
$$ 6A C0 D6 F7 14 CC A0 C5 3D 64 42 6F A6 5E 0A F5
##$RELAX= 
##$RELAX= 
##$RELAX= 
##$RELAX= 
##$RELAX= 
##$RELAX= 
$$ Bruker specific parameters
$$ --------------------------
##$DU= <F:/spectra>
##$EXPNO= 1
##$NAME= <H-F>
##$PROCNO= 1
##$TYPE= <nmr>
##$USER= <she>
##$AMP= (0..31)
100 100 100 100 100 100 100 100 100 100 100 100 100 100 100 100 100 100 
100 100 100 100 100 100 100 100 100 100 100 100 100 100 
##$AQSEQ= 0
##$AQ_mod= 1
##$AUNM= <au_zg>
##$AUTOPOS= <>
##$BF1= 200.13
##$BF2= 200.13
##$BF3= 200.13
##$BF4= 200.13
##$BF5= 200.13
##$BF6= 200.13
##$BF7= 200.13
##$BF8= 200.13
##$BYTORDA= 1
##$CFDGTYP= 0
##$CFRGTYP= 5
##$CHEMSTR= <none>
##$CNST= (0..31)
1 1 145 1 1 1 1 1 1 1 1 1 1 1 1 1 1 1 1 1 1 1 1 1 1 1 1 1 1 1 1 1 
##$CPDPRG= <>
##$CPDPRG1= <>
##$CPDPRG2= <>
##$CPDPRG3= <>
##$CPDPRG4= <mlev>
##$CPDPRG5= <mlev>
##$CPDPRG6= <mlev>
##$CPDPRG7= <mlev>
##$CPDPRG8= <mlev>
##$CPDPRGB= <>
##$CPDPRGT= <>
##$D= (0..31)
0 1.2 0 0 0 0 0 0 0 0.06 0 0.03 0 0 0 0 0.0002 0 0 0 0 0 0 0 0 0 0 0 0 
0 0 0 
##$DATE= 1719483971
##$DBL= (0..7)
120 120 120 120 120 120 120 120 
##$DBP= (0..7)
150 150 150 150 150 150 150 150 
##$DBP07= 0
##$DBPNAM0= <>
##$DBPNAM1= <>
##$DBPNAM2= <>
##$DBPNAM3= <>
##$DBPNAM4= <>
$$ [...]
##$SUBNAM3= <"">
##$SUBNAM4= <"">
##$SUBNAM5= <"">
##$SUBNAM6= <"">
##$SUBNAM7= <"">
##$SUBNAM8= <"">
##$SUBNAM9= <"">
##$SW= 18.0517328524113
##$SWIBOX= (0..15)
0 0 2 0 0 0 0 0 0 0 0 0 0 0 0 0 
##$SW_h= 3612.71676300578
##$TD= 16384
##$TD0= 1
##$TE= 0
##$TE2= 300
##$TE3= 300
##$TEG= 300
##$TL= (0..7)
0 120 120 120 120 120 120 120 
##$TP= (0..7)
150 150 150 150 150 150 150 150 
##$TP07= 0
##$TPNAME0= <>
##$TPNAME1= <>
##$TPNAME2= <>
##$TPNAME3= <>
##$TPNAME4= <>
##$TPNAME5= <>
##$TPNAME6= <>
##$TPNAME7= <>
##$TPOAL= (0..7)
0.5 0.5 0.5 0.5 0.5 0.5 0.5 0.5 
##$TPOFFS= (0..7)
0 0 0 0 0 0 0 0 
##$TUNHIN= 0
##$TUNHOUT= 0
##$TUNXOUT= 0
##$USERA1= <user>
##$USERA2= <user>
##$USERA3= <user>
##$USERA4= <user>
##$USERA5= <user>
##$V9= 5
##$VALIST= <valist>
##$VCLIST= <CCCCCCCCCCCCCCC>
##$VD= 0
##$VDLIST= <DDDDDDDDDDDDDDD>
##$VPLIST= <PPPPPPPPPPPPPPP>
##$VTLIST= <TTTTTTTTTTTTTTT>
##$WBST= 1024
##$WBSW= 4
##$XGAIN= (0..3)
0 0 0 0 
##$XL= 0
##$YL= 0
##$YMAX_a= 348768
##$YMIN_a= -534096
##$ZGOPTNS= <>
##$ZL1= 120
##$ZL2= 120
##$ZL3= 120
##$ZL4= 120
##$ABSF1= 15.51
##$ABSF2= -2.541849
##$ABSG= 5
##$ABSL= 3
##$ALPHA= 0
##$AQORDER= 0
##$ASSFAC= 0
##$ASSFACI= 0
##$ASSFACX= 0
##$ASSWID= 0
##$AUNMP= <proc_1d>
##$AZFE= 0.1
##$AZFW= 0.1
##$BCFW= 0
##$BC_mod= 2
##$BYTORDP= 0
##$COROFFS= 0
##$CY= -3
##$DATMOD= 1
##$DC= 0
##$DFILT= <>
##$DTYPP= 0
##$F1P= 0
##$F2P= 0
##$FCOR= 1
##$FTSIZE= 16384
##$FT_mod= 6
##$GAMMA= 0
##$GB= 0
##$INTBC= 1
##$INTSCL= 3.70164e-10
##$ISEN= 128
##$LB= 0.24
##$LEV0= 0
##$LPBIN= 0
##$MAXI= 10000
##$MC2= 0
##$MEAN= 0
##$ME_mod= 0
##$MI= 1.114404
##$NCOEF= 0
##$NC_proc= -8
##$NLEV= 6
##$NOISF1= 3.799351
##$NOISF2= 2.8
##$NSP= 0
##$NTH_PI= 0
##$NZP= 0
##$OFFSET= 15.45381
##$PC= 1
##$PHC0= -25318.94
##$PHC1= 13.98748
##$PH_mod= 1
##$PKNL= yes
##$PPARMOD= 0
##$PSCAL= 0
##$PSIGN= 0
##$REVERSE= no
##$SF= 200.130013586657
##$SI= 16384
##$SIGF1= 3
##$SIGF2= 2
##$SINO= 5.538805
##$SIOLD= 16384
##$SREGLST= <1H.CDCl3>
##$SSB= 0
##$STSI= 16384
##$STSR= 0
##$SW_p= 3612.71676300578
##$SYMM= 0
##$S_DEV= 0
##$TDeff= 16384
##$TDoff= 0
##$TI= <>
##$TILT= no
##$TM1= 0
##$TM2= 0
##$TOPLEV= 0
##$USERP1= <user>
##$USERP2= <user>
##$USERP3= <user>
##$USERP4= <user>
##$USERP5= <user>
##$WDW= 1
##$XDIM= 16384
##$YMAX_p= 452719766
##$YMIN_p= -1314817
$$ End of Bruker specific parameters
$$ ---------------------------------
##NTUPLES= NMR SPECTRUM
##VAR_NAME=  FREQUENCY,     SPECTRUM/REAL,   SPECTRUM/IMAG
##SYMBOL=    X,             R,               I
##VAR_TYPE=  INDEPENDENT,   DEPENDENT,       DEPENDENT
##VAR_FORM=  AFFN,          ASDF,            ASDF
##VAR_DIM=   16384,         16384,           16384
##UNITS=     HZ,            ARBITRARY UNITS, ARBITRARY UNITS
##FACTOR=    0.220516191357247, 1,           1
##FIRST=     3092.77115286341, 0,            0
##LAST=      -519.945610142372, 0,           0
##MIN=       -519.945610142372, -1314817,    0
##MAX=       3092.77115286341, 452719766,    0
$$ Real data points
##PAGE= N=1
##DATA TABLE= (X++(R..R)), XYDATA
$$ [...]
6625C500769K48877k48688j15570L49266J60371m35768k20015N83078p74043n13820
$$ 3500769 3749646 3500958 3385388 3734654 3895025 3459257 3239242 3822320 3048277 2534457
6615B534457O94283J86886j99906j14844k8140l4780K89029l0797K45174P6087
$$ 2534457 3228740 3415626 3215720 3100876 3072736 3037956 3326985 3296188 3541362 3617449
6605C617449l47712m79233N24329L62984m0273n0970o28804k10633P96339K45613
$$ 3617449 3269737 2790504 3314833 3677817 3637544 3586574 2957770 2747137 3543476 3789089
6595C789089o83245m05498q4163K99772L01112l64177o02666O66479L39351l53128
$$ 3789089 3105844 2700346 2616183 2915955 3217067 2852890 2250224 2916703 3256054 2902926
6585B902926J50147m38184J23203n0574k90889K87072N303L99947j92844j93497
$$ 2902926 3053073 2614889 2738092 2687518 2396629 2683701 2689004 3088951 2896107 2702610
6575B702610m22535L76385J69271k74085J87930Q7292J38525m17870m6595J52238
$$ 2702610 2280075 2656460 2825731 2551646 2739576 2826868 2965393 2547523 2500928 2653166
6565B653166k72766p9950J17641O48296j80304J10597M9450k74361J69344k64368
$$ 2653166 2380400 2300450 2418091 3066387 2886083 2996680 3046130 2771769 2941113 2676745
6555B676745n23562q6804K0169q1947O27173J55477K99277m01196N99351p45762
$$ 2676745 2153183 2066379 2086548 2004601 2631774 2787251 3086528 2685332 3284683 2538921
6545B538921J74589k61448J98180P45617n59511j87754j0814l72877p4111q3870
$$ 2538921 2713510 2452062 2650242 3395859 2836348 2648594 2637780 2264903 2190792 2106922
6535B106922n3517Q83289L2289p05422L20785k6131k45026N62327K6836N09048
$$ 2106922 2053405 2936694 2968983 2263561 2584346 2558215 2313189 2875516 2902352 3411400
6525C411400P4320j66235m52600l97607M39165J95213r3319M94636J6690J31430
$$ 3411400 3485720 3319485 2866885 2469278 2908443 3103656 3010337 3504973 3521663 3653093
6515C653093j60579J04030j7761j35438l42456P33738L64647J38996l16234o0832
$$ 3653093 3492514 3596544 3578783 3443345 3100889 3834627 4199274 4338270 4022036 3961204
6505C961204n14305l13281M96261j60678p2352O05057j31794o91835M48958p6992
$$ 3961204 3446899 3133618 3629879 3469201 3396849 4001906 3870112 3178277 3627235 3550243
6495C550243k91158j75361J30517J92551Q0346P84564k7701m06892K05732J83671
$$ 3550243 3259085 3083724 3214241 3406792 3487138 4271702 4244001 3837109 4042841 4226512
6485D226512J6457Q7023l62516K80076m99739j14540K37532n0686M72231l23900
$$ 4226512 4242969 4329992 3967476 4247552 3747813 3633273 3870805 3820119 4292350 3968450
6475C968450K55258l80849m72359P20913L02375m63918j19112l5501N56454m53840
$$ 3968450 4223708 3842859 3370500 4091413 4393788 3929870 3810758 3775257 4331711 3877871
6465C877871M15429o2895J65244m03O81982n35085k77744k03567N0169o7456K69863
$$ 3877871 4293300 4230405 4395649 4395246 5077228 4542143 4264399 4060832 4111001 4043545 4313408
6454D313408L08685k04569N58700p37719l08420J18504P52106j22167L06302J01467
$$ 4313408 4622093 4417524 4976224 4238505 3930085 4048589 4800695 4678528 4984830 5086297
6444E086297J09318Q3585l54815L92582L21949m93478m42257K35651J81423N1058
$$ 5086297 5195615 5279200 4924385 5316967 5638916 5145438 4703181 4938832 5120255 5171313
6434E171313O15403J71207n78032o76569K15342l33861j67924L07479N96647l29192
$$ 5171313 5786716 5957923 5379891 4703322 4918664 4584803 4416879 4724358 5321005 4991813
6424D991813J83540K18600n18280L53099J2189L89005l15270K35371O46117j69808
$$ 4991813 5175353 5393953 4875673 5228772 5240961 5629966 5314696 5550067 6196184 6026376
6414F026376J81206K95453o6944m62242k99001j79959K16023J58148l12135n43887
$$ 6026376 6207582 6503035 6436091 5973849 5674848 5494889 5710912 5869060 5556925 5013038
6404E013038P08000l8776J57129M4125l82476Q85405J16186j25592l26734n87107
$$ 5013038 5721038 5682262 5839391 5883516 5501040 6386445 6502631 6377039 6050305 5463198
6394E463198J29331M6089K99076Q6061M16245p4598q8177N34092k25203l11921
$$ 5463198 5592529 5638618 5937694 6023755 6440000 6365402 6277225 6811317 6586114 6274193
6384F274193J84605J50944L0882J35969J62404k49975O70446M85250L1268J04466
$$ 6274193 6458798 6609742 6640624 6776593 6938997 6689022 7359468 7844718 7875986 7980452
6374G980452o64401J87914R5083J8383j24524J04054k4145l73497K7311L81457
$$ 7980452 7316051 7503965 7599048 7617431 7492907 7596961 7572816 7199319 7226630 7608087
6364G608087M16624P07432J52608M509M5613j31558J70226L11656J34824M38561
$$ 7608087 8024711 8732143 8884751 8889260 8934873 8803315 8973541 9285197 9420021 9858582
6354I858582m6016J18042M20416L22583Q57082l32560l09321O26311K7744L9736
$$ 9858582 9812566 9930608 10351024 10673607 11530689 11198129 10888808 11515119 11542863 11582599
6344A1582599l15927m9969j53462J77770L75339j07695K55529P02829J18630L75586
$$ 11582599 11266672 11216703 11063241 11241011 11616350 11508655 11764184 12467013 12585643 12961229
6334A2961229L15619J43685j29918J33392N24073M10138L37528J80477N54911
$$ 12961229 13276848 13420533 13290615 13424007 13948080 14358218 14695746 14876223 15431134
6325A5431134J38474M29082n260J11621k96830M83858N44305k31703J77962L75122
$$ 15431134 15569608 15998690 15993430 16105051 15808221 16292079 16836384 16604681 16782643 17157765
6315A7157765K38684j81236N74253O01226J230447J098343Q94471Q40403N84056
$$ 17157765 17396449 17215213 17789466 18390692 19621139 20719482 21613953 22454356 23038412
6306B3038412m9134n59714m9351n44671j12377l8389m51346J93800n8917N03184
$$ 23038412 22989278 22429564 22380213 21835542 21723165 21684776 21233430 21427230 21368313 21871497
6296B1871497N19125Q97135P38905L23786R72387K05390M74371O3571J02178K76845
$$ 21871497 22390622 23287757 24026662 24350448 25322835 25528225 26002596 26066167 26168345 26445190
6286B6445190o16348n81443q5500j105094m8832J85536l5427m00661j50064j69743
$$ 26445190 25828842 25247399 25161899 24056805 24007973 24193509 24158082 23757421 23607357 23437614
6276B3437614j88954K92717o1994r2733l02502J35269P62467N76798O19903Q45885
$$ 23437614 23248660 23541377 23479383 23386650 23084148 23219417 23981884 24558682 25178585 26024470
6266B6024470q9882j16944m91128l50531r04920q12793p17673l55291J38985r9814
$$ 26024470 25934588 25817644 25326516 24975985 24071065 23258272 22540599 22185308 22324293 22224479
6256B2224479k49021p5188q753J61542J50888j77073L81122P39824N23691j98657
$$ 22224479 21975458 21900270 21891517 22053059 22203947 22026874 22407996 23147820 23671511 23472854
6246B3472854K36059M59801K10590L60907O22317L40462J38061K47234M89195
$$ 23472854 23708913 24168714 24379304 24740211 25362528 25702990 25841051 26088285 26577480
6237B6577480L59633p828L53313L40723J240055N71504j03224K55709J001318
$$ 26577480 26937113 26929285 27282598 27623321 28863376 29434880 29331656 29587365 30588683
6228C0588683N95835N49673O84094J141187Q99015M44374J284537J772933R87574
$$ 30588683 31184518 31734191 32418285 33559472 34458487 34902861 36187398 37960331 38947905
6219C8947905J034321J474743J286618J593474K295097K111418J695901K802330
$$ 38947905 39982226 41456969 42743587 44337061 46632158 48743576 50439477 53241807
6211E3241807K653088L243986L302515M543660M513780N115714O217433M885325
$$ 53241807 55894895 59138881 62441396 66985056 71498836 76614550 82831983 87717308
6203H7717308L029607O48399j213762l173012l080036l248060k625625k444568
$$ 87717308 90746915 91395314 90181552 87008540 83928504 80680444 78054819 75610251
6195G5610251j846512o58777j06215O36201K041281K285145K911290L018770M150360
$$ 75610251 73763739 73104962 72998747 73634948 75676229 77961374 80872664 83891434 88041794
6186H8041794M468344M276365M825586O024788P538618P813858Q532251R641323
$$ 88041794 92510138 96786503 101612089 107636877 115175495 122989353 131521604 141162927
6178A41162927R748884O942608L152449k749250p412185j0280391j0548436j0280170
$$ 141162927 150911811 157854419 161006868 158257618 150845433 140565042 130016606 119736436
6170A19736436p789554o291663m851652l384336k373598j530674n42260P3362
$$ 119736436 111946882 105655219 100803567 97419231 95045633 93514959 92972699 93046061
6162I3046061M24017J208802J491734P53463J562656J499964J009190J512797
$$ 93046061 93470078 94678880 96170614 96924077 98486733 99986697 100995887 102508684
6154A02508684K899789L658804M671636L876486K191147p66821l521872n593191
$$ 102508684 105408473 109067277 113738913 117615399 119806546 119039725 115517853 109924662
6146A09924662o647938n809404n249135m181060l535363l177929k956767k476179
$$ 109924662 103276724 97467320 92218185 88037125 84501762 81323833 78367066 75890887
6138G5890887l067381k633879j842785j470077q64042n60443r22603j327610j264352
$$ 75890887 72823506 70189627 68346842 66876765 66012723 65452280 64529677 63202067 61937715
6129F1937715o84417j030404j000059L1003j37865p19046J71277M4680l842J1376
$$ 61937715 61253298 60222894 59222835 59253838 59115973 58396927 58568204 58612884 58609042 58620418
6119E8620418p1344M84745k49791m0106L22672n76135j332966n77830o74054O6490
$$ 58620418 58549074 59033819 58784028 58743922 59066594 58490459 57157493 56579663 55905609 55972099
6109E5972099J98716o88447m64048L79574P64681K2715J069316R43970O8686R86119
$$ 55972099 56170815 55482368 55018320 55397894 56162575 56185290 57254606 58198576 58267262 59253381
6099E9253381R95262J269121J473274J274071J498710J699279K191548K772296
$$ 59253381 60248643 61517764 62991038 64265109 65763819 67463098 69654646 72426942
6091G2426942L236119K704457K734614L306363M188993M475189M069084M099507
$$ 72426942 75663061 78367518 81102132 84408495 88597488 93072677 97141761 101241268
6083A01241268L957550K849362K189656M16053m27847j857002k964935l458726
$$ 101241268 105198818 108048180 110237836 110653889 110226042 108369040 105404105 101945379
6075A01945379l269219k063116j340173l66619J52054P0404J859123K068020L167723
$$ 101945379 98676160 96613044 95272871 94906252 95058306 95128710 96987833 99055853 102223576
6066A02223576L921326M348412M944544O095952P036380Q403971Q758287R288855
$$ 102223576 106144902 110493314 115437858 121533810 128570190 136974161 145732448 155021303
6058A55021303J0062449J0656046R371308Q384658O007239K745898j42303n054221
$$ 155021303 165083752 175739798 185111106 193495764 199503003 202248901 202106598 197052377
6050A97052377q900300j0716978j1562766j0550708j0252819q717217p188027
$$ 197052377 188152077 177435099 165872333 155321625 145068806 136351589 129163562
6043A29163562n838782m788235l361279j714259l05442J138761J602288K377074
$$ 129163562 123324780 118536545 115175266 113461007 113155565 114294326 115896614 118273688
6035A18273688L613923M351107N465146O228913O668044P576151P553064P852464
$$ 118273688 121887611 126238718 131703864 137932777 144600821 152176972 159730036 167582500
6027A67582500O764145N409074L665532J553371j630277n176921r102907j2021188
$$ 167582500 174346645 179755719 183421251 184974622 183344345 178167424 169064517 157043329
6019A57043329j4308876j3844001j2142211j0128071q471270o514588n505943
$$ 157043329 142734453 128890452 116748241 106620170 98148900 91634312 86128369
6012H6128369m782804l516807k379264k064981j092719p96504r3041n03791l52348
$$ 86128369 81345565 77828758 75449494 73384513 72291794 71495290 71402249 70898458 70546110
6003G0546110P95305J772034J652203J880758K762535K911464J875937J022727
$$ 70546110 71341415 73113449 74765652 76646410 79408945 82320409 84196346 85219073
5995H5219073j098681l113492m990584n561425n287395n067278m464209l830185
$$ 85219073 84120392 81006900 76016316 70454891 65167496 60100218 55636009 51805824
5987E1805824l114725k873422k845949j595123j606148j694642j196184j242089
$$ 51805824 48691099 45817677 42971728 41376605 39770457 38075815 36879631 35637542
5979C5637542j278094p41958j212837j779854q22848o46726m67583r36846r78794
$$ 35637542 34359448 33617490 32404653 30624799 29801951 29155225 28687642 27750796 26772002
5970B6772002o31103l59451J82977p3769r4177q15018p46030l16690M3341j9759
$$ 26772002 26140899 25781448 25964425 25890656 25796479 24981461 24235431 23918741 23962082 23942323
5960B3942323n19620m820m26888n76357n26760j18228N4347k63204j95461n83964
$$ 23942323 23422703 23417883 22990995 22414638 21887878 21769650 21823997 21560793 21365332 20781368
5950B0781368m73600O5544o2046n3025r7249k35483J38714J79854l53578j02785
$$ 20781368 20307768 20373312 20311266 20258241 20160992 19925509 20064223 20244077 19890499 19787714
5940A9787714l9679m54648J25799k53235j2857L44599j28203k72002m16845N32835
$$ 19787714 19748035 19293387 19419186 19165951 19153094 19497693 19369490 19097488 18680643 19213478
5930A9213478J20331k62985j18074O53165k57058R2617j49342n62471L82059M36671
$$ 19213478 19333809 19070824 18952750 19605915 19348857 19441474 19292132 18729661 19111720 19548391
5920A9548391M37825j64771J52402L17328N70732K65632K83480P46422Q16549
$$ 19548391 19986216 19821445 19973847 20291175 20861907 21127539 21411019 22157441 22973990
5911B2973990Q55628N23115P72652Q55868n9149k34430l87544l92453j81945j20226
$$ 22973990 23829618 24352733 25125385 25981253 25922104 25687674 25300130 24907677 24725732 24605506
5901B4605506n79554n11100J09106K403M3978J32461m35033k16260Q19101K81871
$$ 24605506 24025952 23514852 23623958 23626361 23670339 23802800 23367767 23151507 23970608 24252479
5891B4252479J50598P72484J024914O10524L02039J098541J323994L57205M46365
$$ 24252479 24403077 25175561 26200475 26810999 27113038 28211579 29535573 29892778 30339143
5882C0339143Q8196L80232o82522p02836l81068j004377r56673o63128j46402
$$ 30339143 30427339 30807571 30125049 29422213 29041145 28036768 27080095 26416967 26270565
5873B6270565n17312j125J87941l35709o8088r0683n00438K89740K74437m3165
$$ 26270565 25753253 25752128 25940069 25604360 25536272 25445589 24945151 25234891 25509328 25466163
5863B5466163N080M77570l6k61508N91369K46432P717L61970K70700m35911l65626
$$ 25466163 25471243 25948813 25948777 25687269 26278638 26525070 26532787 26894757 27165457 26729546 26363920
5852B6363920l76773m2458K36292n78579n92654J096779j89547j99500L48294
$$ 26363920 25987147 25944689 26180981 25602402 25009748 26106527 25916980 25717480 26065774
5843B6065774m0386O2450K32239k32967Q47456M5070J64924M65397j90523j45401
$$ 26065774 26025388 26087838 26320077 26087110 26934566 26979636 27144560 27609957 27419434 27274033
5833B7274033J57616j14729O12336P82430K83993j09198M45907O08278J47311
$$ 27274033 27431649 27316920 27929256 28711686 28995679 28886481 29332388 29940666 30087977
5824C0087977O19437J93893J401793P37217M20669J224910J323081J055984J67462
$$ 30087977 30707414 30901307 32303100 33040317 33460986 34685896 36008977 37064961 37232423
5815C7232423k8975j94241m0468m33310j63177L09837N7389l51981J7402R2934
$$ 37232423 37203448 37009207 36968739 36535429 36372252 36682089 36739478 36387497 36404899 36497833
5805C6497833K95973M62149R27255J95212N66635J103614M70105J366033O38441
$$ 36497833 36793806 37255955 38183210 38378422 38945057 40048671 40518776 41884809 42523250
5796D2523250J286831J195778J172425J341022K334397J868966J166706N13226
$$ 42523250 43810081 45005859 46178284 47519306 49853703 51722669 52889375 53402601
5788E3402601r2757n96403o88772n44236n25206K1588K32161L73916J134992Q05748
$$ 53402601 53309844 52713441 52024669 51480433 50955227 50976815 51208976 51582892 52717884 53523632
5778E3523632R46837N40602J474729J039356M49291J355997K273924J426246K041809
$$ 53523632 54470469 55011071 56485800 57525156 57974447 59330444 61604368 63030614 65072423
5769F5072423J627256K592325K810603L328787L988032M717429M995154N740931
$$ 65072423 66699679 69292004 72102607 75431394 79419426 84136855 89132009 94872940
5761I4872940O437616N893962M267845J706049j444753m513889m872545m847001
$$ 94872940 101310556 107204518 111472363 113178412 111733659 107219770 102347225 97500224
5753I7500224l436015k006621j580848j775789j986009j163145j27630k58185
$$ 97500224 94064209 92057588 90476740 88700951 86714942 85551797 85424167 85165982
5745H5165982M50387J334889K007187K743438K952792L497798M969121N801835
$$ 85165982 85616369 86951258 88958445 91701883 94654675 98152473 103121594 108923429
5737A08923429P456238R091505J0141559J1537067J0879562O539840p67364q158977
$$ 108923429 116379667 125471172 135612731 147149798 158029360 164569200 163801836 155642859
5729A55642859j0749470j0830360j0100924r122299p311334n509774m746904l677986
$$ 155642859 144893389 134063029 123962105 114839806 107528472 102018698 97271794 93593808
5721I3593808l000513k144500j423481n83324j35441L38364Q05546J062659J213822
$$ 93593808 90593295 88448795 87025314 86441990 86306549 86644913 87450459 88513118 89726940
5712H9726940J932084K123233K815865L230605L921978L978913K342647L5324
$$ 89726940 91659024 93782257 96598122 99828727 103750705 107729618 110072265 110107589
5704A10107589k764158m890077n719098n020805n021982m066848l700592k659438
$$ 110107589 107343431 102453354 96734256 91713451 86691469 82624621 78924029 76264591
5696G6264591k816213j856890j074890m20478J73433n87059q76846L69993o60233
$$ 76264591 73448378 71591488 70516598 70096120 70269553 69682494 68805648 69175641 68515408
5687F8515408p94181j038496j002403l75711m52300j272218q35802o48588p11553
$$ 68515408 67721227 66682731 65680328 65304617 64852317 63580099 62744297 62095709 61384156
5678F1384156l82190L32045j63356n49871k66382L63519L07102M62298L03854
$$ 61384156 61001966 61334011 61170655 60620784 60354402 60717921 61025023 61487321 61791175
5669F1791175K19017O52917J88823R29764J93730K27920J62563M77881N09842
$$ 61791175 62010192 62663109 62851932 63781696 63975426 64203346 64365909 64843790 65353632
5660F5353632J114670L36960K64589J088502J659586J449493R17136J722076J645315
$$ 65353632 66468302 66805262 67069851 68158353 69817939 71267432 72184568 73906644 75551959
5651G5551959Q14652K306873K251927J898604K443829K765729L056534K749628
$$ 75551959 76366611 78673484 80925411 82824015 85267844 88033573 91090107 93839735
5643I3839735L926337M026617M079818L288072K268082J473984J470680n08047
$$ 93839735 97766072 101792689 105872507 109160579 111428661 112902645 114373325 113865278
5635A13865278o19693n4722L82081J585773J898806K431516K238711L254538L494000
$$ 113865278 113245585 113190863 113572944 115158717 117057523 119489039 121727750 124982288 128476288
5626A28476288M330572N108165N962888P145810O622243O128571M117109K124758
$$ 128476288 132806860 137915025 143877913 151023723 157645966 163774537 167891646 170016404
5618A70016404J421874J643255J144212J501850K886902L555509L651026L535059
$$ 170016404 171438278 173081533 174225745 175727595 178614497 182170006 185821032 189356091
5610A89356091M013069L636362M020917M400360L638938J667455P20903l06672
$$ 189356091 193369160 197005522 201026439 205426799 209065737 210733192 211454095 211147423
5602B11147423j301697j015928o71406r80667k844828m899811n653820n777253
$$ 211147423 209845726 208829798 208158392 207177725 204332897 199433086 193779266 188002013
5594A88002013m036956k332669m35943J078815J337966K443531N016166O131672
$$ 188002013 183965057 181632388 181196445 182275260 183613226 186056757 191072923 197204595
5586A97204595Q107500J0893971J2956068J3768666J3057283J1491845P630910
$$ 197204595 205312095 216206066 229162134 242930800 255988083 267479928 275110838
5579B75110838J317492o707677j3412776j6302586j7089210j5812180j3577293
$$ 275110838 276428330 269720653 256307877 240005291 222916081 207103901 193526608
5572A93526608j0910723q911386o903204o096697l908580k809229k013190n94140
$$ 193526608 182615885 173704499 166801295 160704598 156796018 153986789 151973599 151379459
5564A51379459k24139J937202K917812M939439O053707P388224Q696966J0298086
$$ 151379459 151155320 153092522 156010334 160949773 167003480 174391704 183088670 193386756
5556A93386756J1319472J1339505P530796l8433n589690j1016564j4793324j5707904
$$ 193386756 204706228 216045733 223576529 223538096 217948406 206931842 192138518 176430614
5548A76430614j4591864j3071043j1121220r579769p103959o339395n114965l893387
$$ 176430614 161838750 148767707 137646487 128066718 120962759 114623364 109508399 105615012
5540A05615012l200924k616125k597314j421529j145980r01454l59531M76658
$$ 105615012 102414088 99797963 97200649 95779120 94633140 93731686 93372155 93848813
5532I3848813J422591J404083J448649K046616J955431N69107j298336l069051
$$ 93848813 95271404 96675487 98124136 100170752 102126183 102695290 101396954 98327903
5524I8327903m213525n109578m483424l371088l585778l030234k945079k612497
$$ 98327903 94114378 89004800 84521376 81150288 77564510 74534276 71589197 68976700
5516F8976700k154482j756729j801726l15266l83542r96468p06337j58202k9915
$$ 68976700 66822218 65065489 63263763 62948497 62564955 61568487 60862150 60703948 60674033
5507F0674033J57495J76105K97394N66188J357497J019541J263913K592057K424653
$$ 60674033 60831528 61007633 61305027 61871215 63228712 64248253 65512166 68104223 70528876
5498G0528876K612703K577042M049644N109436N307890P249493Q300895R064568
$$ 70528876 73141579 75718621 79768265 84877701 90185591 97435084 105735979 114800547
5490A14800547O888773J432143n145105p287008o799185n555208m415941l523526
$$ 114800547 121689320 123121463 117976358 110689350 103890165 98334957 93919016 90395490
5482I0395490k463115j621115q44429J209379J715389L075474M197771K418606
$$ 90395490 87932375 86311260 85466831 86676210 88391599 91467073 95664844 98083450
5474I8083450J080231L17274K135322K756894L533607K864973J020228p08411
$$ 98083450 99163681 99480955 101616277 104373171 107906778 110771751 111791979 111083568
5466A11083568n304494q520871q079651o880354n419261m466686k094744j335227
$$ 111083568 105779074 97258203 89178552 82298198 76878937 72412251 70317507 68982280
5458F8982280j457760r36088n92566o66415J157252J741756J962041J355666J003450
$$ 68982280 67524520 66588432 65995866 65329451 66486703 68228459 70190500 71546166 72549616
5449G2549616r95691k854021m375292n250386n328671m541976l728896l070993
$$ 72549616 71553925 68699904 64324612 59074226 53745555 49203579 45474683 42403690
5441D2403690k352087j766755k039807o42772r90063j264851r38998o67133l93539
$$ 42403690 40051603 38284848 36245041 35602269 34612206 33347355 32408357 31741224 31347685
5432C1347685j769440q23336m67477l63068n96919o71246l09464n94118m04241
$$ 31347685 29578245 28754909 28287432 27924364 27327445 26656199 26346735 25752617 25348376
5423B5348376l46925J08898r36348p46223M61416j217032j59987m9244l5428l97292
$$ 25348376 25001451 25110349 24174001 23427778 23889194 22672162 22512175 22462931 22427503 22030211
5413B2030211n53646j64589K83634K97836n85274k01465M19078l29092n82052
$$ 22030211 21476565 21311976 21595610 21893446 21308172 21106707 21525785 21196693 20614641
5404B0614641q06827p242j81973l72582q96714J61837m53448K35776k27180L17758
$$ 20614641 19807814 19800572 19618599 19246017 18349303 18511140 18057692 18293468 18066288 18384046
5394A8384046m51786j37389O18197p22900k00254j27739j27876q8651J97477l00347
$$ 18384046 17932260 17794871 18413068 17690168 17489914 17362175 17234299 17145648 17343125 17042778
5384A7042778l566J33656l54555m72694M87285l56538Q383N64227l26680l34303
$$ 17042778 17039212 17172868 16818313 16345619 16832904 16476366 16484749 17048976 16722296 16387993
5374A6387993n34785j50254k27418L50740Q33023k54104m99057k46317O4472n08858
$$ 16387993 15853208 15702954 15475536 15826276 16659299 16405195 15906138 15659821 15724293 15215435
5364A5215435k12680m79507n9084n51295n24669J22117j69174O8716p3009M099
$$ 15215435 15002755 14523248 14464164 13912869 13388200 13510317 13341143 13409859 13336850 13340949
5354A3340949O21186j56704j1207l49565J71397k39335k59795Q49483M30954J13231
$$ 13340949 13962135 13805431 13794224 13444659 13616056 13376721 13116926 13966409 14397363 14510594
5344A4510594L06810J89048J20773M08012M84653M5342L06100J21311o2921J74086
$$ 14510594 14817404 15006452 15127225 15535237 16019890 16065232 16371332 16492643 16429722 16603808
5334A6603808j00044J66164p39482r8174n86527m6450o1659o97963n96221l5191
$$ 16603808 16503764 16669928 15930446 15832272 15245745 15199295 15137636 14439673 13843452 13808261
5324A3808261O38111j92733p35851j35349l57946J60536J23213M17079N3355q691
$$ 13808261 14446372 14253639 13517788 13382439 13024493 13185029 13308242 13725321 13778676 13769985
5314A3769985K11951N70628K38001J80265m3922J5596P67132o1178j70924M44881
$$ 13769985 13981936 14552564 14790565 14970830 14926908 14942504 15709636 15648458 15477534 15922415
5304A5922415j25383n44028N8921o05529o39592l23192J01849k78389O1921Q4311
$$ 15922415 15797032 15253004 15311925 14706396 14066804 13743612 13845461 13567072 13628993 13713304
5294A3713304n10071l71950m91953o423k49077K9520k86974J16887r4086j4457
$$ 13713304 13203233 12831283 12339330 12332907 12083830 12113350 11826376 11943263 11849177 11834720
5284A1834720M6505R1933M26775n07425L65592J82213M99150l27586L40118k14613
$$ 11834720 11881225 11973158 12399933 11892508 12258100 12440313 12939463 12611877 12951995 12737382
5274A2737382P01861L53829n8054M280J76982R1424p37865n23544l89690l70936
$$ 12737382 13439243 13793072 13735018 13739298 13916280 14007704 13269839 12746295 12356605 11985669
5264A1985669M25999N6082K58209K59575m72372n260M32748r3743N43136m89590
$$ 11985669 12411668 12467750 12725959 12985534 12513162 12507902 12940650 12846907 13390043 12900453
5254A2900453L6094l62963m65622N92125j86076p51377L00331N5332K94041N2561
$$ 12900453 12936547 12573584 12107962 12700087 12514011 11762634 12062965 12118297 12412338 12464899
5244A2464899n02284J78563q7025K62459j16322L29486P96428k48538j27061N57529
$$ 12464899 11962615 12141178 12054153 12316612 12200290 12529776 13326204 13077666 12950605 13508134
5234A3508134l78523N08037L48078K04930J08990l16340L71791Q54106P05207
$$ 13508134 13129611 13637648 13985726 14190656 14299646 13983306 14355097 15209203 15914410
5225A5914410N12596n11781M44523P64024N0130J36288M51897M15711L23031L71686
$$ 15914410 16427006 15915225 16359748 17123772 17173902 17310190 17762087 18177798 18500829 18872515
5215A8872515O70072O74059O17682N86472M39943O38384L82384J41292N15767
$$ 18872515 19542587 20216646 20834328 21420800 21860743 22499127 22881511 23022803 23538570
5206B3538570K24271N9301J56142j23239L24875L55467k12959J15784k68819l33869
$$ 23538570 23762841 23822142 23978284 23855045 24179920 24535387 24322428 24438212 24169393 23835524
5196B3835524m58835n03437l99768k4732J94515n0656l50617J93719M62797j16767
$$ 23835524 23376689 22873252 22473484 22448752 22643267 22592611 22241994 22435713 22898510 22781743
5186B2781743L95590R03328L99093O96422J371263J567162K82376O19589O31239
$$ 22781743 23177333 24080661 24479754 25176176 26547439 28114601 28396977 29016566 29647805
5177B9647805J643582J558694O98384L12881j41952q14038n0345q33627J21955
$$ 29647805 31291387 32850081 33548465 33861346 33719394 32905356 32855011 32021384 32143339
5168C2143339K83745L4383q9383p8113J44192l97678p45582o55352n76296j176510
$$ 32143339 32427084 32461467 32372084 32293971 32438163 32040485 31294903 30639551 30063255 28886745
5158B8886745j392351j058179j071562m99268l89615k06079J44045o00075l3592
$$ 28886745 27494394 26436215 25364653 24865385 24475770 24269691 24413736 23813661 23780069
5149B3780069J22683o0261l80654J052371M19115M60876J000496J2201J55493
$$ 23780069 23902752 23842491 23461837 24514208 24933323 25394199 26394695 26406896 26562389
5140B6562389k74791o43461o86766J02103N2545o93863j07909N05482J56371O74179
$$ 26562389 26287598 25644137 24957371 25059474 25112019 24418156 24310247 24815729 24972100 25646279
5130B5646279M25828p0685L00069o86889q91908l96192o17072r66413o08595n38117
$$ 25646279 26072107 26001422 26301491 25614602 24722694 24326502 23709430 22743017 22134422 21596305
5120B1596305l98996n51416p33099j35881l11008j92512n97316K27299K63658
$$ 21596305 21197309 20645893 19912794 19776913 19465905 19273393 18676077 18903376 19167034
5111A9167034n38008J40805n20882Q0003K50847J98616k90797M03060k99261J51047
$$ 19167034 18629026 18769831 18248949 18328952 18579799 18778415 18487618 18890678 18591417 18742464
5101A8742464k14497M26078O7204K25802J88160K12302N36156N02046K63088O91394
$$ 18742464 18527967 18954045 19021249 19247051 19435211 19647513 20183669 20685715 20948803 21640197
5091B1640197j05889k00335O29340J20645k74669J25972N62324k9623O08184k62557
$$ 21640197 21534308 21333973 21963313 22083958 21809289 21935261 22497585 22467962 23076146 22813589
5081B2813589k65550L60866J83219N64044K68221R3949p01055M59503P44990N58897
$$ 22813589 22548039 22908905 23092124 23656168 23924389 24018338 23317283 23776786 24521776 25080673
5071B5080673O83989L19317l21361J00256P86879N57133P53440L22304J051015
$$ 25080673 25764662 26083979 25762618 25862874 26649753 27206886 27960326 28282630 29333645
5062B9333645L58942N56178N81633N28884M82604N62832M70457L20743K36213
$$ 29333645 29692587 30248765 30830398 31359282 31841886 32404718 32875175 33195918 33432131
5053C3432131M19018O86162L82459P88463P75929j43394P44080R64888Q77905
$$ 33432131 33851149 34537311 34919770 35708233 36484162 36340768 37084848 38049736 38927641
5044C8927641R69170J048678J425119J145880J149520J365001J879235J491734
$$ 38927641 39896811 40945489 42370608 43516488 44666008 46031009 47910244 49401978
5036D9401978K401224J787603K760403K908287L466695L875091M376354N636232
$$ 49401978 51803202 53590805 56351208 59259495 62726190 66601281 70977635 76613867
5028G6613867O213761P244442Q349913Q844556J0810559J2993900J5674507J8780222
$$ 76613867 82827628 90072070 98421983 107266539 118077098 131070998 146745505 165525727
5020A65525727K3047819K3144556K0743080J5581191j081604j4443604k4852996
$$ 165525727 188573546 211718102 232461182 248042373 246960769 232517165 207664169
5013B07664169k9956049k8102220k2679348j6354122j2298414r205635p408988
$$ 207664169 177708120 149605900 126926552 110572430 98274016 89068381 81659393
5006H1659393n611484m403199m144889l144720k840694k634036j885198j509675
$$ 81659393 76047909 71644710 67499821 64355101 61514407 58880371 56995173 55485498
4998E5485498p24011q84246j078148o27482l66541p82239k51258J17865L9902
$$ 55485498 54761487 53877241 52799093 52171611 51805070 51022831 50771573 50889438 50929340
4989E0929340P1297j04069O41463K07238O39593R69561P54625N94543J237294
$$ 50929340 51000637 50896568 51538031 51745269 52384862 53354423 54109048 54703591 55940885
4980E5940885J065372J064994Q95323J716448K092254K260161L066865L634906
$$ 55940885 57006257 58071251 58966574 60683022 62775276 65035437 68102302 71737208
4972G1737208M061586N042238O006454O648703P116459R229797J1231169J2906368
$$ 71737208 75798794 80841032 86847486 93496189 100612648 109842445 121073614 133979982
4964A33979982J5252857J9614946K5014348K3524748J3428268L670505o513377
$$ 133979982 149232839 168847785 193862133 217386881 230815149 234485654 227972277
4957B27972277j7371068k7245662k8813056k3345090j7704149j3763812j0052738
$$ 227972277 210601209 183355547 154542491 131197401 113493252 99729440 89676702
4950H9676702p889835o144763n063262m677644l773638k633022k012531k240250
$$ 89676702 81786867 75642104 70578842 65901198 62127560 59494538 57482007 55241757
4942E5241757j507248j296398j632023j367138p95134p11680o65452k80090o23199
$$ 55241757 53734509 52438111 50806088 49438950 48643816 47932136 47266684 46986594 46363395
4933D6363395k61815K80268p3675j217m13251K71764P5369o0941l35748M31077
$$ 46363395 46101580 46381848 46308173 46306956 45893705 46165469 46240838 46179897 45844149 46275226
4923D6275226j11569O78828N77889J85313J96506K67260N48814P56807R85655
$$ 46275226 46163657 46842485 47420374 47605687 47802193 48069453 48618267 49375074 50360729
4914E0360729N53229J640747J876110K104989J737893J286349P90234n42115j02238
$$ 50360729 50913958 52554705 54430815 56535804 58273697 59560046 60350280 59808165 59705927
4905E9705927k75054r49430p906J253654M25153K35372N48635R74661R19601M80461
$$ 59705927 59430873 58481443 58473537 59727191 60152344 60387716 60936351 61911012 62830613 63311074
4895F3311074Q24330R56668R30829M57540L25632M47523J40412K68659Q21406
$$ 63311074 64135404 65092072 66022901 66480441 66806073 67253596 67394008 67662667 68484073
4886F8484073J022434J039444J053028J374608J330042J891354K020795J652640
$$ 68484073 69506507 70545951 71598979 72973587 74303629 76194983 78215778 79868418
4878G9868418K400111K531762K480933K487856L276332L677734M020964L807998
$$ 79868418 82268529 84800291 87281224 89769080 93045412 96723146 100744110 104552108
4870A04552108N055894M934613N763003O903695O423975P219138Q432170J0338348
$$ 104552108 109608002 114542615 120305618 127209313 133633288 140852426 149284596 159622944
4862A59622944R646555P844952N589005Q43607j436083r05870M54781P56947J297305
$$ 159622944 169269499 177114451 182703456 183547063 182110980 181205110 181659891 182416838 183714143
4853A83714143J341970J447755K048012K269706L163613L841848L000228L616267
$$ 183714143 185056113 186503868 188551880 190821586 193985199 197827047 200827275 204443542
4845B04443542M279147M764447M913154N851912N869670N641687O092026N890483
$$ 204443542 208722689 213487136 218400290 224252202 230121872 235763559 241855585 247746068
4837B47746068N411686O605559P153631O964561P030746P195315P029301O369602
$$ 247746068 253157754 259763313 266916944 273881505 280912251 288107566 295136867 301506469
4829C01506469N889707L716537K075772K21172j332185k885774l448540l283401
$$ 301506469 307396176 311112713 313188485 313409657 312077472 309191698 305743158 302459757
4821C02459757l783096k852005k046175k031018m46447k41058J083630J740444
$$ 302459757 298676661 295824656 293778481 291747463 291301016 291059958 292143588 293884032
4813B93884032K474191K917712K002172J891218J913128J580659K374329K155891
$$ 293884032 296358223 299275935 301278107 303169325 305082453 306663112 309037441 311193332
4805C11193332J863111J837256O58815p22169j937673k640784m345034m274208
$$ 311193332 313056443 314893699 315552514 314830345 312892672 310251888 305906854 301632646
4797C01632646n045182n772791n574957o306021o918593o201325n664094m958983
$$ 301632646 296587464 290814673 285239716 278933695 272015102 265813777 260149683 255190700
4789B55190700l547705l058665j906721j968437j611886r32843j113362j325110
$$ 255190700 251642995 248584330 246677609 244709172 243097286 242164443 241051081 239725971
4781B39725971j025353l33902o54825r74750o23027j725113k426233k344879k241983
$$ 239725971 238700618 238366716 237711891 236737141 236114114 234389001 231962768 229617889 227375906
4772B27375906k776573l430525k366643j891007j909217p25410j415514j903893
$$ 227375906 224599333 221168808 218802165 216911158 215001941 214276531 212861017 210957124
4764B10957124j687818n48633j24521M94870J331458J599164K134304K627561
$$ 210957124 209269306 208720673 208596152 209091022 210422480 212021644 214155948 216783509
4756B16783509K939238K743495K657211K998247L082557L255904K398182K077519
$$ 216783509 219722747 222466242 225123453 228121700 231204257 234460161 236858343 238935862
4748B38935862N07577o93801N506q9785l77588L86316Q30280O22343P48978P30690
$$ 238935862 239443439 238749638 238755144 238665359 238287771 238674087 239504367 240126710 240875688 241606378
4738B41606378O81797K219030J870455J889585K396691J829975J332319O96841
$$ 241606378 242288175 244507205 246377660 248267245 250663936 252493911 253826230 254523071
4730B54523071M23500K44183p03749K16776m86994j135839j128772j982684j614651
$$ 254523071 254946571 255190754 254487005 254703781 254216787 253080948 251952176 249969492 248354841
4721B48354841k178964k324709j704746r00528k42197m87292m07286R45117J122374
$$ 248354841 246175877 243851168 242146422 241245894 241003697 240516405 240109119 241054236 242176610
4712B42176610J568120Q95633J210844O79807L64334m67061k030484l692138m837330
$$ 242176610 243744730 244640363 245851207 246531014 246895348 246428287 244397803 240705665 235868335
4703B35868335n288979o484816o917118p087034p607855p584360o436628p031953
$$ 235868335 230579356 224094540 217177422 210090388 202482533 194898173 188461545 181429592
4695A81429592o661439n669750n124985l711061l295941k804170k203991j687864
$$ 181429592 174768153 169098403 163973418 160262357 156966416 154162246 151958255 150270391
4687A50270391j386489j185554j618937j536306m36772j265056k552434k572228
$$ 150270391 148883902 147698348 146079411 144543105 144106333 142841277 140288843 137716615
4679A37716615l274387l793826l543677m471099m496774m380873m436327m013904
$$ 137716615 134442228 130648402 127104725 122633626 118136852 113755979 109319652 105305748
4671A05305748m191186m110146m513526l832215l730520l716913k911955k848777
$$ 105305748 101114562 97004416 92490890 88658675 84928155 81211242 78299287 75450510
4663G5450510k950028k496953k032297k031712j569951j450006k205558l41366
$$ 75450510 72500482 70003529 67971232 65939520 64369569 62919563 60714005 60372639
4655F0372639n94580j476755j037338o07730p68900m71998k09859n7634l83004
$$ 60372639 59778059 58301304 57263966 56656236 55887336 55415338 55205479 55147845 54764841
4646E4764841m55907k38959r10264r97566m82110p45188j272223r47385n67641
$$ 54764841 54308934 54069975 53159711 52162145 51680035 50934847 49662624 48715239 48147598
4637D8147598p67428l00132k66119p25790r44080p95037m68596m72936r81161
$$ 48147598 47380170 47080038 46813919 46088129 45144049 44349012 43880416 43407480 42426319
4628D2426319L86729o33864j237384p07091q04830q88048o48636O7553l61480
$$ 42426319 42813048 42179184 40941800 40234709 39429879 38541831 37893195 37960748 37599268
4619C7599268k02353l61151L17455n61417n51184k57303l18723o28833j96419
$$ 37599268 37396915 37035764 37353219 36791802 36240618 35983315 35664592 35035759 34839340
4610C4839340r0515o19828n35693q47722J15626J5196m31798j059184n08169J39695
$$ 34839340 34748825 34128997 33593304 32745582 32861208 32876404 32444606 31385422 30877253 31016948
4600C1016948o5540l05174m16827r72614o58438p63150p58869l82971k86076m31084
$$ 31016948 30951408 30646234 30229407 29256793 28598355 27835205 27076336 26693365 26407289 25976205
4590B5976205m72450j06076m23257j86792l91277N1109j76168o98442k82832j77507
$$ 25976205 25503755 25397679 24974422 24787630 24396353 24447462 24271294 23572852 23290020 23112513
4580B3112513k59612K18366m68823K47643l29352o5802l39331k67878J00772m70586
$$ 23112513 22852901 23071267 22602444 22850087 22520735 22454933 22115602 21847724 21948496 21477910
4570B1477910j29947m09020k35720k31517m29747l51895L3171o12703k33137K15645
$$ 21477910 21347963 20938943 20703223 20471706 20041959 19690064 19723235 19110532 18877395 19093040
4560A9093040J06427O93874m76131J68482J11039q7580j07329J1887L5603k69171
$$ 19093040 19199467 19893341 19417210 19585692 19696731 19609151 19501822 19513709 19549312 19280141
4550A9280141K34023q5597M32258L78417k81597L22285N87653L24798M41975J5453
$$ 19280141 19514164 19428567 19860825 20239242 19957645 20279930 20867583 21192381 21634356 21649809
4540B1649809L72828O77720M04428O61382M73003J336778L18221p70172k96059
$$ 21649809 22022637 22700357 23104785 23766167 24239170 25575948 25894169 25123997 24827938
4531B4827938o72866j559368q63312o76333o48290m79020r58067j41764l59272
$$ 24827938 24155072 22595704 21732392 21056059 20407769 19928749 18970682 18828918 18469646
4522A8469646k07084L27473M94603J22805n39224m74526n83999l60932l5468k54721
$$ 18469646 18262562 18590035 19084638 19207443 18668219 18193693 17609694 17248762 17213294 16958573
4512A6958573L29039j23482k48374m5625J38959L09876k22743l71845J03885J52682
$$ 16958573 17287612 17164130 16915756 16870131 17009090 17318966 17096223 16724378 16828263 16980945
4502A6980945l25930J87994k64399k92311k10853N84J35622L25415K8440J09078
$$ 16980945 16655015 16843009 16578610 16286299 16075446 16076030 16211652 16537067 16565507 16674585
4492A6674585m11068l78688L25422l70584K01287l58670n46567M51009q6437j74771
$$ 16674585 16263517 15884829 16210251 15839667 16040954 15682284 15135717 15586726 15500289 15325518
4482A5325518J93346k96590P5384L78087k00633O08888R5853j76647R8781n2766
$$ 15325518 15518864 15222274 15297658 15675745 15475112 16084000 16179853 16003206 16101987 16049221
4472A6049221N67270K13558m80189j87751O14414J22898l15393K01106L52033
$$ 16049221 16616491 16830049 16349860 16162109 16776523 16899421 16584028 16785134 17137167
4463A7137167J23142L72560k85657k67793M12146J8888N0074K96035P17281K22926
$$ 17137167 17260309 17632869 17347212 17079419 17491565 17510453 17560527 17856562 18573843 18796769
4453A8796769J80061j47480q86222K86501M52965k35827k78730M94784L28699
$$ 18796769 18976830 18829350 17943128 18229629 18682594 18446767 18168037 18662821 18991520
4444A8991520P1127o1021l18586N63338M82589N440o7514p09063K16627P3699
$$ 18991520 19062647 19001626 18683040 19246378 19728967 19734407 19666893 18957830 19174457 19248156
4434A9248156O48456j93492K25025L68402O5328j79544j95230m89013N29479J063037
$$ 19248156 19896612 19703120 19928145 20296547 20361875 20182331 19987101 19498088 20027567 21090604
4424B1090604n03658k55006J91810N95799N7234K06621k98936M1760K24198J77164
$$ 21090604 20586946 20331940 20523750 21119549 21176783 21383404 21084468 21126228 21350426 21527590
4414B1527590M45706K14258K19470n05424M05079M97348j25816J55561L59903
$$ 21527590 21973296 22187554 22407024 21901600 22306679 22804027 22678211 22833772 23193675
4405B3193675M05180k44267M44822N26272J07089K57968O95972K39836m81253
$$ 23193675 23598855 23354588 23799410 24325682 24432771 24690739 25386711 25626547 25145294
4396B5145294K89352M78790N06327L39634l9953K69613o13468K11331K61438L87216
$$ 25145294 25434646 25913436 26419763 26759397 26719444 26989057 26375589 26586920 26848358 27235574
4386B7235574j93889L68557Q41593L85273Q5181L41695R65090j23627O37353K17035
$$ 27235574 27041685 27410242 28251835 28637108 28722289 29063984 30029074 29905447 30542800 30759835
4376C0759835M78779L12169P03564j50420L85692R06500J4821p6358R70189K88290
$$ 30759835 31238614 31550783 32254347 32103927 32489619 33396119 33410940 33334582 34304771 34593061
4366C4593061J15457L63904J65552N83295K1430j49023Q74867J225820P57913
$$ 34593061 34708518 35072422 35237974 35821269 35842699 35693676 36568543 37794363 38552276
4357C8552276N10097J051122N04631J298733J265551J787704K548036J690335
$$ 38552276 39062373 40113495 40618126 41916859 43182410 44970114 47518150 49208485
4349D9208485J782503K398697L114578L163911M491788M200046N185781O201695
$$ 49208485 50990988 53389685 56504263 59668174 64159962 68360008 73545789 79747484
4341G9747484O640870N898674J474666m026922o699567o818184n660260m196851
$$ 79747484 86388354 92287028 93761694 89734772 83035205 76217021 70556761 66359910
4333F6359910l438347l645441k571659k898546k851251j751791j695297j748272
$$ 66359910 62921563 59276122 56704463 53805917 50954666 49202875 47507578 45759306
4325D5759306j044135q75068o04464n43458O44375q2982m50161j182120j024301
$$ 45759306 44715171 43840103 43235639 42692181 43336556 43253574 42803413 41621293 40596992
4316D0596992o78567j00176J92472m05275n28384K32046L64538j9452K21652L78783
$$ 40596992 39918425 39818249 40010721 39605446 39077062 39309108 39673646 39654194 39875846 40254629
4306D0254629Q8332Q45536M20333N40681J086485l35201K00548l72205p77648
$$ 40254629 40342961 41188497 41608830 42149511 43235996 42900795 43101343 42729138 41951490
4297D1951490o03862q14021o85563l11686q04847q07142p31009n22582l08750
$$ 41951490 41347628 40533607 39848044 39536358 38731511 37924369 37193360 36670778 36362028
4288C6362028m5076j48965n49159m03492r2534k27661j76044q4286M03809J15521
$$ 36362028 36316952 36167987 35618828 35215336 35122802 34895141 34719097 34634811 35038620 35154141
4278C5154141j26906N45594N95879q6752m76336J45111J79168O71069N54144J214141
$$ 35154141 35027235 35572829 36168708 36081956 35605620 35750731 35929899 36600968 37155112 38369253
4268C8369253L8934l33411l5604l01821n58373l91801m19814q40573N7093m40701
$$ 38369253 38408187 38074776 38039172 37737351 37178978 36787177 36367363 35526790 35583883 35143182
4258C5143182j251483j90575p94032J97126L97045M5285J67419l77220o44015
$$ 35143182 33891699 33701124 32907092 33104218 33501263 33546548 33713967 33336747 32692732
4249C2692732J6106L54880L5470P3952J47711M50126n34090K78668k71284O43309
$$ 32692732 32708838 33063718 33099188 33173140 33320851 33770977 33236887 33515555 33244271 33887580
4239C3887580P7119K66086L54392R059L12675N25524j50272K29792l8698M60686
$$ 33887580 33964699 34230785 34585177 34594236 34906911 35432435 35282163 35511955 35473257 35933943
4229C5933943M6426l66044j72128k70668j26177L76163M54356n7866j01083J64720
$$ 35933943 35980369 35614325 35442197 35171529 35045352 35421515 35875871 35818005 35716922 35881642
4219C5881642j31042L63446L58696J11405L29230M23031K66390K53330J39642
$$ 35881642 35750600 36114046 36472742 36584147 36913377 37336408 37602798 37856128 37995770
4210C7995770O19541O53840M60878M25852L24121l866R4082O20925L85508O26683
$$ 37995770 38615311 39269151 39730029 40155881 40480002 40476136 40570218 41191143 41576651 42203334
4200D2203334K08900j1868K89745O17756j03094P17010Q06387O15411J77021M30583
$$ 42203334 42412234 42400366 42690111 43307867 43204773 43921783 44728170 45343581 45520602 45951185
4190D5951185R19418L28959K77672O06716P30415R05620M76496P79887J395485
$$ 45951185 46870603 47199562 47477234 48083950 48814365 49719985 50196481 50976368 52371853
4181E2371853P57074Q92007R00291R58597J212651J059161R84029P24490N66258
$$ 52371853 53128927 54020934 54921225 55879822 57092473 58151634 59135663 59860153 60426411
4172F0426411J572553J148856J110549J599796J016504J213839J258839J632500
$$ 60426411 61998964 63147820 64258369 65858165 66874669 68088508 69347347 70979847
4164G0979847J076794J077641J207918R86752J148239J285256J356980J294501
$$ 70979847 72056641 73134282 74342200 75328952 76477191 77762447 79119427 80413928
4156H0413928J043062K377732J879474J374557J309569J807389K065484J948677
$$ 80413928 81456990 83834722 85714196 87088753 88398322 90205711 92271195 94219872
4148I4219872J756675J469592K056141J310502J910975J578472J653323K053831
$$ 94219872 95976547 97446139 99502280 100812782 102723757 104302229 105955552 108009383
4140A08009383K240893K420116K268366J750863K592411J774583J519699K826280
$$ 108009383 110250276 112670392 114938758 116689621 119282032 121056615 122576314 125402594
4132A25402594K557111L385533K902105L407227L613288L237831K845245K885608
$$ 125402594 127959705 131345238 134247343 137654570 141267858 144505689 147350934 150236542
4124A50236542K184766K500199K663669K524652K594186K760783K064994L511234
$$ 150236542 152421308 154921507 157585176 160109828 162704014 165464797 167529791 171041025
4116A71041025L312714K107368K924542K666297L027313K511945K466623J490862
$$ 171041025 174353739 176461107 179385649 182051946 185079259 187591204 190057827 191548689
4108A91548689J347902K165393K896602K600124L274470M240201M272406M657042
$$ 191548689 192896591 195061984 197958586 200558710 203833180 208073381 212345787 217002829
4100B17002829N341297M481877M201085M464347L499801L575862L932231M012180
$$ 217002829 222344126 226826003 231027088 235491435 238991236 242567098 246499329 250511509
4092B50511509L662485L669654L424801L644036L838941M576903L492341L689358
$$ 250511509 254173994 257843648 261268449 264912485 268751426 273328329 276820670 280510028
4084B80510028L551245K867783K253758K486064L941653K997365L921355M292528
$$ 280510028 284061273 286929056 289182814 291668878 295610531 298607896 302529251 306821779
4076C06821779M138359M752215L232632K900606L082775J910384J928401J951766
$$ 306821779 310960138 315712353 318944985 321845591 324928366 326838750 328767151 330718917
4068C30718917K926485K124259K682751K829722K880011L777712L300923L409098
$$ 330718917 333645402 335769661 338452412 341282134 344162145 347939857 351240780 354649878
4060C54649878L517932L960852M436460M007717L405176L807808M850694M393739
$$ 354649878 358167810 362128662 366565122 370572839 373978015 377785823 382636517 387030256
4052C87030256M499069M855978N264421N799544N869070N187135L501614J754959
$$ 387030256 391529325 396385303 401649724 407449268 413318338 418505473 422007087 423762046
4044D23762046Q90778j4970J94270L35103L06596L33327o38909o80369j244995
$$ 423762046 424652824 424637854 424832124 425167227 425473823 425807150 425168241 424487872 423242877
4035D23242877r97550j264890j870845j318423j668135j085282l60556j327398
$$ 423242877 422245327 420980437 419109592 417791169 416123034 415037752 414677196 413349798
4027D13349798j340236j194101j225207j309898j063857o01980J00586j270937
$$ 413349798 412009562 410815461 409590254 408280356 407216499 406614519 406715105 405444168
4019D05444168m95815j235495l683520m586994o111705n850380o171532o846650
$$ 405444168 404948353 403712858 400029338 395442344 389330639 383480259 377308727 370462077
4011C70462077o980422p221552p689670p134016q530551p916462p186858o897995
$$ 370462077 363481655 356260103 348570433 341436417 332905866 324989404 317802546 310904551
4003C10904551n598446n700478m792962m997153m069228l817792m083132l887600
$$ 310904551 305306105 299605627 294812665 289815512 285746284 281928492 277845360 273957760
3995B73957760l797314l277234k923538l057396k891831m113271l848058l624976
$$ 273957760 270160446 266883212 263959674 260902278 258010447 253897176 250049118 246424142
3987B46424142m177592l088046k475540l295145m094533l756033m063195l866454
$$ 246424142 242246550 239158504 236682964 233387819 229293286 225537253 221474058 217607604
3979B17607604m835826m689853m569111m390644l156645l356145l442774l789814
$$ 217607604 212771778 208081925 203512814 199122170 195965525 192609380 189166606 185376792
3971A85376792l197501k615434k867186l257215l258599k666879k656057k660991
$$ 185376792 182179291 179563857 176696671 173439456 170180857 167513978 164857921 162196930
3963A62196930k496399k390085k687736k744969l005331k707870k444959k335660
$$ 162196930 159700531 157310446 154622710 151877741 148872410 146164540 143719581 141383921
3955A41383921l088665k646542k296012k741870k153318k810638k065388j558765
$$ 141383921 138295256 135648714 133352702 130610832 128457514 125646876 123581488 122022723
3947A22022723k158592k422232j890823k033400k082710j413522k112051j897997
$$ 122022723 119864131 117441899 115551076 113517676 111434966 110021444 107909393 106011396
3939A06011396j487491j513421j940205k171404k288215k227615k389672k219845
$$ 106011396 104523905 103010484 101070279 98898875 96610660 94383045 91993373 89773528
3931H9773528k172627k631126j142192k224190j783796j432231j776916j369550
$$ 89773528 87600901 84969775 83827583 81603393 79819597 78387366 76610450 75240900
3923G5240900r08765j046740r04142j419790j290096j004881j063372l95337r27226
$$ 75240900 74332135 73285395 72381253 70961463 69671367 68666486 67603114 67207777 66280551
3914F6280551j029395o14051o60214j335751q28478r30292n04309r99832p19158
$$ 66280551 65251156 64637105 63976891 62641140 61812662 60882370 60378061 59378229 58659071
3905E8659071o91159p61651n09735q14086p32918p13176m62100o18625q95361
$$ 58659071 57967912 57206261 56696526 55882440 55149522 54436346 53974246 53355621 52460260
3896E2460260o01754p23393l61394m78693k83250n53635L6903k78248k67974l50982
$$ 52460260 51858506 51135113 50773719 50295026 50011776 49458141 49495044 49216796 48948822 48597840
3886D8597840J62791l9135k31439m28215j61579o17692m61770n57992k57688J82493
$$ 48597840 48760631 48721496 48490057 48061842 47900263 47282571 46820801 46262809 46005121 46187614
3876D6187614o39336o77970m25267j08118j97043n03098o63476J2416R3577m12305
$$ 46187614 45548278 44870308 44445041 44336923 44139880 43636782 42973306 42985722 43079299 42666994
3866D2666994p58274l10972l51023Q1667J82347p01477k63521k00623o30866P7422
$$ 42666994 41908720 41597748 41246725 41328392 41510739 40809262 40545741 40345118 39714252 39791674
3856C9791674l82739o08894j18555J42294n07586j7789p51639J0882m0726m91664
$$ 39791674 39408935 38800041 38681486 38823780 38316194 38298405 37546766 37557648 37516922 37025258
3846C7025258j65275L74899L170k92662m7230m33599n19081r07728R2699L58550
$$ 37025258 36859983 37234882 37238052 36945390 36898160 36464561 35945480 35037752 35130451 35489001
3836C5489001R8476K7776n34777M79883l81577l88557J37710k06875j42142j33262
$$ 35489001 35587477 35615253 35080476 35560359 35178782 34790225 34927935 34721060 34578918 34445656
3826C4445656l67465k6813J03007Q6820o50056n50311R50779j78669k88111j53208
$$ 34445656 34078191 34051378 34154385 34241205 33591149 33040838 33991617 33812948 33524837 33371629
3816C3371629J59755K77492o14156K64472M27232k32558j29658j30377P976J87022
$$ 33371629 33531384 33808876 33194720 33459192 33886424 33653866 33524208 33393831 33401807 33588829
3806C3588829l31555J31488o3365m29592j34136k79827j39690k69377K084J015466
$$ 33588829 33257274 33388762 33325397 32895805 32761669 32481842 32342152 32072775 32074859 33090325
3796C3090325r90l41829j37877k61701n17790K39789N41728j94694l60791j77594
$$ 33090325 33089335 32747506 32609629 32347928 31830138 32069927 32611655 32416961 32056170 31878576
3786C1878576L8614J3519P8941J29315J81626J94865K23757j210423K09743L14865
$$ 31878576 31917190 31930709 32009650 32138965 32320591 32515456 32739213 31528790 31738533 32053398
3776C2053398j0171R12345j3502R1128P0493j42486K23670j39258L13853K997
$$ 32053398 32043227 32955572 32942070 33033198 33103691 32961205 33184875 33045617 33359470 33362467
3766C3362467k33742o0368K6164j87824J72679m4355L41738O22792p42335j63332
$$ 33362467 33128725 33068357 33094521 32906697 33079376 33035021 33376759 33999551 33257216 33093884
3756C3093884l86776J59703j0570l543n8869k79654m5643K28950L19164J388R4297
$$ 33093884 32707108 32866811 32856241 32852698 32793829 32514175 32468532 32697482 33016646 33018034 33112331
3745C3112331J93821l30691M3079K56034k4707N25133l85728K2848J3521p1235
$$ 33112331 33306152 32975461 33018540 33274574 33249867 33775000 33389272 33412120 33425641 33354406
3735C3354406K89055j15849l4430J42924m78460m48892J02112L0214j26969m71013
$$ 33354406 33643461 33527612 33493182 33636106 33157646 32708754 32810866 32841080 32714111 32243098
3725C2243098M32454J27498k77447K24907l71270N14881Q2419j17970O7788K77953
$$ 32243098 32675552 32803050 32525603 32750510 32379240 32894121 32976540 32858570 32926358 33204311
3715C3204311R8837j81990k75963j4436K46763j44416J35870J20758J56891q0564
$$ 33204311 33303148 33121158 32845195 32830759 33077522 32933106 33068976 33189734 33346625 33266061
3705C3266061K17123R04226K70167o57797p33563J91190K73712L13016J51410
$$ 33266061 33483184 34387410 34657577 33999780 33266217 33457407 33731119 34044135 34195545
3696C4195545k27894m01770M06498J21456n51932J9856O8290l21717L25396L01706
$$ 34195545 33967651 33565881 33972379 34093835 33541903 33561759 33630049 33308332 33633728 33935434
3686C3935434J73386p6876j39939J28177k80991p2652J26696J92054K70891P5882
$$ 33935434 34108820 34031944 33892005 34020182 33739191 33666539 33793235 33985289 34256180 34332062
3676C4332062l651m12427K89853o8795m4912j5898J64097j44295K5862M26391
$$ 34332062 34328411 33915984 34205837 34137042 34092130 34076232 34240329 34096034 34121896 34548287
3666C4548287M21490J11899L73322k1763n5754O09805m9603m10946n6422N19489
$$ 34548287 34969777 35081676 35454998 35433235 35377481 35987286 35937683 35526737 35470315 35989804
3656C5989804J10811P21241k2597K93228K47221K97069K90439L98919j5485m69148
$$ 35989804 36100615 36821856 36799259 37092487 37339708 37636777 37927216 38326135 38310650 37841502
3646C7841502L71619K11332m4048J38086K46516K64851L69231M19326n133P14110
$$ 37841502 38213121 38424453 38380405 38518491 38765007 39029858 39399089 39818415 39813282 40527392
3636D0527392O44979M45695M36677m42408J44170R01413J86289L0986K44629N9012
$$ 40527392 41172371 41618066 42054743 41612335 41756505 42657918 42844207 42875193 43119822 43178834
3626D3178834M68269J108952M14557K62499J46054R05893N5812K63844N71391
$$ 43178834 43647103 44756055 45170612 45433111 45579165 46485058 46540870 46804714 47376105
3617D7376105L95288L21892N33042k221N22863N95394Q9549N87071K80339J75224
$$ 47376105 47771393 48093285 48626327 48624106 49146969 49742363 49831912 50418983 50699322 50874546
3607E0874546O69354P44113Q44384O16521M87684N36828J37024N12600R50518
$$ 50874546 51543900 52288013 53132397 53748918 54236602 54773430 54910454 55423054 56373572
3598E6373572R12419J017781K80386M60083N89971N59144J090707R82048P71474
$$ 56373572 57285991 58303772 58584158 59044241 59634212 60193356 61284063 62266111 63037585
3589F3037585M92932N58805R39295J182629N21685M68189J527445J412429J37039
$$ 63037585 63530517 64089322 65028617 66211246 66732931 67201120 68728565 70140994 70278033
3580G0278033J327163P44790R59278R28663J293372J459775J469556R79203P62129
$$ 70278033 71605196 72349986 73309264 74237927 75531299 76991074 78460630 79439833 80201962
3571H0201962J256046J176887J260533R02645J376617J816804J495189J603050
$$ 80201962 81458008 82634895 83895428 84798073 86174690 87991494 89486683 91089733
3563I1089733J269604J026055J466469J481576K027436J686564J844571J612367
$$ 91089733 92359337 93385392 94851861 96333437 98360873 100047437 101892008 103504375
3555A03504375J816351K162195J713733J540095K428021K113136K228891J966030
$$ 103504375 105320726 107482921 109196654 110736749 113164770 115277906 117506797 119472827
3547A19472827J967355J979305J844856K155191J762814K463559J474266K361115
$$ 119472827 121440182 123419487 125264343 127419534 129182348 131645907 133120173 135481288
3539A35481288K134535K094527K140722J961859K610451K532940K905967K647217
$$ 135481288 137615823 139710350 141851072 143812931 146423382 148956322 151862289 154509506
3531A54509506L129725L121869L326359L332393K834967L505362M589549L550442
$$ 154509506 157639231 160761100 164087459 167419852 170254819 173760181 178349730 181900172
3523A81900172M534997N037560M827858M969914N092723N960857O612199P551405
$$ 181900172 186435169 191472729 196300587 201270501 206363224 212324081 218936280 226487685
3515B26487685Q035877R288674R858473J0157143J0586095J1976463J2018753
$$ 226487685 234523562 243812236 253670709 263827852 274413947 286390410 298409163
3508B98409163J3548798J4839544J5581850J5522944J5874088J6655257J6376630
$$ 298409163 311957961 326797505 342379355 357902299 373776387 390431644 406808274
3501D06808274J4929686J3410174R944329O324714J302589m386817j0092593j5012300
$$ 406808274 421737960 435148134 445092463 451417177 452719766 448332949 438240356 423228056
3493D23228056j6637122j7930338j8912820j7391698j5541121j4270337j3519458
$$ 423228056 406590934 388660596 369747776 352356078 336814957 322544620 309025162
3486C09025162j2291750j0692772r499069q900133p823083p105548o771944o327958
$$ 309025162 296733412 286040640 276541571 267641438 259818355 252712807 245940863 239612905
3478B39612905n955146n500579n435968m460488m460953l610157l661363k920345
$$ 239612905 233657759 228157180 222721212 218260724 213799771 210189614 206528251 203607906
3470B03607906k825587l130416l628154l740789l170251k611201l142306m398844
$$ 203607906 200782319 197651903 194023749 190282960 187112709 184501508 181359202 176960358
3462A76960358l348053l557599l386769l080988l416675l226051k994748l023896
$$ 176960358 173612305 170054706 166667937 163586949 160170274 156944223 153949475 150925579
3454A50925579l160998k810593k624096j805507k473751k731724j862554l118239
$$ 150925579 147764581 144953988 142329892 140524385 138050634 135318910 133456356 130338117
3446A30338117l562777k948012k669328k428840k681852k176107j895384j628151
$$ 130338117 126775340 123827328 121158000 118729160 116047308 113871201 111975817 110347666
3438A10347666k164049j963432k315939j054169j682422k255070j416922r39252
$$ 110347666 108183617 106220185 103904246 102850077 101167655 98912585 97495663 96556411
3430I6556411j668309j316036q28225j191397j540773r26655j505476o82585o97176
$$ 96556411 94888102 93572066 92743841 91552444 90011671 89085016 87579540 86896955 86199779
3421H6199779p76511n38902l90522n08075j118719j465388j501876o34782n88374
$$ 86199779 85423268 84884366 84493844 83985769 82867050 81401662 79899786 79265004 78676630
3412G8676630o81964j322123j029713r63004r87928p88978r12937j377465o15029
$$ 78676630 77994666 76672543 75642830 74679826 73691898 72902920 71989983 70612518 69997489
3403F9997489p53340l05274p17939n17939q38017n11154n94756n24241j096875
$$ 69997489 69244149 68938875 68220936 67702997 66864980 66353826 65759070 65234829 64137954
3394F4137954k39175n23149o83284n36753k45981k41712j090081n68541K24783
$$ 64137954 63898779 63375630 62692346 62155593 61909612 61667900 60577819 60009278 60234061
3385F0234061j23500j204216l84681k093n20657l87600r45770o99288o32402k2016
$$ 60234061 60110561 58906345 58521664 58519571 57998914 57611314 56665544 55966256 55333854 55311838
3375E5311838l77691l33836n12189P5840k85650p77115j61180R6026k41330n22859
$$ 55311838 54934147 54600311 54088122 54163962 53878312 53101197 52940017 53036043 52794713 52271854
3365E2271854k87634k74365o71445o02093j26830Q8126j2861m93032L8422n32616
$$ 52271854 51984220 51709855 51038410 50436317 50309487 50397613 50384752 49891720 49930142 49397526
3355D9397526k06079j93969k41030j32624o27714l09513J23541K14614L30388
$$ 49397526 49191447 48997478 48756448 48623824 47996110 47686597 47810138 48024752 48355140
3346D8355140k92534n3989k37611N4040k95906j56883n26472k6750k55965j47839
$$ 48355140 48062606 48008617 47771006 47825046 47529140 47372257 46845785 46819035 46563070 46415231
3336D6415231r7530j76048l35588K95953r5882k19179r46176l44691j58082j59485
$$ 46415231 46317701 46141653 45806065 46102018 46006136 45786957 44840781 44496090 44338008 44178523
3326D4178523l42865r3103o40773o11177j15752k73711l69134o25039l0229P84451
$$ 44178523 43835658 43742555 43101782 42490605 42374853 42101142 41732008 41106969 41076740 41861191
3316D1861191q14993o77984j0772o55970l31858K74197k49944K96667j2291o63090
$$ 41861191 41046198 40368214 40357442 39701472 39369614 39643811 39393867 39690534 39678243 39015153
3306C9015153k04190L9701k10986m99929J54117L3371j67481m97144m3585k73862
$$ 39015153 38810963 38850664 38639678 38139749 38293866 38327237 38159756 37662612 37619027 37345165
3296C7345165J36468n65087l84788n06066j91500n82078j03549j77224m24131
$$ 37345165 37481633 36916546 36531758 36025692 35834192 35252114 35148565 34971341 34547210
3287C4547210l29589j00480k55364O69118n26999K26384R5915P284J97663j72810
$$ 34547210 34217621 34117141 33861777 34530895 34003896 34230280 34326195 34333479 34531142 34358332
3277C4358332o1088M58814o4583j016L12317k53897n45870J74626L29940L73075
$$ 34358332 34297244 34756058 34691475 34690459 35002776 34748879 34203009 34377635 34707575 35080650
3267C5080650N62741j96953m84234n32845K06881k0324n6069R23468m62029l52197
$$ 35080650 35643391 35446438 34962204 34429359 34636240 34615916 34559847 35483315 35021286 34669089
3257C4669089K79285N04011r5338J42063O14335M80910K74204O7301M93217J73661
$$ 34669089 34948374 35452385 35357047 35499110 36113445 36594355 36868559 36935860 37429077 37602738
3247C7602738J23854L07219R80714P74238L30245L52371O25962K72817q6074j74312
$$ 37602738 37726592 38033811 39014525 39788763 40119008 40471379 41097341 41370158 41284084 41109772
3237D1109772N47212O81078O10117K90862O05727N61234Q02958K76504O77287
$$ 41109772 41656984 42338062 42948179 43239041 43844768 44406002 45208960 45485464 46162751
3228D6162751L23485J09635j43450O00508J455139N97735K2419p8007Q22038j00531
$$ 46162751 46486236 46595871 46452421 47052929 48508068 49105803 49128222 49050215 49872253 49771722
3218D9771722m0604O23997J29060R30985J192109O02392O30013J478286P51475
$$ 49771722 49731118 50355115 50484175 51415160 52607269 53209661 53839674 55317960 56069435
3209E6069435P63173J351130R49650J337925J515019J098598J349035J898130
$$ 56069435 56832608 58183738 59133388 60471313 61986332 63084930 64433965 66332095
3201F6332095J203935M80691J203209J350778J517836J356234J582991J877970
$$ 66332095 67536030 68016721 69219930 70570708 72088544 73444778 75027769 76905739
3193G6905739J632755K025999J889462K115730K673089K069038J414282J333851
$$ 76905739 78538494 80564493 82453955 84569685 87242774 89311812 90726094 92059945
3185I2059945J701613R85918J690483J238609J369958J229927O98237P65920J500097
$$ 92059945 93761558 94747476 96437959 97676568 99046526 100276453 100974690 101740610 103240707
3176A03240707K066939J682418J368671J680903J916002K878666K991480K554361
$$ 103240707 105307646 106990064 108358735 110039638 111955640 114834306 117825786 120380147
3168A20380147L304182L676452M432505M791550M006721M142920M417376M954020
$$ 120380147 123684329 127360781 131793286 136584836 140591557 144734477 149151853 154105873
3160A54105873M870866M169295M017795K203049K27747k174656k229905m096382
$$ 154105873 158976739 163146034 167163829 169366878 169594625 167419969 165190064 161093682
3152A61093682m889419l995131l682236k906429j879054j087727m62671j91093
$$ 161093682 156204263 152209132 148526896 145620467 143741413 142653686 142191015 141999922
3144A41999922Q72894J472097J602757K103458K977084K833469K768744L193835
$$ 141999922 142872816 144344913 145947670 148051128 151028212 153861681 156630425 159824260
3136A59824260L259275L469023L148166K535691J817663J835162M36049r13816
$$ 159824260 163083535 166552558 169700724 172236415 174054078 175889240 176325289 175411473
3128A75411473k402493l191692l461025m502242m481891n783684n856746n500253
$$ 175411473 173008980 169817288 166356263 161854021 157372130 151588446 145731700 140231447
3120A40231447n003625l365979k451883k514900k215392j733046p24055r2129
$$ 140231447 135227822 131861843 129409960 126895060 124679668 122946622 122222567 122130438
3112A22130438J71271m38417o35090O6916p50948m52357j301585j650518j926692
$$ 122130438 122301709 121863292 121228202 121295118 120544170 120091813 118790228 117139710 115213018
3103A15213018k533071k459357l657776l822733m674743m246469l991358m204711
$$ 115213018 112679947 110220590 106562814 102740081 98065338 93818869 89827511 85622800
3095H5622800l239762l073620l004996l128805k483402k028313k398356j854255
$$ 85622800 82383038 79309418 76304422 73175617 70692215 68663902 66265546 64411291
3087F4411291j982073k169933j743731r39138q63709j074433j750272r76404n12256
$$ 64411291 62429218 60259285 58515554 57576416 56712707 55638274 53888002 52911598 52399342
3078E2399342j369310j355542o99912j476684j528534r73600j599729r15029j287056
$$ 52399342 51030032 49674490 48974578 47497894 45969360 44995760 43396031 42481002 41193946
3069D1193946j092092j247674n87481j220894r74819r16069q76828q83339m60777
$$ 41193946 40101854 38854180 38266699 37045805 36070986 35154917 34278089 33394750 32933973
3060C2933973o18407n15497o59315j372018q38419q0526l29449r75303o34680
$$ 32933973 32315566 31800069 31140754 29768736 28930317 28849791 28520342 27545039 26910359
3051B6910359j056118L62899R4909k29456p22975n42725J04118l90570N0776J04755
$$ 26910359 25854241 26217140 26312049 26082593 25359618 24816893 24921011 24530441 24581217 24685972
3041B4685972m71687o49712M4946j91530j174340o63853N63858L3946m88317k96246
$$ 24685972 24214285 23564573 23609519 23417989 22243649 21579796 22143654 22177600 21689283 21393037
3031B1393037n60021m89596n59507o40590l09356p47661o17314J02454p1331n28042
$$ 21393037 20833016 20343420 19783913 19143323 18833967 18086306 17468992 17571446 17500115 16972073
3021A6972073p90327p8107J40282k53698j59111m98993K93688J07572m51348o86848
$$ 16972073 16181746 16103639 16243921 15990223 15831112 15332119 15625807 15733379 15282031 14595183
3011A4595183K56428l06278n91017k97919k07617k94310m43905j19963K01859
$$ 14595183 14851611 14545333 13954316 13656397 13448780 13154470 12710565 12590602 12792461
3002A2792461J12208o28473m51238J45781k57875k39394L3030J71655j076254
$$ 12792461 12904669 12276196 11824958 11970739 11712864 11473470 11506500 11678155 10601901
2993A0601901l63072Q76607j018821o01058K82444m92310j70741R36284k09349
$$ 10601901 10238829 11115436 10096615 9495557 9778001 9285691 9114950 10051234 9841885
2984I841885n34855n25243K76813R0513l85973J67500l81242j35691j25331j31607
$$ 9841885 9307030 8781787 9058600 9149113 8763140 8930640 8549398 8413707 8288376 8156769
2974H156769l43264k72787K65409J79579J20579k17281m14552k86865R6150m60745
$$ 8156769 7813505 7540718 7806127 7985706 8106285 7889004 7474452 7187587 7283737 6822992
2964F822992N23764p7133j45569j09496q6122m8938O49328k08502m98791m83728
$$ 6822992 7346756 7269623 7124054 7014558 6928436 6879498 7528826 7320324 6821533 6337805
2954F337805J57849N4353j43625J35047O3057L62677M5509l14157j25377L84262
$$ 6337805 6495654 6550007 6406382 6541429 6604486 6967163 7012672 6698515 6573138 6957400
2944F957400k11288l61885k20267L91746O712p36762k80696m78130L80946K46421
$$ 6957400 6746112 6384227 6163960 6555706 6562418 5825656 5544960 5066830 5447776 5694197
2934E694197L5910L98477j79489m77332l47379M14048L7554l75300j037660K01786
$$ 5694197 5730107 6128584 5949095 5471763 5124384 5538432 5575986 5200686 4163026 4364812
2924D364812p3145K61379L98352l02026J62832L3493j10710J17571k10106O14894
$$ 4364812 4291667 4553046 4951398 4649372 4812204 4845697 4734987 4852558 4642452 5257346
2914E257346k92233n94209k31689N33656O22206l67582l86353j39594L59441J29102
$$ 5257346 4965113 4370904 4139215 4672871 5295077 4927495 4541142 4401548 4760989 4890091
2904D890091j21254m85680l46054P66320L29073p76787k67893l1372K05476K47145
$$ 4890091 4768837 4283157 3937103 4703423 5032496 4255709 3987816 3956444 4161920 4409065
2894D409065J98016l81227K15276j23347J73949R7854j57403K71870J63403o91882
$$ 4409065 4607081 4225854 4441130 4317783 4491732 4589586 4432183 4704053 4867456 4175574
2884D175574j23999j31335K59896M84329L9175M7814l46033J56112m21449p1506
$$ 4175574 4051575 3920240 4180136 4664465 4703640 4751454 4405421 4561533 4140084 4068578
2874D068578R4269q7015P7292K55351j73650q1197k01569L06976n40958O3392
$$ 4068578 4162847 4075832 4153124 4408475 4234825 4153628 3952059 4259035 3718077 3781469
2864C781469L4754J2276j3077J0901L9162P076K10487J04738k02385o2561j42376
$$ 3781469 3816223 3828499 3815422 3826323 3865485 3872561 4083048 4187786 3985401 3922840 3780464
2853C780464j47619j06975N47962j99908m60549M4265N57469J72066n97018J57945
$$ 3780464 3632845 3525870 4073832 3873924 3413375 3457640 4015109 4187175 3590157 3748102
2843C748102N9027j76150j59381q5714J98948L43707k40352m19957j00716J61900
$$ 3748102 3807129 3630979 3471598 3385884 3584832 3928539 3688187 3268230 3167514 3329414
2833C329414M47969o01865l41260K43013M6797K76730r33480M3325L55114N322
$$ 3329414 3777383 3175518 2834258 3077271 3124068 3400798 2467318 2510643 2865757 2871079
2823B871079N44298o4995p02772J16515l22859M13272M72651n73083K02190K54348
$$ 2871079 3415377 3350382 2647610 2764125 2441266 2854538 3327189 2754106 2956296 3210644
2813C210644M46470o3765j066443m56543J43640J63650J70642q3103m01203K44120
$$ 3210644 3657114 3593349 2526906 2070363 2214003 2377653 2548295 2465192 2063989 2308109
2803B308109L04233n9874R9597q21467l34430R20624N14176j76416j31499L13147
$$ 2308109 2612342 2552468 2652065 1830598 1496168 2416792 2930968 2754552 2623053 2936200
2793B936200m67643L7312L08107k84438k77597N55547k04646l12676L08179K1593
$$ 2936200 2468557 2505869 2813976 2529538 2251941 2807488 2602842 2290166 2598345 2619938
2783B619938J49074l64077j34729k40735m27304k5553q2389K39774M29156J74524
$$ 2619938 2769012 2404935 2270206 2029471 1602167 1576614 1494225 1733999 2163155 2337679
2773B337679n76272L16751n51169R1034L42391R1360M33397k7141k18286K299
$$ 2337679 1761407 2078158 1526989 1618023 1960414 2051774 2485171 2458030 2239744 2242043
2763B242043m05510q3808k3531k56134L19919j80524Q9112r0771R6582j87828
$$ 2242043 1836533 1752725 1729194 1473060 1792979 1612455 1701567 1610796 1707378 1519550
2753A519550L01531j25211j92386N97958k55908M7613J18633J3366R7999M2150
$$ 1519550 1821081 1695870 1503484 2101442 1845534 1893147 2011780 2025146 2123145 2165295
2743B165295J85950r0335n23179n49900J57116J22025Q4892J9715m47108K3471
$$ 2165295 2351245 2260910 1737731 1187831 1344947 1466972 1551864 1571579 1124471 1147942
2733A147942M59499J0938L8446L97735m87240L35554k27909k23188K34728J85472
$$ 1147942 1607441 1618379 1656825 2054560 1567320 1902874 1674965 1451777 1686505 1871977
2723A871977l87471l0066k65154k99540L60284j43503K02126L37567N060n34314
$$ 1871977 1484506 1454440 1189286 889746 1250030 1106527 1308653 1646220 1651280 1116966
2713A116966p5421L07366P84868o28449N40480K32862n21737m65342j69744L8097
$$ 1116966 1041545 1348911 2133779 1505330 2045810 2278672 1756935 1291593 1121849 1159946
2703A159946M0897k92790O44189O1558m57717K47807k87683R1542n60706L47625
$$ 1159946 1200843 908053 1552242 1613800 1156083 1403890 1116207 1207749 647043 994668
2693I94668r8104J19170P4939j57450J95371n15041N14321M9511j65888J07144
$$ 994668 896564 1015734 1090673 933223 1128594 613553 1127874 1177385 1011497 1118641
2683A118641j0758L12702l25960J1694L99220m94909J21882l39041k19502l4436
$$ 1118641 1107883 1420585 1094625 1106319 1505539 1010630 1132512 793471 573969 539533
2673E39533N34470L57842K91591o37652j08918k16306l27759J55047N9935k21108
$$ 539533 1074003 1431845 1723436 1085784 976866 760560 432801 587848 647783 426675
2663D26675L72581J076758n39600k28492R9204j31709j73043K57568m2386q0864
$$ 426675 799256 1876014 1336414 1107922 1207126 1075417 902374 1159942 1117556 1036692
2653A036692k71159K90699l71772l68763N40571P54956l42605j52557k34631J05122
$$ 1036692 765533 1056232 684460 315697 856268 1611224 1268619 1116062 881431 986553
2643I86553k12919l8775J14529j68653k94876M7204K95669J11185M22959J04730
$$ 986553 773634 734859 849388 680735 385859 433063 728732 839917 1262876 1367606
2633A367606o0082P1067j36131j63566K70435R4303l99021Q3374N84865p88615
$$ 1367606 1307524 1378591 1242460 1078894 1349329 1443632 1044611 1127985 1712850 924235
2623I24235L59721K06218o67607r9190j30724P2248k99336j37834O36072J38949
$$ 924235 1283956 1490174 822567 723377 592653 664901 365565 227731 863803 1002752
2613A002752l7161m19600l68544N34202K95289k98361J62333k05056M16119Q8160
$$ 1002752 965591 545991 177447 711649 1006938 708577 870910 665854 1081973 1170133
2603A170133k9807o5773M47223m60733m93531R8037j7382L3407O36303k57865
$$ 1170133 1140326 1074553 1521776 1061043 567512 665549 648167 681574 1317877 1060012
2593A060012m9341j19136J07911k15109m20503K67808J86996l45933J37289O7503
$$ 1060012 1010671 891535 999446 784337 363834 631642 818638 472705 609994 677497
2583F77497j35047K62257p27482J11111J20770J89540m8029O6883L42482J73555
$$ 677497 542450 804707 77225 188336 309106 498646 450617 517500 859982 1033537
2573A033537k72317k42803P6299j58907j11809Q36935l46585k09085O452K79854
$$ 1033537 761220 518417 594716 435809 324000 1160935 814350 605265 611717 891571
2563H91571N62086R7783o67714l33100k32360q6584P8476K84546p50771K21750
$$ 891571 1453657 1551440 883726 550626 318266 231682 310158 594704 -156067 65683
2553F5683Q13199k19455K94306K84102k73875J34068J50624J79391n45553j95979
$$ 65683 878882 659427 953733 1237835 963960 1098028 1248652 1428043 882490 686511
2543F86511K04371K57319O3186l95424n554l62348L65176L64357l05331k55654
$$ 686511 890882 1148201 1211387 815963 810409 448061 813237 1177594 872263 616609
2533F16609q44911K89317J02168j37056K57997L29002K00541o5389j13868k02158
$$ 616609 -228302 61015 163183 26127 284124 613126 813667 748278 634410 432252
2523D32252k31131j00639k10604R29169L94567r8846j98085l26400o08986k5816
$$ 432252 201121 100482 -110122 819047 1213614 1114768 916683 590283 -18703 -44519
2513d4519N99376K8203K78847L55004l09756o16780L39285m73500j13375O02330
$$ -44519 554857 583060 861907 1216911 907155 290375 629660 156160 42785 645115
2503F45115K99213j05798K46357K45685j89517K13247k82854k58187J49949J3115
$$ 645115 944328 838530 1084887 1330572 1141055 1354302 1071448 813261 963210 976325
2493I76325j9307n41356r9210j16221L17370K42295j61804K40305k6790j70112
$$ 976325 957018 415662 316452 200231 517601 759896 598092 838397 811607 641495
2483F41495N28994O3321n04141j10075K45812j37152j09974N95929r0897k51556
$$ 641495 1170489 1233810 729669 619594 865406 728254 618280 1214209 1123312 871756
2473H71756J1438K35209M61299j15877k90293k06522L77454j17318J01123L2769
$$ 871756 883194 1118403 1579702 1463825 1173532 967010 1344464 1227146 1328269 1361038
2463A361038L12937n2306k63592O7953J52822m52892j0649P1196Q73478M7441
$$ 1361038 1673975 1621669 1358077 1426030 1578852 1125960 1115311 1186507 2059985 2107426
2453B107426j82760K63267p171L8124Q2541J07246M15094j76220n88155Q0589
$$ 2107426 1924666 2187933 2180762 2218886 2301427 2408673 2823767 2647547 2059392 2139981
2443B139981N066L86713m9366K43161K87447J85530O5352j03436j4503N29886
$$ 2139981 2145047 2531760 2482394 2725555 3013002 3198532 3263884 3160448 3145945 3675831
2433C675831o5825k59147l56121N52214M75995m14633o6188L06017M53646J63322
$$ 3675831 3610006 3350859 2994738 3546952 4022947 3608314 3542126 3848143 4301789 4465111
2423D465111J99908k98451Q3684J10279J70541K58124m72430N16748N03312J03163
$$ 4465111 4665019 4366568 4450252 4560531 4731072 4989196 4516766 5033514 5536826 5639989
2413E639989K40953K96539l04706L84400N89199j84845P53792O80814j15272o8571
$$ 5639989 5880942 6177481 5872775 6257175 6846374 6661529 7415321 8096135 7980863 7912292
2403G912292K53188j83418Q25281K71278L06178K64294l1869r1460M0138N05106
$$ 7912292 8165480 7982062 8807343 9078621 9384799 9649093 9617224 9525764 9565902 10071008
2393A0071008L01890N14502R77849K38517o177N18506L82724L83505O84253J85074
$$ 10071008 10372898 10887400 11865249 12103766 12097589 12616095 12998819 13382324 14066577 14251651
2383A4251651P70344R57463M54580J220299J734757J126310J525664J464194K565060
$$ 14251651 15021995 15979458 16434038 17654337 19389094 20515404 22041068 23505262 26070322
2374B6070322K586210L274160J374131K147102K331906L503786M057095M774313
$$ 26070322 28656532 31930692 33304823 35451925 37783831 41287617 45344712 50119025
2366E0119025N222599P141423Q440469J1162489J1781187J5508522K0630219L2529033
$$ 50119025 55341624 62483047 70923516 82086005 93867192 109375714 130005933 162534966
2358A62534966J5806541k9580812l1359133k1963806j4580000j2224793j0267211
$$ 162534966 178341507 148760695 117401562 95437756 80857756 68632963 58365752
2351E8365752q680229o216425n283763m521921l459290k344194j755043m91373
$$ 58365752 49685523 43469098 38185335 33663414 30204124 27859930 26104887 25613514
2343B5613514j334432k621420j642578j823919j479914j248359j146120j425525
$$ 25613514 24279082 21657662 20015084 18191165 16711251 15462892 14316772 12891247
2335A2891247n70080o42399j125568m97452l79070l3148m57153r3931p66335o66319
$$ 12891247 12321167 11678768 10553200 10055748 9676678 9643530 9186377 9092446 8326111 7659792
2325G659792k22643m4319o64254m69582l54216n13083k53322J17810K77320k87793
$$ 7659792 7437149 7392830 6728576 6258994 5904778 5391695 5138373 5256183 5533503 5245710
2315E245710k93238K59706K9510q38081p7837p9662K42850J26203l95854m22503
$$ 5245710 4952472 5212178 5241688 4403607 4325770 4246108 4488958 4615161 4219307 3796804
2305C796804j08253q5551O9286M0096j48869j53820J45634N28249j31852j012570
$$ 3796804 3688551 3603000 3672286 3712382 3563513 3409693 3555327 4083576 3951724 2939154
2295B939154j65556K17869N5357n97231K59983M23321L2441r00189o84618o8495
$$ 2939154 2773598 2991467 3046824 2449593 2709576 3132897 3165338 2265149 1580531 1512036
2285A512036N06686L15310P057L23572m11607m89288J31554M68837j75129l028
$$ 1512036 2018722 2334032 2341089 2664661 2253054 1763766 1895320 2364157 2189028 2186000
2275B186000m3959o18809O8657M0140l14533n29333K71364L01076J37947p5126
$$ 2186000 2142041 1523232 1591889 1632029 1317496 788163 1059527 1360603 1498550 1423424
2265A423424J52169J31144O5384k54109k86809K63345O3194L3244j86928k65975
$$ 1423424 1575593 1706737 1772121 1518012 1231203 1494548 1557742 1590986 1404058 1138083
2255A138083m2588R666L20852p68961n0510P33982k90789q1643j42676j29797
$$ 1138083 1095495 1105161 1426013 657052 606542 1340524 1049735 968092 825416 695619
2245F95619L44123J1659K17921n09941j64762N5602J39755N47866j13803N8083
$$ 695619 1039742 1051401 1269322 759381 594619 650221 789976 1337842 1224039 1282122
2235A282122j48834P1360l78269j31398j19256l94701O41938J103l46595m29481
$$ 1282122 1133288 1204648 826379 694981 575725 181024 822962 824065 477470 47989
2225D7989j78844M36033k9703J41435N91580J23210l0518l85132L67084o56876
$$ 47989 -130855 305178 275475 416910 1008490 1131700 1101182 716050 1083134 426258
2215D26258J86401m24564P6509O7641m2324l20611J55465L40478l88671O23334
$$ 426258 612659 188095 264604 332245 289921 -30690 124775 465253 76582 699916
2205F99916j60486N04019L73052o65349q4193m15692k13917k85357O18683M10860
$$ 699916 539430 1043449 1416501 751152 666959 251267 37350 -248007 370676 781536
2195G81536J15984k31731j41132M52199l35735R3505j08017K09899p28532M18286
$$ 781536 897520 665789 524657 976856 641121 734626 626609 836508 107976 526262
2185E26262k01483K0040M04944M9543O40318m32175n09844P8807K18428l88209
$$ 526262 324779 344819 749763 799306 1439624 1007449 497605 576412 794840 406631
2175D06631j97332m0021k06446J80898N9669q8090o0607J91741J84845J30893
$$ 406631 209299 169278 -37168 143730 203399 115309 54702 246443 431288 562181
2165E62181K66687P2352o3783q701j23521m89025k99383k67198K41263K43785
$$ 562181 828868 901220 837437 828736 705215 216190 -83193 -350391 -109128 134657
2155A34657j47084K96411M3426N86636l56716M5258l29015N1334m49381l5833
$$ 134657 -12427 283984 327410 914046 557330 602588 273573 324907 -124474 -160307
2145a60307K19558L47350K15695j84706m4661k11246L1997K4251p2167J31756
$$ -160307 59251 406601 622296 437590 392929 181683 213680 237931 165764 297520
2135B97520l65829L91504P20375k73583j97694p4521O0630k05735o696N3761p3544
$$ 297520 -68309 323195 1043570 769987 572293 497772 558402 352667 345971 399732 326188
2124C26188n8615j61564J44126p9243N03458k95735j06107l44698L04730K03187
$$ 326188 267573 106009 250135 170892 674350 378615 272508 -72190 232540 435727
2114D35727l47585j95197K53826L46510j57892j1666J10048J9663j8990m30554
$$ 435727 88142 -107055 146771 493281 335389 323723 433771 453434 434444 3890
2104C890l6301K57019j47603N21355j54149j04976M80241L0545K51347j52343
$$ 3890 -32411 224608 77005 598360 444211 339235 819476 850021 1101368 949025
2094I49025l97457N25520l27074K727l99218K29331k42032L26235L33774k13732
$$ 949025 551568 1077088 750014 752741 353523 582854 340822 667057 1000831 787099
2084G87099l4254k6127j92102l94586K19255j9025M2041Q4601j31045j86378L78831
$$ 787099 752845 726718 534616 140030 359285 340260 382301 466902 335857 149479 528310
2073E28310p6778K23565R3747o10139J47272j26333K56866J93655k55763o40584
$$ 528310 451532 675097 768844 158705 305977 179644 436510 630165 374402 -266182
2063b66182J33836l5460N08821N33675k0052M3888k08274r815q16064j24344M76253
$$ -266182 -132346 -167806 341015 874690 854638 898526 690252 680437 -135627 -259971 216282
2052B16282l86415k89624O22985l18153J15618j92947k17617K90067j48022J20762
$$ 216282 -170133 -459757 163228 -154925 -39307 -232254 -449871 -159804 -307826 -187064
2042a87064M73610j91268k64785q2131l74561L47972P13118j18675j55198J53745
$$ -187064 286546 95278 -169507 -251638 -626199 -278227 434891 316216 161018 314763
2032C14763m93256K45627J26714N32418k53398j18684Q0362m11051J07477J11309
$$ 314763 -178493 67134 193848 726266 472868 354184 434546 23495 130972 242281
2022B42281M4870J97055j70829n33822L25451J06096k52440K27518k8235j86130
$$ 242281 287151 484206 313377 -220445 105006 211102 -41338 186180 157945 -28185
2012b8185l06284L48891M5204j2366Q4077O4986m8206p6146k95738M20430L2358
$$ -28185 -334469 14422 59626 47260 131337 196323 148117 71971 -223767 196663 229021
2001B29021j81361l05650m30277K09788J038345K6274l81588m85898M82091k65171
$$ 229021 47660 -257990 -688267 -478479 559866 586140 204552 -281346 200745 -64426
1991f4426K82055P76699m62120M4820L906o59841m07526M46958K4498l0006j45048
$$ -64426 217629 994328 532208 577028 580934 -78907 -486433 -39475 -14977 -44983 -190031
1980a90031J90476K81541l47243K93681L15555o07775P71135j08621m08093l67169
$$ -190031 445 281986 -65257 228424 543979 -63796 707339 598718 190625 -176544
1970a76544N00848j84010N3563M24943m59899k07201M80001l19499L29239J34947
$$ -176544 324304 140294 193857 618800 158901 -48300 431701 112202 441441 576388
1960E76388l598m02382j637n82551J98160M78935l84265K15455J43028j38383
$$ 576388 572790 170408 168771 -413780 -215620 263315 -120950 94505 237533 99150
1950I9150j98390L3028J51457m42070j03246N51401K02640K29283n22571j43790
$$ 99150 -99240 -66212 85245 -356825 -460071 91330 293970 523253 682 -143108
1940a43108O07308p9730j19889K89081q2687q7194m5657M1066l21261O6266p435
$$ -143108 464200 384470 264581 553662 470975 383781 338124 379190 57929 124195 116760
1929A16760J20373j69560J22013l6620K82214k55324R0456K28611k09428n1164
$$ 116760 237133 67573 189586 152966 435180 179856 270312 498923 289495 238331
1919B38331m85500q0307K92500J62908M97567k73406R6988J21512m9974n8246
$$ 238331 -247169 -327476 -34976 127932 625499 352093 449081 570593 520619 462373
1909D62373r8696J78005j38669j62979q4904m19950k71009l4935N95549n6837
$$ 462373 363677 541682 403013 240034 155130 -264820 -535829 -570764 24785 -32052
1899c2052j12041j06417N66253k19336o56982O27053P5544n0357N73995J48292
$$ -32052 -144093 -250510 315743 96407 -560575 66478 142022 91665 665660 813952
1889H13952q80154j40806L75717L8993o9879j0688j09273M52698o59678J1678
$$ 813952 -66202 -207008 168709 207702 137823 127135 17862 470560 -189118 -177440
1879a77440J79139J63409O9223L03494N5528l34683n5202N1374l37308j43387
$$ -177440 1699 165108 234331 537825 593353 258670 203468 254842 -82466 -225853
1869b25853M50872p5045p5789M58790p88434r6780J1701q9957l04268P01388L91215
$$ -225853 225019 149974 74185 532975 -255459 -352239 -340538 -430495 -734763 -33375 357840
1858C57840K11025K50140l04520k82375L78244j84970p13911j46336k17608J01496
$$ 357840 568865 819005 514485 232110 610354 425384 -288527 -434863 -652471 -550975
1848e50975r7819O1372K91445j55956P4101L41341K51957k77371J74636l65076
$$ -550975 -648794 -587422 -295977 -451933 -377832 -36491 215466 -61905 112731 -252345
1838b52345l90754K33952L46882L06190n89447o1757j94399O65513K88355L45082
$$ -252345 -643099 -409147 -62265 243925 -345522 -407279 -601678 63835 352190 697272
1828F97272N6257o14512N1000K46012M9609n39758l96094J09155N04039L46394
$$ 697272 753529 139017 190017 436029 485638 -54120 -450214 -341059 162980 509374
1818E09374O8757j05691o75294k96602L49268l7923J34672j52466k03875J26084
$$ 509374 578131 472440 -202854 -499456 -150188 -188111 -53439 -205905 -409780 -283696
1808b83696j52978n2967J82614M68662L53897l84068M6022J95809m80396K74292
$$ -283696 -436674 -489641 -307027 161635 515532 131464 177486 373295 -107101 167191
1798A67191J15603j2338j84272K14303n69080M06016K74988k55836J30753N14377
$$ 167191 282794 270456 86184 300487 -268593 137423 412411 156575 287328 801705
1788H01705k31260m49541j20748J73558M3405j77095k36187l10372J59214L59592
$$ 801705 570445 120904 156 173714 217119 40024 -196163 -506535 -347321 12271
1778A2271k02463J31304m33284Q92234Q7902n39858r5184L84182m19367l15317
$$ 12271 -190192 -58888 -492172 400062 487964 -51894 -147078 237104 -182263 -497580
1768d97580K4521N58588j73468l86499J89977J85339q289O0167J67059j01202
$$ -497580 -473059 85529 -87939 -474438 -284461 -99122 -107411 -47244 119815 18613
1758A8613m0631K52150J28066J93591j09459L31264k50913q75710M34218k90764
$$ 18613 -22018 230132 358198 551789 442330 773594 522681 -353029 81189 -209575
1748b09575N74206l68289o358j26530n2584K26653p6087k7798J53269n38400q22
$$ -209575 364631 -3658 -10016 -136546 -189130 37523 -38564 -66362 86907 -451493 -452315
1737d52315j83902J41602L35756K76036M57807r84160O9975J34711R445J69370
$$ -452315 -636217 -494615 -158859 117177 574984 -409176 -339201 -204490 -195045 -25675
1727b5675l09301K96133M3952P70420k71192o3131p15550n3265J76101k63991
$$ -25675 -334976 -38843 5109 775529 504337 441206 -274344 -327609 -151508 -415499
1717d15499N9388J96109j44828k68767k25875k25031j46923M45524k90547M9136
$$ -415499 -356111 -160002 -304830 -573597 -799472 -1024503 -1171426 -725902 -1016449 -967313
1707i67313Q91013M72468k02626R7009J10999P7224p162O196k5985k90138j44662
$$ -967313 -76300 396168 193542 290551 401550 478774 471612 477808 451823 161685 17023
1696A7023j79628J64397m7533k22067j43473M05441J32646J27183k09399L79344
$$ 17023 -162605 1792 -45741 -267808 -411281 -5840 126806 253989 44590 423934
1686D23934r384j80737J21530k75406m62356M36791O8442o9138j13019n8421K25848
$$ 423934 414550 233813 355343 79937 -382419 54372 122814 53676 -59343 -117764 108084
1675A08084m18228K45008j09632L49501J84616n73914R6183o61664K06041N21819
$$ 108084 -310144 -65136 -174768 174733 359349 -214565 -118382 -780046 -574005 -52186
1665e2186j76533o37084j90650M64546L9288M08133K29913r0028j2777k38193
$$ -52186 -228719 -865803 -1056453 -591907 -552619 -144486 85427 -4601 -17378 -255571
1655b55571j11474J17114l90603o25921m8362Q31000N12154k12746m05574N32423
$$ -255571 -367045 -249931 -640534 -1266455 -1314817 -483817 28337 -184409 -589983 -57560
1645e7560j07650M02270k07806j6637K01800k75336J62735l67873j7083k37377
$$ -57560 -165210 237060 29254 12617 214417 -60919 101816 -266057 -283140 -520517
1635e20517J86946L36431K7138k38677n59507O24071M70627k15545o3998P7771
$$ -520517 -333571 2860 29998 -208679 -768186 -144115 326512 110967 46969 124740
1625A24740l08245J33186M4761k12082O4522j05482o5508L35825K60029n7895
$$ 124740 -183505 -50319 -5558 -217640 -153118 -258600 -324108 11717 271746 213851
1615B13851j3650n52549n426M43046J75079K45427R3848m59037l85570n21067
$$ 213851 200201 -352348 -357774 85272 260351 505778 599626 140589 -244981 -766048
1605g66048N38779K01507k05042J02057k42101n8839N67633m55331J47221L35091
$$ -766048 -227269 -25762 -230804 -128747 -370848 -429687 137946 -317385 -170164 164927
1595A64927M21206j11607k31283m30900m76336J95958L25218K8390L71708r0507
$$ 164927 586133 474526 243243 -187657 -663993 -468035 -142817 -114427 257281 166774
1585A66774L240j91975k92783J53601K53269l58769M8362L8893l24660j48625
$$ 166774 170014 -21961 -314744 -161143 92126 -266643 -218281 -179388 -504048 -652673
1575f52673M43975N55341j95009J08913m8595Q9489j83826q8784k34962N14646
$$ -652673 -208698 346643 151634 260547 211952 301441 117615 28831 -206131 308515
1565C08515j83462o3634j67646K49888J34512m7047P2449q6954n70456M8100J96378
$$ 308515 125053 61419 -106227 143661 278173 231126 303575 216621 -353835 -305735 -109357
1554a09357M62028k62209o84645L25823J02422K82197k73785O7547l7022J0089
$$ -109357 352671 90462 -594183 -268360 -165938 116259 -157526 -89979 -127001 -116912
1544a16912l17594J75854m93896J52029J64717K57030M49056o6631K69832m93410
$$ -116912 -434506 -258652 -752548 -600519 -435802 -178772 270284 203653 473485 -19925
1534a9925m99363O08397M39208R7803M94700o38379l82629m55623L5445q050J07600
$$ -19925 -519288 89109 528317 626120 1120820 482441 99812 -355811 -320366 -328416 -220816
1523b20816L65382r3728j30088J9760J70685j74523K01558P6147p71601j16343
$$ -220816 144566 50838 -79250 -59490 111195 -63328 138230 214377 -557224 -673567
1513f73567K96579O09666j71056m22518L79995N94051j50614n641K86825q61555
$$ -673567 -376988 232678 61622 -360896 19099 613150 462536 456895 743720 -117835
1503a17835j31720N62128l64840k10787J52021k38298K43277p4884r895O6315
$$ -117835 -249555 312573 -52267 -263054 -111033 -349331 -106054 -180938 -190833 -124518
1493a24518j34364L88685K18852q3941k88043k96324M0041L8471j87396k5256
$$ -124518 -258882 129803 348655 264714 -23329 -319653 -279612 -241141 -428537 -453793
1483d53793L83709k70554J81279q8450l6116R2457J09851K80792k22843L33897
$$ -453793 -70084 -340638 -159359 -247809 -283925 -191468 -81617 199175 -23668 310229
1473C10229j27700o42295O7631J51199Q9540K23703k11387k07695K97542k61742
$$ 310229 182529 -459766 -392135 -240936 -151396 72307 -139080 -346775 -49233 -310975
1463c10975n75669K73846M12776l13987J10210L58501P5222J65009k92025p2717
$$ -310975 -886644 -612798 -200022 -514009 -403799 -45298 29924 194933 -97092 -169809
1453a69809J29713k19213M6382K73425j30829j77026l20658M66229O3517M53745
$$ -169809 -40096 -259309 -212927 60498 -70331 -247357 -568015 -101786 -38269 415476
1443D15476j31969l33042m51183K50545N26353j17930m81430J05474K91611k72641
$$ 415476 283507 -49535 -500718 -250173 276180 158250 -323180 -217706 73905 -198736
1433a98736Q5601m72602J74420j13162K33324j49369J12928J78362m55620J26536
$$ -198736 -113135 -585737 -411317 -524479 -291155 -440524 -327596 -149234 -604854 -478318
1423d78318J2456k92033K28022K99189m1863n8865j98583K3891M38296M11885
$$ -478318 -465862 -757895 -529873 -230684 -272547 -331412 -529995 -506104 -67808 344077
1413C44077K95462k08322o74393j05028K22798j93813J09929L63525k17221j5528
$$ 344077 639539 431217 -243176 -348204 -125406 -319219 -209290 154235 -62986 -78514
1403g8514N36820j81757k04882K69765J8668j014066j48664M71896K68216K0794
$$ -78514 458306 276549 71667 341432 360100 -653966 -802630 -330734 -62518 -41724
1393d1724j51876K46792p4597L3410J07251O7330l48159R3184m44878l90747K07860
$$ -41724 -193600 53192 -21405 12005 119256 186586 -161573 -68389 -513267 -904014 -696154
1382f96154M02503j17428L42622J6704j71598L75460K62013o02681J44995K45416
$$ -696154 -293651 -411079 -68457 -51753 -223351 152109 414122 -188559 -43564 201852
1372B01852j36439N4479j40390K32460q6608k67588K23609l56794m02048r936
$$ 201852 65413 119892 -20498 211962 125354 -142234 81375 -275419 -677467 -687403
1362f87403O21537K35209N65115j48160l86491J95897N4356m07861j50211R8147
$$ -687403 -65866 169343 734458 586298 199807 395704 450060 42199 -108012 -9865
1352i865k71847M31217K98990J57617n23472j31786m06862L5903M86754k46503
$$ -9865 -281712 149505 448495 606112 82640 -49146 -456008 -420105 66649 -179854
1342a79854n3167j72978k43707j30517O3179M77128j95513M79574L8184k33998
$$ -179854 -233021 -405999 -649706 -780223 -717044 -239916 -435429 44145 82329 -151669
1332a51669k50488Q71714j30855L56817m00603n66134k07476K79468K46533J8846
$$ -151669 -402157 469557 338702 695519 294916 -271218 -478694 -199226 47307 66153
1322F6153m99145K19834k77110j3214L08424n37789r7683O15489J62966j96951
$$ 66153 -432992 -213158 -490268 -503482 -195058 -732847 -830530 -215041 -52075 -249026
1312b49026k4812k18388M33335m73795M59879M72106K02033K42056K52523l43094
$$ -249026 -273838 -492226 -58891 -532686 -72807 399299 601332 843388 1095911 752817
1302G52817n45513O1212r8036j46776j143m20118R0962q6291M50897K22435k1215
$$ 752817 207304 268516 170480 23704 22561 -397557 -306595 -392886 58011 280446 259231
1291B59231p6766m88925l12027J25534K80370L3604l16222L10298L16927j04426
$$ 259231 182465 -306460 -618487 -492953 -212583 -178979 -495201 -184903 132024 27598
$$ [...]
##END NTUPLES=NMR SPECTRUM
##END=
