##TITLE=1H_CG-1206-A22
 CDCl3
 8 sc, 
 13.8.2024
##JCAMPDX= 6.0         $$ Bruker NMR JCAMP-DX V2.0
##DATA TYPE= NMR SPECTRUM
##DATA CLASS= NTUPLES
##ORIGIN= UXNMR, Bruker Analytische Messtechnik GmbH
##OWNER= root
$$ XWIN-NMR		Version 3.5
$$ Tue Aug 13 14:13:29 2024 Russian Standard Time (UT+4h)  she@DPX200
##.OBSERVE FREQUENCY= 200.1313
##.OBSERVE NUCLEUS= ^1H
##.ACQUISITION MODE= SIMULTANEOUS
##.ACQUISITION SCHEME= undefined
##.AVERAGES= 8
##.DIGITISER RES= 18
##SPECTROMETER/DATA SYSTEM= spect
##.PULSE SEQUENCE= zg30
##.SOLVENT NAME= DMSO
##.SHIFT REFERENCE= (INTERNAL, DMSO, 0, 21.2265)
##AUDIT TRAIL= $$ (NUMBER, WHEN, WHO, WHERE, WHAT)
$$ ##TITLE= Audit trail, XWIN-NMR		Version 3.5
$$ ##JCAMPDX= 5.01
$$ ##ORIGIN= Bruker BioSpin GmbH
$$ ##OWNER= she
$$ F:/spectra/data/she/nmr/H-F/1/pdata/1/auditp.txt
$$ ##AUDIT TRAIL=  $$ (NUMBER, WHEN, WHO, WHERE, WHAT)
(   1,<2024-08-13 14:12:09.53 +0400>,<she>,<DPX200>,
      <created by zg, POWCHK disabled, PULCHK disabled
       configuration hash MD5:
       00 E9 B6 7A A2 85 ED C7 34 08 36 98 17 FE 4E 26
       data hash MD5: 16K
       BB 1C AE EA 44 8A 3D CF 56 6E A4 FC B9 E0 74 29>)
(   2,<2024-08-13 14:12:16.73 +0400>,<she>,<DPX200>,
      <Start of raw data processing
       efp BC_mod = 2 LB = 0.24 FT_mod = 6 PKNL = 1 PHC0 = -25997.04 PHC1 = 13.78749 SI = 16K 
       data hash MD5: 16K
       E9 B4 2F D5 D8 E6 38 72 FC 5E 02 1B B0 77 06 99>)
(   3,<2024-08-13 14:12:37.21 +0400>,<she>,<DPX200>,
      <pk PHC0 = -11.90631 PHC1 = 16 
       data hash MD5: 16K
       E6 0F B0 30 E6 A1 70 FA 63 C3 F4 4C 5A 6B 0F 09>)
(   4,<2024-08-13 14:12:40.75 +0400>,<she>,<DPX200>,
      <abs ABSG = 5 
       data hash MD5: 16K
       7F 23 2B 77 DF 90 FD 7D D4 FA 00 A3 F4 8E 46 F5>)
(   5,<2024-08-13 14:12:58.31 +0400>,<she>,<DPX200>,
      <abs ABSG = 5 
       data hash MD5: 16K
       EC D1 21 97 2F C5 F6 A2 91 65 68 AB E4 A7 21 AE>)
$$ ##END=
$$ 
$$ hash MD5
$$ A0 78 B8 54 E8 A5 CC 1C 47 0F E6 DC 96 DD 68 CE
##$RELAX= 
##$RELAX= 
##$RELAX= 
##$RELAX= 
##$RELAX= 
##$RELAX= 
$$ Bruker specific parameters
$$ --------------------------
##$DU= <F:/spectra>
##$EXPNO= 1
##$NAME= <H-F>
##$PROCNO= 1
##$TYPE= <nmr>
##$USER= <she>
##$AMP= (0..31)
100 100 100 100 100 100 100 100 100 100 100 100 100 100 100 100 100 100 
100 100 100 100 100 100 100 100 100 100 100 100 100 100 
##$AQSEQ= 0
##$AQ_mod= 1
##$AUNM= <au_zg>
##$AUTOPOS= <>
##$BF1= 200.13
##$BF2= 200.13
##$BF3= 200.13
##$BF4= 200.13
##$BF5= 200.13
##$BF6= 200.13
##$BF7= 200.13
##$BF8= 200.13
##$BYTORDA= 1
##$CFDGTYP= 0
##$CFRGTYP= 5
##$CHEMSTR= <none>
##$CNST= (0..31)
1 1 145 1 1 1 1 1 1 1 1 1 1 1 1 1 1 1 1 1 1 1 1 1 1 1 1 1 1 1 1 1 
##$CPDPRG= <>
##$CPDPRG1= <>
##$CPDPRG2= <>
##$CPDPRG3= <>
##$CPDPRG4= <mlev>
##$CPDPRG5= <mlev>
##$CPDPRG6= <mlev>
##$CPDPRG7= <mlev>
##$CPDPRG8= <mlev>
##$CPDPRGB= <>
##$CPDPRGT= <>
##$D= (0..31)
0 1.2 0 0 0 0 0 0 0 0.06 0 0.03 0 0 0 0 0.0002 0 0 0 0 0 0 0 0 0 0 0 0 
0 0 0 
##$DATE= 1723543929
##$DBL= (0..7)
$$ [...]
##$SUBNAM3= <"">
##$SUBNAM4= <"">
##$SUBNAM5= <"">
##$SUBNAM6= <"">
##$SUBNAM7= <"">
##$SUBNAM8= <"">
##$SUBNAM9= <"">
##$SW= 24.0689771365484
##$SWIBOX= (0..15)
0 0 2 0 0 0 0 0 0 0 0 0 0 0 0 0 
##$SW_h= 4816.95568400771
##$TD= 16384
##$TD0= 1
##$TE= 0
##$TE2= 300
##$TE3= 300
##$TEG= 300
##$TL= (0..7)
0 120 120 120 120 120 120 120 
##$TP= (0..7)
150 150 150 150 150 150 150 150 
##$TP07= 0
##$TPNAME0= <>
##$TPNAME1= <>
##$TPNAME2= <>
##$TPNAME3= <>
##$TPNAME4= <>
##$TPNAME5= <>
##$TPNAME6= <>
##$TPNAME7= <>
##$TPOAL= (0..7)
0.5 0.5 0.5 0.5 0.5 0.5 0.5 0.5 
##$TPOFFS= (0..7)
0 0 0 0 0 0 0 0 
##$TUNHIN= 0
##$TUNHOUT= 0
##$TUNXOUT= 0
##$USERA1= <user>
##$USERA2= <user>
##$USERA3= <user>
##$USERA4= <user>
##$USERA5= <user>
##$V9= 5
##$VALIST= <valist>
##$VCLIST= <CCCCCCCCCCCCCCC>
##$VD= 0
##$VDLIST= <DDDDDDDDDDDDDDD>
##$VPLIST= <PPPPPPPPPPPPPPP>
##$VTLIST= <TTTTTTTTTTTTTTT>
##$WBST= 1024
##$WBSW= 4
##$XGAIN= (0..3)
0 0 0 0 
##$XL= 0
##$YL= 0
##$YMAX_a= 165802
##$YMIN_a= -133776
##$ZGOPTNS= <>
##$ZL1= 120
##$ZL2= 120
##$ZL3= 120
##$ZL4= 120
##$ABSF1= 21.22655
##$ABSF2= -2.842649
##$ABSG= 5
##$ABSL= 3
##$ALPHA= 0
##$AQORDER= 0
##$ASSFAC= 0
##$ASSFACI= 0
##$ASSFACX= 0
##$ASSWID= 0
##$AUNMP= <proc_1d>
##$AZFE= 0.1
##$AZFW= 0.1
##$BCFW= 0
##$BC_mod= 2
##$BYTORDP= 0
##$COROFFS= 0
##$CY= -3
##$DATMOD= 1
##$DC= 0
##$DFILT= <>
##$DTYPP= 0
##$F1P= 0
##$F2P= 0
##$FCOR= 1
##$FTSIZE= 16384
##$FT_mod= 6
##$GAMMA= 0
##$GB= 0
##$INTBC= 1
##$INTSCL= 3.70164e-10
##$ISEN= 128
##$LB= 0.24
##$LEV0= 0
##$LPBIN= 0
##$MAXI= 10000
##$MC2= 0
##$MEAN= 0
##$ME_mod= 0
##$MI= 1.114404
##$NCOEF= 0
##$NC_proc= -8
##$NLEV= 6
##$NOISF1= 3.799351
##$NOISF2= 2.8
##$NSP= 0
##$NTH_PI= 0
##$NZP= 0
##$OFFSET= 21.22655
##$PC= 1
##$PHC0= -26008.95
##$PHC1= 29.78749
##$PH_mod= 1
##$PKNL= yes
##$PPARMOD= 0
##$PSCAL= 0
##$PSIGN= 0
##$REVERSE= no
##$SF= 200.129460418825
##$SI= 16384
##$SIGF1= 3
##$SIGF2= 2
##$SINO= 5.538805
##$SIOLD= 16384
##$SREGLST= <1H.CDCl3>
##$SSB= 0
##$STSI= 16384
##$STSR= 0
##$SW_p= 4816.95568400771
##$SYMM= 0
##$S_DEV= 0
##$TDeff= 16384
##$TDoff= 0
##$TI= <>
##$TILT= no
##$TM1= 0
##$TM2= 0
##$TOPLEV= 0
##$USERP1= <user>
##$USERP2= <user>
##$USERP3= <user>
##$USERP4= <user>
##$USERP5= <user>
##$WDW= 1
##$XDIM= 16384
##$YMAX_p= 270905940
##$YMIN_p= -8173197
$$ End of Bruker specific parameters
$$ ---------------------------------
##NTUPLES= NMR SPECTRUM
##VAR_NAME=  FREQUENCY,     SPECTRUM/REAL,   SPECTRUM/IMAG
##SYMBOL=    X,             R,               I
##VAR_TYPE=  INDEPENDENT,   DEPENDENT,       DEPENDENT
##VAR_FORM=  AFFN,          ASDF,            ASDF
##VAR_DIM=   16384,         16384,           16384
##UNITS=     HZ,            ARBITRARY UNITS, ARBITRARY UNITS
##FACTOR=    0.29402158847633, 1,            1
##FIRST=     4248.0578276549, 0,             0
##LAST=      -568.897856352814, 0,           0
##MIN=       -568.897856352814, -8173197,    0
##MAX=       4248.0578276549, 270905940,     0
$$ Real data points
##PAGE= N=1
##DATA TABLE= (X++(R..R)), XYDATA
$$ [...]
5943H31552n16996n05926j00718l4380L53226l46174K47835O63528M5138K09282
$$ 831552 314556 -191370 -292088 -326468 26758 -319416 -71581 591947 637085 846367
5933H46367O0035l36963j023503r51703J977201N11777j092831j266308J014550
$$ 846367 906402 569439 -454064 -1405767 571434 1083211 -9620 -1275928 -261378
5924b61378J026998L37787k83992l84096m83322k05726O88194o05943J93663j42825
$$ -261378 765620 1103407 819415 435319 -48003 -253729 434465 -171478 22185 -120640
5914a20640K39217j38658R9275Q3035j75241L16114j167393p8511N94517L48285
$$ -120640 118577 -20081 79194 162229 -13012 303102 -864291 -942802 -348285 0
5904@l03033o37066O47692j68996o98898j37126P51997m2699R54916K64342L8595
$$ 0 -303033 -940099 -292407 -461403 -1160301 -1297427 -545430 -588129 366787 631129 669724
5893F69724n35636r33865l52526J83246P69561J15968o55552K00883P29927q78435
$$ 669724 134088 -799777 -1152303 -969057 -199496 -83528 -739080 -538197 191730 -686705
5883f86705Q76312p74109J37889L04031l89992N05458K31648n92345m08098N30941
$$ -686705 189607 -584502 -446613 -142582 -532574 -27116 204532 -387813 -795911 -264970
5873b64970m19723j42731j73554O73213m66851m59490N80710R22501k33395N57108
$$ -264970 -684693 -827424 -1000978 -327765 -794616 -1254106 -673396 249105 15710 572818
5863E72818j80735j359749M22801M20337k34460L47303j03485q3385J79516l62350
$$ 572818 392083 -967666 -544865 -124528 -358988 -11685 -115170 -198555 -19039 -381389
5853c81389M65976l98839j019131J143274L50172L4679k94450N80016q82197K84191
$$ -381389 84587 -314252 -1333383 -190109 160063 194742 -99708 480308 -401889 -117698
5843a17698n71493P25006j16586j18588m00171j20055n73127O91680J6954n07936
$$ -117698 -689191 35815 -80771 -199359 -599530 -719585 -1292712 -601032 -584078 -1092014
5833a092014N04490R87313m08160l65957l43653m65992K18583m73301O97476l64655
$$ -1092014 -587524 399789 -8371 -374328 -717981 -1183973 -965390 -1438691 -741215 -1105870
5823a105870M12270j64250j821l33515L91993N55521k04075k92146O42633O5432
$$ -1105870 -693600 -857850 -859671 -1193186 -801193 -245672 -449747 -741893 -99260 -33828
5813c3828L10405j036531L70341K96383k2900J79390Q8926L6131k16612m34749
$$ -33828 276577 -759954 -389613 -93230 -116130 63260 152186 188317 -28295 -463044
5803d63044M12375L58382j137560R8794q9109p3620P15844M56177k24619j14281
$$ -463044 -50669 307713 -829847 -731053 -820162 -893782 -177938 278239 53620 -60661
5793f0661L52599O50352L71898o94285P8516o50565L87943p04402n37741O70530
$$ -60661 291938 942290 1314188 619903 698419 47854 435797 -268605 -806346 -135816
5783a35816P96016J97597q90145m29013n92531J332473l88126L26265J021555
$$ -135816 660200 857797 -32348 -461361 -1053892 278581 -109545 216720 1238275
5774A238275m90776L00868L41436l25785j071382P29585Q1470m09316l97011K95044
$$ 1238275 747499 1048367 1389803 1064018 -7364 722221 803691 394375 -2636 292408
5764B92408j78184l96864o52566j025314J463772N86124j9414J6278J36238l44685
$$ 292408 114224 -282640 -935206 -1960520 -496748 89376 69962 86240 222478 -122207
5754a22207l029L50109j25313K96649n20172n62898p4648N70716Q38002k21647
$$ -122207 -125236 224873 99560 396209 -123963 -686861 -761509 -190793 647209 425562
5744D25562o46047m59264M96743J059364P3831R18528j771578l11628l71430J32290
$$ 425562 -220485 -679749 -183006 876358 950189 1868717 97139 -214489 -585919 -453629
5734d53629n05344O59394Q30160j00226l87264l49438K27968j29408R51076o34139
$$ -453629 -958973 -299579 530581 430355 43091 -306347 -78379 -207787 743289 109150
5724A09150J89092J97092m93000j99801o26177N89018p29697J74663J381310N4554
$$ 109150 298242 495334 2334 -197467 -823644 -234626 -964323 -789660 591650 646204
5714F46204k81056M6313n31924J448l85572N11154L60736m79541N35118q46642
$$ 646204 365148 411461 -120463 -119015 -504587 6567 367303 -112238 422880 -423762
5704d23762K68229j95754l80406O02397K99929N29116L7512l26014o58750O88750
$$ -423762 -155533 -351287 -731693 -129296 170633 699749 737261 411247 -247503 441247
5694D41247m06841M4768Q3971m5738K26593m81567J342788j155676o93464l32477
$$ 441247 34406 79174 163145 117407 344000 -137567 1205221 49545 -643919 -976396
5684i76396R76048K88888m13991n81976K54865N54400o05694M77640o08011M24100
$$ -976396 -348 288540 -125451 -707427 -452562 101838 -503856 -26216 -634227 -210127
5674b10127R88796j197362m23919P72073O1670m3643j028896K6803J17937k39913
$$ -210127 778669 -418693 -842612 -70539 -8869 -52512 -1081408 -1054605 -936668 -1176581
5664a176581K57572J69759O28864n76522l82988R81511j85246j84127Q80063l88880
$$ -1176581 -919009 -749250 -120386 -696908 -1079896 -98385 -283631 -467758 412305 23425
5654B3425n8584K56498o27119m57607L00158N21321N87139r11413o7805O79798
$$ 23425 -35159 221339 -405780 -863387 -563229 -41908 545231 -366182 -433987 245811
5644B45811O47264j175556k59766n73260K24451R99905K4955K9872l4963p61051
$$ 245811 893075 -282481 -542247 -1115507 -891056 108849 133804 163676 128713 -632338
5634f32338k33442M00210O26140M54478r13239J82937L52580k91163K62418k63787
$$ -632338 -865780 -465570 160570 615048 -298191 -115254 237326 -53837 208581 -55206
5624e5206k68661p1281M18673n22914j51781j69348l4940l71596L35557l41502
$$ -55206 -323867 -395148 23525 -499389 -651170 -820518 -855458 -1227054 -891497 -1232999
5614a232999R61697n20432L6710J79141l65731k72572M81709N25978q14690M40369
$$ -1232999 -271302 -791734 -755024 -575883 -941614 -1214186 -732477 -206499 -1021189 -580820
5604e80820L60504j414777K71589J358414j21149q83910o7941P9095j40122P11038
$$ -580820 -220316 -1635093 -1363504 -5090 -126239 -1010149 -1078090 -998995 -1139117 -428079
5594d28079p52248K50782R24955m22806k05535O8284k84280Q80310N60290r38555
$$ -428079 -1180327 -929545 -4590 -427396 -632931 -564647 -848927 31383 591673 -346882
5584c46882M46027P82357j449055J602377j008051m7060k7259m05972M40315k71097
$$ -346882 99145 881502 -567553 1034824 26773 -20287 -47546 -453518 -13203 -284300
5574b84300o87836k33585P96861M37791l94285N1859p5860M27705n15180L3519
$$ -284300 -972136 -1205721 -408860 28931 -365354 -313495 -389355 38350 -476830 -443311
5564d43311r6251n8270M07181L82322k09638l83075Q17068j184322Q54888N3748
$$ -443311 -539562 -597832 -190651 191671 -17967 -401042 416026 -768296 86592 140340
5554A40340q81178K81605m34544J49849M23660L27870M41422m40315n93411P70628
$$ 140340 -740838 -459233 -893777 -743928 -320268 7602 449024 8709 -584702 185926
5544A85926q55448l7327l0266k22506K65023L43480J01628q10779N1259K76257
$$ 185926 -669522 -706849 -737115 -959621 -694598 -351118 -249490 -1060269 -1009010 -732753
5534g32753J413658p68922n89653N11554l2474M30748j64587Q47826k50847p52867
$$ -732753 680905 -88017 -677670 -166116 -198590 232158 67571 915397 664550 -88317
5524h8317k30958L33814Q0508q51582O76760L58813r8806r6088n77487N31036
$$ -88317 -319275 14539 95047 -756535 -79775 279038 180232 84144 -493343 37693
5514C7693J57427o77863j62185O34977L19176j57378M15013n57628K79827k03196
$$ 37693 195120 -482743 -644928 -9951 309225 151847 566860 9232 289059 85863
5504H5863m05947k76163J4253j50389o72455N97922k86733O5365Q62792J65928
$$ 85863 -320084 -596247 -581994 -732383 -1404838 -806916 -1093649 -1028284 -165492 436
5494D36J04596J09730p1083P92731p57829k29547o63928L69241k37127K37982
$$ 436 105032 214762 143679 936410 178581 -50966 -714894 -345653 -582780 -344798
5484c44798n49300M65971k76046o87604O48737M71089M19206j59761J83321N88643
$$ -344798 -894098 -428127 -704173 -1391777 -743040 -271951 147255 -12506 170815 759458
5474G59458k3267p69525q3456j11829M47090o49552L19747Q480Q00436j04495
$$ 759458 736191 -33334 -116790 -228619 218471 -431081 -111334 -102854 697582 593087
5464E93087j530069K42904N85313k75965J188942M15822j022502l95543m10629
$$ 593087 -936982 -694078 -108765 -384730 804212 1220034 197532 -198011 -608640
5455f08640L29628p49926J081311J051810K31095n74099o29068P97082j52267
$$ -608640 -279012 -1028938 52373 1104183 1335278 761179 132111 929193 776926
5446G76926o42289N83557N06007j37803K64339l64910J52801K7414o3461M40117
$$ 776926 134637 718194 1224201 1086398 1350737 985827 1138628 1166042 1102581 1542698
5436A542698R4992k0694o95187j296519l79957L61547R43868Q91688j107914N26323
$$ 1542698 1637690 1616996 921809 -374710 -754667 -393120 550748 1442436 334522 860845
5426H60845M71262j115796L32919M07760q03970N5984M4977q11108l88300L01407
$$ 860845 1332107 216311 549230 956990 153020 209004 253981 -557127 -945427 -644020
5416f44020J452740j80067N22992r25977J18338P8559J07202l13486j121947L99870
$$ -644020 808720 628653 1151645 225668 344006 422565 529767 216281 -905666 -505796
5406e05796J424350j86946p46418K04817M54160m87511K05969m65722J28282L88306
$$ -505796 918554 731608 -14810 190007 644167 156656 362625 -103097 25185 413491
5396D13491L55651m25621L62995N84840m41699r5297Q00057m23281j570767J207437
$$ 413491 769142 343521 706516 1291356 849657 754360 1554417 1131136 -439631 767806
5386G67806k76476o79914M86399O90206R3042n07117n94449M11535P24618p58813
$$ 767806 491330 -188584 297815 988021 1081063 573946 -20503 391032 1115650 356837
5376C56837K81393J83158o95446p71072k8822R20864K301O4619J54196n15616
$$ 356837 638230 821388 125942 -645130 -673952 246912 249213 313832 468028 -47588
5366d7588l65707J391995k8973j21242q92711n95503j38916P87295k5136O1196
$$ -47588 -413295 978700 949727 828485 -64226 -659729 -798645 -11350 -36486 24710
5356B4710R08969p70080k92871l1030O29465k83048L46229r04012O29427O02319
$$ 24710 933679 163599 -129272 -160302 469163 186115 532344 -371668 257759 860078
5346H60078j17263L99119k75013Q55926l59960J49397J44037j331772j15652j35416
$$ 860078 742815 1141934 866921 1722847 1362887 1512284 1656321 324549 208897 73481
5336G3481K71365j369o07443k23276M0303K11092R41207L38685l47375P01947
$$ 73481 344846 343477 -263966 -487242 -446939 -235847 705360 1044045 696670 1398617
5326A398617L2160l86389n75295j026212L77675P89369J0823l91025M72195K60617
$$ 1398617 1430777 1044388 469093 -557119 -179444 609925 620748 229723 701918 962535
5316I62535j23100j51887L89682k35821O8980l02900N89029n38004k90775J035668
$$ 962535 839435 687548 1077230 841409 910389 607489 1196518 658514 367739 1403407
5306A403407p40098l18438K8726k71731J5036N47483K77295p03610O78858K16791
$$ 1403407 663309 344871 373597 101866 116902 664385 941680 238070 916928 1133719
5296A133719m97960L74011o5417n53741M91115M16165o77116L46839m49938Q06681
$$ 1133719 635759 1009770 944353 390612 881727 1297892 620776 967615 517677 1324358
5286A324358p08778L57686k52194Q29978n65311n37220J59029j32589m71325j48343
$$ 1324358 615580 973266 721072 1551050 985739 448519 607548 474959 3634 -144709
5276a44709J53282L35663Q63640M20114J40688l82949l14399P88827Q1389j62656
$$ -144709 8573 344236 1207876 1627990 1768678 1385729 1071330 1860157 1941546 1778890
5266A778890k38863j20633n37848l97756J363316j22499O1935J927o31794p379
$$ 1778890 1540027 1419394 881546 483790 1847106 1724607 1786542 1788469 1156675 1149296
5256A149296k03424P54158N24610k8957q25523r06734K08981J372775K03945p10578
$$ 1149296 945872 1700030 2224640 2195683 1370160 463426 672407 2045182 2249127 1538549
5246A538549O93687m28782r3071J01902K97943L37160l80411R6139p25718P72828
$$ 1538549 2232236 1803454 1710383 1812285 2110228 2447388 2066977 2163116 1437398 2210226
5236B210226l67362j75588M31587o7807q9915N4695P40028l81855N4950p05248
$$ 2210226 1842864 1667276 2098863 2031056 1941141 1995836 2735864 2354009 2408959 1703711
5226A703711m2914l72902K2386N71114R0884P31164o61637J30025O03032o48310
$$ 1703711 1660797 1287895 1310281 1881395 1972279 2703443 2041806 2171831 2774863 2126553
5216B126553j85434L93853O4606m19163L45258n09693r3733j42561o33036J248479
$$ 2126553 1941119 2334972 2399578 1980415 2325673 1815980 1722247 1579686 946650 2195129
5206B195129P80161q0604q95948o91920K75756k68289K45835K3449K36771o83855
$$ 2195129 2975290 2894686 1998738 1306818 1582574 1314285 1560120 1583569 1820340 1136485
5196A136485m38347M06790J07289M75159m96206o01890O3129J016638M16926N6037
$$ 1136485 698138 1104928 1212217 1687376 1191170 589280 652409 1669047 2085973 2142010
5186B142010m04051j011956j9774J104202j240460P66782J29833m91313J4059
$$ 2142010 1737959 726003 706229 1810431 569971 1336753 1466586 975273 989332
5177I89332m99192o26984P03693j56453M57421P69808j019179p50870R31817K9951
$$ 989332 490140 -136844 566849 410396 867817 1637625 618446 -132424 799393 829344
5167H29344J24247K98041r49880J027928q18612M20850k05734o13223m07064J416476
$$ 829344 953591 1251632 301752 1329680 511068 931918 726184 112961 -294103 1122373
5157A122373J28662j39906O67277n76714j341017N32222m0307L46864J7188l78230
$$ 1122373 1251035 1111129 1778406 1201692 -139325 392897 352590 699454 716642 338412
5147C38412k03143R70221p1365l89929j31122K09946o1944p35477M37484N39936
$$ 338412 135269 1105490 1034125 644196 513074 723020 661076 -74401 363083 903019
5137I03019J403349k74710j595006O35393J80887l52892j81412N66097P53974
$$ 903019 2306368 2031658 436652 1072045 1252932 900040 718628 1284725 2038699
5128B038699o81180k20338j67354P1560N01893O9683o54422J01153N22018p58006
$$ 2038699 1357519 1137181 969827 1041387 1543280 1612963 958541 1059694 1581712 823706
5118H23706M70463m73155L70631M55251o46322k81010k78051P76214J066567O50320
$$ 823706 1294169 821014 1191645 1646896 1000574 719564 441513 1217727 2284294 2934614
5108B934614p92472L8867n05715m22530K14304j02581J10978O41783l5841o37776
$$ 2934614 2142142 2181009 1675294 1252764 1467068 1364487 1475465 2117248 2081407 1443631
5098A443631j48066q58532J795051l49739r8496k89924j41593n96628k7549M98145
$$ 1443631 1295565 437033 2232084 1882345 1783849 1493925 1352332 755704 728155 1226300
5088A226300P3041P10389N31444l77670m62876n26567m65776R76419L81416l49973
$$ 1226300 1299341 2009730 2541174 2163504 1700628 1174061 708285 1684704 2066120 1716147
5078A716147K78997N57404q49972J77K68399M35507K84736O02746l08433J71726
$$ 1716147 1995144 2552548 1702576 1702753 1971152 2406659 2691395 3294141 2985708 3157434
5068C157434k13614L19780M32286p61492j18581J43731k97776O59652L34346O7022
$$ 3157434 2943820 3263600 3695886 2934394 2815813 2959544 2661768 3321420 3655766 3722788
5058C722788O03561k13542n86908l86606q25569N77127O37286o88243L37119l43040
$$ 3722788 4326349 4112807 3525899 3139293 2313724 2890851 3528137 2839894 3177013 2833973
5048B833973n61381O99129J73005N19292j32634p31563j35400k11158k4469J51112
$$ 2833973 2272592 2971721 3144726 3664018 3531384 2799821 2664421 2453263 2428794 2579906
5038B579906J018650m1723r22812K0197R8132J13805k60270J18476P04228l67687
$$ 2579906 3598556 3556833 2634021 2654218 2752350 2866155 2605885 2724361 3428589 3060902
5028C060902k73758J76694J99714K33766j378176L2749J45229O94409n20420p18568
$$ 3060902 2787144 2963838 3163552 3397318 2019142 2051891 2197120 2891529 2371109 1652541
5018A652541M86823L08655j199939J287752L29975L02480l52433k9778n25917
$$ 1652541 2139364 2448019 1248080 2535832 2865807 3168287 2815854 2786076 2260159
5009B260159q6808L13135R77310k3316O77725j393767o83785J017659l48350j236648
$$ 2260159 2173351 2486486 3463796 3440480 4118205 2724438 2040653 3058312 2709962 1473314
4999A473314K82018R15812k16134N52881j208246n671N49251j75636k00223J115841
$$ 1473314 1755332 2671144 2455010 3007891 1799645 1793974 2343225 2167589 1967366 3083207
4989C083207N0761J9331k89171K55943o99270R386L98101O30317n44994L46738
$$ 3083207 3133968 3153299 2864128 3120071 2420801 2430187 2828288 3458605 2913611 3260349
4979C260349m59223k32441j50096Q92242Q59298q52812M02814j81426O39862r50992
$$ 3260349 2801126 2568685 2418589 3310831 4170129 3317317 3720131 3538705 4178567 3227575
4969C227575R65835j352296K00170L43680n73814R85922J38101k1525j28256j7117
$$ 3227575 4193410 2841114 3041284 3384964 2811150 3797072 3935173 3913648 3785392 3768275
4959C768275M8991N98914K3934k61353O91273j42443J7219l84003R24124Q2497
$$ 3768275 3817266 4416180 4440114 4178761 4870034 4727591 4744810 4360807 5284931 5367428
4949E367428O99706J78947k76331J75102l81007l42840L25293J565520n8630O9166
$$ 5367428 6067134 6246081 5969750 6144852 5763845 5421005 5746298 7311818 7253188 7322354
4939G322354k4084m11109l57450m56588K4350R01944j415879J285267Q71997L21873
$$ 7322354 7298270 6887161 6529711 6073123 6097473 6999417 5583538 6868805 7740802 8062675
4929H062675n45903q18777M16036J687891Q14217L08051j8809Q20122L2830r3899
$$ 8062675 7516772 6697995 7114031 8801922 9616139 9924190 9905381 10725503 10758333 10664434
4919A0664434k47404n79085j528084M53961J100105l63742k60472O39257j082572
$$ 10664434 10417030 9837945 8309861 8763822 9863927 9500185 9239713 9878970 8796398
4910H796398o08709j06889J544595L08779p50649j62441o22539J176285l46915
$$ 8796398 8187689 8080800 9625395 9934174 9183525 9021084 8398545 9574830 9227915
4901I227915M02513J003367p75005j34534o82775J84626l71885J21331j195162
$$ 9227915 9630428 10633795 9858790 9724256 9041481 9226107 8854222 8975553 7780391
4892G780391l79304N28153L68589p2975q99750R49160M0550o50968J273993P36156
$$ 7780391 7401087 7929240 8297829 8224854 7325104 8274264 8314814 7663846 8937839 9673995
4882I673995m97979j306428K32101L96974M62955O4755k31932L50702J34095j92000
$$ 9673995 9176016 7869588 8101689 8498663 8961618 9026373 8794441 9145143 9279238 9087238
4872I087238j185819k53315L6742L94135L77157q14766R68858L57878l67812J4932
$$ 9087238 7901419 7648104 7684846 8078981 8456138 7641372 8610230 8968108 8600296 8615228
4862H615228k1091L58383M68850l58294p69262J27658O63484K37221K34926p63432
$$ 8615228 8594137 8952520 9421370 9063076 8293814 8421472 9084956 9322177 9557103 8793671
4852H793671J66730N80655m32111J132297j13520p12145l27310L46148l70112
$$ 8793671 8960401 9541056 9108945 10241242 10127722 9415577 9088267 9434415 9064303
4843I064303O67425R682J50599n17899k70113M15360Q3739p59128P76563o42890
$$ 9064303 9731728 9741410 9892009 9374110 9103997 9519357 9603096 8843968 9620531 8977641
4833H977641J541750K52254j115218j39553R10876P9486k08368R55770L12410
$$ 8977641 10519391 10771645 9656427 9516874 10427750 10507236 10298868 11254638 11567048
4824A1567048o61325M03784M95615q06323j79152J71776o12387J004734J5765
$$ 11567048 10905723 11309507 11805122 10998799 10819647 10991423 10379036 11383770 11399535
4815A1399535k3065J7931N73035j99959k67157N37897R57273O15885k54745j56810
$$ 11399535 11376470 11394401 11967436 11767477 11500320 12038217 12995490 13611375 13356630 13199820
4805A3199820M78250O7769p9109P32771L03556L19249k48186N1461r09935j25960
$$ 13199820 13678070 13745839 13666730 14399501 14703057 15022306 14774120 14825581 13915646 13789686
4795A3789686Q50780O59091N3858L68544J1003P8354K23305Q24863N3308K06922
$$ 13789686 14640466 15299557 15353415 15721959 15732962 15811316 16034621 16859484 16912792 17119714
4785A7119714J630647K8777M6574k71361P22325K54648J48852K15494j59352K65060
$$ 17119714 18750361 18779138 18825712 18554351 19276676 19531324 19680176 19895670 19736318 20001378
4775B0001378j83546J063719R27557P61418L90271j45701J068522L41219L38133
$$ 20001378 19817832 20881551 21809108 22570526 22960797 22815096 23883618 24224837 24562970
4766B4562970P36982L35166R55858L16335O86909R56971Q5876J433010J509909
$$ 24562970 25299952 25635118 26590976 26907311 27594220 28551191 28637067 30070077 31579986
4757C1579986R74906J091937J012475J225573J59167M39284O80264J597630J615007
$$ 31579986 32554892 33646829 34659304 35884877 36044044 36483328 37163592 38761222 40376229
4748D0376229J645794J895135J860628K226535J990449K221784L015577M131041
$$ 40376229 42022023 43917158 45777786 48004321 49994770 52216554 55232131 59363172
4740E9363172M063046M278518N846166M968492N263241K789648J506668O72252
$$ 59363172 63426218 67704736 73550902 78519394 83782635 86572283 88078951 88751203
4732H8751203j489294j633072k305405l45668K64488o2417J485187Q67322K542520
$$ 88751203 87261909 85628837 83323432 82977764 83242252 83179835 84665022 85532344 88074864
4723H8074864M401202N633545O258870P841743Q585435J1134549J2298532J1923954
$$ 88074864 92476066 98109611 104368481 112210224 120795659 131930208 144228740 156152694
4715A56152694J0098965O252842L74118m672077p477958r576734j0328403q801563
$$ 156152694 166251659 172504501 172878619 168206542 160728584 151151850 140823447 132021884
4707A32021884p406612n715624l982128k199038q17139m64550K201096L347461
$$ 132021884 124615272 118899648 114917520 112718482 111901343 111436793 113637889 116985350
4699A16985350N715077O858699P355289Q999958J0053858P638382M248280r22750
$$ 116985350 122700427 129559126 136914415 145914373 155968231 163606613 167854893 166932143
4691A66932143n929647r710352j2165474j2047911j0798558r533569p604034n982551
$$ 166932143 161002496 151292144 139126670 127078759 116280201 106746632 99142598 93160047
4683I3160047m412494n043207m332191k522321n49628m43655k74908J013802J399872
$$ 93160047 88747553 83704346 79372155 76849834 76300206 75856551 75581643 76595445 77995317
4674G7995317K735660J314979O90k434347m423105l892754n274109m736293l779876
$$ 77995317 80730977 82045956 82046646 79612299 75189194 71296440 66022331 61286038 57506162
4665E7506162m841225l823179k533663k767679k034209k502786k398215j124217
$$ 57506162 52664937 48841758 46308095 43540416 41506207 39003421 36605206 35480989
4657C5480989j072042k16697n37020q47058k085651p34007j114313j548816l61352
$$ 35480989 34408947 34192250 33655230 32808172 30722521 29988514 28874201 27325385 26964033
4648B6964033o04934p33636j609287o72629j571638n30488n21513M78285k52785
$$ 26964033 26359099 25625463 24016176 23343547 21771909 21241421 20719908 21198193 20945408
4639B0945408p96157N51056p32136p17065j089288n1273L37546o71012p83342
$$ 20945408 20149251 20700307 19968171 19251106 18161818 18110545 18448091 17777079 16993737
4630A6993737K75475k22766l31675p58424n41725l98039j377946m04700M84726
$$ 16993737 17269212 17046446 16714771 15956347 15414622 15016583 13638637 13233937 13718663
4621A3718663j27343R5300n58868q33766M7036L62278j50245K25947l62557m35594
$$ 13718663 13591320 13686620 13127752 12293986 12341022 12703300 12553055 12779002 12416445 11980851
4611A1980851k04760O10514R6686o12687k85158p76281o440L64228p11658m00861
$$ 11980851 11776091 12386605 12483291 11870604 11585446 10809165 10802725 11166953 10455295 10054434
4601A0054434L38591J35936N97942P58514q35730l42872q84331m52749J44745
$$ 10054434 10393025 10528961 11126903 11885417 11049687 10706815 9822484 9369735 9514480
4592I514480J96447K48849p22840M83822N48602M16467J03134j323892M39432
$$ 9514480 9710927 9959776 9236936 9720758 10269360 10685827 10788961 9465069 9904501
4583I904501P9108K82917l82873r11115P43779K04954l24221j54775O37463m52159
$$ 9904501 9983609 10266526 9883653 8972538 9716317 9921271 9597050 9442275 10079738 9627579
4573I627579o25122J61532N105L64440k7021p2694l18974j19491P37500j49907
$$ 9627579 9002457 9163989 9169094 9533534 9506513 9433819 9114845 8995354 9732854 9582947
4563I582947J79128r5954m76258N89683O43257L16539L43054k33114j517080L69481
$$ 9582947 9762075 9666121 9189863 9779546 10422803 10739342 11082396 10849282 9332202 9701683
4553I701683Q0553M52155K41854l48489l55243q18332J445398L22132j196638
$$ 9701683 9782236 10234391 10476245 10127756 9772513 8954181 10399579 10721711 9525073
4544I525073K17138N85493l82640L13230m98505j75966q1162P65723M83723p19346
$$ 9525073 9742211 10327704 9945064 10258294 9759789 9583823 9502661 10268384 10752107 10032761
4534A0032761L612J9917r66801M57560J066976P2507r34111J43074O02384M51815
$$ 10032761 10036373 10056290 9089489 9547049 10614025 10686532 9752421 9895495 10497879 10949694
4524A0949694k07233R1332r48818N27195o0442J008069K27190n62946M14963o10497
$$ 10949694 10742461 10833793 9884975 10412170 10351728 11359797 11586987 11024041 11439004 10828507
4514A0828507L31847R23808J33550J106644p96600P5739O15103k34262M91676
$$ 10828507 11160354 12084162 12217712 13324356 12527756 12603495 13218598 12984336 13476012
4505A3476012n10618J333698n5100J02809Q44842j60124L64108j3532l01963K28647
$$ 13476012 12965394 14299092 14243992 14346801 15191643 15031519 15395627 15382095 15080132 15308779
4495A5308779l054N25568M50018O44966Q27514O8114K99178l5119K36362O87070
$$ 15308779 15305725 15831293 16281311 16926277 17753791 17821905 18121083 18085964 18322326 19009396
4485A9009396J66635P01026o5387L52053M24912J84289l50426N41913J320479
$$ 19009396 19176031 19877057 19811670 20163723 20588635 20772924 20422498 20964411 22284890
4476B2284890m79360m52418J502049O78975P55636M86364l16493J233470m27864
$$ 22284890 21805530 21353112 22855161 23534136 24289772 24776136 24459643 25693113 25265249
4467B5265249J52475r30035M86866k61586O02536m54065j196469M77067N14256
$$ 25265249 25417724 24487689 24974555 24712969 25315505 24861440 23664971 24142038 24656294
4458B4656294Q15142l16965J77492J133349k21689L96067M09372n94511L93096
$$ 24656294 25471436 25154471 25331963 26465312 26243623 26639690 27049062 26454551 26847647
4449B6847647n912k75986j224312k05635m02457l5408L73605q7581J08034M68820
$$ 26847647 26841735 26565749 25341437 25135802 24733345 24697937 25071542 24983961 25091995 25560815
4439B5560815p95345J26753O04180R65596O54L92265M07625K0114o36919q2596
$$ 25560815 24765470 24892223 25496403 26461999 26462653 26854918 27262543 27282657 26645738 26563142
4429B6563142n6960N47754o32690K63063M96878J97711J261631N6237k88217L74738
$$ 26563142 26506182 27053936 26421246 26684309 27181187 27378898 28640529 28696766 28408549 28783287
4419B8783287k05869O02788j10182J91375J027039J078885o36865J65551P95994
$$ 28783287 28577418 29180206 29070024 29261399 30288438 31367323 30730458 30896009 31692003
4410C1692003J04029J128342J209311Q07118N48073J161436J124980J550928Q57156
$$ 31692003 31796032 32924374 34133685 34940803 35488876 36650312 37775292 39326220 40183376
4401D0183376P93055q1339N02361K220077K70105J178006K996077J114442K248815
$$ 40183376 40976431 40895092 41397453 43617530 43887635 45065641 48061718 49176160 51424975
4392E1424975K075144K259061K135180J829448J779625L684091M965525N015251
$$ 51424975 53500119 55759180 57894360 59723808 61503433 65187524 70153049 75168300
4384G5168300O255316O572026O907107O495719N882438L208361J979497K89796
$$ 75168300 81423616 87995642 94902749 101398468 107280906 110489267 112468764 112758560
4376A12758560k466797l026857j281737j744340o93603O4978J188489K403983
$$ 112758560 110291763 107264906 105983169 104238829 103545226 103610204 104798693 107202676
4368A07202676M393600M168939O155397R806619J0193091J2740649J5091114J4107353
$$ 107202676 111596276 115765215 121920612 131727231 141920322 154660971 169752085 183859438
4360A83859438J2390670N187916k867619o873539j1941744j2632365j1665034
$$ 183859438 196250108 201438024 198570405 191696866 179755122 167122757 155457723
4353A55457723q439063p398916o868482l578784k633886j625105J636439J350242
$$ 155457723 147018660 139619744 132751262 129172478 126538592 124913487 126549926 127900168
4345A27900168M970374O557136R131097J1285268R836617N235529j850969o729313
$$ 127900168 132870542 139427678 148558775 159844043 169680660 174916189 173065220 166335907
4337A66335907r126070j2256282j3827195j0206990q483818p443518o632215n517671
$$ 166335907 157209837 144953555 131126360 120919370 112435552 104992034 98359819 92842148
4329I2842148m914738m081605l466008q52537o38087j146311J144322R34328k21037
$$ 92842148 87927410 83845805 80379797 79527260 78889173 77742862 78887184 79821512 79600475
4320G9600475q90700k774884l817807m162560l915332m322871l987354l737191
$$ 79600475 78709775 75934891 72117084 67954524 64039192 59716321 55728967 51991776
4312E1991776l781503j829900k190186r27729k060955j880418j846978j162024
$$ 51991776 48210273 46380373 44190187 43262458 41201503 39321085 37474107 36312083
4304C6312083j122442j068941l59523j667627j239829j248407N57123L998p87387
$$ 36312083 35189641 34120700 33761177 32093550 30853721 29605314 30162437 30166435 29379048
4295B9379048o59357n57215J69768k48561k50310o14240O17611o15534j734194
$$ 29379048 28719691 28162476 28332244 28083683 27833373 27219133 27836744 27221210 25487016
4286B5487016k08273M85713r27343p40432m30268O4142n62373j85161k05015j376402
$$ 25487016 25278743 25764456 24837113 24096681 23666413 23730555 23168182 22983021 22778006 21401604
4276B1401604q28384J78049j79435p59905m65156Q8352P5477q88556k05389o75459
$$ 21401604 20573220 20751269 20571834 19811929 19346773 19435125 19510602 18622046 18416657 17741198
4266A7741198m88242P41772J05633m71904R71009L3324m59055r0975q84848m49929
$$ 17741198 17252956 17994728 18100361 17628457 18599466 18632790 18173735 18082760 17197912 16747983
4256A6747983M9215j215205N5247M30287o58172K22700m52793k19196M0589p35365
$$ 16747983 16797198 15581993 15637240 16067527 15409355 15632055 15179262 14960066 15000655 14265290
4246A4265290k74599M11678p68246r99785J274720O98692j488271O08758q5627
$$ 14265290 13990691 14402369 13634123 12634338 13909058 14607750 13119479 13728237 13642610
4237A3642610o39191R04731j104326o9070m54599L39205j467932L2749R19273
$$ 13642610 13003419 13908150 12803824 12734754 12280155 12619360 11151428 11184177 12103450
4228A2103450l53209K59645n2528r15229M1166r7146p1597J44489k62007P52540
$$ 12103450 11750241 12009886 11957358 11042129 11083295 10986149 10914552 11059041 10797034 11549574
4218A1549574p79272P23209l31457K67561p27284q22476K42276L8349M96764l44637
$$ 11549574 10770302 11493511 11162054 11429615 10702331 9879855 10122131 10160480 10657244 10312607
4208A0312607P5359r16834P69832p7363j033590q90221p0846M40583r30116O08594
$$ 10312607 10387966 9471132 10240964 10163601 9130011 8239790 8168944 8609527 7679411 8288005
4198H288005K19443l64585o25766R4886k4234J263648n17473Q9895q38418r83427
$$ 8288005 8507448 8142863 7517097 7611983 7587749 8851397 8333924 8423819 7585401 6601974
4188F601974K64162q748J18907K22127N55199M95391j45248Q61643M22571j433817
$$ 6601974 6866136 6857388 6976295 7198422 7753621 8249012 8103764 8965407 9387978 7954161
4178G954161k99207j1406q397n21016M84927m63213l40066k80123O13763J53581
$$ 7954161 7654954 7643548 7635151 7114135 7599062 7135849 6795783 6515660 7129423 7283004
4168G283004r02717r35030K55395K14706M09759R60849n49717k30273m67057n38414
$$ 7283004 6380287 5445257 5700652 5915358 6325117 7285966 6736249 6505976 6038919 5500505
4158E500505O76191k16593P57076l88884m13000K12703L54826p86120J051277
$$ 5500505 6176696 5960103 6717179 6328295 5915295 6127998 6482824 5696704 6747981
4149F747981k01744l12700M64567n90464J78188o49967L03445j42688J79980J328279
$$ 6747981 6546237 6233537 6698104 6107640 6285828 5635861 5939306 5796618 5976598 7304877
4139G304877L01387j181134j78673Q95423K2867r73337M36590k52392l32990J48942
$$ 7304877 7606264 6425130 6246457 7141880 7164747 6191410 6628000 6375608 6042618 6191560
4129F191560M74974j468096O14223p8026P6322K78001q9665J004130j49292k93861
$$ 6191560 6666534 5198438 5812661 5734635 5810957 6088958 5999293 7003423 6854131 6560270
4119F560270l26912K3166l23675N86893J5751j538959m26314O78151k92470k22515
$$ 6560270 6233358 6256524 5932849 6519742 6535493 4996534 4570220 5248371 4955901 4733386
4109D733386P40811p91620M79153m12626Q03726Q15188j245637l9788M34012N96396
$$ 4733386 5474197 4682577 5161730 4749104 5552830 6368018 5122381 5082593 5516605 6113001
4099F113001j13201L99378N2271r96252j19771k17744k6443L49750n92264Q93707
$$ 6113001 5999800 6399178 6451449 5455197 5335426 5117682 5091239 5440989 4848725 5742432
4089E742432Q16453j76559o27768n03737J9017k15893k20269L41849l10219J086711
$$ 5742432 6558885 6382326 5754558 5250821 5269838 5053945 4833676 5175525 4865306 5952017
4079E952017l57528l63065p93725n01406P22299J153952m38025q27388l87171
$$ 5952017 5594489 5231424 4437699 3936293 4658592 5812544 5374519 4547131 4159960
4070D159960K44569J018985j65191p24380k36419m7563M76988q01009J08280N20778
$$ 4159960 4404529 5423514 5258323 4533943 4297524 4249961 4726949 3925940 4034220 4554998
4060D554998n29138J00529P67028j05103k72620o5348L9973K7125q14353O94775
$$ 4554998 4025860 4126389 4893417 4788314 4515694 4450346 4490319 4517444 3703091 4397866
4050D397866M61860l46030j20995n95235R87523R9748J70649l40902K0113K80683
$$ 4397866 4859726 4513696 4392701 3797466 4784989 4884737 5055386 4714484 4734597 5015280
4040E015280k5042k57615L88058m09819j023766k82590R43617K13765j25788J137764
$$ 5015280 4990238 4732623 5120681 4710862 3687096 3404506 4348123 4561888 4436100 5573864
4030E573864l9462L83237n48302L09479j61354r93989k37176j27157J047252N02048
$$ 5573864 5534402 5917639 5369337 5678816 5517462 4523473 4286297 4159140 5206392 5708440
4020E708440m09825L77127o01459n33694k71352N01451L72397q28860J54616J625837
$$ 5708440 5298615 5675742 5074283 4540589 4269237 4770688 5143085 4314225 4468841 6094678
4010F094678l14414r014L41646M14796j059517j32412L44895m43373m97750R69907
$$ 6094678 5780264 5771250 6112896 6527692 5468175 5335763 5680658 5237285 4739535 5709442
4000E709442L66551L85612p09179p30342Q16624Q38625M61555r7302k57259M33473
$$ 5709442 6075993 6461605 5752426 5022084 5838708 6677333 7138888 7041586 6784327 7217800
3990G217800J5503L64135J61507j33958K32721m8250n99695l84708N59383J01730
$$ 7217800 7233303 7597438 7758945 7624987 7857708 7809458 7209763 6825055 7384438 7486168
3980G486168o95347K82196Q47741m22368k39637J111128n42031l71061K56689
$$ 7486168 6790821 7073017 7920758 7498390 7258753 8369881 7827850 7456789 7713478
3971G713478k71679O04301K3535J47075J099344O6866o71778o44760J030202J13654
$$ 7713478 7441799 8046100 8069635 8216710 9316054 9382920 8711142 8066382 9096584 9210238
3961I210238k88287l00609n38098M93961j12271J28585J575948m95761j574723
$$ 9210238 8921951 8621342 8083244 8577205 8464934 8593519 10169467 9673706 8098983
3952H098983j21400M84414O75775O78027n79480m76959J00083k70769Q05704R66921
$$ 8098983 7977583 8461997 9137772 9815799 9236319 8759360 8859443 8588674 9394378 10361299
3942A0361299q54147P89969j14034n46726M43197j20288j56749n2557K16294k05407
$$ 10361299 9507152 10297121 10183087 9636361 10079558 9959270 9802521 9749964 9966258 9760851
3932I760851J171666k70409M13773q71170m13325l90982J5906Q31783N35921N52594
$$ 9760851 10932517 10662108 11075881 10204711 9791386 9400404 9416310 10248093 10784014 11336608
3922A1336608p3923O00347q28193m28921R35358p30715O42773J20487n50971M648
$$ 11336608 11262685 11863032 11034839 10605918 11541276 10810561 11453334 11573821 11022850 11027498
3912A1027498N68876J65678l44402m4738l10330L96962m24425J44732k4182q41119
$$ 11027498 11596374 11762052 11417650 11372912 11062582 11459544 11035119 11179851 11155669 10314550
3902A0314550L03713j55026O13179J33791n0301L25791O60246L12224k03105k29062
$$ 10314550 10618263 10463237 11076416 11210207 11159906 11485697 12145943 12458167 12255062 12026000
3892A2026000l12545k24422O88879N87691P42697j694292O38843m17421Q6444
$$ 12026000 11713455 11489033 12177912 12765603 13508300 11814008 12452851 12035430 12121874
3883A2121874o64135O08576P59495j271195J079336N42119p3808n35395l91006
$$ 12121874 11457739 12066315 12825810 11554615 12633951 13176070 13102262 12566867 12175861
3874A2175861l27451J002582l56871O78004K58139l2990l1898N33322j43283N09332
$$ 12175861 11848410 12850992 12494121 13172125 13430264 13397274 13365376 13898698 13755415 14264747
3864A4264747M02040n13216k5282N83043N12856q65952m2022R71925l00182J435972
$$ 14264747 14666787 14153571 14128289 14711332 15224188 14358236 14316214 15288139 14987957 16423929
3854A6423929R9742p67818P80426j062518n21693l83546J586518K84741J047853
$$ 16423929 16523671 15755853 16536279 15473761 14952068 14568522 16155040 16439781 17487634
3845A7487634q05985n11570J127626N1413K5485m00018j88669M47497l9469P43625
$$ 17487634 16681649 16170079 17297705 17349118 17374603 16974585 16785916 17233413 17193944 17937569
3835A7937569j92724O8051R85309N96525R34250J708877k31876j32457K79534
$$ 17937569 17744845 17812896 18798205 19394730 20328980 22037857 21805981 21673524 21953058
3826B1953058Q79668J069537n44914J063998P35653N95590L54763Q40503Q57541
$$ 21953058 22832726 23902263 23357349 24421347 25157000 25752590 26107353 26947856 27805397
3817B7805397J534270N41493L72528J740092J124492J170410N61461J207709J146911
$$ 27805397 29339667 29881160 30253688 31993780 33118272 34288682 34850143 36057852 37204763
3808C7204763J134871K874737J055202J828840J512682K278351L235393K486805
$$ 37204763 38339634 41214371 42269573 44098413 45611095 47889446 51124839 53611644
3800E3611644L140083L828757K474236K484050L100417L848975L547769L233972
$$ 53611644 56751727 60580484 63054720 65538770 68639187 72488162 76035931 79269903
3792G9269903K806763L135156K958827J722561J322259K013716J613852J148390
$$ 79269903 82076666 85211822 88170649 89893210 91215469 93229185 94843037 95991427
3784I5991427J524548K484835K304561K130561L430631L826994L480479M045107
$$ 95991427 97515975 100000810 102305371 104435932 107866563 111693557 115174036 119219143
3776A19219143N294930M373618M116853L451946M036978K952368J792227M49752
$$ 119219143 124514073 128887691 133004544 136456490 140493468 143445836 145238063 145687815
3768A45687815m94860J09051k460093l23967j719227m59124j169453l94493R35996
$$ 145687815 145192955 145302006 142841913 142517946 140798719 140339595 139170142 138775649 139711645
3759A39711645R55349J429770J775801J609684J108401K185950R84510R50934
$$ 139711645 140666994 142096764 143872565 145482249 146590650 148776600 149761110 150712044
3751A50712044J289583j283914k047472j969739j175736j928606j167509r66546
$$ 150712044 152001627 150717713 148670241 146700502 145524766 143596160 142428651 141462105
3743A41462105n00604j20769J064514L168330K023198K801111L286006M121816
$$ 141462105 140961501 140840732 141905246 145073576 147096774 149897885 153183891 157305707
3735A57305707M291064M370366M281938L838616L360364L058081K486965L396670
$$ 157305707 161596771 165967137 170249075 174087691 177448055 180506136 182993101 186389771
3727A86389771J893776R84702J898854L378193K827457K906035L192967K280180
$$ 186389771 188283547 189268249 191167103 194545296 197372753 200278788 203471755 205751935
3719B05751935J049768J822741J851509N56898O03061Q70409m66219j266232O76523
$$ 205751935 206801703 208624444 210475953 211032851 211635912 212506321 212040102 210773870 211450393
3710B11450393m15903q13k90449m04640J204179J575689L19293M76536O71100
$$ 211450393 211034490 211033677 210743228 210338588 211542767 213118456 213437749 213914285 214585385
3701B14585385j159965l031980m356275n256837n893354p556141p478997o101611
$$ 214585385 213425420 210393440 206037165 200780328 194886974 187330833 179851836 173750225
3693A73750225p664094o745513n315188n002936n374600k048568k399094k756757
$$ 173750225 166086131 159340618 154025430 149022494 143647894 141599326 139200232 136443475
3685A36443475j573970j374648j183165k613210k801243l642980m220776m417339
$$ 136443475 134869505 133494857 132311692 129698482 126897239 123254259 119033483 114616144
3677A14616144m174003m596843m604871n133847n247927m016867m297161m300633
$$ 114616144 110442141 105845298 101240427 96106580 90858653 86841786 82544625 78243992
3669G8243992m121798l403619k451568l305111k014384k753076j968897k396621
$$ 78243992 74122194 70718575 68267007 64961896 62947512 60194436 58225539 55828918
3661E5828918j766390p76786k027147p05984k271523j00816j863994l19667q38323
$$ 55828918 54062528 53285742 51258595 50552611 48281088 48180272 46316278 45996611 45158288
3652D5158288j002788o46264n87080j359461r42370q50478j293314p15033m72404
$$ 45158288 44155500 43509236 42922156 41562695 40620325 39769847 38476533 37761500 37289096
3643C7289096o71802M92481j418380k06981j106351k76286J09955p49736j793644
$$ 37289096 36617294 37109775 35691395 35484414 34378063 34101777 34211732 33461996 31668352
3634C1668352j374329m57625Q17203j261285j381108q53845m97247M65459q79707
$$ 31668352 30294023 29836398 30653601 29392316 28011208 27157363 26660116 27125575 26245868
3625B6245868l248n01361m21044r88162j372006j159684J026849o44522k89788
$$ 26245868 26242620 25741259 25320215 24332053 22960047 21800363 22827212 22182690 21892902
3616B1892902p28571K65210r88246j266894q36038L90134K38040o49280o47981
$$ 21892902 21164331 21429541 20441295 19174401 18338363 18728497 18966537 18317257 17669276
3607A7669276M1304N58137m28845r86168K68798r28598j66821J45236n11467q61659
$$ 17669276 17710580 18268717 17839872 16853704 17122502 16193904 16027083 16172319 15660852 14799193
3597A4799193K67106j76920J81l31599Q69558q49034r99277l53139N95327n5430
$$ 14799193 15066299 14889379 14889560 14557961 15427519 14578485 13579208 13226069 13821396 13765966
3587A3765966k0810k76813k52866j74385j04810J77544J5072q14003J45126k94300
$$ 13765966 13745156 13468343 13215477 13041092 12936282 13113826 13128898 12314895 12460021 12165721
3577A2165721P2637O5707q37485o74121Q62622J178686j46621o08248r84627O9030
$$ 12165721 12238358 12304065 11466580 10792459 11655081 12833767 12687146 12078898 11094271 11163301
3567A1163301M64550n61049J80836R09680j088547M27470m86219j98427L77943
$$ 11163301 11627851 11066802 11247638 12157318 11068771 11496241 11010022 10811595 11189538
3558A1189538k44300l91966M73394J7957m38226L33863j17793j16034K58941Q25747
$$ 11189538 10945238 10553272 11026666 11044623 10606397 10940260 10822467 10706433 10965374 11791121
3548A1791121j340748J81770N34379l86387J27490n23201P91368k57795k05996
$$ 11791121 10450373 10632143 11166522 10780135 10907625 10384424 11175792 10917997 10712001
3539A0712001j174916Q34682N12260M09858l94214j588806O07753P98147Q4084
$$ 10712001 9537085 10371767 10884027 11293885 10899671 9310865 9918618 10716765 10800849
3530A0800849J149315k71157j567839p85130O23691M26361P74563o15703k94463
$$ 10800849 11950164 11679007 10111168 9326038 9949729 10376090 11150653 10534950 10240487
3521A0240487r03741P06430J38280N03170j03414q84120J1406m33705P18523R54711
$$ 10240487 9336746 10043176 10181456 10684626 10581212 9697092 9708498 9274793 9993316 10948027
3511A0948027p52697J16796R78179N38889m19951l60973l79458O19089J7691l13991
$$ 10948027 10195330 10312126 11290305 11829194 11409243 11048270 10668812 11287901 11305592 10991601
3501A0991601L82339O74253m96876l65337J331664n30145k41416R9172J289701
$$ 10991601 11373940 12048193 11551317 11185980 12517644 11987499 11746083 11845255 13134956
3492A3134956p68961q48644M43599K39710o85700K45638J14576N96711O33225
$$ 13134956 12365995 11517351 11960950 12200660 11514960 11760598 11875174 12471885 13105110
3483A3105110L60967q4738p34297O04745P34517J56000K1508l89615R24759r55847
$$ 13105110 13466077 13381339 12647042 13251787 13986304 14142304 14163812 13774197 14698956 13743109
3473A3743109P26355P0755k95160p73779n82570P43126N61698p4271m99614J480617
$$ 13743109 14469464 14540219 14245059 13471280 12888710 13631836 14193534 14119263 13619649 15100266
3463A5100266K52584l55836K39223o43492J08387Q2955l9713J15349K00550n76313
$$ 15100266 15352850 14997014 15236237 14592745 14701132 14784087 14744374 14859723 15060273 14483960
3453A4483960Q1793K84457R53023k79695J05401K67031r96586Q04585N9785Q0857
$$ 14483960 14565753 14850210 15803233 15523538 15628939 15895970 14899384 15703969 15763754 15844611
3443A5844611k18173O59798k18731j49240K60193P83762R3332Q57430P8937k14778
$$ 15844611 15626438 16286236 16067505 15918265 16178458 16962220 17055552 17912982 17991919 17777141
3433A7777141P3261q25425J167892O75258M58030P69299M41318K23190M33596
$$ 17777141 17850402 17024977 18192869 18868127 19326157 20095456 20536774 20759964 21193560
3424B1193560m0976p41446l45548p3057m35198k9433M30620k83059J13189J45083
$$ 21193560 21152584 20411138 20065590 19992533 19557335 19527902 19958522 19675463 19788652 19933735
3414A9933735j294181P5761M75255M50726m81460n92760j36122P16478j99754
$$ 19933735 18639554 18715315 19190570 19641296 19159836 18567076 18430954 19147432 18947678
3405A8947678J122849j089696j498579J12039J72406l39707J79934R00241l32710
$$ 18947678 20070527 18980831 17482252 17594291 17766697 17426990 17606924 18507165 18174455
3396A8174455K16613o10492J97198n18492P28061P37870Q9993j052307n40289
$$ 18174455 18391068 17780576 17977774 17459282 18187343 18925213 19015206 17962899 17422610
3387A7422610J50529N44216l87887m1538p60381Q08990N4697r4439N60797j68754
$$ 17422610 17573139 18117355 17729468 17687930 16927549 17736539 17791236 17696797 18257594 18088840
3377A8088840m0767O97525N00990K67368j203948j385179Q50846O45535r05832
$$ 18088840 18048073 18745598 19246588 19513956 18310008 16924829 17775675 18421210 17515378
3368A7515378L78333o37464P59586O37395p46913J78655r57116L96515N74944
$$ 17515378 17893711 17256247 18015833 18653228 17906315 18084970 17127854 17524369 18099313
3359A8099313j039505j06989k72329K88928Q58905O4355M210k34068L08732R915
$$ 18099313 17059808 16952819 16680490 16969418 17828323 17892678 17896888 17662820 17971552 17981467
3349A7981467k63635N55685r15103O32471N37831p44012n9476O81290K96382p93632
$$ 17981467 17717832 18273517 17358414 17990885 18528716 17784704 17725228 18406518 18702900 17909268
3339A7909268M77616j229624R64426n19789o39802J372029O05065M78385j875452
$$ 17909268 18386884 17157260 18121686 17601897 16962095 18334124 18939189 19417574 17542122
3330A7542122J552483R20903n60969q5763q28834k87282M17821J455366n94982
$$ 17542122 19094605 20015508 19454539 19368776 18539942 18252660 18670481 20125847 19530865
3321A9530865J124879k6781l35017n38668J209204K27891m77042l11439M84292
$$ 19530865 20655744 20628963 20293946 19755278 20964482 21192373 20715331 20403892 20888184
3312B0888184K68727n19614L4309R15610J33803K22249m74033J265215k92729
$$ 20888184 21156911 20637297 20671606 21587216 21721019 21943268 21469235 22734450 22441721
3303B2441721o20p64230K3988J056410p21217J72959J163159J93584k35165l8697
$$ 22441721 22441101 21676871 21700859 22757269 22036052 22209011 23372170 23565754 23330589 23291892
3293B3291892K40428O86240N53775k26257M7563J000760O95709K96589M7585O04787
$$ 23291892 23532320 24218560 24772335 24546078 24593641 25594401 26290110 26586699 26634284 27239071
3283B7239071M11354P27722l96698K314716k01059M11711P02940J023639M09239
$$ 27239071 27650425 28378147 27981449 30296165 30095106 30506817 31209757 32233396 32642635
3274C2642635R82678Q36242Q88039J278761L25484P01290J897369J093654O51028
$$ 32642635 33625313 34461555 35349594 36628355 36953839 37655129 39552498 40646152 41297180
3265D1297180J365878J945342J491007J664090J494662K376668K558096K209558
$$ 41297180 42663058 44608400 46099407 47763497 49258159 51634827 54192923 56402481
3257E6402481J910471J022412K080517J965091K023541J806632J148828K364488
$$ 56402481 58312952 59335364 61415881 63380972 65404513 67211145 68359973 70724461
3249G0724461K456557R72311K741710L774147J908421K870542L591656J410218
$$ 70724461 73181018 74153329 76895039 80669186 82577607 85448149 89039805 90450023
3241I0450023K233903K037177K620703J791436L151505L403587J964951K744110
$$ 90450023 92683926 94721103 97341806 99133242 102284747 105688334 107653285 110397395
3233A10397395L935962K792950L350066L627786M149966L847422N006876L908229
$$ 110397395 114333357 117126307 120476373 124104159 128254125 132101547 137108423 141016652
3225A41016652L366508M154131K745213L914027K894839K931293K449075K696044
$$ 141016652 144383160 148537291 151282504 155196531 158091370 161022663 163471738 166167782
3217A66167782L115723L422431M118489M433443M300299M027167L637141N252436
$$ 166167782 169283505 172705936 176824425 181257868 185558167 189585334 193222475 198474911
3209A98474911P478119O211007P239363Q530603Q067599P803262O095559N993089
$$ 198474911 205953030 212164037 219403400 227934003 236001602 243804864 249900423 255893512
3201B55893512L544342L107603K232435K237130J579860J84258j62844J66140
$$ 255893512 259437854 262545457 264777892 267015022 268594882 268779140 268616296 268782436
3193B68782436n03537L72862Q19733l74748Q030L60326k30048J212212M58674
$$ 268782436 268278899 268651761 269471494 269096746 269104776 269465102 269235054 270447266 270905940
3184B70905940p8901k29326o46040p51133l127175l419391m476988n671377o021798
$$ 270905940 270827039 270597713 269951673 269200540 266073365 262653974 258176986 252505609 246483811
3175B46483811p697164o625447o223503o739448n935424m694623n349118l254983
$$ 246483811 238786647 232161200 225937697 219198249 213262825 208568202 203219084 199964101
3167A99964101l418155m447527l368057l001609l553171k967892j150671k775774
$$ 199964101 196545946 192098419 188730362 185728753 182175582 179207690 178057019 175281245
3159A75281245l207930l054603k974071m352672l180953l820826k955003m640743
$$ 175281245 172073315 169018712 166044641 161691969 158511016 154690190 151735187 147094444
3151A47094444m178942l055167l528076l446305k598023l691149l621033k485732
$$ 147094444 142915502 139860335 136332259 132885954 130287931 126596782 122975749 120490017
3143A20490017k621252l652179k299989k609597j317172k408691k443003k680895
$$ 120490017 117868765 114216586 111916597 109307000 107989828 105581137 103138134 100457239
3135A00457239k688387j417458k038195k367198k069123l237305j615143j438093
$$ 100457239 97768852 96351394 94313199 91946001 89876878 86639573 85024430 83586337
3127H3586337j023759k222612j165340j436717l104220o82881j426998n86081
$$ 83586337 82562578 80339966 79174626 77737909 74633689 73950808 72523810 71937729
3119G1937729j654189j980089j405257j498913j199940j75374p4201p72306j454184
$$ 71937729 70283540 68303451 66898194 65399281 64199341 64023967 63949766 63177460 61723276
3110F1723276l83886k24042o61059r31769j278665k354j91933l27429r4355j01448
$$ 61723276 61339390 61115348 60454289 59522520 58243855 58241501 58049568 57722139 57627784 57526336
3100E7526336o99053j102141O70947L64337j23082j75035m99644R2265k82167
$$ 57526336 56827283 55725142 56396089 56760426 56637344 56462309 55962665 56054930 55772763
3091E5772763m63363K40522p6806J48806m01743P72643l5363Q98078r34664o1415
$$ 55772763 55309400 55549922 55473116 55621922 55220179 55992822 55957459 56855537 55920873 55859458
3081E5859458n17342o32521j20613P36074r4019P63356q28240m95856K76964L75380
$$ 55859458 55342116 54709595 54588982 55325056 55231037 55994393 55166153 54670297 54947261 55322641
3071E5322641r46525k87141q9587J98352k35073n91113r61475J08088k66653q4782
$$ 55322641 54376116 54088975 53999388 54197740 53962667 53371554 52410079 52518167 52251514 52166732
3061E2166732l99308K13746n88393j349006j98363q58268K31269p49844q43864
$$ 52166732 51767424 51981170 51392777 50043771 49845408 48987140 49218409 48468565 47624701
3052D7624701o54446K22614k80662q11860p26609j079698r41734j66908N3286
$$ 47624701 46970255 47192869 46912207 46100347 45373738 44294040 43352306 43185398 43238684
3043D3238684j72838j376717M99411j041140L99886q50130n07538o66982j350381
$$ 43238684 43065846 41689129 42188540 41147400 41547286 40697156 40189618 39522636 38172255
3034C8172255M34310j331410p58315J50474j774159l9606M71696j454855k86606
$$ 38172255 38606565 37275155 36516840 36667314 34893155 34853549 35325245 33870390 33583784
3025C3583784k45365q74578M10414j86300p48836n02136O72770j353248o47881
$$ 33583784 33338419 32463841 32874255 32687955 31939119 31436983 32109753 30756505 30108624
3016C0108624p97436j231833J15078J113892n18058q36970o35160j56808p35156
$$ 30108624 29311188 28079355 28194433 29308325 28790267 27953297 27318137 27161329 26426173
3007B6426173m50600M3522N08269o22955o67295k98926m47334q05954J76482n8329
$$ 26426173 25975573 26019095 26527364 25904409 25237114 24938188 24490854 23684900 23861382 23803053
2997B3803053m76836J59228M22027n30440q47244o96675j68028l93934M33928
$$ 23803053 23326217 23485445 23907472 23377032 22529788 21833113 21665085 21271151 21705079
2988B1705079j451866j042948J675900n09152k26759p66010K03372j58518j054929
$$ 21705079 20253213 19210265 20886165 20377013 20150254 19384244 19587616 19429098 18374169
2979A8374169K73452M19149p72711L57956J41002q55802J17285m37039j09260
$$ 18374169 18647621 19066770 18294059 18652015 18793017 17937215 18054500 17617461 17508201
2970A7508201r805j146227P63743j24502Q22158m73578l1678K38923j061066o99315
$$ 17508201 17498396 16352169 17115912 16991410 17813568 17339990 17308312 17547235 16486169 15786854
2960A5786854J397724j29461p9749j896043J59220k96043N3278K08409m92360
$$ 15786854 17184578 17055117 16975368 15079325 15238545 14942502 14995780 15204189 14711829
2951A4711829o42643J070173q0039l6029O6184q39986m46491l90402n82648o80763
$$ 14711829 14069186 15139359 15059320 15023291 15089475 14249489 13802998 13412596 12829948 12149185
2941A2149185L52112M67168Q37618o60904P4308j454997M25544P78109n15000
$$ 12149185 12501297 12968465 13806083 13145179 13219487 11764490 12190034 12968143 12453143
2932A2453143Q0399O8676l16278N14673J9006Q2905l23274q16381m71652K9167
$$ 12453143 12533542 12602218 12285940 12800613 12819619 12902524 12579250 11762869 11291217 11320384
2922A1320384k87312J400482o83897m19703R24624o10890k81929P24895m3285
$$ 11320384 11033072 12433554 11749657 11329954 12254578 11643688 11361759 12086654 12043369
2913A2043369l12315q34681K11474k68816j124379J152436J018849j073149L17105
$$ 12043369 11731054 10896373 11107847 10839031 9714652 10867088 11885937 10812788 11129893
2904A1129893k72512O2806M30152K31674k32407p14988j443484N44889Q37760
$$ 11129893 10857381 10920187 11350339 11582013 11349606 10634618 9191134 9736023 10573783
2895A0573783K96710j057397J65787K04177j010614M65332K9139N29742Q61803
$$ 10573783 10870493 9813096 9978883 10183060 9172446 9637778 9666917 10196659 11058462
2886A1058462J60865k4400n55361j92994k0230K15618M74308n27938J42745L58756
$$ 11058462 11219327 11194927 10639566 10446572 10426342 10641960 11116268 10588330 10731075 11089831
2876A1089831O81502M15354l00182n64807p8456m54005P9699l6513K76560N81808
$$ 11089831 11771333 12186687 11886505 11321698 11243242 10789237 10868936 10832423 11108983 11690791
2866A1690791o84696l51573l27632P41507J11927k14663J374852J43971k53679
$$ 11690791 11006095 10654522 10326890 11068397 11180324 10965661 12340513 12484484 12230805
2857A2230805m47664N52395R81623Q1425o63422J8720N95990K50430l55870k17204
$$ 12230805 11783141 12335536 13317159 13398584 12735162 12753882 13349872 13600302 13244432 13027228
2847A3027228J49344Q591J513372J61756n92481M64265j8504Q04197n73979J19942
$$ 13027228 13176572 13185163 14698535 14860291 14267810 14732075 14713571 15517768 14943789 15063731
2837A5063731J197290J311861R2481n31397R07232O5297m03786J192226n08325
$$ 15063731 16261021 17572882 17665363 17133966 18041198 18106495 17702709 18894935 18386610
2828A8386610Q14218m5850J473771O72601J187319N05054N05717R22170M9972
$$ 18386610 19200828 19154978 20628749 21301350 22488669 22993723 23499440 24421610 24471582
2819B4471582j31737J277164J358025J524531O75591P00192Q34389J003494N48809
$$ 24471582 24339845 25617009 26975034 28499565 29175156 29875348 30709737 31713231 32262040
2810C2262040J313919K276243J216052K04643K284856J995009K075132K156319
$$ 32262040 33575959 35852202 37068254 37272897 39557753 41552762 43627894 45784213
2802D5784213J353725L927787J940909K029290K825977K534144J506655J176652
$$ 45784213 47137938 51065725 53006634 55035924 57861901 60396045 61902700 63079352
2794F3079352R94529Q16111O74485R49439J368300J00722j516674n20022k807693
$$ 63079352 64073881 64889992 65564477 66513916 67882216 67982938 66466264 65946242 63138549
2785F3138549j797573l540661l595604l172063m612539k634012k389432k764865
$$ 63138549 61340976 57800315 54204711 51032648 46420109 43786097 41396665 38631800
2777C8631800k400169j829726j635509j638788n28750k491915j323490j099821
$$ 38631800 36231631 34401905 32766396 31127608 30598858 28106943 26783453 25683632
2769B5683632k27084j149983j906470K35853n26951j416482k10446o5511j126084
$$ 25683632 25456548 24306565 22400095 22635948 22108997 20692515 20482069 20416558 19290474
2760A9290474j384750R2117J89390j627616n47934k48319n65155l32428M46778
$$ 19290474 17905724 17997841 18187231 16559615 16011681 15763362 15198207 14865779 15312557
2751A5312557j251036j095134L5044l35837N43228j248423M99042m18292m01784
$$ 15312557 14061521 12966387 13001431 12665594 13208822 11960399 12459441 12041149 11639365
2742A1639365L35137p23617m60925l22801j05551n27647l57892J239716j29018
$$ 11639365 11974502 11250885 10789960 10467159 10361608 9833961 9476069 10715785 10586767
2733A0586767o26829o02449K54722m06549o3747j02369r4806j124891M61545L8335
$$ 10586767 9959938 9357489 9612211 9205662 9141915 9039546 8944740 7819849 8281394 8319729
2723H319729o06537J43027k7163N8290L21737l73214O03652n49100p09218N32768
$$ 8319729 7713192 7856219 7829056 7887346 8209083 7835869 8439521 7890421 7181203 7713971
2713G713971j052640l0241p768M93057p73507J654713Q90263j293836j010260
$$ 7713971 6661331 6631090 6623322 7116379 6342872 7997585 8887848 7594012 6583752
2704F583752j87424l83273O74193L03385n91241K87675k00932q35252K3555j59765
$$ 6583752 6396328 6013055 6687248 6990633 6399392 6687067 6486135 5650883 5674438 5514673
2694E514673Q03494j220666Q23829o64925m65836P6543m07501J338197o77169
$$ 5514673 6318167 5097501 5921330 5256405 4790569 4867112 4459611 5797808 5120639
2685E120639R5283Q33151o58452j49848j7357N79372q15877l88834K62049k73599
$$ 5120639 5215922 6049073 5390621 5240773 5223416 5802788 4986911 4598077 4860126 4586527
2675D586527k14353k09607l24597P50698j008239L99409J469172O7629J09909
$$ 4586527 4372174 4162567 3837970 4588668 3580429 3979838 5449010 5516639 5626548
2666E626548q46696J79100l21059j073654R89249J336079o98532P6208n06452
$$ 5626548 4779852 4958952 4637893 3564239 4553488 5889567 5191035 5267243 4760791
2657D760791n71337n0753j47890J91784L80014p68967J090111k07316M6466m5685
$$ 4760791 4189454 4138701 3990811 4182595 4562609 3793642 4883753 4676437 4722903 4677218
2647D677218L27536N0785j555917N20981Q1140M34678j49904l87460O03258n83458
$$ 4677218 5004754 5055539 3499622 4020603 4101743 4536421 4386517 3999057 4602315 4018857
2637D018857J0664M12283l42337O67503o33955p13981M33652K30433m21641p20344
$$ 4018857 4029521 4441804 4099467 4766970 4133015 3419034 3852686 4083119 3661478 2941134
2627B941134J086623l76578l00470Q26823k92452M87105o04167l48391Q67053
$$ 2941134 4027757 3651179 3350709 4177532 3885080 4372185 3768018 3419627 4286680
2618D286680k16588L53072k43434O10003L12854l48798r20954k34170J271149
$$ 4286680 4070092 4423164 4179730 4789733 5102587 4753789 3832835 3598665 4869814
2609D869814j30233J444L19981J79316M00927k20740r86252q7834M69574k6591
$$ 4869814 4739581 4741025 5061006 5240322 5641249 5420509 4434257 4346423 4815997 4789406
2599D789406Q5123M5116n30746P46421p55673J224224J67753p50644Q56907r71677
$$ 4789406 4874529 4919645 4388899 5135320 4379647 5603871 5771624 5020980 5877887 4906210
2589D906210M53037J142460n28407k90358Q42715Q14168o2773q11979O84881r2552
$$ 4906210 5359247 6501707 5973300 5682942 6525657 7339825 7277052 6465073 7149954 7057402
2579G057402L42316m03503L80639M68380Q49462K97307k25488k06508J167910
$$ 7057402 7399718 6996215 7376854 7845234 8694696 8992003 8766515 8560007 9727917
2570I727917O0321n44206J391613J288671K44203N03389J720213k92629J197903
$$ 9727917 9788238 9244032 10635645 11924316 12168519 12671908 14392121 14099492 15297395
2561A5297395M56596J408920J276018M58742p40533P56634J439140J53127j41003
$$ 15297395 15753991 17162911 18438929 18897671 18157138 18913772 20352912 20506039 20365036
2552B0365036J461958j6530m84944M77772K5749O32939O65176L54293L75313L78556
$$ 20365036 21826994 21810464 21325520 21803292 21829041 22461980 23127156 23481449 23856762 24235318
2542B4235318O34520P65043J337109J767293K896606K304187R96322Q02887k47922
$$ 24235318 24869838 25634881 26971990 28739283 31635889 33940076 34936398 35739285 35491363
2533C5491363j330784k104284j280025k138131j389740k203898p91001p30158
$$ 35491363 34160579 32056295 30776270 28638139 27248399 25044501 24253500 23523342
2525B3523342o17530p59846m55203r52464L43325K18890L58737K28844k68911
$$ 23523342 22905812 22145966 21690763 20738299 21081624 21300514 21659251 21888095 21619184
2516B1619184K30667M54595K79853k31519l15089o70957l27124j374301p00163
$$ 21619184 21849851 22304446 22584299 22352780 22037691 21366734 21039610 19665309 18965146
2507A8965146j54920j715159n05352r07838p48204n53610q75995j368157q07472
$$ 18965146 18810226 17095067 16589715 15681877 14933673 14380063 13504068 12135911 11328439
2498A1328439L96096J8314p43495J31548J79092p50342l80365o09196m19163m65890
$$ 11328439 11724535 11742849 10999354 11130902 11309994 10559652 10179287 9570091 9150928 8685038
2488H685038m46274n03351r12635K73917M77000o24245M19133J2772p95503r72164
$$ 8685038 8238764 7735413 6822778 7096695 7573695 6949450 7368583 7381355 6585852 5613688
2478E613688n7714p69361R25902O35875j308352p3178m47809L93018o82086Q4144
$$ 5613688 5555974 4786613 5712515 6348390 5040038 4966860 4519051 4912069 4229983 4314127
2468D314127N18294m24173P8521r48763N06566J051n72792L33198J47711J52002
$$ 4314127 4832421 4408248 4486769 3538006 4044572 4045623 3472831 3806029 3953740 4105742
2458D105742m22942l31725P5540K37112o92557N10417m58547l72548L46845r67760
$$ 4105742 3682800 3351075 3426615 3663727 2971170 3481587 3023040 2650492 2997337 2029577
2448B029577R29262k91150O78900q99059O13365p49567M67796p63161J3198p81501
$$ 2029577 2958839 2667689 3346589 2447530 3060895 2311328 2779124 2015963 2029161 1247660
2438A247660J127420R48482j350731o07420K95324J301394j217848l81256J97361
$$ 1247660 2375080 3323562 1972831 1365411 1660735 2962129 1744281 1363025 1560386
2429A560386J162052l45172o39805N31822J50200m67890J71833N14776j106411
$$ 1560386 2722438 2377266 1737461 2269283 2419483 1951593 2123426 2638202 1531791
2420A531791k86729R13584j222444J30708Q84743k20793p52958J1429P31822n04377
$$ 1531791 1245062 2158646 936202 1066910 1951653 1730860 977902 989331 1721153 1216776
2410A216776r71279R35389P79526J31881j90650l22202j83224m92463r6254Q33229
$$ 1216776 245497 1180886 1960412 2092293 1901643 1579441 1396217 903754 807500 1640729
2400A640729M48961n85529k40582N91415j112213n155O92690p9591k76560n61754
$$ 1640729 2089690 1504161 1263579 1854994 742781 737626 1430316 1350725 1074165 512411
2390E12411M37473K62377l43716k55859n02549J134680j05229L71542m20043J2950
$$ 512411 949884 1212261 868545 612686 110137 1244817 1139588 1511130 1091087 1104037
2380A104037J012183r06664m99591q2214L08325q98754M49752O43089o80989R82450
$$ 1104037 2116220 1209556 709965 627751 936076 37322 487074 1130163 449174 1431624
2370A431624o27756N53343p61300J16406J87085p75614R5530Q36256N0726r23729
$$ 1431624 803868 1357211 595911 712317 899402 123788 219318 1055574 1106300 182571
2360A82571P23389j13120n01152l55748M65736J092727o56554M40760L02005o92714
$$ 182571 905960 792840 291688 -64060 401676 1494403 837849 1278609 1580614 887900
2350H87900j86546r25057M43057L43288n60137J90825l32184j33446J37129R38809
$$ 887900 701354 -223703 219354 562642 2505 193330 -138854 -272300 -135171 803638
2340H03638N52009r49360O81202r98129O29038N81029m96322O7192k15231p7560
$$ 803638 1355647 406287 1087489 89360 718398 1299427 803105 870297 655066 577506
2330E77506P77752q32174P96111N61928j104517K88411K50322m18005n88483Q69220
$$ 577506 1355258 523084 1319195 1881123 776606 1065017 1315339 897334 308851 1178071
2320A178071j07466J96818n71397l69728l54183R87547n34047N0598O35802l1244
$$ 1178071 1070605 1267423 696026 326298 -27885 959662 425615 476213 1112015 1080771
2310A080771O20914j362389j043181O15859L89938k11022k92802N85196j4176
$$ 1080771 1701685 339296 -703885 -88026 301912 90890 -201912 383284 369108
2301C69108j37927k22108K08843K85185L40603j41838m03641J62455o23826J004519
$$ 369108 231181 9073 217916 503101 843704 701866 298225 460680 -163146 841373
2291H41373m42765O74831q80977L8706O13083o43587R4595J02516M38804p24209
$$ 841373 398608 1073439 192462 231168 844251 200664 295259 397775 836579 112370
2281A12370n4369R2942o46823N56048L07778P37602l38858O7230l95476j029673
$$ 112370 58001 150943 -495880 60168 367946 1105548 766690 833920 438444 -591229
2271e91229Q78846r0584O18115J64924O145r11536j125046P61781J47112O66691
$$ -591229 287617 197033 815148 980072 986217 74681 -1050365 -288584 -141472 525219
2261E25219r20870Q33428N23328L15116o69017l9016R01857r10997p97957M98718
$$ 525219 -395651 437777 961105 1276221 607204 568188 1470045 559048 -238909 259809
2251B59809Q94559j369642J177K77315l13579j99326M43225K81979K63887J362615
$$ 259809 1154368 -215274 -214097 63218 -250361 -449687 -6462 275517 539404 1902019
2241A902019j563537o26712k7771N7149m12533O95099R41269j625694N87584n53353
$$ 1902019 338482 -288230 -316001 -258852 -671385 23714 964983 -660711 -73127 -626480
2231f26480J149396L92622M7213j31203j025312M51320m33980j0323n74022O98228
$$ -626480 522916 915538 962751 831548 -193764 257556 -176424 -186747 -760769 -62541
2221f2541n43985J69279N06452L35562p93541O1872O24042L16923Q236m22555
$$ -62541 -606526 -437247 69205 404767 -388774 -326902 297140 614063 622299 199744
2211A99744j69892K05913N82167o7248K20150p29957M01177j38075k08993o62203
$$ 199744 29852 235765 817932 750684 970834 240877 642054 503979 294986 -367217
2201c67217K4955J74140O00471l33504q06516m5443R16538q947r67670N9091P70664
$$ -367217 -342262 -168122 432349 98845 -707671 -753114 163424 154477 -813193 -754102 16562
2190A6562O11724J11632k07417q01516M09169n05609l8963J35242r13360J049618
$$ 16562 628286 739918 532501 -269015 140154 -365455 -404418 -269176 -1182536 -132918
2180a32918L21285j65407L17811o9492n56549k16708J29881J59844L13191R8543
$$ -132918 188367 22960 340771 271279 -285270 -501978 -372097 -212253 100938 199481
2170A99481K95820L70521m86542K44122m77919o67587P43487P0951q9501Q8262
$$ 199481 495301 865822 379280 623402 145483 -522104 221383 292334 202833 291095
2160B91095k66382K08225j77881l45653O83793J1109j143060Q37412L91514n63067
$$ 291095 24713 232938 55057 -290596 393197 404306 -738754 98658 490172 -72895
2150g2895l02903Q19729r27179M21076k69448m3285L88480O05801j449368P23803
$$ -72895 -375798 443931 -483248 -62172 -331620 -374905 13575 619376 -829992 -106189
2140a06189J22628m892j06156J25432M88169l89233M07489L77393j196652M46217
$$ -106189 16439 11547 -94609 30823 518992 129759 537248 914641 -282011 164206
2130A64206R76304o90906J72328j066734n2947J175031P06752j250215N87411
$$ 164206 1140510 449604 621932 -444802 -497749 677282 1384034 133819 721230
2121G21230j132793P314m86221N90826O8713k51288P4070J159421K92620j403643
$$ 721230 -411563 -404249 -890470 -299644 -230931 -482219 -408149 751272 1043892 -359751
2111c59751P4470R77762p22031M38969L34070p08724J17580l61344P73239q0616
$$ -359751 -285281 692481 -29550 409419 743489 34765 152345 -208999 564240 483624
2101D83624m48538R16601m31611n21197o85053Q08337l40759p76609Q0487J182132
$$ 483624 35086 951687 520076 -1121 -686174 122163 -218596 -995205 -914718 267414
2091B67414l42041j5396N68620L43693l31946m11603j1108N15020L34199l75362
$$ 267414 -74627 -90023 478597 822290 490344 78741 67633 582653 916852 541490
2081E41490p10537m96474K48779M91490q7121l94957P38234m76457j1967K67289
$$ 541490 -169047 -665521 -416742 74748 -12373 -407330 330904 -145553 -157520 109769
2071A09769K93295r4754p49261p67767K01612P33451l2361n54410J162108m5356
$$ 109769 403064 308310 -440951 -1208718 -1007106 -273655 -306016 -860426 301682 256326
2061B56326k041K76737N86052r49923m17668O77322j14343j95701m47745l67557
$$ 256326 254285 531022 1117074 167151 -250517 426805 312462 116761 -330984 -698541
2051f98541M58192N1685K27216O91354P16664q458n65988j180425O99829q11563
$$ -698541 -240349 -188664 38552 729906 1446570 1438112 872124 -308301 391528 -420035
2041d20035N00425J30384q53973O63911J28019j096196J4356N53016l01374N62941
$$ -420035 80390 210774 -643199 20712 148731 -947465 -933109 -380093 -681467 -118526
2031a18526M73727L67169j009597J151490j070712j248155J475383R66883j194258
$$ -118526 355201 722370 -287227 864263 -206449 -1454604 20779 987662 -206596
2022b06596M73495j26215R1771M1366j15927J89215j73178K93670j76310J47054
$$ -206596 266899 140684 232455 273821 157894 347109 173931 467601 291291 438345
2012D38345K7628M90934j74474L8655o00155p5504P91155l15493j61532j67051
$$ 438345 465973 956907 782433 821088 220933 145429 936584 621091 459559 292508
2002B92508p74607r1997N10132P60435Q45881J74413k37407P7088p57122n21150
$$ 292508 -482099 -574096 -63964 696471 1542352 1716765 1479358 1556446 799324 278174
1992B78174O23931M77031J70389k50482O09672j48762m015p09622O73538R02767
$$ 278174 902105 1379136 1549525 1299043 1908715 1759953 1755938 1046316 1719854 2622621
1982B622621l13968O51774J296278m64633n88901j1970k77867m30888P56167M15910
$$ 2622621 2308653 2960427 4256705 3792072 3203171 3191201 2913334 2482446 3238613 3654523
1972C654523J98981L59850J224847Q46209j73269o13265J79577J944059N82759
$$ 3654523 3853504 4213354 5438201 6284410 6111141 5497876 5677453 7621512 8204271
1963H204271j80162R17506J728729J002672R15675R86785J009529J307517J454493
$$ 8204271 8024109 8941615 10670344 11673016 12588691 13575476 14585005 15892522 17347015
1954A7347015R45683O63997J297709J378194K865195K530410K095249L050346
$$ 17347015 18292698 18956695 20254404 21632598 24497793 27028203 29123452 32173798
1946C2173798L271478K545496L671344K024973L940172N805280P148821J1556233
$$ 32173798 35445276 37990772 41662116 43687089 47627261 53432541 60581362 72137595
1938G2137595J5101866J9361010K5882616K1870893L707600q605838j7035446
$$ 72137595 87239461 106600471 132483087 154353980 158061580 149455742 132420296
1931A32420296j9967891j7725986j3345865j1339446q401649p447287o511001
$$ 132420296 112452405 94726419 81380554 70041108 61639459 54192172 47681171
1924D7681171m374786l218631l776607m769265j358629k260157k305161q43316
$$ 47681171 43306385 40087754 36311147 31541882 30183253 27923096 25617935 24774619
1916B4774619k684538j621955k287534r18207j034797n15782j343138j75802q86419
$$ 24774619 22090081 20468126 18180592 17262385 16227588 15711806 14368668 14192866 13306447
1907A3306447j134561k48954k9771j442937J49446L4932j533885k62160L62980
$$ 13306447 12171886 11922932 11893161 10450224 10599670 10634602 9100717 8838557 9201537
1898I201537j224548m49506O44311p78744j277993J69214k20813J10082n86007
$$ 9201537 7976989 7527483 8171794 7393050 6115057 6284271 6063458 6173540 5587533
1889E587533p48724K34267l72334M95856Q91416q63463j121258N54657m72821
$$ 5587533 4838809 5073076 4700742 5196598 6088014 5224551 4103293 4657950 4185129
1880D185129l78092j43811K37468q38688Q23333L43814q05829l0697P47408m04000
$$ 4185129 3807037 3663226 3900694 3062006 3885339 4229153 3423324 3392627 4140035 3736035
1870C736035j316042N31345o24114j483m0287q6466O81256K11501o64618p01439
$$ 3736035 2419993 2951338 2327224 2325741 2285454 2198988 2880244 3091745 2427127 1725688
1860A725688j98961O74825J14620K86380j83191p98352O13613O57532m84252q19596
$$ 1725688 1526727 2201552 2316172 2602552 2419361 1621009 2234622 2892154 2407902 1588306
1850A588306k0518k14898k37762k08878q0189L8385O23613m75345M59986n07089
$$ 1588306 1567788 1352890 1115128 906250 826061 864446 1488059 1012714 1472700 965611
1840I65611k59817k49890K25472J062479l03658M96179L82409q41513k36502m85538
$$ 965611 705794 455904 681376 1743855 1440197 1936376 2318785 1477272 1240770 755232
1830G55232q76981N47617P47045N00810k96476p82419j08307j93495K41963P86027
$$ 755232 -121749 425868 1172913 1673723 1377247 594828 486521 293026 534989 1321016
1820A321016k92763M24486K15484p23677Q70100j495298k15585l960J91105O94330
$$ 1321016 1028253 1452739 1668223 944546 1814646 319348 103763 99803 290908 985238
1810I85238p03766M57754m45515l06730Q71054m21061k94541j34790M70859J64153
$$ 985238 281472 739226 293711 -13019 858035 436974 142433 7643 478502 642655
1800F42655O22491n00168N83085j051247M10996l99138k16575N09243J52876m09678
$$ 642655 1265146 764978 1348063 296816 707812 308674 92099 601342 754218 344540
1790C44540j301103l656J019503Q34037n24121M71632k18193j53636k61087N74342
$$ 344540 -956563 -960219 59284 893321 369200 840832 622639 469003 207916 782258
1780G82258p60475J84402l97275m37595R91145K06527l35594o73222j43097r2985
$$ 782258 21783 206185 -191090 -628685 362460 568987 233393 -439829 -582926 -675911
1770f75911J093360o1298K0891J42291n38245P25345o31650R88606k48483q38747
$$ -675911 417449 356151 377042 519333 -18912 706433 74783 1063389 814906 -23841
1760b3841P6229l16214k33599J45025O03985n36737J061512n47448o3686l01031
$$ -23841 52388 -263826 -497425 -352400 251585 -285152 776360 228912 165226 -135805
1750a35805N01813K62434m57779J50394k13698Q48124o40048l09248M74636j037421
$$ -135805 366008 628442 170663 321057 107359 955483 315435 6187 480823 -556598
1740e56598K02049L23271L86479p58902R67023R90643m53959o85830l25638M13115
$$ -556598 -354549 -31278 355201 -403701 563322 1553965 1100006 414176 88538 501653
1730E01653o80746l72552M75596J198802j436880L07349J038347j532526l8197
$$ 501653 -179093 -551645 -76049 1122753 -314127 -6778 1031569 -500957 -539154
1721e39154O2125M22141K22487k87801O23072p24734R05203K61274l63529r3524
$$ -539154 -477029 -54888 167599 -120202 502870 -221864 683339 944613 581084 487560
1711D87560M52736q24242L51199o87935K34494J083651l4780j159102k36262K64411
$$ 487560 940296 116054 467253 -220682 13812 1097463 1062683 -96419 -332681 -68270
1701f8270O0559L17781m30624q1449R1711n86537L68973P39537J91392l37368
$$ -68270 -7711 310070 -120554 -202003 -110292 -696829 -327856 411681 603073 265705
1691B65705j97908n41932P15308r7723p37584Q12006k76208L37514R8391j019792
$$ 265705 67797 -474135 241173 143450 -594134 217872 -58336 279178 377569 -642223
1681f42223L30833J69100L7928l0134o08352M82532N61015j91086j82119K90281
$$ -642223 -311390 -142290 -104362 -134496 -742848 -260316 300699 109613 -72506 217775
1671B17775j54659J2155Q5223n14888j10235M2778M33516m78183O85946R3977
$$ 217775 63116 75271 160494 -354394 -464629 -421851 11665 -466518 219428 313405
1661C13405L38153j17059k7164M78717j230384k92936l52767k86423K48084M01608
$$ 313405 651558 534499 507335 986052 -244332 -537268 -890035 -1176458 -928374 -526766
1651e26766l47681J589825q48339o92606J117787q8421O89271j355820J32686
$$ -526766 -874447 715378 -132961 -825567 292220 203799 893070 -462750 -330064
1642c30064j162974L40625J99881P66722N33515r07548L97025R07352p84708q2866
$$ -330064 -1493038 -1152413 -952532 -185810 347705 -559843 -162818 744534 -40174 -123040
1632a23040K10016K7183k39654m81660R94561k03517M85395L94708n67316k85364
$$ -123040 86976 114159 -125495 -607155 387406 183889 669284 1063992 496676 211312
1622B11312M09051q74256j17188M30535j54989r44748P17733J73665K99570j23647
$$ 211312 620363 -253893 -371081 59454 -95535 -1040283 -322550 -148885 150685 27038
1612B7038L36561p63912l13510K34893J55116M5842L53118k16650l48795K54399
$$ 27038 363599 -400313 -713823 -478930 -323814 -277972 75146 -141504 -490299 -235900
1602b35900j0220n4999M65003j132456R09363r4767K3430J499129l03175r27995
$$ -235900 -246120 -301119 163884 -968572 -59209 -153976 -130546 1368583 1065408 137413
1592A37413j0411q18990q26608N61292P68521j34719L51322M98888k05667K61534
$$ 137413 127002 -691988 -1518596 -957304 -188783 -323502 27820 526708 321041 582575
1582E82575l78968L62837k57812J17209j49463P37512J04033q40356k51761P4617
$$ 582575 203607 566444 308632 425841 276378 1013890 1117923 277567 25806 100423
1572A00423P8264l88986K51345l90876p96338O73136M07680N15970K98303p6994
$$ 100423 178687 -210299 41046 -349830 -1146168 -473032 -65352 450618 748921 671927
1562F71927m46006k62564j30334P00590p76107j000892P1112O76703L18088Q0191
$$ 671927 225921 -36643 -166977 533613 -242494 -1243386 -1172274 -495571 -177483 -97292
1552i7292L93237K289L3023q1334n09037k4069J06577r9101K84514o01303P84855
$$ -97292 295945 298234 331257 249923 -259114 -283183 -176606 -275707 8807 -592496 192359
1541A92359m5038L59641j14748n71749o36098K46125K76966J69750l98996j64903
$$ 192359 147321 506962 392214 -179535 -815633 -569508 -292542 -122792 -521788 -686691
1531f86691Q21988m37889m47589R3857O4886N89525r69932M65170q08531K54327
$$ -686691 135297 -302592 -750181 -656324 -591438 -1913 -971845 -506675 -1315206 -1060879
1521a060879O63993k82434n06665J063836j92059r5209L80842O89418j5229p68836
$$ -1060879 -396886 -679320 -1185985 -122149 -314208 -409417 -28575 660843 645614 -123222
1511a23222P06293j013260J5898k23726l80694M83474J69219K02559N14274J66992
$$ -123222 583071 -430189 -414291 -638017 -1018711 -535237 -366018 -163459 350815 517807
1501E17807o95332j68055J67549l72481j22503l26955O36378o82406R9513K14230
$$ 517807 -177525 -345580 -178031 -550512 -673015 -999970 -363592 -1045998 -946485 -732255
1491g32255M43664Q4310l25494n12596L20798K55382R52353l07338M01563m30544
$$ -732255 -288591 -204281 -529775 -1042371 -721573 -466191 486162 178824 580387 149843
1481A49843J83450J72690m07052j00021L14621k72943K7372l43896J00531l82844
$$ 149843 333293 505983 98931 -1090 313531 40588 67960 -275936 -175405 -558249
1471e58249J050439J086914r42035k16596l30392k74592L11440o44373O45996
$$ -558249 492190 1579104 637069 420473 90081 -184511 126929 -517444 128552
1462A28552k47594j033489O08182O30140K47136p10232J31962k23524m7273J191711
$$ 128552 -119042 -1152531 -544349 85791 332927 -377305 -245343 -468867 -516140 675571
1452F75571j90257m21129l39632p2312P25765q37148N45007p60844L03077O69972
$$ 675571 485314 64185 -275447 -347759 378006 -459142 85865 -674979 -371902 298070
1442B98070M33178l46158j58069k54754K65668M68816j109380J75853l99740O32695
$$ 298070 731248 385090 227021 -27733 237935 706751 -402629 -226776 -626516 6179
1432F179N18219o87323N99224J5256o19585Q01203k26464K40844j171932l8010
$$ 6179 524398 -162925 436299 451555 -168030 633173 406709 647553 -524379 -562389
1422e62389P75814j267764Q69625J199754k91549k37956n18056P97153m3355q29527
$$ -562389 213425 -1054339 -184714 1015040 723491 485535 -32521 764632 721277 -108250
1412a08250N82220n08933O37441j75654p3397M25029m41681m79895p5286m48004
$$ -108250 473970 -34963 602478 426824 353427 778456 336775 -143120 -218406 -666410
1402f66410O32394J65987J93215n34533R11576J47336k17015l19805r33549O69358
$$ -666410 -34016 131971 325186 -209347 702229 849565 632550 312745 -620804 48554
1392D8554N6463L14138m26396N06274m2282p4953j020159p5160R06158O35047
$$ 48554 105017 419155 -7241 499033 456751 381798 -638361 -713521 192637 827684
1382H27684k16103l99402n60041K02035M43045l48640l44644k60783j90438Q67665
$$ 827684 611581 212179 -347862 -145827 297218 -51422 -396066 -656849 -847287 20378
1372B0378N2268J71299o53279N20073O33893p12247l87184J12244Q42503k75263
$$ 20378 72646 243945 -409334 110739 744632 32385 -354799 -242555 599948 324685
1362C24685j153189j41009J480205J01658q7483p49382p2801n77406K98197M71139
$$ 324685 -828504 -969513 510692 612350 524867 -224515 -297316 -874722 -576525 -105386
1352a05386k86542j14278l87709O41755N41949N8670q62533K35678P63083p82464
$$ -105386 -391928 -506206 -893915 -252160 289789 348459 -514074 -278396 484687 -297777
1342b97777l46494l15109n86777P28504J374851J20882n26335l4802j96383n1705
$$ -297777 -644271 -959380 -1546157 -817653 557198 678080 151745 116943 -79440 -131145
1332a31145j47517J54690K64159J16510k44488l16584P86849m6032J70489j60936
$$ -131145 -278662 -123972 140187 256697 12209 -304375 482474 436442 606931 445995
1322D45995j110062M65024J5877K24297j6609L98477J94736J83096q51745r07077
$$ 445995 -664067 -199043 -183166 41131 24522 422999 617735 800831 -50914 -957991
1312i57991J794563r41818r56348O65399O88998l79673n89577O0805P99783K46104
$$ -957991 836572 -105246 -1061594 -396195 292803 -86870 -676447 -615642 184141 430245
1302D30245M5981p59143J089901l44587l3316L36392q69375j408984R11799P18216
$$ 430245 476226 -282917 806984 462397 429081 765473 -103902 -1512886 -601087 117129
1292A17129o7437m88068N16193k99295l53667k85758M13351N54323m96579N08099
$$ 117129 49692 -438376 77817 -221478 -575145 -860903 -447552 106771 -389808 118291
1282A18291l92894J041753m38601r5103M14418p76360q49058l5213M78388O90417
$$ 118291 -274603 767150 328549 233446 647864 -128496 -977554 -1012767 -534379 156038
1272A56038O72217N23457k07789j309897j068630M29433J411749k21699l47859
$$ 156038 828255 1351712 1143923 -165974 -1234604 -805171 606578 384879 37020
1263C7020O99966L26091q65912L93382k1619k76481P127J55874m07844R1335O63458
$$ 37020 736986 1063077 197165 590547 568928 292447 299574 455448 47604 138939 802397
1252H02397r06890j01434J77274J04315J5485K95786k73459k12024J245065o1492
$$ 802397 -104493 -205927 -28653 75662 91147 386933 113474 -98550 1146515 1085023
1242A085023j011009N3508Q38834k56182K9698m64479Q26652m63115l65442K06125
$$ 1085023 74014 127522 966356 710174 739872 275393 1102045 638930 273488 479613
1232D79613J41395L43628r78749r4504j16320p48404p37185P58497k1690J110754
$$ 479613 621008 964636 -14113 -108617 -224937 -973341 -1710526 -952029 -973719 137035
1222A37035k24067o25372K68453k10919l71753q3197q1765M53807Q8117O36401
$$ 137035 -87032 -712404 -443951 -654870 -1026623 -1109820 -1191585 -737778 -649661 -13260
1212a3260o60808M2400M52283P27506q02173L82948j080071k59204J8484L73383
$$ -13260 -674068 -631668 -179385 548121 -254052 128896 -951175 -1210379 -1191895 -818512
1202h18512k14355J011571O63886k34906L9130j117981M86703Q40824j418454
$$ -818512 -1032867 -21296 642590 407684 446814 -671167 -184464 656360 -762094
1193g62094Q58206q04512K56789P01048Q5608J69349j023358m5399P77428j149102
$$ -762094 96112 -708400 -451611 249437 335045 504394 -518964 -564363 213065 -936037
1183i36037n7930J016398j2389j07601K40642L31054k83688k10046k87856O42257
$$ -936037 -993967 22431 10042 -97559 143083 474137 190449 -19597 -307453 334804
1173C34804r87310L32204M73167o14129N34515L74518r2944M7936J4553O96162
$$ 334804 -652506 -320302 152865 -461264 73251 447769 354825 402761 417314 1113476
1163A113476j311425j94256j17688O08274L69163J94046J3387p09591n07743P13484
$$ 1113476 -197949 -392205 -509893 98381 467544 661590 674977 -34614 -542357 171127
1153A71127j7251p27556m6981J032347n45880n03908J89080o8108L13372K94554
$$ 171127 153876 -573680 -620661 411686 -134194 -638102 -449022 -517130 -203758 90796
1143I0796k92897O59953J49806p59908O5065q22275K92586J024079n98181p5625
$$ 90796 -202101 457852 607658 -152250 -87185 -909460 -616874 407205 -190976 -266601
1133b66601p442l15920O68769m47088j13316J0268p15741L04360O73392J110717
$$ -266601 -274043 -589963 78806 -368282 -481598 -471330 -1187071 -882711 -209319 901398
1123I01398J00953r99857p42952R69076K33125k9108j164265J082441p51421J28735
$$ 901398 1002351 2494 -740458 228618 461743 432635 -731630 350811 -400610 -271875
1113b71875p16197q7704R42407N61011k6810j00834o13556l32273J430831o55694
$$ -271875 -988072 -1075776 -133369 427642 400832 299998 -313558 -645831 785000 129306
1103A29306j40084M79749p8025n22738K12995o92353R15978j12415k12397q5284
$$ 129306 -10778 468971 390946 -131792 81203 -611150 304828 192413 -19984 -105268
1093a05268N2738m31981K33106L44941o40590K28099p7868O97907l35265N47602
$$ -105268 -52530 -484511 -251405 93536 -547054 -318955 -396823 301084 -34181 513421
1083E13421j241455m7855M42716m84348P01262p868K33518r27107J242029m62805
$$ 513421 -728034 -775889 -333173 -817521 -116259 -124127 109391 -817716 424313 -38492
1073c8492j93809J48798J35818l82623N70813j092644L39872L43807L01802n68507
$$ -38492 -232301 -83503 52315 -330308 240505 -852139 -512267 -168460 133342 -435165
1063d35165L23554m00955J51805k84334l42541Q98828m75550K35348k53603K70527
$$ -435165 -111611 -512566 -360761 -645095 -987636 -88808 -564358 -329010 -582613 -312086
1053c12086k5313J366984Q5570P664p59769K75256l97730K18783m44112K22503
$$ -312086 -337399 1029585 1115155 1122819 363050 638306 240576 459359 15247 237750
1043B37750Q4659n1332n90412n94662J218575o0925K27003p79500k32487O96084
$$ 237750 322409 271077 -319335 -913997 304578 243653 470656 -308844 -541331 154753
1033A54753n44j95266J95902J75579j32378j91452j037626J39050R30939J118494
$$ 154753 154209 -41057 154845 330424 198046 6594 -1031032 -891982 38957 1157451
1023A157451k49785J7879o43690P0817p5326p66150l2955L40718J38591n1606
$$ 1157451 907666 925545 281855 352672 277346 -488804 -521759 -181041 -42450 -94056
1013i4056k27449q25795N07256O59964q15411j15156K09862M67504j59322L73925
$$ -94056 -321505 -1147300 -640044 19920 -795491 -910647 -700785 -233281 -392603 -18678
1003a8678n31704M6686J809842m41892r90885Q5374j20300k37321j98412J54544
$$ -18678 -550382 -503696 1306146 864254 -126631 -41257 -161557 -398878 -597290 -442746
993d42746k11092L65145q18423O36988l2220O01412n5767j034989L80479Q49430
$$ -442746 -653838 -288693 -1107116 -470128 -502348 99064 43297 -991692 -611213 238217
983B38217k56606K41041L52987k33498L90533P6717o77973o11583N71670q61825
$$ 238217 -18389 222652 575639 342141 732674 809391 131418 -480165 91505 -770320
973g70320N85251k61093j40041Q08774M02667m19916j2036J154677L61270n98995
$$ -770320 -185069 -446162 -586203 222571 625238 205322 193286 1347963 1709233 1110238
963A110238n81727j06099j22366j204681L14039K37584J167912n62467m54159
$$ 1110238 528511 422412 300046 -904635 -590596 -353012 814900 252433 -201726
954b01726q4142j41482L10683L67627j21272k55149l72794J87172k89433P12220
$$ -201726 -285868 -427350 -116667 250960 129688 -125461 -498255 -311083 -600516 111704
944A11704K53530R8044J41623M26800r50704L7651n38383O44139L23297M4116
$$ 111704 365234 463278 604901 1031701 80997 118648 -419735 224404 547701 591817
934E91817K34462k13645Q40180J56412j175824R2791m24471M61136j36743m55306
$$ 591817 826279 612634 1452814 1609226 433402 526193 101722 562858 426115 -29191
924b9191m5838l31795M23603k78292o8375N32646k00286L20699M26568K60563
$$ -29191 -75029 -406824 16779 -261513 -329888 202758 2472 323171 749739 1010302
914A010302l94221k00591n03718J80926m73681M44590P07964o26729K21146j72283
$$ 1010302 616081 415490 -88228 92698 -380983 63607 771571 144842 365988 193705
904A93705M39149J70814L47591r02939m55875j20580L94834K25614J76526m26812
$$ 193705 632854 803668 1151259 248320 -207555 -328135 66699 292313 468839 42027
894D2027p0258O05929p97918m15001O66781k19627J0110m63965l70761O9325J94810
$$ 42027 -28231 577698 -220220 -635221 31560 -188067 -177957 -641922 -1012683 -943358 -748548
883g48548R22009M9265o41812m34563R4232J236350j399409N786M45390K94040
$$ -748548 173461 222726 -419086 -853649 -759417 476933 -922476 -916690 -471300 -177260
873a77260M65125K52152m45013M96042l03316o17046q9391N70225P79547K93073
$$ -177260 287865 540017 95004 591046 287730 -329316 -418707 151518 931065 1224138
863A224138j033541j11990m64645j64681N94216m05167j37387o28981O45969J059740
$$ 1224138 190597 78607 -386038 -550719 43497 -361670 -499057 -1128038 -482069 577671
853E77671J98061r37568n02081J47583N49270J66185j086462J69670N05391L99990
$$ 577671 775732 -161836 -663917 -516334 32936 199121 -887341 -717671 -212280 187710
843A87710K95568o71230Q3446K88904P11685l7122k15350k29404n94415p9946
$$ 187710 483278 -187952 -104506 184398 896083 858961 643611 414207 -180208 -260154
833b60154j35152J248417l16463L41203j4635j29901j272246M70957o4878J33708
$$ -260154 -395306 853111 536648 877851 863216 733315 -538931 -67974 -132852 856
823H56q6946L50047k97156N80413n63386p78387K38022O94902P62235k16991J01114
$$ 856 -86090 263957 -33199 547214 -16172 -794559 -556537 138365 900600 683609 784723
812G84723n4393o81078J1842N2451k19773K87232M75560J31633j018158P65913
$$ 784723 730330 49252 61094 113545 -106228 181004 656564 788197 -229961 535952
802E35952K37654q37655n46810K74466K57108l02965O89153N81165p91433P3805
$$ 535952 773606 -64049 -610859 -336393 -79285 -382250 306903 888068 96635 170440
792A70440j97043K17902K19800n14473j49649k33055J8870K56988j99334j8631
$$ 170440 -26603 191299 411099 -103374 -253023 -486078 -467208 -210220 -409554 -428185
782d28185o03L99274k93510L63480l21345k4299N26332m97086P5114l52736L45399
$$ -428185 -428788 -29514 -323024 40456 -280889 -305188 221144 -275942 -200828 -553564 -208165
771b08165M76324L2088m8250n94159J067189N25813j331985j09872K53876m10463
$$ -208165 268159 300247 251997 -342162 725027 1250840 -81145 -191017 62859 -347604
761c47604J82976m67434P68349m27982Q6526o88589J375045P39869r13328o33887
$$ -347604 -164628 -632062 136287 -291695 -205169 -893758 481287 1221156 307828 -326059
751c26059J21663J082531L76773j432190L13771q36459N59634l56607o52159J318022
$$ -326059 -204396 878135 1254908 -177282 136489 -699970 -140336 -496943 -1149102 168920
741A68920n0611m60150j32211M611L06582j80161r0081J72926p66425M71876M74911
$$ 168920 118309 -341841 -474052 -469441 -162859 -343020 -433101 -260175 -1026600 -554724 -79813
730g9813j39550j830N27805j125153k45694Q17316j45437o75570J014661l26466
$$ -79813 -219363 -221193 306612 -818541 -1064235 -246919 -392356 -1067926 -53265 -379731
720c79731q95698J219283L25993J71053k16703n52547J93234K00304K63937m24015
$$ -379731 -1275429 -56146 269847 440900 224197 -328350 -135116 65188 329125 -94890
710i4890M22741O10341p99175N94448j306826K71383O16822J76466N35038m4060
$$ -94890 327851 938192 139017 733465 -573361 -301978 314844 491310 1026348 982288
700I82288l88788K58229J29076o91526J9055N82961J22022j153300N65528l22304
$$ 982288 593500 851729 980805 289279 308334 891295 1013317 -139983 425545 103241
690A03241p70290R4670r44243O22633J25348P43063M13218K01280r98249R26285
$$ 103241 -667049 -572379 -1516622 -893989 -768641 -25578 387640 588920 -409329 516956
680E16956M9990q2244j09486j002426O79292n0806J65140l79472p17946N23036
$$ 516956 566946 484702 375216 -627210 52082 1276 166416 -213056 -931002 -407966
670d07966K24758m52762K36912P10506N22382l45369p4788p02459k15612Q20928
$$ -407966 -183208 -635970 -399058 311448 833830 488461 413673 -288786 -504398 316530
660C16530J06658j491779O07488p53813M29085J55994M82907K82198L70103m23911
$$ 316530 423188 -1068591 -461103 -1214916 -785831 -629837 -146930 135268 505371 81460
650H1460j04044J69821M9039l11847p4794N9906R76363n37368q44522L68517L31483
$$ 81460 -22584 147237 196276 -115571 -190365 -130459 845904 308536 -535986 -167469 164014
639A64014N86376m42442L53347p2154K44431o1837j347055Q32839J193634o88042
$$ 164014 750390 307948 661295 589141 833572 771735 -575320 257519 1451153 763111
629G63111k46710L15115j83117j012533P01715Q71192p37240O65768j416169L40009
$$ 763111 516401 831516 648399 -364134 337581 1208773 471533 1137301 -278868 61141
619F1141k79643K99638k99891N74939j3093j14450k14255j40922j64518L2691
$$ 61141 -218502 81136 -218755 356184 343091 228641 14386 -126536 -291054 -258363
609b58363O6871l44245L08205l079k02728L30840K3374K57119m42338k23414j6756
$$ -258363 -191492 -535737 -227532 -230611 -433339 -102499 -79125 177994 -264344 -487758 -504514
598e04514N33864P89548n76705Q24617l1543P3466n77881o75521p88382J099746
$$ -504514 29350 818898 242193 1066810 1035267 1108733 530852 -144669 -933051 166695
588A66695k89208l60816M9510K77018N35943K52437n41722j33178k44437K98557
$$ 166695 -122513 -483329 -433819 -156801 379142 631579 89857 -43321 -287758 10799
578A0799j22191o05039M58620M88161K70738l22050k50026K3775m32536P47559
$$ 10799 -111392 -716431 -257811 230350 501088 179038 -70988 -47213 -479749 267810
568B67810l17109L55031k40991l32674K21032P63762L18558j25353q43997K03233
$$ 267810 -49299 305732 64741 -267933 -46901 716861 1035419 910066 66069 269302
558B69302J86798j060929P71350o38404M56691L52449P2846l79924M95918o1151
$$ 269302 456100 -604829 166521 -471883 -15192 337257 410103 30179 526097 464946
548D64946n71486N55072q25664m63560R7805Q47415o36587J41489n48626N98298
$$ 464946 -106540 448532 -377132 -840692 -742887 104528 -532059 -390570 -939196 -340898
538c40898P26234n33826M2199J014965O42108j987125l58541J370773l16347q59643
$$ -340898 385336 -148490 -106291 908674 1550782 -436343 -794884 575889 259542 -600101
528f00101J121502r67829Q0939l01361k02287J276058p36436o35991J78711J97864
$$ -600101 521401 -446428 -365489 -666850 -869137 406921 -329515 -965506 -786795 -588931
518e88931J04711J082290k13044j86677J64141p5533l65481M8902k45505j91784
$$ -588931 -484220 598070 385026 198349 362490 286957 -78524 -29622 -275127 -466911
508d66911P0021L78627J09988N00678K23611o72999j12860n98389L87747r6000
$$ -466911 -396890 -18263 91725 592403 816014 143015 30155 -568234 -180487 -276487
498b76487L78521k89342J32417m79331k45707J267626n84462l63862M11033O54856
$$ -276487 102034 -187308 -54891 -534222 -779929 487697 -96765 -460627 -49594 605262
488F05262j233567K66545n43185L23406J22019L07791J20620l88680M92771N00081
$$ 605262 -628305 -361760 -904945 -581539 -459520 -151729 -31109 -419789 72982 573063
478E73063k42241m29509k76914P4858K51461j86700k24437M09700Q06101j112364
$$ 573063 330822 -98687 -375601 -300743 -49282 -235982 -460419 -50719 755382 -356982
468c56982Q6031J31743j92941o67178l96069K66074P05426K0225j8873q91010
$$ -356982 -270951 -139208 -332149 -999327 -1395396 -1129322 -423896 -403671 -422544 -1313554
458a313554M56127O56180j3458n24563J85979P77735j40279N41019j82932p84489
$$ -1313554 -857427 -201247 -214705 -739268 -553289 224446 84167 625186 442254 -342235
448c42235J19686J23770J71671K63668p77702m03198K36395j785L26375N79650
$$ -342235 -222549 -98779 72892 336560 -441142 -844340 -607945 -609730 -283355 296295
438B96295Q8259m08531N33113J71221r28201O20883K20881l15626j72500O66867
$$ 296295 384554 -23977 509136 680357 -247844 373039 593920 278294 105794 772661
428G72661l46961j33497k88251J07993k53209k77663K46229K25491J81212M19441
$$ 772661 425700 292203 3952 111945 -141264 -418927 -172698 52793 234005 653446
418F53446j24244K20757o39317j27836L456n60102Q06597R0402k15800L05834
$$ 653446 529202 749959 110642 -17194 -13738 -573840 232757 323159 107359 413193
408D13193r87284N33970K47194j143265Q37370P6927K24832j67225k87658o78374
$$ 413193 -574091 -40121 207073 -936192 -98822 -21895 202937 35712 -251946 -930320
398i30320J221682k20485J60345l1211j336406J379240R83130j528870J61457
$$ -930320 291362 70877 231222 200011 -1136395 242845 1225975 -302895 -141438
389a41438m09243k82354Q93285j43623l6751K53997p9795M9384r19n00139o40081
$$ -141438 -550681 -833035 60250 -83373 -120124 133873 54078 103462 102543 -397596 -1037677
378a037677J094942l08830M03842j46319n6146j43893R05252m75862J44421k47457
$$ -1037677 57265 -251565 152277 5958 -50188 -194081 711171 235309 379730 132273
368A32273J34877r488k62445R9804o0981N86775k20746n00404o0166O66046K29673
$$ 132273 267150 257662 -4783 95021 34040 620815 400069 -100335 -160501 505545 735218
357G35218m57605p60369m35469M33476K35115J061958j8649J51375r91994m69042
$$ 735218 277613 -482756 -918225 -484749 -249634 812324 793675 945050 -46944 -515986
347e15986O93085K16605L37565o85706L7777o7623N37035r77Q47947m18207o67951
$$ -515986 177099 393704 731269 45563 83340 15717 552752 551775 1399722 981515 313564
336C13564j028396k83208j38179P32398K13655K52019L02691J34260m88170M57249
$$ 313564 -714832 -998040 -1136219 -403821 -190166 61853 364544 498804 10634 467883
$$ [...]
##END NTUPLES=NMR SPECTRUM
##END=
