##TITLE=1H_CG-1206-A2
 CDCl3
 8 sc, 
 26.6.2024
##JCAMPDX= 6.0         $$ Bruker NMR JCAMP-DX V2.0
##DATA TYPE= NMR SPECTRUM
##DATA CLASS= NTUPLES
##ORIGIN= UXNMR, Bruker Analytische Messtechnik GmbH
##OWNER= root
$$ XWIN-NMR		Version 3.5
$$ Wed Jun 26 14:06:31 2024 Russian Standard Time (UT+4h)  she@DPX200
##.OBSERVE FREQUENCY= 200.1312
##.OBSERVE NUCLEUS= ^1H
##.ACQUISITION MODE= SIMULTANEOUS
##.ACQUISITION SCHEME= undefined
##.AVERAGES= 8
##.DIGITISER RES= 18
##SPECTROMETER/DATA SYSTEM= spect
##.PULSE SEQUENCE= zg30
##.SOLVENT NAME= CDCl3
##.SHIFT REFERENCE= (INTERNAL, CDCl3, 0, 15.0087)
##AUDIT TRAIL= $$ (NUMBER, WHEN, WHO, WHERE, WHAT)
$$ ##TITLE= Audit trail, XWIN-NMR		Version 3.5
$$ ##JCAMPDX= 5.01
$$ ##ORIGIN= Bruker BioSpin GmbH
$$ ##OWNER= she
$$ F:/spectra/data/she/nmr/H-F/1/pdata/1/auditp.txt
$$ ##AUDIT TRAIL=  $$ (NUMBER, WHEN, WHO, WHERE, WHAT)
(   1,<2024-06-26 14:05:32.50 +0400>,<she>,<DPX200>,
      <created by zg, POWCHK disabled, PULCHK disabled
       configuration hash MD5:
       00 E9 B6 7A A2 85 ED C7 34 08 36 98 17 FE 4E 26
       data hash MD5: 16K
       29 35 61 82 2C C9 ED 14 0A 15 E7 2E 15 64 78 5C>)
(   2,<2024-06-26 14:05:35.65 +0400>,<she>,<DPX200>,
      <Start of raw data processing
       efp BC_mod = 2 LB = 0.24 FT_mod = 6 PKNL = 1 PHC0 = -25314.05 PHC1 = 9.587481 SI = 16K 
       data hash MD5: 16K
       54 A6 75 B5 54 47 7C AE 91 6A 5F 4F AB F9 01 33>)
(   3,<2024-06-26 14:05:52.25 +0400>,<she>,<DPX200>,
      <pk PHC0 = 85.36268 PHC1 = 2.4 
       data hash MD5: 16K
       1D C4 E7 76 0C 08 CF 63 83 04 0A 13 A3 D5 A6 48>)
(   4,<2024-06-26 14:05:55.03 +0400>,<she>,<DPX200>,
      <abs ABSG = 5 
       data hash MD5: 16K
       F6 B5 59 66 FB 4A B5 3B 8C 32 7B 8F 58 DA C3 C1>)
$$ ##END=
$$ 
$$ hash MD5
$$ AD F3 E1 45 57 C3 7E 5A F9 21 63 7B 1F 15 7B C6
##$RELAX= 
##$RELAX= 
##$RELAX= 
##$RELAX= 
##$RELAX= 
##$RELAX= 
$$ Bruker specific parameters
$$ --------------------------
##$DU= <F:/spectra>
##$EXPNO= 1
##$NAME= <H-F>
##$PROCNO= 1
##$TYPE= <nmr>
##$USER= <she>
##$AMP= (0..31)
100 100 100 100 100 100 100 100 100 100 100 100 100 100 100 100 100 100 
100 100 100 100 100 100 100 100 100 100 100 100 100 100 
##$AQSEQ= 0
##$AQ_mod= 1
##$AUNM= <au_zg>
##$AUTOPOS= <>
##$BF1= 200.13
##$BF2= 200.13
##$BF3= 200.13
##$BF4= 200.13
##$BF5= 200.13
##$BF6= 200.13
##$BF7= 200.13
##$BF8= 200.13
##$BYTORDA= 1
##$CFDGTYP= 0
##$CFRGTYP= 5
##$CHEMSTR= <none>
##$CNST= (0..31)
1 1 145 1 1 1 1 1 1 1 1 1 1 1 1 1 1 1 1 1 1 1 1 1 1 1 1 1 1 1 1 1 
##$CPDPRG= <>
##$CPDPRG1= <>
##$CPDPRG2= <>
##$CPDPRG3= <>
##$CPDPRG4= <mlev>
##$CPDPRG5= <mlev>
##$CPDPRG6= <mlev>
##$CPDPRG7= <mlev>
##$CPDPRG8= <mlev>
##$CPDPRGB= <>
##$CPDPRGT= <>
##$D= (0..31)
0 1.2 0 0 0 0 0 0 0 0.06 0 0.03 0 0 0 0 0.0002 0 0 0 0 0 0 0 0 0 0 0 0 
0 0 0 
##$DATE= 1719396331
##$DBL= (0..7)
120 120 120 120 120 120 120 120 
##$DBP= (0..7)
150 150 150 150 150 150 150 150 
##$DBP07= 0
##$DBPNAM0= <>
##$DBPNAM1= <>
##$DBPNAM2= <>
##$DBPNAM3= <>
##$DBPNAM4= <>
$$ [...]
##$SUBNAM3= <"">
##$SUBNAM4= <"">
##$SUBNAM5= <"">
##$SUBNAM6= <"">
##$SUBNAM7= <"">
##$SUBNAM8= <"">
##$SUBNAM9= <"">
##$SW= 18.0517418723606
##$SWIBOX= (0..15)
0 0 2 0 0 0 0 0 0 0 0 0 0 0 0 0 
##$SW_h= 3612.71676300578
##$TD= 16384
##$TD0= 1
##$TE= 0
##$TE2= 300
##$TE3= 300
##$TEG= 300
##$TL= (0..7)
0 120 120 120 120 120 120 120 
##$TP= (0..7)
150 150 150 150 150 150 150 150 
##$TP07= 0
##$TPNAME0= <>
##$TPNAME1= <>
##$TPNAME2= <>
##$TPNAME3= <>
##$TPNAME4= <>
##$TPNAME5= <>
##$TPNAME6= <>
##$TPNAME7= <>
##$TPOAL= (0..7)
0.5 0.5 0.5 0.5 0.5 0.5 0.5 0.5 
##$TPOFFS= (0..7)
0 0 0 0 0 0 0 0 
##$TUNHIN= 0
##$TUNHOUT= 0
##$TUNXOUT= 0
##$USERA1= <user>
##$USERA2= <user>
##$USERA3= <user>
##$USERA4= <user>
##$USERA5= <user>
##$V9= 5
##$VALIST= <valist>
##$VCLIST= <CCCCCCCCCCCCCCC>
##$VD= 0
##$VDLIST= <DDDDDDDDDDDDDDD>
##$VPLIST= <PPPPPPPPPPPPPPP>
##$VTLIST= <TTTTTTTTTTTTTTT>
##$WBST= 1024
##$WBSW= 4
##$XGAIN= (0..3)
0 0 0 0 
##$XL= 0
##$YL= 0
##$YMAX_a= 217657
##$YMIN_a= -319817
##$ZGOPTNS= <>
##$ZL1= 120
##$ZL2= 120
##$ZL3= 120
##$ZL4= 120
##$ABSF1= 15.00869
##$ABSF2= -3.043159
##$ABSG= 5
##$ABSL= 3
##$ALPHA= 0
##$AQORDER= 0
##$ASSFAC= 0
##$ASSFACI= 0
##$ASSFACX= 0
##$ASSWID= 0
##$AUNMP= <proc_1d>
##$AZFE= 0.1
##$AZFW= 0.1
##$BCFW= 0
##$BC_mod= 2
##$BYTORDP= 0
##$COROFFS= 0
##$CY= -3
##$DATMOD= 1
##$DC= 0
##$DFILT= <>
##$DTYPP= 0
##$F1P= 0
##$F2P= 0
##$FCOR= 1
##$FTSIZE= 16384
##$FT_mod= 6
##$GAMMA= 0
##$GB= 0
##$INTBC= 1
##$INTSCL= 3.70164e-10
##$ISEN= 128
##$LB= 0.24
##$LEV0= 0
##$LPBIN= 0
##$MAXI= 10000
##$MC2= 0
##$MEAN= 0
##$ME_mod= 0
##$MI= 1.114404
##$NCOEF= 0
##$NC_proc= -8
##$NLEV= 6
##$NOISF1= 3.799351
##$NOISF2= 2.8
##$NSP= 0
##$NTH_PI= 0
##$NZP= 0
##$OFFSET= 15.00869
##$PC= 1
##$PHC0= -25228.69
##$PHC1= 11.98748
##$PH_mod= 1
##$PKNL= yes
##$PPARMOD= 0
##$PSCAL= 0
##$PSIGN= 0
##$REVERSE= no
##$SF= 200.130002669683
##$SI= 16384
##$SIGF1= 3
##$SIGF2= 2
##$SINO= 5.538805
##$SIOLD= 16384
##$SREGLST= <1H.CDCl3>
##$SSB= 0
##$STSI= 16384
##$STSR= 0
##$SW_p= 3612.71676300577
##$SYMM= 0
##$S_DEV= 0
##$TDeff= 16384
##$TDoff= 0
##$TI= <>
##$TILT= no
##$TM1= 0
##$TM2= 0
##$TOPLEV= 0
##$USERP1= <user>
##$USERP2= <user>
##$USERP3= <user>
##$USERP4= <user>
##$USERP5= <user>
##$WDW= 1
##$XDIM= 16384
##$YMAX_p= 297244453
##$YMIN_p= -901621
$$ End of Bruker specific parameters
$$ ---------------------------------
##NTUPLES= NMR SPECTRUM
##VAR_NAME=  FREQUENCY,     SPECTRUM/REAL,   SPECTRUM/IMAG
##SYMBOL=    X,             R,               I
##VAR_TYPE=  INDEPENDENT,   DEPENDENT,       DEPENDENT
##VAR_FORM=  AFFN,          ASDF,            ASDF
##VAR_DIM=   16384,         16384,           16384
##UNITS=     HZ,            ARBITRARY UNITS, ARBITRARY UNITS
##FACTOR=    0.220516191357247, 1,           1
##FIRST=     3003.68914582711, 0,            0
##LAST=      -609.027617178659, 0,           0
##MIN=       -609.027617178659, -901621,     0
##MAX=       3003.68914582711, 297244453,    0
$$ Real data points
##PAGE= N=1
##DATA TABLE= (X++(R..R)), XYDATA
$$ [...]
$$ plain form
6848 4072850 4083872 4079804 4029748 4124747 4139053 4123215 4173006 4303341 4306435 4447385 4509272
6837 4509272 4570490 4676519 4746174 4817456 4829175 4827308 4903163 5016317 5058206 5121837 5157035
6826 5157035 5181183 5260492 5379911 5526347 5613289 5560556 5546034 5621100 5624766 5689291 5781677
6815 5781677 5844568 6003296 6132257 6239191 6333769 6477160 6670055 6749769 6751313 6819095 6915869
6804 6915869 6944080 6999804 7087669 7031461 7063735 7034436 7055030 7048691 7125493 7194174 7290150 7368787
6792 7368787 7416509 7541426 7541096 7586373 7742536 7784673 7900114 8038522 8197093 8251474 8328688
6781 8328688 8450320 8486526 8520536 8555736 8645102 8734591 8673878 8771078 8890196 8965746 9148443
6770 9148443 9244925 9306158 9510780 9740059 9873133 10015240 10131859 10299846 10464852 10542288
$$ packed form
6848D072850J1022m068n0056R4999J4306j5838M9791J30335L094J40950O1887
6837D509272O1218J06029O9655P1282J1719j867P5855J13154M1889O3631L5198
6826E157035K4148P9309J19419J46436Q6942n2733j4522P5066L666O4525R2386
6815E781677O2891J58728J28961J06934R4578J43391J92895P9714J544O7782R6774
6804F915869K8211N5724Q7865n6208L2274k9299K0594o339P6802O8681R5976P8637
6792G368787M7722J24917l30M5277J56163M2137J15441J38408J58571N4381P7214
6781H328688J21632L6206L4010L5200Q9366Q9489o0713R7200J19118P5550J82697
6770I148443R6482O1233K04622K29279J33074J42107J16619J67987J65006P7436
$$ plain form
6760 10542288 10587109 10712473 10833824 10950403 11109107 11318360 11468237 11775621 12092638 12396473
6750 12396473 12837876 13233555 13587102 14041293 14440380 14881115 15430927 16022748 16546379
6741 16546379 17082816 17506252 17829071 18075902 18296587 18417997 18487809 18460861 18490452 18613600
6731 18613600 18717526 18947562 19222390 19624547 20065773 20590929 21244122 22022965 22827638
6722 22827638 23744809 24779092 25950249 27134552 28315936 29584747 30605870 31474668
6714 31474668 32062566 32280655 32206263 31840799 31305018 30718917 30162097 29746426 29438363 29211789
6704 29211789 29221097 29461212 29822874 30387738 31154483 32191421 33219496 34508416 36058165
6695 36058165 37795833 39602230 41578771 43530489 45287741 46341147 46689358 46336695
$$ packed form
6760A0542288M4821J25364J21351J16579J58704K09253J49877L07384L17017L03835
6750A2396473M41403L95679L53547M54191L99087M40735N49812N91821N23631
6741A6546379N36437M23436L22819K46831K20685J21410O9812k6948K9591J23148
6731A8613600J03926K30036K74828M02157M41226N25156O53193P78843Q04673
6722B2827638R17171J034283J171157J184303J181384J268811J021123Q68798
6714C1474668N87898K18089p4392l65464n35781n86101n56820m15671l08063k26574
6704B9211789R308K40115L61662N64864P66745J036938J028075J288920J549749
6695C6058165J737668J806397J976541J951718J757252J053406L48211l52663
$$ plain form
6687 46336695 45460418 44221849 42879674 41663577 40609506 39828521 39232269 38972201 38956310
6678 38956310 39072693 39305682 39697461 40161028 40720755 41397089 42274370 43185391 44071768
6669 44071768 44857642 45506025 45919839 46129145 45964578 45606860 45063365 44283764 43253589
6660 43253589 42385638 41635403 40816446 40183436 39790175 39550824 39519037 39611382 39998730 40403644
6650 40403644 40674713 40902482 41058823 41092739 40927855 40792364 40658099 40471570 40434845 40482018
6640 40482018 40623240 40876179 41276389 41709958 42095098 42487064 42952994 43508432 44281517
6631 44281517 45164363 46167733 47485090 49021514 50780769 52724987 54918576 57314551
6623 57314551 59859379 62507928 65137345 67693473 70065602 72390170 74752148 76987381
$$ packed form
6687D6336695q76277j238569j342175j216097j054071p80985n96252k60068j5891
6678C8956310J16383K32989L91779M63567N59727O76334Q77281R11021Q86377
6669D4071768P85874O48383M13814K09306j64567l57718n43495p79601j030175
6660D3253589q67951p50235q18957o33010l93261k39351l1787R2345L87348M04914
6650D0403644K71069K27769J56341L3916j64884j35491j34265j86529l6725M7173
6640D0482018J41222K52939M00210M33569L85140L91966M65930N55438P73085
6631D4281517Q82846J003370J317357J536424J759255J944218K193589K395975
6623E7314551K544828K648549K629417K556128K372129K324568K361978K235233
$$ plain form
6615 76987381 79102965 80861004 82057836 82608912 82435849 81744775 80820101 79913557 79177491
6606 79177491 78723105 78855218 79441293 80523482 82171952 84253650 87029046 90431752 94347875
6597 94347875 98734089 103419923 108366948 113210368 117633361 121755224 125460052 128838857
6589 128838857 131998674 134887800 136946955 137600548 136326188 133158470 128656086 123635660
6581 123635660 118934830 115036087 112165520 110413549 109541726 109441087 110170253 111356521
6573 111356521 112924900 114729754 116454747 117759149 118449702 118699032 118509228 117947014 117274213
6564 117274213 116697621 116142512 115571327 114883547 113844363 112287810 110248254 107929414 105631459
6555 105631459 103695343 102429690 101758973 101904245 102843751 104396958 106638034 109365521
$$ packed form
6615G6987381K115584J758039J196832N51076j73063o91074r24674r06544p36066
6606G9177491m54386J32113N86075J082189J648470K081698K775396L402706L916123
6597I4347875M386214M685834M947025M843420M422993M121863L704828L378805
6589A28838857L159817K889126K059155O53593j274360l167718m502384n020426
6581A23635660m700830l898743k870567j751971q71823j00639P29166J186268
6573A11356521J568379J804854J724993J304402O90553K49330j89804n62214o72801
6564A17274213n76592n55109n71185o87780j039184j556553k039556k318840k297955
6555A05631459j936116j265653o70717J45272R39506J553207K241076K727487
$$ plain form
6547 109365521 112349073 115126091 117068377 117595695 116093536 112189116 106529503 100034874
6539 100034874 93387521 87299280 81877817 77216545 73299379 70006080 67395982 65040696
6531 65040696 63172031 61713027 60670788 60023870 59754518 59847906 60218922 60961145 61984553
6522 61984553 63135038 64380357 65395035 66000755 65850560 64620176 62425601 59445985
6514 59445985 56007443 52405668 48963747 45752339 42817642 40096646 37679786 35598426
6506 35598426 33724877 31931671 30295483 28818738 27454984 26266173 25139608 24083200
6498 24083200 23074665 22230948 21436145 20749778 20043551 19479526 18909571 18386276 17880093
6489 17880093 17380795 16875817 16340068 15933356 15531465 15064675 14686308 14418296 14137717
$$ packed form
6547A09365521K983552K777018J942286N27318j502159l904420n659613o494629
6539A00034874o647353o088241n421463m661272l917166l293299k610098k355286
6531F5040696j868665j459004j042239o46918k69352R3388L71016P42223J023408
6522F1984553J150485J245319J014678O05720j50195j230384k194575k979616
6514E9445985l438542l601775l441921l211408k934697k720996k416860k081360
6506C5598426j873549j793206j636188j476745j363754j188811j126565j056408
6498B4083200j008535q43717p94803o86367p06227n64025n69955n23295n06183
6489A7880093m99298n04978n35749m06712m01891m66790l78367k68012k80579
$$ plain form
6480 14137717 13847732 13627645 13503063 13355066 13178694 12973195 12890122 12822119 12623688 12490273
6470 12490273 12343278 12171113 12016344 11920152 11778723 11642998 11547728 11470726 11242935 11109437
6460 11109437 11057346 10854642 10637730 10477576 10391864 10280681 10183766 10027960 9992033 10032866
6450 10032866 9970755 9878062 9787774 9763220 9677078 9734411 9700051 9637229 9514287 9468746 9570227
6439 9570227 9545611 9491719 9497840 9403025 9327560 9346881 9189820 9215643 9185162 9170547 9054968
6428 9054968 8888990 8775514 8703189 8659545 8673164 8644674 8629953 8675823 8712416 8721549 8767485
6417 8767485 8769893 8907919 8976685 9048719 9112366 9238574 9321302 9339063 9408458 9464724 9527512
6406 9527512 9648443 9748562 9755503 9770750 9874668 9911493 9976181 9945877 9905516 9874133 9777606
$$ packed form
6480A4137717k89985k20087j24582j47997j76372k05499q3073o8003j98431j33415
6470A2490273j46995j72165j54769r6192j41429j35725r5270p7002k27791j33498
6460A1109437n2091k02704k16912j60154q5712j11183r6915j55806l5927M0833
6450A0032866o2111r2693r0288k4554q6142N7333l4360o2822j22942m5541J01481
6439I570227k4616n3892O121r4815p5465J9321j57061K5823l0481j4615j15579
6428I054968j65978j13476p2325m3644J3619k8490j4721M5870L6593R133M5936
6417H767485K408J38026O8766P2034O3647J26208Q2728J7761O9395N6266O2788
6406I527512J20931J00119O941J5247J03918L6825O4688l0304m0361l1383r6527
$$ plain form
6395 9777606 9763773 9791901 9928348 9976496 9965873 10083533 10140007 10147448 10188499 10299010 10407296
6384 10407296 10504838 10646428 10737276 10759173 10946682 11034833 11058302 11097331 11155474 11164188 11183050
6373 11183050 11204653 11193272 11294569 11337588 11305152 11330354 11385824 11286214 11206110 11251766 11257015
6362 11257015 11172298 11094109 11124248 11156661 11173344 11144841 11070300 11082897 11096038 10968619 10823948
6351 10823948 10905711 10918260 10972238 11040657 11087383 11105144 11231795 11317632 11422887 11516649 11647150
6340 11647150 11793754 11881794 11861786 11880281 11897709 11832607 11789102 11927238 11969237 11899264 11962262
6329 11962262 12036369 12181166 12134805 12149435 12324591 12465622 12596847 12808767 12944686 13147310
6319 13147310 13394450 13660342 13946940 14246503 14642232 14905761 15258549 15623592 15952709
$$ packed form
6395I777606j3833K8128J36447M8148j0623J17660N6474P441M1051J10511J08286
6384A0407296R7542J41590R0848K1897J87509Q8151K3469L9029N8143Q714J8862
6373A1183050K1603j1381J01297M3019l2436K5202N5470r9610q0104M5656N249
6362A1257015q4717p8189L0139L2413J6683k8503p4541J2597J3141j27419j44671
6351A0823948Q1763J2549N3978O8419M6726J7761J26651Q5837J05255R3762J30501
6340A1647150J46604Q8040k0008J8495J7428o5102m3505J38136M1999o9973O2998
6329A1962262P4107J44797m6361J4630J75156J41031J31225K11920J35919K02624
6319A3147310K47140K65892K86598K99563L95729K63529L52788L65043L29117
$$ plain form
6310 15952709 16298751 16738546 17091611 17471848 17906342 18402465 18832210 19364060 19789019
6301 19789019 20176477 20612045 21127445 21647058 22313173 23117279 23923674 24816715 25635873
6292 25635873 26386068 26995827 27385135 27384192 27158783 26831415 26455385 26097943 25917781 25963720
6282 25963720 26081547 26244006 26578772 27098717 27633581 28155190 28618700 28984463 29398118
6273 29398118 29895570 30549761 31425791 32436810 33670220 35055510 36224270 36908333 36899712
6264 36899712 36235748 35083902 33851137 32604933 31353123 30287848 29329014 28475930 27866114
6255 27866114 27465947 27160280 26966824 27040205 27037771 27103849 27268786 27288390 27379501 27423079 27457096
6244 27457096 27582330 27830109 28095355 28301132 28375841 28204465 27798717 27249903 26647926 25943495
$$ packed form
6310A5952709L46042M39795L53065L80237M34494M96123M29745N31850M24959
6301A9789019L87458M35568N15400N19613O66115Q04106Q06395Q93041Q19158
6292B5635873P50195O09759L89308r43k25409l27368l76030l57442j80162M5939
6282B5963720J17827J62459L34766N19945N34864N21609M63510L65763M13655
6273B9398118M97452O54191Q76030J011019J233410J385290J168760O84063q621
6264C6899712o63964j151846j232765j246204j251810j065275r58834q53084o09816
6255B7866114m00167l05667j93456P3381k434O6078J64937J9604R1111M3578L4017
6244B7457096J25234K47779K65246K05777P4709j71376m05748n48814o01977p04431
$$ plain form
6234 25943495 25311010 24825478 24302615 23878128 23487056 23084174 22767771 22614885 22470349
6225 22470349 22309745 22257081 22271080 22369927 22449442 22505814 22645736 22792697 22891381 23106187
6215 23106187 23322343 23530092 23625637 23827190 23912540 24043955 24116341 24201983 24241302 24347256
6205 24347256 24388994 24405471 24581307 24802933 25038446 25229716 25456885 25669759 25983813 26303865
6195 26303865 26714091 27098208 27479161 27933026 28402885 28933324 29386254 29953743 30443411
6186 30443411 30891998 31399811 31926991 32521542 33100125 33688820 34315127 35045833 35801307
6177 35801307 36471439 37181432 37958114 38653678 39406905 40267668 41098096 41991256 43062494
6168 43062494 44296055 45595930 46982157 48588444 50244172 52166820 54391392 56778056
$$ packed form
6234B5943495o32485m85532n22863m24487l91072m02882l16403j52886j44536
6225B2470349j60604n2664J3999R8847P9515N6372J39922J46961R8684K14806
6215B3106187K16156K07749R5545K01553Q5350J31415P2386Q5642L9319J05954
6205B4347256M1738J6477J75836K21626K35513J91270K27169K12874L14054L20052
6195B6303865M10226L84117L80953M53865M69859N30439M52930N67489M89668
6186C0443411M48587N07813N27180N94551N78583N88695O26307P30706P55474
6177C5801307O70132P09993P76682O95564P53227Q60763Q30428Q93160J071238
6168D3062494J233561J299875J386227J606287J655728J922648K224572K386664
$$ plain form
6160 56778056 59390345 62275687 65329965 68627881 72011302 75412156 78748409 81923162
6152 81923162 84974577 87876075 90665386 93364730 95785453 97762569 99022217 99554149
6144 99554149 99216640 98282279 97096897 95864200 94865004 94386970 94528809 95283751 96699980
6135 96699980 98796228 101603434 105123251 109444166 114445087 119945120 125806451 131676455
6127 131676455 137384205 143011143 148665096 154460742 160256574 165970276 171008326 174571177
6119 174571177 176126987 175314645 172354127 167796891 162282484 156210468 150019569 144183940
6111 144183940 138799520 134200241 130542366 127816570 125838039 124654839 124371873 124890669
6103 124890669 126138811 128188233 130941644 134404173 138500253 142844795 147511243 152354343
$$ packed form
6160E6778056K612289K885342L054278L297916L383421L400854L336253L174753
6152H1923162L051415K901498K789311K699344K420723J977116J259648N31932
6144I9554149l37509r34361j185382j232697r99196m78034J41839P54942J416229
6135I6699980K096248K807206L519817M320915N000921N500033N861331N870004
6127A31676455N707750N626938N653953N795646N795832N713702N038050L562851
6119A74571177J555810q12342k960518m557236n514407o072016o190899n835629
6111A44183940n384420m599279l657875k725796j978531j183200k82966N18796
6103A24890669J248142K049422K753411L462529M096080M344542M666448M843100
$$ plain form
6095 152354343 157280441 162274519 166824907 170334258 172315727 172040347 169236733 163886431
6087 163886431 156528535 148182150 139726490 131811707 124715885 118557717 113214789 108677499
6079 108677499 104884607 101929139 99531775 97424891 95589893 94130938 92988035 91986586
6071 91986586 91348947 90883373 90527110 90264037 89996495 89707095 89146054 88077975 86295376
6062 86295376 83641420 80355523 76633341 72671203 68720434 65028055 61783040 58847383
6054 58847383 56248316 54057480 51945052 49865151 47951569 46075294 44117228 42202330
6046 42202330 40235313 38336881 36492699 34794352 33244712 31813011 30648977 29467295
6038 29467295 28490717 27654971 26782586 25961664 25178380 24455564 23827548 23098150 22342463
$$ packed form
6095A52354343M926098M994078M550388L509351J981469k75380k803614n350302
6087A63886431p357896q346385q455660p914783p095822o158168n342928m537290
6079A08677499l792892k955468k397364k106884j834998j458955j142903j001449
6071I1986586o37639m65574l56263k63073k67542k89400n61041j068079j782599
6062H6295376k653956l285897l722182l962138l950769l692379l245015k935657
6054E8847383k599067k190836k112428k079901j913582j876275j958066j914898
6046D2202330j967017j898432j844182j698347j549640j431701j164034j181682
6038B9467295r76578q35746q72385q20922p83284p22816o28016p29398p55687
$$ plain form
6029 22342463 21672184 21040801 20546861 20103838 19661820 19283896 18975466 18732028 18561853
6020 18561853 18445473 18466754 18432037 18365516 18403194 18531723 18716619 18685915 18561249 18239949
6010 18239949 17840831 17360398 16848704 16349228 15722428 15107357 14643389 14338924 13940124
6001 13940124 13664877 13379431 13044983 12786416 12574698 12292070 12065454 11823457 11588438
5992 11588438 11389642 11060071 10757561 10525370 10389994 10181461 9931001 9819490 9725805 9554987
5982 9554987 9455269 9275085 9068894 8946001 8816986 8626307 8538929 8388436 8266319 8236627
5972 8236627 8156144 8073527 7991480 7965676 7937736 7884146 7841158 7725848 7666558 7639864 7625128
5961 7625128 7588860 7502673 7400589 7326193 7219671 7129890 7107378 6976882 6812165 6822477 6800500
$$ packed form
6029B2342463o70279o31383m93940m43023m42018l77924l08430k43438j70175
6020A8561853j16380K1281l4717o6521L7678J28529J84896l0704j24666l21300
6010A8239949l99118m80433n11694m99476o26800o15071m63968l04465l98800
6001A3940124k75247k85446l34448k58567k11718k82628k26616k41997k35019
5992A1588438j98796l29571l02510k32191j35376k08533k50460j11511r3685j70818
5982I554987r9718j80184k06191j22893j29015j90679q7378j50493j22117k9692
5972H236627q0483q2617q2047k5804k7940n3590m2988j15310n9290k6694j4736
5961G625128l6268q6187j02084p4396j06522q9781k2512j30496j64717J0312k1977
$$ plain form
5950 6800500 6730687 6685793 6617111 6599095 6542002 6490522 6506610 6528439 6479071 6465708 6441052
5939 6441052 6525138 6455056 6431891 6350972 6241812 6136435 6102330 6071493 5969679 5861496 5834302
5928 5834302 5769768 5730193 5766721 5715030 5756788 5774994 5777360 5728066 5742744 5799799 5870446 5840212
5916 5840212 5864080 5733779 5583191 5508671 5464569 5345290 5258645 5204887 5104058 5035101 4983447
5905 4983447 4918654 4887351 4909778 4924845 4857287 4889116 4951232 4997706 4992123 5108043 5295436
5894 5295436 5355810 5520865 5682052 5698214 5763213 5884010 5987174 6067109 6100918 6224474
5884 6224474 6258406 6178459 6041919 5898488 5602532 5335712 5103737 4969590 4913237 4820291
5874 4820291 4746200 4703204 4605093 4569886 4667171 4709430 4707684 4717594 4816961 4895777 4999347 5119272
$$ packed form
5950F800500o9813m4894o8682j8016n7093n1480J6088K1829m9368j3363k4656
5939F441052Q4086p0082k3165q0919j09160j05377l4105l0837j01814j08183k7194
5928E834302o4534l9575L6528n1691M1758J8206K366m9294J4678N7055P0647l0234
5916E840212K3868j30301j50588p4520m4102j19279q6645n3758j00829o8957n1654
5905D983447o4793l1303K2427J5067o7558L1829O2116M6474n583J15920J87393
5894E295436O0374J65055J61187J6162O4999J20797J03164P9935L3809J23556
5884F224474L3932p9947j36540j43431k95956k66820k31975j34147n6353r2946
5874D820291p4091m2996r8111l5207R7285M2259j746R910R9367P8816J03570J19925
$$ plain form
5862 5119272 5272746 5382243 5400368 5447018 5576031 5636263 5702608 5896056 6068416 6216909
5852 6216909 6222261 6196033 6073165 5962953 5818810 5537898 5351930 5237568 5062369 4878726
5842 4878726 4764148 4799962 4741299 4705052 4703321 4705543 4718870 4768529 4816787 4831777 4831699 4982833
5830 4982833 5071991 5074431 5146981 5211478 5218860 5271555 5419144 5493073 5518685 5535636 5522850 5503155
5818 5503155 5516336 5428423 5264717 5228376 5133957 5093461 5108729 5075607 5065641 5082577 5113441
5807 5113441 5216882 5265275 5257368 5351965 5360020 5436229 5509429 5661668 5702907 5753056 5823470
5796 5823470 5877845 5896678 5916313 5968142 5910211 5886224 5913856 5872697 5852378 5804535 5776654
5785 5776654 5758688 5783524 5788465 5675479 5649799 5687202 5692743 5742110 5708045 5753650 5884748
$$ packed form
5862E119272J53474J09497J8125M6650J29013O0232O6345J93448J72360J48493
5852F216909N352k6228j22868j10212j44143k80912j85968j14362j75199j83643
5842D878726j14578L5814n8663l6247j731K222J3327M9659M8258J4990p8J51134
5830D982833Q9158K440P2550O4497P382N2695J47589P3929K5612J6951j2786j9695
5818E503155J3181q7913j63706l6341r4419m0496J5268l3122r966J6936L0864
5807E113441J03441M8393p907R4597Q055P6209P3200J52239M1239N0149P0414
5796E823470N4375J8833J9635N1829n7931k3987K7632m1159k0319m7843k7881
5785E776654j7966K4836M941j12986k5680L7403N541M9367l4065M5605J31098
$$ plain form
5774 5884748 5958212 5970481 5955287 6095914 6183613 6248850 6292488 6327326 6375616 6420991 6401477
5763 6401477 6432996 6467439 6428899 6419513 6336014 6282158 6239372 6194368 6163624 6187299 6168945 6107512
5751 6107512 6090556 6127362 6082808 6034036 5987952 6061195 6096523 6137923 6117125 6039150 6039360 6135867
5739 6135867 6247002 6216485 6256409 6329349 6353038 6359562 6378669 6413436 6518585 6544391 6474889
5728 6474889 6445409 6428190 6444434 6480473 6565235 6522533 6402083 6370406 6412962 6415159 6407404 6436731
5716 6436731 6424106 6483550 6500362 6426592 6397832 6454496 6429679 6458277 6535527 6644142 6676307
5705 6676307 6733949 6735811 6834068 6854970 6854601 7037289 7127480 7031411 7031933 7030327 6983811 6896969
5693 6896969 6866286 6840010 6867767 6940087 6939152 6897404 6980412 7106745 7173338 7308049 7378074
$$ packed form
5774E884748P3464J2269j5194J40627Q7699O5237M3638L4838M8290M5375j9514
5763F401477L1519L4443l8540r386q3499n3856m2786m5004l0744K3675j8354o1433
5751F107512j6956L6806m4554m8772m6084P3243L5328M1400k0798p7975K10R6507
5739F135867J11135l0517L9924P2940K3689O524J9107L4767J05149K5806o9502
5728F474889k9480j7219J6244L6039Q4762m2702j20450l1677M2556K197p755K9327
5716F436731j2625N9444J6812p3770k8760N6664k4817K8598P7250J08615L2165
5705F676307N7642J862R8257K0902l69J82688R0191r6069N22j606m6516q6842
5693F896969l0683k6276K7757P2320r35m1748Q3008J26333O6593J34711P0025
$$ plain form
5682 7378074 7520549 7570291 7675387 7708992 7767199 7914831 8013213 8088070 8264907 8387156
5672 8387156 8545321 8610717 8662951 8667727 8644192 8644083 8591256 8516314 8414875 8299022 8235052
5661 8235052 8140151 8124582 8201783 8186607 8217828 8130654 8131330 8110195 8141955 8199249 8160014 8187486
5649 8187486 8321580 8350887 8350622 8331930 8330224 8347322 8477982 8533651 8494946 8556500 8609116 8659384
5637 8659384 8737811 8852418 8862195 8904643 8861330 8845798 8769569 8837184 8956574 9003796 9069860
5626 9069860 9016511 9062209 9096490 9234604 9213992 9241761 9250457 9314209 9439267 9447277 9491748
5615 9491748 9525851 9562723 9607669 9695341 9698513 9799099 9885208 9906913 9962212 10039998 10095990
5604 10095990 10107133 10114544 10224157 10292930 10368481 10394972 10497714 10563226 10617187 10620755 10678258
$$ packed form
5682G378074J42475M9742J05096L3605N8207J47632R8382P4857J76837J22249
5672H387156J58165O5396N2234M776k3535j09n2827p4942j01439j15853o3970
5661H235052r4901j5569P7201j5176L1221q7174O76k1135L1760N7294l9235K7472
5649H187486J34094K9307k65j8692j706J7098J30660N5669l8705O1554N2616N0268
5637H659384P8427J14607R777M2448m3313j5532p6229O7615J19390M7222O6064
5626I069860n3349M5698L4281J38114k0612K7769Q696O3752J25058Q010M4471
5615I491748L4103L6872M4946Q7672L172J00586Q6109K1705N5299P7786N5992
5604A0095990J1143P411J09613O8773P5551K6491J02742O5512N3961L568N7503
$$ plain form
5593 10678258 10756805 10853112 10995767 11017897 11132161 11156331 11269795 11391392 11431091 11522621
5583 11522621 11566497 11591582 11666044 11767086 11825424 11956145 11997172 12073745 12184480 12270779 12286699
5572 12286699 12401325 12450466 12619940 12774718 12858125 13010318 13090125 13250360 13333750 13399861
5562 13399861 13477802 13627743 13710227 13787422 13987139 14132912 14212987 14305489 14489717 14718921
5552 14718921 14774733 14969738 15084232 15239892 15344623 15529286 15769519 16017035 16105122 16174076
5542 16174076 16416127 16660850 16926389 17084334 17274062 17512651 17729421 18026841 18275327
5533 18275327 18556580 18853181 19097928 19346916 19637983 19887575 20232957 20526110 20792464
5524 20792464 21127006 21452430 21717966 22031064 22307929 22594430 23029724 23324519 23631911
$$ packed form
5593A0678258P8547R6307J42655K2130J14264K4170J13464J21597L9699R1530
5583A1522621M3876K5085P4462J01042N8338J30721M1027P6573J10735Q6299J5920
5572A2286699J14626M9141J69474J54778Q3407J52193P9807J60235Q3390O6111
5562A3399861P7941J49941Q2484P7195J99717J45773Q0075R2502J84228K29204
5552A4718921N5812J95005J14494J55660J04731J84663K40233K47516Q8087O8954
5542A6174076K42051K44723K65539J57945J89728K38589K16770K97420K48486
5533A8275327K81253K96601K44747K48988K91067K49592L45382K93153K66354
5524B0792464L34542L25424K65536L13098K76865K86501M35294K94795L07392
$$ plain form
5515 23631911 24005480 24390834 24789317 25179835 25545051 25976150 26344280 26700143 27093525
5506 27093525 27522109 28013007 28511188 28959869 29426195 29905839 30366751 30938216 31435184
5497 31435184 31932486 32471862 33074782 33756445 34369189 35038402 35718082 36400049 37078679
5488 37078679 37874761 38735315 39546470 40427795 41465326 42499551 43470738 44514716 45727196
5479 45727196 46999085 48302931 49650146 51141492 52737854 54398240 56076675 57854250
5471 57854250 59701516 61628774 63526785 65519966 67718589 69884704 72018393 74255763
5463 74255763 76427695 78691897 81017793 83311430 85608170 87914963 90250267 92697820
5455 92697820 95119825 97527290 99852765 102148146 104471446 106856068 109320212 111844847
$$ packed form
5515B3631911L73569L85354L98483L90518L65216M31099L68130L55863L93382
5506B7093525M28584M90898M98181M48681M66326M79644M60912N71465M96968
5497C1435184M97302N39376O02920O81663O12744O69213O79680O81967O78630
5488C7078679P96082Q60554Q11155Q81325J037531J034225R71187J043978J212480
5479D5727196J271889J303846J347215J491346J596362J660386J678435J777575
5471E7854250J847266J927258J898011J993181K198623K166115K133689K237370
5463G4255763K171932K264202K325896K293637K296740K306793K335304K447553
5455I2697820K422005K407465K325475K295381K323300K384622K464144K524635
$$ plain form
5447 111844847 114449524 117257158 120171822 123128849 126169016 129203693 132385531 135582164
5439 135582164 138729951 142104724 145533369 148892331 152022777 154514066 156383110 157966400
5431 157966400 159307288 160663998 162215413 163638869 164301244 164246025 163901317 163481127 163035832
5422 163035832 162522955 162034306 161516139 161000486 160358448 159651729 158860250 157961765 156914238
5413 156914238 155865745 154659583 153459895 152151939 150823797 149437969 147946039 146481492
5405 146481492 144960310 143451287 141951536 140474610 138954560 137465167 136103580 134769987
5397 134769987 133442971 132248030 131143781 130051423 129052255 128079292 127197054 126318825 125562022
5388 125562022 124925675 124268876 123760688 123291836 122790758 122285851 122012971 121965642 122062973 122431510
$$ packed form
5447A11844847K604677K807634K914664K957027L040167L034677L181838L196633
5439A35582164L147787L374773L428645L358962L130446K491289J869044J583290
5431A57966400J340888J356710J551415J423456O62375n5219l44708m20190m45295
5422A63035832n12877m88649n18167n15653o42038p06719p91479q98485j047527
5413A56914238j048493j206162j199688j307956j328142j385828j491930j464547
5405A46481492j521182j509023j499751j476926j520050j489393j361587j333593
5397A34769987j327016j194941j104249j092358r99168r72963q82238q78229p56803
5388A25562022o36347o56799n08188m68852n01078n04907k72880m7329R7331L68537
$$ plain form
5378 122431510 123210616 124333923 125815583 127629307 129803479 132327581 135464520 139453340
5370 139453340 144282198 149607425 155965389 164059886 173347885 178213263 175172357 169775980
5362 169775980 163290545 156895569 152192855 148599334 145811534 143633806 141858923 140472278
5354 140472278 139234840 137989136 136848564 135846071 134936126 133991860 133198134 132435150 131869443
5345 131869443 131439016 131087802 130906601 130892445 130906631 130940963 130899786 130801813 130817181 130789034
5335 130789034 130784791 130852427 130954144 131140810 131374029 131756025 132189697 132723905 133435098 134328948
5325 134328948 135154871 136199667 137347368 138517129 139832107 141287929 142845788 144455435
5317 144455435 146012975 147690715 149466931 151130430 152778056 154360366 155909631 157330022
$$ packed form
5378A22431510P79106J123307J481660J813724K174172K524102L136939L988820
5370A39453340M828858N325227O357964Q094497R287999M865378l040906n396377
5362A69775980o485435o394976m702714l593521k787800k177728j774883j386645
5354A40472278j237438j245704j140572j002493r09945r44266p93726p62984n65707
5345A31869443m30427l51214j81201j4156J4186L4332m1177r7973J5368k8147
5335A30789034m243O7636J01717J86666K33219L81996M33672N34208P11193Q93850
5325A34328948Q25923J044796J147701J169761J314978J455822J557859J609647
5317A44455435J557540J677740J776216J663499J647626J582310J549265J420391
$$ plain form
5309 157330022 158508688 159614949 160661780 161724839 162688539 163595047 164421824 165336181 166211021
5300 166211021 166985156 167786661 168750956 169792132 170854919 171809061 172828124 173748465 174418978
5291 174418978 175025731 175517350 175821452 175884813 175883405 175538229 174873251 173899850 172508638 170886257
5281 170886257 168956392 166662325 164202284 161609009 158758732 155908202 152852352 149701864
5273 149701864 146606649 143495181 140327543 137299866 134387399 131568901 128897402 126268966
5265 126268966 123763413 121267776 118757158 116383928 114068060 111763818 109463049 107122223
5257 107122223 104710148 102261666 99802959 97098871 94500062 91850728 89137545 86373940
5249 86373940 83620787 80965029 78274190 75596550 72914383 70370359 67910352 65448641
$$ packed form
5309A57330022J178666J106261J046831J063059R63700R06508Q26777R14357Q74840
5300A66211021P74135Q01505R64295J041176J062787R54142J019063R20341O70513
5291A74418978O06753M91619L04102O3361j408l45176o64978r73401j391212j622381
5281A70886257j929865k294067k460041k593275k850277k850530l055850l150488
5273A49701864l095215l111468l167638l027677k912467k818498k671499k628436
5265A26268966k505553k495637k510618k373230k315868k304242k300769k340826
5257A07122223k412075k448482k458707k704088k598809k649334k713183k763605
5249H6373940k753153k655758k690839k677640k682167k544024k460007k461711
$$ plain form
5241 65448641 63174526 60928643 58802942 56771170 54867068 53032762 51277982 49708818
5233 49708818 48037103 46538011 45182088 43905996 42690862 41469481 40392188 39390006
5225 39390006 38339568 37420941 36586784 35751347 34793495 33869053 32975636 32145607 31330477
5216 31330477 30560666 29874927 29201344 28602050 27983087 27349881 26766552 26197061 25699264
5207 25699264 25192800 24577007 24149398 23699328 23287275 22849915 22442142 22018769 21621491
5198 21621491 21314095 20954332 20614325 20261367 19968349 19634403 19268137 18963855 18713531
5189 18713531 18369086 18043860 17753095 17433320 17210555 17022675 16789079 16500565 16251807
5180 16251807 16005277 15705843 15507112 15330888 15085885 14936305 14686689 14489878 14282466
$$ packed form
5241F5448641k274115k245883k125701k031772j904102j834306j754780j569164
5233D9708818j671715j499092j355923j276092j215134j221381j077293j002182
5225C9390006j050438r18627q34157q35437r57852r24442q93417q30029q15130
5216C1330477p69811o85739o73583n99294o18963o33206n83329n69491m97797
5207B5699264n06464o15793m27609m50070m12053m37360m07773m23373l97278
5198B1621491l07396l59763l40007l52958k93018l33946l66266l04282k50324
5189A8713531l44445l25226k90765l19775k22765j87880k33596k88514k48758
5180A6251807k46530k99434j98731j76224k45003j49580k49616j96811k07412
$$ plain form
5171 14282466 14137132 13991679 13882531 13705330 13508687 13324992 13133122 12969840 12889820 12765506
5161 12765506 12546346 12429308 12289911 12169304 12008241 11786362 11687591 11562566 11416470 11359601
5151 11359601 11260594 11120045 10971477 10787736 10698749 10594085 10533536 10509694 10453292 10362114
5141 10362114 10286137 10168368 10048257 9925340 9865212 9798737 9747649 9655191 9536892 9468661
5131 9468661 9310733 9188118 9075631 9087960 9039924 8971651 8923428 8847150 8765638 8647323 8604241
5120 8604241 8481847 8378596 8373231 8421616 8353260 8278153 8287793 8239596 8147414 8065351 8028343
5109 8028343 8026393 7972851 7975019 8010172 7922052 7928574 7901083 7855649 7775369 7796972 7731557 7756116
5097 7756116 7750701 7751012 7756515 7772868 7757858 7742684 7781342 7781038 7773980 7701034 7694778 7785085 7765572
$$ packed form
5171A4282466j45334j45453j09148j77201j96643j83695j91870j63282q0020j24314
5161A2765506k19160j17038j39397j20607j61063k21879r8771j25025j46096n6869
5151A1359601r9007j40549j48568j83741q8987j04664o0549k3842n6402r1178
5141A0362114p5977j17769j20111j22917o0128o6475n1088r2458j18299o8231
5131I468661j57928j22615j12487J2329m8036o8273m8223p6278q1512j18315m3082
5120H604241j22394j03251n365M8385o8356p5107R640m8197r2182q2063l7008
5109H028343j950n3542K168L5153q8120O522k7491m5434q0280K1603o5415K4559
5097G756116n415L11N503J6353j5010j5174L8658l04p058p2946o256R0307j9513
$$ plain form
5084 7765572 7778682 7806605 7766456 7813200 7908775 7947428 8023360 8049790 8029755 8107826 8092133
5073 8092133 8084052 8149245 8180786 8210126 8205616 8252073 8221606 8307336 8335955 8327881 8365921 8364595
5061 8364595 8363844 8403017 8465470 8547761 8528496 8595528 8612748 8618804 8695988 8743097 8866392 8986677
5049 8986677 9112729 9162870 9170088 9172523 9298523 9354450 9473253 9522552 9567442 9623234 9645835
5038 9645835 9679681 9726260 9812541 9849701 9934605 10014741 10079675 10180178 10271649 10320525 10398199
5027 10398199 10479760 10570225 10722412 10864143 10995736 11100059 11198394 11309766 11440221 11619667
5017 11619667 11721687 11831101 11871636 11932316 12086764 12185318 12200448 12315311 12451515 12600679
5007 12600679 12753413 12835395 12928003 12943924 13006419 13141651 13234008 13278831 13479362 13581689
$$ packed form
5084G765572J3110K7923m0149M6744R5575L8653P5932K6430k0035P8071j5693
5073H092133q081O5193L1541K9340m510M6457l0467Q5730K8619q074L8040j326
5061H364595p51L9173O2453Q2291j9265O7032J7220O056P7184M7109J23295J20285
5049H986677J26052N0141P218K435J26000N5927J18803M9299M4890N5792K2601
5038I645835L3846M6579Q6281L7160Q4904Q0136O4934J00503R1471M8876P7674
5027A0398199Q1561R0465J52187J41731J31593J04323R8335J11372J30455J79446
5017A1619667J02020J09414M0535O0680J54448R8554J5130J14863J36204J49164
5007A2600679J52734Q1982R2608J5921O2495J35232R2357M4823K00531J02327
$$ plain form
4997 13581689 13694995 13776278 13871814 13980715 14136272 14275405 14355046 14496671 14617615 14736677
4987 14736677 14938198 15032804 15159514 15345716 15579570 15656187 15786699 15967911 16155529 16414171
4977 16414171 16611796 16810586 16962150 17126937 17450540 17792368 18151787 18623579 19116082
4968 19116082 19529544 19911061 20475425 21195667 21870979 22705861 23612352 24630452 25911913
4959 25911913 27222350 28699762 30257343 32048340 34122332 36294956 38782078 41531848
4951 41531848 44597133 47817330 50631277 52607575 53526884 53356596 52317891 50784449
4943 50784449 49418505 48557460 48105587 47981849 47769438 47044992 45299239 42863898 40182227
4934 40182227 37658646 35451341 33550741 31945210 30629035 29557081 28681007 27799286
$$ packed form
4997A3581689J13306Q1283R5536J08901J55557J39133P9641J41625J20944J19062
4987A4736677K01521R4606J26710J86202K33854P6617J30512J81212J87618K58642
4977A6414171J97625J98790J51564J64787L23603L41828L59419M71792M92503
4968A9116082M13462L81517N64364P20242O75312Q34882R06491J018100J281461
4959B5911913J310437J477412J557581J790997K073992K172624K487122K749770
4951D1531848L065285L220197K813947J976298R19309j70288j038705j533442
4943E0784449j365944q61045m51873j23738k12411p24446j745753k435341k681671
4934D0182227k523581k207305j900600j605531j316175j071954q76074q81721
$$ plain form
4926 27799286 26996543 26264871 25566350 24829907 24126822 23422234 22800110 22248455 21644398
4917 21644398 21133902 20646272 20158701 19733034 19474042 19080231 18766395 18586393 18375855
4908 18375855 18186367 18003577 17884132 17779859 17638444 17525053 17456893 17362586 17230583 17202978
4898 17202978 17187918 17082932 16995590 16895977 16804425 16780696 16676892 16565057 16519201 16497666 16496410
4887 16496410 16447295 16464794 16519876 16622000 16641486 16716610 16800740 16817481 16759034 16653315 16609046
4876 16609046 16558484 16568653 16544162 16450723 16494157 16547922 16577855 16607755 16637738 16738196 16770488
4865 16770488 16786400 16859427 16847146 16865046 16904738 16948277 16977014 17008948 16930147 16951814 16998378
4854 16998378 17044128 17168592 17173604 17311025 17402535 17458558 17527561 17572987 17606197 17729518 17842506
$$ packed form
4926B7799286q02743p31672o98521p36443p03085p04588o22124n51655o04057
4917B1644398n10496m87630m87571m25667k58992l93811l13836j80002k10538
4908A8375855j89488j82790j19445j04273j41415j13391o8160r4307j32003k7605
4898A7202978j5060j04986q7342r9613r1552k3729j03804j11835m5856k1535j256
4887A6496410m9115J7499N5082J02124J9486P5124Q4130J6741n8447j05719m4269
4876A6609046n0562J0169k4491r3439M3434N3765K9933K9900K9983J00458L2292
4865A6770488J5912P3027j2281J7900L9692M3539K8737L1934p8801K1667M6564
4854A6998378M5750J24464N012J37421R1510N6023O9003M5426L3210J23321J12988
$$ plain form
4843 17842506 17951261 17948720 18011416 18104748 18170212 18264616 18337978 18495928 18586351 18612286 18710419
4832 18710419 18825569 18970933 19076251 19146238 19259134 19359828 19489598 19642658 19772100 19859503
4822 19859503 19997010 20116268 20243201 20411387 20617003 20779238 20930319 21119759 21286866
4813 21286866 21474169 21696181 21893656 22009871 22254123 22519775 22641230 22830654 23010788
4804 23010788 23281333 23568275 23822979 24104746 24330019 24576222 24895614 25164368 25402331
4795 25402331 25672244 26044292 26364241 26764676 27118034 27381802 27797069 28194505 28638990
4786 28638990 29070982 29505648 29949423 30366047 30874429 31349786 31859109 32246107 32778477
4777 32778477 33325343 33795948 34363781 34958430 35591554 36122468 36723308 37315603 37965445
$$ packed form
4843A7842506J08755k541O2696R3332O5464R4404P3362J57950R0423K5935R8133
4832A8710419J15150J45364J05318O9987J12896J00694J29770J53060J29442Q7403
4822A9859503J37507J19258J26933J68186K05616J62235J51081J89440J67107
4813B1286866J87303K22012J97475J16215K44252K65652J21455J89424J80134
4804B3010788K70545K86942K54704K81767K25273K46203L19392K68754K37963
4795B5402331K69913L72048L19949M00435L53358K63768M15267L97436M44485
4786B8638990M31992M34666M43775M16624N08382M75357N09323L86998N32370
4777C2778477N46866M70605N67833N94649O33124N30914O00840N92295O49842
$$ plain form
4768 37965445 38617556 39284632 39925938 40566762 41332320 42129200 42877819 43652058 44381186
4759 44381186 45230581 46142098 46983067 47892496 48802458 49683489 50565872 51573897 52676962
4750 52676962 53653041 54715123 55824971 56996238 58161767 59378560 60544649 61752424
4742 61752424 63026716 64385967 65665518 66948464 68281255 69681543 71163218 72636879
4734 72636879 74172926 75768410 77368996 78941480 80615089 82307514 83952584 85645619
4726 85645619 87359093 89126033 90938348 92740429 94672465 96627757 98528647 100488111
4718 100488111 102468378 104377019 106403081 108406260 110399655 112463868 114506630 116595919
4710 116595919 118686729 120771165 122892567 125056572 127260170 129544762 131924697 134279474
$$ packed form
4768C7965445O52111O67076O41306O40824P65558P96880P48619P74239P29128
4759D4381186Q49395R11517Q40969R09429R09962Q81031Q82383J008025J103065
4750E2676962R76079J062082J109848J171267J165529J216793J166089J207775
4742F1752424J274292J359251J279551J282946J332791J400288J481675J473661
4734G2636879J536047J595484J600586J572484J673609J692425J645070J693035
4726H5645619J713474J766940J812315J802081J932036J955292J900890J959464
4718A00488111J980267J908641K026062K003179J993395K064213K042762K089289
4710A16595919K090810K084436K121402K164005K203598K284592K379935K354777
$$ plain form
4702 134279474 136527185 138856468 141204908 143497624 145962113 148349313 150856723 153389053
4694 153389053 155890852 158487628 161082142 163588303 166102946 168671275 171239959 173929151
4686 173929151 176554712 179211694 182020988 184711568 187457122 190285658 193069442 195957634
4678 195957634 198817035 201770786 204872118 208064058 211423335 214839915 218156236 221550063
4670 221550063 224992405 228408189 231917808 235553406 239241406 242750956 246153567 249416967
4662 249416967 252554648 255524727 258503052 261277847 264060397 266874633 269493547 271922265
4654 271922265 274120084 276049455 277649416 278902777 280028785 280981721 281709565 282262536
4646 282262536 282683827 282882213 282913160 282724843 282225498 281512689 280638412 279529361 278263405
$$ packed form
4702A34279474K247711K329283K348440K292716K464489K387200K507410K532330
4694A53389053K501799K596776K594514K506161K514643K568329K568684K689192
4686A73929151K625561K656982K809294K690580K745554K828536K783784K888192
4678A95957634K859401K953751L101332L191940L359277L416580L316321L393827
4670B21550063L442342L415784L509619L635598L688000L509550L402611L263400
4662B49416967L137681K970079K978325K774795K782550K814236K618914K428718
4654B71922265K197819J929371J599961J253361J126008R52936P27844N52971
4646B82262536M21291J98386L0947j88317m99345p12809q74277j109051j265956
$$ plain form
4637 278263405 276760385 274930650 272880235 270702465 268261066 265637163 262964922 260124350
4629 260124350 257373602 254405041 251258558 247903921 244339688 240384544 236156002 231909828
4621 231909828 227674240 223610492 219530507 215535927 211793896 207999148 204202010 200448344
4613 200448344 196708026 193017423 189482340 185891277 182376800 179015626 175774746 172612253
4605 172612253 169559697 166437522 163433508 160644263 157912490 155304981 152740108 150214767
4597 150214767 147660509 145006263 142359923 139740890 137134178 134789109 132485703 130302602
4589 130302602 128320298 126328030 124498679 122628152 120746100 118973182 117265092 115617274
4581 115617274 113998437 112510494 111005071 109492972 108037852 106631299 105328046 103940062
$$ packed form
4637B78263405j503020j829735k050415k177770k441399k623903k672241k840572
4629B60124350k750748k968561l146483l354637l564233l955144m228542m246174
4621B31909828m235588m063748m079985l994580l742031l794748l797138l753666
4613B00448344l740318l690603l535083l591063l514477l361174l240880l162493
4605A72612253l052556l122175l004014k789245k731773k607509k564873k525341
4597A50214767k554258k654246k646340k619033k606712k345069k303406k183101
4589A30302602j982304j992268j829351j870527j882052j772918j708090j647818
4581A15617274j618837j487943j505423j512099j455120j406553j303253j387984
$$ plain form
4573 103940062 102621025 101225811 99812759 98525091 97196128 95851114 94488377 93178244
4565 93178244 91820662 90529604 89118439 87823051 86613787 85436673 84171641 82966852
4557 82966852 81804355 80649715 79548193 78394370 77226915 76015948 74848564 73625601
4549 73625601 72369884 71133489 69911891 68641320 67476558 66326701 65145858 64050598
4541 64050598 63018358 61844754 60677999 59602860 58489123 57488415 56545135 55562251
4533 55562251 54630429 53797124 53025143 52180224 51413714 50754522 49954325 49205014 48603829
4524 48603829 47933729 47267906 46607780 45941343 45369471 44758667 44176836 43565894 43070336
4515 43070336 42521462 41975408 41435953 40987532 40557851 40113753 39613068 39050971 38545676
$$ packed form
4573A03940062j319037j395214j413052j287668j328963j345014j362737j310133
4565I3178244j357582j291058j411165j295388j209264j177114j265032j204789
4557H2966852j162497j154640j101522j153823j167455j210967j167384j222963
4549G3625601j255717j236395j221598j270571j164762j149857j180843j095260
4541F4050598j032240j173604j166755j075139j113737j000708r43280r82884
4533E5562251r31822q33305p71981q44919p66510o59192q00197p49311o01185
4524D8603829o70100o65823o60126o66437n71872o10804n81831o10942m95558
4515D3070336n48874n46054n39455m48421m29681m44098n00685n62097n05295
$$ plain form
4506 38545676 38218676 37807604 37363113 36978012 36600599 36310574 35985621 35661731 35298666
4497 35298666 35000287 34669260 34369283 34014943 33738085 33454565 33179236 32906929 32655336
4488 32655336 32509798 32261169 31926896 31742858 31499427 31285080 31021807 30818778 30629787
4479 30629787 30464782 30265383 30037049 29914219 29783499 29627859 29499781 29438082 29314342 29177990
4469 29177990 29123563 29025614 28914612 28819918 28807313 28690327 28543457 28484556 28470338 28390783 28296172
4458 28296172 28188345 28080582 28100181 28041565 28007547 27974449 27949254 27848147 27805297 27786311 27739799
4447 27739799 27690166 27664006 27626350 27691227 27652432 27553348 27667511 27717944 27710763 27764233 27822884
4436 27822884 27862533 27862601 27894307 27914107 28003251 28041547 28077779 28127998 28205457 28256026 28375423 28455526
$$ packed form
4506C8545676l27000m11072m44491l85101l77413k90025l24953l23890l63065
4497C5298666k98379l31027k99977l54340k76858k83520k75329k72307k51593
4488C2655336j45538k48629l34273j84038k43431k14347k63273k03029j88991
4479C0629787j65005j99399k28334j22830j30720j55640j28078o1699j23740j36352
4469B9177990n4427r7949j11002r4694j2605j16986j46870n8901j4218p9555r4611
4458B8296172j07827j07763J9599n8616l4018l3098k5195j01107m2850j8986m6512
4447B7739799m9633k6160l7656O4877l8795r9084J14163N0433p181N3470N8651
4436B7822884L9649O8L1706J9800Q9144L8296L6232N0219P7459N0569J19397Q0103
$$ plain form
4424 28455526 28504666 28642180 28654520 28676539 28728042 28840096 28842419 28950737 28988841 28980951 29106863
4413 29106863 29117549 29137858 29149851 29136379 29251111 29304240 29320038 29318315 29316936 29348410 29427721
4402 29427721 29440844 29463157 29526771 29577151 29591324 29655390 29734762 29783752 29784518 29850477 29864999 29896771
4390 29896771 29948545 29982217 29998084 29992065 29972430 29928768 29999669 30020516 30010522 29924612 29934183 29907633
4378 29907633 29935881 29961654 29930691 29928695 29952724 29924534 29933482 29950317 29941557 29929634 29989172 30020398
4366 30020398 29930709 29950570 30031177 30069450 30062416 30124634 30134589 30119135 30203790 30185431 30292265
4355 30292265 30258243 30196460 30155895 30248662 30304558 30388866 30399894 30424158 30417496 30422982 30537053
4344 30537053 30574118 30603173 30576469 30631309 30621180 30631635 30671820 30696068 30839019 30961461 30947111
$$ packed form
4424B8455526M9140J37514J2340K2019N1503J12054K323J08318L8104p890J25912
4413B9106863J0686K0309J1993j3472J14732N3129J5798j723j379L1474P9311
4402B9427721J3123K2313O3614N0380J4173O4066P9372M8990P66O5959J4522L1772
4390B9896771N1774L3672J5867o019j9635m3662P0901K0847r994q5910R571k6550
4378B9907633K8248K5773l0963j996K4029k8190Q948J6835q760j1923N9538L1226
4366C0020398q9689J9861Q0607L8273p034O2218R955j5454Q4655j8359J06834
4355C0292265l4022o1783m0565R2767N5896Q4308J1028K4264o662N486J14071
4344C0537053L7065K9055k6704N4840j0129J0455M0185K4248J42951J22442j4350
$$ plain form
4333 30947111 31000805 31157051 31237655 31235735 31302101 31414575 31427723 31495354 31640196 31733102 31862794
4322 31862794 32041177 32184419 32280746 32351621 32396132 32572530 32702938 32794494 32948051 33150997
4312 33150997 33257169 33324863 33514618 33812209 34039954 34180725 34312415 34499943 34731563 34940570
4302 34940570 35109316 35313259 35553376 35815166 36025358 36296017 36560592 36779338 37011850
4293 37011850 37285302 37578513 37895989 38227079 38563927 38862627 39106331 39445617 39815932
4284 39815932 40114609 40474120 40904893 41273932 41629557 41983737 42349607 42787559 43169277
4275 43169277 43572388 44013820 44537937 44994116 45471110 45940802 46519759 47034085 47601712
4266 47601712 48188236 48793966 49379452 49973800 50633837 51306325 51881581 52522812 53236230
$$ packed form
4333C0947111N3694J56246Q0604j920O6366J12474J3148O7631J44842R2906J29692
4322C1862794J78383J43242R6327P0875M4511J76398J30408R1556J53557K02946
4312C3150997J06172O7694J89755K97591K27745J40771J31690J87528K31620K09007
4302C4940570J68746K03943K40117K61790K10192K70659K64575K18746K32512
4293C7011850K73452K93211L17476L31090L36848K98700K43704L39286L70315
4284C9815932K98677L59511M30773L69039L55625L54180L65870M37952L81718
4275D3169277M03111M41432N24117M56179M76994M69692N78957N14326N67627
4266D7601712N86524O05730N85486N94348O60037O72488N75256O41231P13418
$$ plain form
4257 53236230 53966645 54721199 55558018 56310933 56977616 57761558 58550252 59322756 60066493
4248 60066493 60842897 61669670 62442634 63297196 64105482 64943450 65793249 66565377 67416518
4239 67416518 68333730 69308166 70098547 70959080 71868286 72827435 73851199 74806167 75690651
4230 75690651 76736911 77737414 78830003 79995015 81124702 82197485 83268158 84480301
4222 84480301 85694894 86930958 88141094 89319838 90594866 91873783 93216170 94575304
4214 94575304 95931051 97355502 98805001 100188961 101521504 102824141 104237624 105761506
4206 105761506 107259461 108749700 110226712 111806826 113457195 115002579 116674184 118328323
4198 118328323 120149218 121975750 123938294 125927596 127945084 130058436 132320574 134722296
$$ packed form
4257E3236230P30415P54554Q36819P52915O66683P83942P88694P72504P43737
4248F0066493P76404Q26773P72964Q54562Q08286Q37968Q49799P72128Q51141
4239F7416518R17212R74436P90381Q60533R09206R59149J023764R54968Q84484
4230G5690651J046260J000503J092589J165012J129687J072783J070673J212143
4222H4480301J214593J236064J210136J178744J275028J278917J342387J359134
4214I4575304J355747J424451J449499J383960J332543J302637J413483J523882
4206A05761506J497955J490239J477012J580114J650369J545384J671605J654139
4198A18328323J820895J826532J962544J989302K017488K113352K262138K401722
$$ plain form
4190 134722296 137186939 139755170 142583504 145389442 148365869 151594801 154994745 158560205
4182 158560205 162310087 166384880 170649455 175133859 179902062 184800320 189942923 195392148
4174 195392148 201177658 207315946 213692496 220557914 227632445 234942721 242477838 250198366
4166 250198366 258077400 265631321 272843150 279576287 285472493 290242317 293813886 296148633
4158 296148633 297244453 297240008 296152353 294177586 291778178 289345862 287162129 285378103
4150 285378103 283772858 282334974 280941672 279263143 276866561 273655020 269549962 264415605
4142 264415605 258465014 252033779 245358917 238855668 232654572 226729100 221052033 215777474
4134 215777474 210786127 205928145 201327315 196818655 192438008 188211733 184031974 179979085
$$ packed form
4190A34722296K464643K568231K828334K805938K976427L228932L399944L565460
4182A58560205L749882M074793M264575M484404M768203M898258N142603N449225
4174A95392148N785510O138288O376550O865418P074531P310276P535117P720528
4166B50198366P879034P553921P211829O733137N896206M769824L571569K334747
4158B96148633J095820m445j087655j974767k399408k432316k183733j784026
4150B85378103j605245j437884j393302j678529k396582l211541m105058n134357
4142B64415605n950591o431235o674862o503249o201096n925472n677067n274559
4134B15777474m991347m857982m600830m508660m380647m226275m179759m052889
$$ plain form
4126 179979085 175925165 171917745 167898708 163932714 159979074 156203746 152570798 149016585
4118 149016585 145537630 142094129 138831615 135651248 132640232 129807957 127005751 124329793
4110 124329793 121809495 119371129 116951992 114737254 112528689 110430135 108492529 106600596
4102 106600596 104640317 102892421 101064117 99356368 97756910 96162405 94588263 93066713
4094 93066713 91689725 90266711 88900951 87577499 86288083 85111419 83971605 82827046
4086 82827046 81828338 80873928 79901962 78916834 77998685 77055691 76163301 75295865 74526583
4077 74526583 73803094 73064013 72342732 71680544 71079870 70523009 69998620 69534129 69110978
4068 69110978 68599560 68104970 67561032 67147619 66782624 66343968 65923741 65379928 64777150
$$ packed form
4126A79979085m053920m007420m019037l965994l953640l775328l632948l554213
4118A49016585l478955l443501l262514l180367l011016k832275k802206k675958
4110A24329793k520298k438366k419137k214738k208565k098554j937606j891933
4102A06600596j960279j747896j828304j707749j599458j594505j574142j521550
4094I3066713j376988j423014j365760j323452j289416j176664j139814j144559
4086H2827046r98708r54410r71966r85128r18149r42994q92390q67436p69282
4077G4526583p23489p39081p21281o62188o00674n56861n24389m64491m23151
4068F9110978n11418m94590n43938m13413l64995m38656m20227n43813o02778
$$ plain form
4059 64777150 64265722 63700938 63162163 62701293 62288194 61780264 61201999 60719228 60204686
4050 60204686 59718342 59093351 58592218 58208626 57782273 57380301 57100880 56680834 56257841
4041 56257841 55923028 55782424 55604307 55450261 55371722 55171181 55019046 54933364 54841910 54827462
4031 54827462 54785780 54558361 54196584 53557692 53011671 52522662 52130964 51781225 51338141 50803777
4021 50803777 50141392 49594500 49095182 48687765 48281166 47951151 47580898 47258494 46975110
4012 46975110 46711087 46388892 46125279 45890598 45606206 45420755 45284419 45125889 44940690
4003 44940690 44817428 44718331 44569722 44395198 44229310 44040760 43824686 43439291 42956191 42582944
3993 42582944 42207346 41859368 41570454 41253320 40821892 40429055 40068369 39742004 39440432
$$ packed form
4059F4777150n11428n64784n38775m60870m13099n07930n78265m82771n14542
4050F0204686m86344o24991n01133l83592m26353m01972k79421m20046m22993
4041E6257841l34813j40604j78117j54046p8539k00541j52135q5682r1454j4448
4031E4827462m1682k27419l61777o38892n46021m89009l91698l49739m43084n34364
4021E0803777o62385n46892m99318m07417m06599l30015l70253l22404k83384
4012D6975110k64023l22195k63613k34681k84392j85451j36336j58530j85199
4003D4940690j23262r9097j48609j74524j65888j88550k16074l85395m83100l73247
3993D2582944l75598l47978k88914l17134m31428l92837l60686l26365l01572
$$ plain form
3984 39440432 39172459 38815330 38509821 38288743 37986199 37750076 37487617 37112244 36896372
3975 36896372 36636615 36359224 36160709 35924366 35674210 35417101 35287644 34937418 34665271
3966 34665271 34493719 34291688 34107505 33808899 33592182 33357093 33150049 32944587 32783070
3957 32783070 32641009 32341773 32175863 31973867 31840430 31704025 31566420 31387414 31192883
3948 31192883 31030792 30932341 30831556 30711223 30580361 30514811 30512719 30412379 30257049 30226869
3938 30226869 30231560 30158996 30122192 30053486 30099351 30164586 30106786 30070257 30142941 30203862 30177967
3927 30177967 30342035 30422474 30452567 30507619 30584286 30655043 30825003 30978261 31074757 31230753
3917 31230753 31419575 31605539 31741896 31955254 32206170 32386356 32590094 32809607 33101651
$$ packed form
3984C9440432k67973l57129l05509k21078l02544k36123k62459l75373k15872
3975C6896372k59757k77391j98515k36343k50156k57109j29457l50226k72147
3966C4665271j71552k02031j84183k98606k16717k35089k07044k05462j61517
3957C2783070j42061k99236j65910k01996j33437j36405j37605j79006j94531
3948C1192883j62091r8451j00785j20333j30862o5550k092j00340j55330l0180
3938C0226869M691p2564l6804o8706M5865O5235n7800l6529P2684O0921k5895
3927C0177967J64068Q0439L0093N5052P6667P0757J69960J53258R6496J55996
3917C1230753J88822J85964J36357K13358K50916J80186K03738K19513K92044
$$ plain form
3908 33101651 33338789 33560170 33768330 34034771 34319318 34651603 35047397 35281642 35578807
3899 35578807 35941393 36300632 36583834 36907814 37189279 37592319 38083560 38441051 38836406
3890 38836406 39344760 39686288 40062683 40517309 40994470 41463940 41914203 42388803 42917448
3881 42917448 43457831 44089835 44668485 45198981 45758478 46370209 46899340 47553132 48236111
3872 48236111 48788334 49399987 50052516 50734610 51406684 52220562 53035305 53844784 54781875
3863 54781875 55672543 56537704 57494332 58482310 59529694 60632450 61782078 62959877 64193595
3854 64193595 65466236 66765148 68125916 69505430 70930674 72311087 73694075 75067901
3846 75067901 76434912 77846347 79166052 80509653 81791191 83139100 84510520 85865246
$$ packed form
3908C3101651K37138K21381K08160K66441K84547L32285L95794K34245K97165
3899C5578807L62586L59239K83202L23980K81465M03040M91241L57491L95355
3890C8836406N08354L41528L76395M54626M77161M69470M50263M74600N28645
3881D2917448N40383O32004N78650N30496N59497O11731N29131O53792O82979
3872D8236111N52223O11653O52529O82094O72074Q13878Q14743Q09479R37091
3863E4781875Q90668Q65161R56628R87978J047384J102756J149628J177799J233718
3854F4193595J272641J298912J360768J379514J425244J380413J382988J373826
3846G5067901J367011J411435J319705J343601J281538J347909J371420J354726
$$ plain form
3838 85865246 87313841 88870806 90480941 92164753 93880799 95682974 97472234 99330998
3830 99330998 101224282 103221445 105254961 107253781 109409677 111779634 114114491 116465247
3822 116465247 118815184 121108615 123207195 124930955 126232306 127284893 128258014 128990005
3814 128990005 129456316 129537482 129616613 129911469 130604253 131601035 132807820 133991989 135269913
3805 135269913 136618824 137865872 138809606 139454773 139710769 139505304 139134100 138843354 138767542
3796 138767542 138776098 138713767 138564424 138470786 138312280 138070817 137675956 137015534 136245881 135379660
3786 135379660 134502836 133555935 132465222 131168521 129798346 128528088 127348764 126092716
3778 126092716 124847479 123582470 122215880 120761231 119224433 117646048 115832750 113792599
$$ packed form
3838H5865246J448595J556965J610135J683812J716046J802175J789260J858764
3830I9330998J893284J997163K033516J998820K155896K369957K334857K350756
3822A16465247K349937K293431K098580J723760J301351J052587R73121P31991
3814A28990005M66311Q1166P9131K94856O92784R96782J206785J184169J277924
3805A35269913J348911J247048R43734O45167K55996k05465l71204k90746p5812
3796A38767542Q556o2331j49343r3638j58506k41463l94861o60422p69653q66221
3786A35379660q76824r46901j090713j296701j370175j270258j179324j256048
3778A26092716j245237j265009j366590j454649j536798j578385j813298k040151
$$ plain form
3770 113792599 111657303 109444349 107085223 104871020 102640074 100342445 98145019 96011433
3762 96011433 93875417 91757718 89738361 87703565 85713291 83769244 81826962 79877428
3754 79877428 77967058 76059815 74145570 72169635 70246001 68223013 66303445 64473158
3746 64473158 62758003 61100583 59408476 57855157 56325526 54862892 53499430 52117354
3738 52117354 50788071 49638724 48465342 47290099 46158360 45134576 44045816 43025524
3730 43025524 42002569 41018185 40007572 39100429 38171564 37308861 36430719 35563266 34806470
3721 34806470 34114790 33318078 32595090 31924312 31248386 30612020 29963811 29421095 28969235
3712 28969235 28417985 27896470 27382498 26965942 26471639 25901962 25476965 25060530 24635600
$$ packed form
3770A13792599k135296k212954k359126k214203k230946k297629k197426k133586
3762I6011433k136016k117699k019357k034796j990274j944047j942282j949534
3754G9877428j910370j907243j914245j975935j923634k022988j919568j830287
3746F4473158j715155j657420j692107j553319j529631j462634j363462j382076
3738E2117354j329283j149347j173382j175243j131739j023784j088760j020292
3730D3025524j022955r84384j010613r07143r28865q62703q78142q67453p56796
3721C4806470o91680p96712p22988o70778o75926o36366o48209n42716m51860
3712B8969235n51250n21515n13972m16556m94303n69677m24997m16435m24930
$$ plain form
3703 24635600 24051903 23633177 23261075 22973310 22552048 22132006 21741337 21356739 20978688
3694 20978688 20630114 20335364 20019088 19584277 19250495 18989624 18667034 18337333 18014006
3685 18014006 17730369 17506123 17171202 16895504 16697699 16422064 16150871 15840024 15592031
3676 15592031 15351918 15071635 14843763 14603482 14380657 14161341 13939125 13739782 13640048 13383444
3666 13383444 13062492 12857206 12620373 12395543 12210832 12062818 11841032 11619905 11452674
3657 11452674 11279846 11114870 10852001 10702186 10573312 10405657 10301506 10141033 9979583
3648 9979583 9802658 9631619 9467120 9302441 9095269 8971520 8817683 8699150 8540313 8445051
3638 8445051 8391409 8293543 8139286 7963279 7853359 7757925 7635878 7507382 7382595 7259145
$$ packed form
3703B4635600n83697m18726l72102k87765m21262m20042l90669l84598l78051
3694B0978688l48574k94750l16276m34811l33782k60871l22590l29701l23327
3685A8014006k83637k24246l34921k75698j97805k75635k71193l10847k47993
3676A5592031k40113k80283k27872k40281k22825k19316k22216j99343r9734k56604
3666A3383444l20952k05286k36833k24830j84711j48014k21786k21127j67231
3657A1452674j72828j64976k62869j49815j28874j67655j04151j60473j61450
3648I979583j76925j71039j64499j64679k07172j23749j53837j18533j58837r5262
3638H445051n3642r7866j54257j76007j09920r5434j22047j28496j24787j23450
$$ plain form
3628 7259145 7177523 7085753 7070765 6966375 6804718 6708692 6584860 6535595 6457743 6324702 6213539
3617 6213539 6091591 6059054 6067258 6013889 5905762 5876472 5838652 5754904 5693969 5639717 5561774
3606 5561774 5515403 5446873 5367720 5349531 5263025 5195017 5127182 5059023 5032890 5023073 4975054 4948644
3594 4948644 4906885 4875806 4808038 4765965 4696375 4697074 4664845 4583390 4465738 4430143 4524823 4551219
3582 4551219 4442614 4322858 4252736 4198888 4161395 4139071 4170247 4135066 4059515 4066663 4082928
3571 4082928 4089840 4036072 4003559 3983305 3956311 3929122 3934390 3877117 3782426 3861362 3857149 3759248
3559 3759248 3731515 3723057 3697601 3744704 3668354 3653477 3573145 3581105 3629369 3614109 3594781 3635824
3547 3635824 3554814 3485995 3530004 3528252 3462066 3463381 3516414 3480464 3436006 3393479 3374741 3376336
$$ packed form
3628G259145q1622r1770j4988j04390j61657r6026j23832m9265p7852j33041j11163
3617F213539j21948l2537Q204n3369j08127k9290l7820q3748o0935n4252p7943
3606E561774m6371o8530p9153j8189q6506o8008o7835o8159k6133r817m8019k6410
3594D948644m1759l1079o7768m2073o9590O99l2229q1455j17652l5595R4680K6396
3582D551219j08605j19756p0122n3848l7493k2324L1176l5181p5551P148J6265
3571D082928O912n3768l2513k0254k6994k7189N268n7273r4691P8936m213r7901
3559C759248k7733q458k5456M7103p6350j4877q0332P960M8264j5260j9328M1043
3547C635824q1010o8819M4009j752o6186J315N3033l5950m4458m2527j8738J595
$$ plain form
3535 3376336 3336910 3372389 3403629 3368832 3331742 3345006 3387802 3340704 3313812 3247508 3167615
3524 3167615 3199338 3189754 3133805 3180481 3147564 3098696 3090949 3126399 3043999 2988006 2978468 3038579
3512 3038579 3022421 3034967 3039232 2947229 2868676 2835937 2873836 2934785 2884789 2853921 2862933 2781278
3500 2781278 2764725 2721231 2688141 2644817 2651177 2574075 2656118 2735078 2663499 2600486 2530974 2513645
3488 2513645 2552424 2520964 2479356 2474932 2402548 2465582 2453873 2445007 2428885 2307623 2346901 2381590
3476 2381590 2269287 2207812 2211723 2207213 2119370 2034746 2021662 1972218 1987735 2011568 1981409 1986890
3464 1986890 1947187 1899343 1963375 1864321 1874524 1827378 1766588 1819840 1763131 1690766 1719919
3453 1719919 1719493 1736324 1727307 1659653 1541955 1522741 1590235 1718156 1652772 1593799 1588714 1541664
$$ packed form
3535C376336l9426L5479L1240l4797l7090J3264M2796m7098k6892o6304p9893
3524C167615L1723r584n5949M6676l2917m8868p747L5450q2400n5993r538O0111
3512C038579j6158J2546M265r2003p8553l2739L7899O0949m9996l0868R012q1655
3500B781278j6553m3494l3090m3324O360p7102Q2043P8960p1579o3013o9512j7329
3488B513645L8779l1460m1608m424p2384O3034j1709q866j6122j21262L9278L4689
3476B381590j12303o1475L911m510q7843q4624j3084m9444J5517K3833l0159N481
3464A986890l9703m7844O4032r9054J0203m7146o0790N3252n6709p2365K9153
3453A719919m26J6831r017o7654j17698j9214O7494J27921o5384n8973n085m7050
$$ plain form
3441 1541664 1554340 1499742 1505658 1446771 1419259 1406008 1398630 1452847 1429920 1382789 1396127 1330197
3429 1330197 1341233 1302521 1296694 1272540 1269581 1249065 1209412 1241119 1236617 1239889 1215728 1152913
3417 1152913 1066246 1069770 1085349 998188 1104793 1063074 1091632 1066522 1015080 986830 1054095
3406 1054095 1056022 1057936 1118794 1078065 988461 959054 969369 946526 954281 936973 903403 849870
3394 849870 839915 950824 933582 875103 845829 855360 861531 880840 944247 915244 894316 913851
3382 913851 870236 843482 819106 777228 794664 812795 869062 764037 761873 752984 777188 717654
3370 717654 624933 737314 789330 729665 717635 715848 623245 627935 611027 577658 574489 665177
3358 665177 684715 665339 685637 631575 630008 602832 645639 614449 683691 675276 620519 563014
$$ packed form
3441A541664J2676n4598N916n8887k7512j3251p378N4217k2927m7131J3338o5930
3429A330197J1036l8712n827k4154k959k0516l9653L1707m502L272k4161o2815
3417A152913q6667L524J5579q7161J06605m1719K8558k5110n1442k8250O7265
3406A054095J927J914O0858m0729q9604k9407J0315k2843P755j7308l3570n3533
3394H49870r955J10909j7242n8479k9274R531O171J9309O3407k9003k0928J9535
3382I13851m3615k6754k4376m1878J7436J8131N6267j05025k164q889K4204n9534
3370G17654r2721J12381N2016n9665j2030j787r2603M690j6908l3369l169R0688
3358F65177J9538j9376K0298n4062j567k7176M2807l1190O9242q415n4757n7505
$$ plain form
3346 563014 563258 516238 487448 493934 495950 496143 472432 457956 494114 518931 494218 464717 422156
3333 422156 399972 496523 447903 460849 430597 394786 429586 434184 414391 455341 426612 364701
3321 364701 390956 394721 424347 413712 411698 377020 303330 291572 414794 490208 441157 390093
3309 390093 331803 323897 324771 345252 315008 302608 345398 334719 323226 297905 286779 192161
3297 192161 178207 237431 198476 184690 220547 238693 316036 228832 247360 313481 369785 365601
3285 365601 320994 338255 404313 344877 267979 311433 299977 328160 288154 244148 290633 225554
3273 225554 208432 248075 199059 223864 199635 218946 189516 181757 211998 133681 172262 106483
3261 106483 156665 67817 86624 121544 136700 152444 196849 180740 140345 99238 104088 189811
$$ packed form
3346E63014K44m7020k8790O486K016J93k3711j4476L6158K4817k4713k9501m2561
3333D22156k2184R6551m8620J2946l0252l5811L4800M598j9793M0950k8729o1911
3321C64701K6255L765K9626j0635k014l4678p3690j1758J23222P5414m9051n1064
3309C90093n8290p906Q74K0481l0244j2400M2790j0679j1493k5321j1126r4618
3297A92161j3954N9224l8955j3786L5857J8146P7343q7204J8528O6121N6304m184
3285C65601m4607J7261O6058n9436p6898M3454j1456K8183m0006m4006M6485o5079
3273B25554j7122L9643m9016K4805k4229J9311k9430p759L0241p8317L8581o5779
3261A06483N0182q8848J8807L4920J5156J5744M4405j6109m0395m1107M850Q5723
$$ plain form
3249 189811 183299 168575 205747 154988 132338 193778 196488 218202 192835 117571 69170 140741
3237 140741 187089 171715 154313 88270 22681 75974 76309 80473 72946 73014 61570 74425 62076
3224 62076 52558 78011 55669 50163 90180 106761 37556 55732 164153 139901 100778 49953
3212 49953 102742 92410 74193 84097 80782 29020 41144 74673 129246 47467 24094 53170
3200 53170 26384 21049 -34282 29844 75075 128298 151324 111912 50854 20308 16102 6182
3188 6182 49327 107938 105636 82997 -3876 -4617 33322 20804 37640 9202 25763 -47108 -16770
3175 -16770 65672 42401 110179 64124 -26910 -9116 21287 19421 -18131 -35437 3439 11723
3163 11723 63887 96587 16786 -3513 35297 31754 26881 30513 -55516 -2053 -34590 -7053
$$ packed form
3249A89811o512j4724L7172n0759k2650O1440K710K1714k5367p5264m8401P1571
3237A40741M6348j5374j7402o6043o5589N3293L35M164p527O8j1444J2855j2349
3224F2076r518K5453k2342n506M0017J6581o9205J8176J08421k4252l9123n0825
3212D9953N2789j0332j8217R904l315n1762J2124L3529N4573q1779k3373K9076
3200E3170k6786n335n5331O4126M5231N3223K3026l9412o1058l0546m206r920
3188F182M3145N8611k302k2639q6873p41L7939j2518J6836k8438J6561p2871L0338
3175a6770Q2442k3271O7778m6055r1034J7794L0403j866l7552j7306L8876Q284
3163A1723N2164L2700p9801k0299L8810l543m873L632q6029N3463l2537K7537
$$ plain form
3151 -7053 38252 27946 4883 -56104 -23733 9337 28550 -35511 -11991 38430 101569 60500
3139 60500 -23944 55541 139489 115231 24681 -29812 -4044 57781 54919 19856 31517 78978
3127 78978 91919 62443 110583 73554 50923 -49886 -51961 17084 48831 43395 87866 82250
3115 82250 40323 84006 118021 11855 86670 141938 135246 3011 45065 90130 28979 65641
3103 65641 80480 90838 79367 72567 85248 154714 143992 160680 168995 179220 123184 100317
3091 100317 49148 56400 18555 73019 135993 128983 122136 160337 163546 215144 166113 192508
3079 192508 161376 130310 164420 205457 249043 235480 220390 195887 248395 253790 201829 209661
3067 209661 222170 246082 246617 231358 142945 117490 186316 181255 262443 322334 289225 287531
$$ packed form
3151g053M5305j0306k3063o0987L2371L3070J9213o4061K3520N0421O3139m1069
3139F0500q4444P9485Q3948k4258r0550n4493K5768O1825k862l5063J1661M7461
3127G8978J2941k9476M8140l7029k2631j00809k075O9045L1747n436M4471n616
3115H2250m1927M3683L4015j06166P4815N5268o692j32235M2054M5065o1151L6662
3103F5641J4839J0358j1471o800J2681O9466j0722J6688Q315J0225n6036k2867
3091A00317n1169P252l7845N4464O2974p010o847L8201L209N1598m9031K6395
3079A92508l1132l1066L4110M1037M3586j3563j5090k4503N2508N395n1961P832
3067B09661J2509K3912N35j5259q8413k5455O8826n061Q1188N9891l3109j694
$$ plain form
3055 287531 379448 391846 323301 438348 432846 463980 480100 522352 584661 583848 676801 708572
3043 708572 800490 814121 797814 885599 1021704 1027222 1115523 1193474 1313208 1435278 1501404
3032 1501404 1628971 1837388 2050377 2262867 2522135 3001675 3511465 3547347 3583272 3785585
3022 3785585 4013346 4285916 4005768 3349980 2969558 2798629 2731479 2658450 2620480 2696746
3012 2696746 2830495 3036793 3287647 3457959 3699051 3582731 3053513 2643692 2333826 2158955
3002 2158955 1937922 1784577 1646151 1584691 1454504 1469377 1434422 1310822 1271603 1206154
2992 1206154 1192495 1198112 1207366 1173235 1017229 973654 851786 729804 696043 679657 694191
2981 694191 645685 632018 607627 467475 390795 427606 407442 419548 329800 351229 344734 339224
$$ packed form
3055B87531R1917J2398o8545J15047n502L1134J6120M2252O2309q13R2953L1771
3043G08572R1918J3631j6307Q7785J36105N518Q8301P7951J19734J22070O6126
3032A501404J27567K08417K12989K12490K59268M79540N09790L5882L5925K02313
3022C785585K27761K72570k80148o55788l80422j70929o7150p3029l7970P6266
3012B696746J33749K06298K50854J70312K41092j16320n29218m09821l09866j74871
3002B158955k21033j53345j38426o1460j30187J4873l4955j23600l9219o5449
2992A206154j3659N617R254l4131j56006m3575j21868j21982l3761j6386J4534
2981F94191m8506j3667k4391j40152p6680L6811k0164J2106q9748K1429o495n510
$$ plain form
2969 339224 405170 361930 318407 341367 312045 307716 251869 256118 270686 218057 203752 177473
2957 177473 146762 123471 108082 101206 29837 56448 69339 60814 56263 55654 95918 106816 108805
2944 108805 150424 48292 43631 56696 66426 78031 31240 58642 43279 24553 60144 66100
2932 66100 28516 32160 30391 8288 -2420 30886 24028 -37126 -96514 -98072 -90952 -32713 -25597
2919 -25597 -2776 -1406 -25017 -105752 -93103 15695 47228 29878 18367 -909 12592 -31858
2907 -31858 -70740 -1877 -13035 -10872 -21093 -37992 -76390 -84219 -68950 -10728 -67227 -152430
2895 -152430 -176811 -101767 -81460 -61029 -77131 -159293 -101407 16736 -14158 -4222 22117 -1480
2883 -1480 21733 -9234 -12262 -28882 -41264 -112162 -88832 -113595 -60556 -18432 -32786 -92094
$$ packed form
2969C39224O5946m3240m3523K2960k9322m329n5847M249J4568n2629j4305k6279
2957A77473l0711k3291j5389o876p1369K6611J2891q525m551o09M0264J0898J989
2944A08805M1619j02132m661J3065R730J1605m6791K7402j5363j8726L5591N956
2932F6100l7584L644j769k2103j0708L3306o858o1154n9388j558P120N8239P116
2919b5597K2821J370k3611q0735J2649J08798L1533j7350j1511j9276J3501m4450
2907c1858l8882O8863j1158K163j0221j6899l8398p829J5269N8222n6499q5203
2895a52430k4381P5044K0307K0431j6102q2162N7886J18143l0894R936K6339k3597
2883a480K3213l0967l028j6620j2382p0898K3330k4763N3039M2124j4354n9308
$$ plain form
2871 -92094 -118365 -91835 -99076 -119591 -121753 -139965 -92423 -158499 -142238 -73691 -65821 -87363
2859 -87363 -61421 -70592 -49237 -31515 -53975 -19569 -54190 -22461 -118056 -84996 -69516 -83653
2847 -83653 -108127 -145625 -69216 -103347 -154078 -104221 -132330 -175754 -133219 -137836 -146805 -127450
2835 -127450 -147666 -95022 -98610 -107868 -108972 -118697 -89197 -61152 -68769 -97774 -93226 -109344 -54640
2822 -54640 -88791 -52781 -54597 -99817 -47521 -70422 -61782 -115031 -156903 -163121 -131406 -151963
2810 -151963 -129249 -159622 -173084 -148488 -180090 -123234 -123088 -86251 -104038 -134012 -122834 -99530
2798 -99530 -133160 -156715 -184674 -131019 -58234 -81272 -125859 -133937 -3217 -79091 -66779 -42109
2786 -42109 -123324 -125748 -127567 -111614 -131800 -131503 -143816 -191321 -163668 -151852 -157660 -165637 -137293
$$ packed form
2871i2094k6271K6530p241k0515k162j8212M7542o6076J6261O8547P870k1542
2859h7363K5942r171K1355J7722k2460L4406l4621L1729r5595L3060J5480j4137
2847h3653k4474l7498P6409l4131n0731M9857k8109m3424M2535m617q969J9355
2835a27450k0216N2644l588r258j104r725K9500K8045p617k9005M548j6118N4704
2822e4640l4151L6010j816m5220N2296k2901Q640n3249m1872o218L1715k0557
2810a51963K2714l0373j3462K4596l1602N6856J46L6837j7787k9974J1178K3304
2798i9530l3630k3555k7959N3655P2785k3038m4587q078J30720p5874J2312K4670
2786d2109q1215k424j819J5953k0186K97j2313m7505K7653J1816n808p977K8344
$$ plain form
2773 -137293 -134152 -100706 -126479 -64450 4474 32302 -31849 -64580 -49250 -84136 -34048 -84051
2761 -84051 -69096 -91877 -80139 -109586 -187902 -89395 -68374 -72929 -169383 -136536 -76852 -164102
2749 -164102 -126380 -124616 -93313 -128535 -99117 -97944 -124324 -160540 -133147 -42806 -54840 -127769
2737 -127769 -124705 -86403 -83548 -85252 -124957 -104989 -106995 -163775 -181438 -124919 -89042 -92769 -82483
2724 -82483 -97239 -110961 -78797 -114619 -168477 -114219 -130836 -76664 -86171 -119773 -67538 19866
2712 19866 -82144 -18358 28909 5731 13631 -26974 -70317 -112529 -128933 -87885 -31590 -89835
2700 -89835 -93992 -75851 -87355 -81403 -97101 -157254 -99282 -46029 -45797 -68123 -38471 -5363 -16490
2687 -16490 -28693 -49539 -103016 -158426 -125487 -99086 -72954 -13752 -28667 -62403 -86762 -27978
$$ packed form
2773a37293L141L3446k5773O2029O8924K7828o4151l2731J5330l4886N0088n0003
2761h4051J4955k2781J1738k9447p8316R8507K1021m555r6454L2847N9684q7250
2749a64102L7722J764L1303l5222K9418J173k6380l6216K7393R0341j2034p2929
2737a27769L064L8302K855j704l9705J9968k006n6780j7663N6519L5877l727J0286
2724h2483j4756j3722L2164l5822n3858N4258j6617N4172r507l3602N2235Q7404
2712A9866j02010O3786M7267k3178P900m0605m3343m2212j6404M1048N6295n8245
2700h9835m157J8141j1504N952j5698o0153N7972N3253K32k2326K9652L3108j1127
2687a6490j2203k0846n3477n5410L2939K6401K6132N9202j4915l3736k4359N8784
$$ plain form
2675 -27978 -86367 -27391 -73136 -41824 -31989 -55301 -89394 -175402 -161658 -147017 -55080 -39146
2663 -39146 -43271 -40883 -104436 -100957 -139459 -128438 -91216 -118044 -64780 -12175 -81350 -85285 -65316
2650 -65316 -70588 -112718 -137757 -117839 -137190 -114902 -116789 -121079 -175395 -180482 -115054 -129281 -144296
2637 -144296 -151045 -147549 -98458 -98465 -125642 -67013 -103392 -66615 -5843 439 22679 -16031 -66941
2624 -66941 -111184 -143543 -154092 -120078 -90847 -96444 -92109 -104458 -130313 -9733 -38575 -51301
2612 -51301 -83791 -31196 -137274 -175162 -138144 -229677 -205638 -126934 -102396 -147025 -131762 -124501
2600 -124501 -163625 -146120 -136333 -77417 -100748 -66569 -46830 -71883 -91413 -79132 -144351 -54602
2588 -54602 -100576 -232564 -197349 -128424 -112719 -165539 -87604 -166422 -130638 -163859 -170423 -73418
$$ packed form
2675b7978n8389N8976m5745L1312R835k3312l4093q6008J3744J4641R1937J5934
2663c9146m125K388o3553L479l8502J1021L7222k6828N3264N2605o9175l935J9969
2650f5316n272m2130k5039J9918j9351K2288j887m290n4316n087O5428j4227j5015
2637a44296o749L496M9091pk7177N8629l6379L6777O0772O282K2240l8710n0910
2624f6941m4243l2359j0549L4014K9231n597M335j2349k5855J20580k8842j2726
2612e1301l2490N2595j06078l7888L7018r1533K4039P8704K4538m4629J5263P261
2600a24501l9124J7505R787N8916k3331L4179J9739k5053j9530J2281o5219Q9749
2588e4602m5974j31988L5215O8925J5705n2820P7935p8818L5784l3221o564R7005
$$ plain form
2576 -73418 -140842 -165114 -156467 -95646 -99303 -75532 -5847 -100561 -118630 -120448 -22978 -29536 -27749
2563 -27749 -2293 -5461 -51098 -22380 28516 -46329 -80081 -104157 -99295 -91771 -139784 -100898
2551 -100898 -67725 -37195 56805 -30256 -20919 -24501 -81759 -22581 -126112 -145248 -56461 -95814
2539 -95814 -128286 -31102 -17835 -98724 -140638 -106884 -159604 -85425 -21393 -8649 -66785 -121687
2527 -121687 -90866 -64514 -78648 -127479 -98321 -51109 -81865 -105138 -42633 4100 -16502 -38527
2515 -38527 -36834 -27460 -29455 -113776 -104975 -52383 -23784 -78626 -90773 -118692 -92454 -62000 -86920
2502 -86920 -30737 -9674 -66650 -85078 -48821 -78951 -117901 -87343 -53399 -30520 -27252 -30391
2490 -30391 -113473 -86175 4664 -48219 -76171 14470 -42253 -105166 -136201 -98906 -102527 -66092
$$ packed form
2576g3418o7424k4272Q647O0821l657K3771O9685r4714j8069j818R7470o558J787
2563b7749K5456l168m5637K8718N0896p4845l3752k4076M862P524m8013L8886
2551a00898L3173L0530R4000q7061R337l582n7258N9178j03531j9136Q8787l9353
2539i5814l2472R7184J3267q0889m1914L3754n2720P4179O4032J2744n8136n4902
2527a21687L0821K6352j4134m8831K9158M7212l0756k3273O2505M6733k0602k2025
2515c8527J693R374j995q4321Q801N2592K8599n4842j2147k7919K6238L0454k4920
2502h6920N6183K1063n6976j8428L6257l0130l8950L0558L3944K2879L268l139
2490c0391q3082K7298R0839n2883k7952R0641n6723o2913l1035L7295l621L6435
$$ plain form
2478 -66092 -85675 -61386 -52173 -61598 -30509 -48741 -31139 -99987 -113711 -146524 -67582 -90984
2466 -90984 -98557 -88523 -85247 -81498 -15351 14880 -51127 -130170 -153749 -192459 -135407 -87796
2454 -87796 -110598 -173504 -75734 -66876 -94653 -133309 -200773 -109566 -40450 18280 -54013 -80852
2442 -80852 -117552 -137078 -91885 -38137 -65790 -52506 -51892 -61923 -102263 -144507 -87521 14571
2430 14571 -47895 -94631 -105116 -69917 -22983 -61622 -90698 -49291 -102327 -141567 -51754 1655
2418 1655 -40704 -37710 9937 -14046 -105501 -107461 -119651 -75694 19566 -33359 -56616 -18676
2406 -18676 -39568 -55722 -31352 -22839 -17200 -55250 -33611 -41879 -47716 6961 -41296 -43629 -15407
2393 -15407 -91084 -101202 -110214 -66459 -11190 -4437 -48123 -76920 -62412 -32955 -51525 -67813
$$ packed form
2478f6092j9583K4289R213r425L1089j8232J7602o8848j3724l2813P8942k3402
2466i0984p573J0034L276L749O6147L0231o6007p9043k3579l8710N7052M7611
2454h7796k2802o2906R7770Q858k7777l8656o7464R1207O9116N8730p2293k6839
2442h0852l6700j9526M5193N3748k7653J3284O14j0031m0340m2244N6986J02092
2430A4571o2466m6736j0485L5199M6934l8639k9076M1407n3036l9240Q9813N3409
2418A655m2359K994M7647k3983r1455j960j2190M3957R5260n2925k3257L7940
2406a8676k0892j6154K4370Q513N639l8050K1639q268n837N4677m8257k333K8222
2393a5407p5677j0118r012M3755N5269O753m3686k8797J4508K9457j8570j6288
$$ plain form
2381 -67813 -95053 -83481 -108628 -57215 -63123 -112613 -110448 -80495 -105702 -107499 -31134 -18835
2369 -18835 -41005 -53082 -28911 -14714 -40006 -46296 25625 17297 -3162 -16499 -45316 -6202
2357 -6202 50455 -31412 -34514 -6985 -43248 -107187 -66542 -111319 -69932 -27234 1490 -27145
2345 -27145 -38137 -81951 -70700 17647 23515 67633 23469 14011 40712 -24430 8086 58666
2333 58666 21280 -27220 -60954 -8966 -25328 -106573 -90261 -92498 -59299 -69682 -114267 -77842
2321 -77842 -93991 -49899 -41766 2592 -52640 -6677 39646 -17873 13924 -31533 -20177 33546
2309 33546 -48103 -24213 -105044 -124813 -55357 -37244 -53665 14337 24052 18647 63656 -303
2297 -303 -393 -19859 -77432 -63827 -79636 -39755 2808 -2477 -38029 -12224 -53115 -76192 -116060
$$ packed form
2381f7813k7240J1572k5147N1413n908m9490K165K9953k5207j797P6365J2299
2369a8835k2170j2077K4171J4197k5292o290P1921q328k0459j3337k8817L9114
2357f202N6657q1867l102K7529l6263o3939M0645m4777M1387M2698K8724k8635
2345b7145j0992m3814J1251Q8347N868M4118m4164r458K6701o5142L2516N0580
2333E8666l7386m8500l3734N1988j6362q1245J6312k237L3199j0383m4585L6425
2321g7842j6149M4092Q133M4358n5232M5963M6323n7519L1797m5457J1356N3723
2309C3546q1649K3890q0831j9769O9456J8113j6421O8002R715n405M5009o3959
2297c03r0j9466n7573J3605j5809L9881M2563n285l5552K5805m0891k3077l9868
$$ plain form
2284 -116060 -91123 -113950 -62354 -64196 -129764 -91258 -71536 27860 30309 -2420 54720 1364
2272 1364 5974 -23405 -16046 -27869 -78159 -25536 -21267 -10779 -46884 -73127 -76467 -27462 -13743
2259 -13743 -34388 4740 9209 -80432 -51386 -96207 -57800 -144230 -70984 8617 -1937 -10799
2247 -10799 -38360 5759 52385 36673 -17865 -143300 -75127 -73481 -12960 23657 -55152 -8054
2235 -8054 -63271 -62685 -76133 -20821 20866 -5315 -24476 -51992 -23175 3730 15395 -40967
2223 -40967 -31266 -47403 -36479 4929 -68693 -80553 -81981 -67427 4361 49200 -20138 -4382
2211 -4382 -7907 -59965 -11565 -17089 -67217 -54521 -13398 14152 7335 -12774 882 8926 88555
2198 88555 66516 23156 -37772 -65594 -36801 -24146 -97674 -53342 -28223 -55505 -46713 -84025
$$ packed form
2284a16060K4937k2827N1596j842o5568L8506J9722R9396K449l2729N7140n3356
2272A364M610k9379P359j1823n0290N2623M269J0488l6105k6243l340M9005J3719
2259a3743k0645L9128M469q9641K9046m4821L8407q6430P3246P9601j0554q862
2247a0799k7561M4119M6626j5712n4538j25435O8173J646O0521L6617p8809M7098
2235h054n5217N86j3448N5312M1687k6181j9161k7516K8817K6905J1665n6362
2223d0967R701j6137J0924M1408p3622j1860j428J4554P1788M4839o9338J5756
2211d382l525n2058M8400n524n0128J2696M1123K7550o817k0109J3656Q044P9629
2198H8555k2039m3360o0928k7822K8793J2655p3528M4332K5119k7282Q792l7312
$$ plain form
2186 -84025 -63003 -24414 -59064 -70427 -48851 -119211 -60197 -58450 -58570 12058 -4375 13666
2174 13666 -43566 -34545 1131 -14452 -33589 -43422 -168450 -161466 -47163 -4706 -42339 -153379
2162 -153379 -95404 -60796 -45487 -37269 -42398 -92336 -65764 -108034 -101918 -35215 -56429 -70905
2150 -70905 5034 10532 -1453 -60218 -3561 -48598 -103183 -113778 -89420 -10994 53819 -31518
2138 -31518 -47209 -29471 -14331 -9698 -2427 32296 10639 -70095 -105730 -54869 -27568 -26657 -55335
2125 -55335 -45403 11352 7532 -31951 -50101 -56361 -83684 -117418 -134642 -64974 -37901 -69948
2113 -69948 -69025 -92912 -66841 45606 15948 -24872 -34871 -31507 54472 14710 -3860 -31043
2101 -31043 -49260 -39487 -14923 -79621 -35833 43728 151396 161668 117573 63177 -9156 -31817
$$ packed form
2186h4025K1022L8589l4650j1363K1576p0360N9014J747j20P0628j6433J8041
2174A3666n7232R021L5676j5583j9137r833j25028O984J14303M2457l7633j11040
2162a53379N7975L4608J5309Q218n129m9938K6572m2270O116O6703k1214j4476
2150g0905P5939N498j1985n8765N6657m5037n4585j0595K4358P8426O4813q5337
2138c1518j5691J7738J5140M633P271L4723k1657q0734l5635N0861K7301R11k8678
2125e5335R932N6755l820l9483j8150o260k7323l3734j7224O9668K7073l2047
2113f9948R23k3887K6071J12447k9658m0820r999L364Q5979l9762j8570k7183
2101c1043j8217R773K4564o4698M3788P9561J07668J0272m4095n4396p2333k2661
$$ plain form
2089 -31817 -81189 -49953 -48970 8205 -6591 -43382 -20164 -35249 -8524 -15617 12002 -17046
2077 -17046 -47340 67069 70893 68664 63573 4195 -23434 27490 76877 50036 -5426 7642
2065 7642 31699 7372 -30576 -56079 -15092 -82275 -68566 -59410 -62067 -2260 9831 -45855
2053 -45855 23080 74774 21278 -309 3073 -27770 -38266 -37173 33862 15702 32612 -8242
2041 -8242 -45135 17935 20396 38789 56704 11124 62555 -18697 16856 -19531 -56230 -5852
2029 -5852 -7897 77590 48263 -22556 8692 -20014 -25454 8822 48890 50919 34542 45682 64631
2016 64631 -3875 -27551 28232 -724 -47937 -123361 -29229 34954 -8688 -98696 -38202 -21089
2004 -21089 -5200 659 -72620 -65036 -59548 -24505 -27471 -75204 -43155 -65601 -56072 -95534 10993
$$ packed form
2089c1817m9372L1236R83N7175j4796l6791K3218j5085K6725p093K7619k9048
2077a7046l0294J14409L824k229n091n9378k7629N0924M9387k6841n5462J3068
2065G642K4057k4327l7948k5503M0987o7183J3709R156k657N9807J2091n5686
2053d5855O8935N1694n3496k1587L382l0843j0496J093P1035j8160J6910m0854
2041h242l6893O3070K461J8393J7915m5580N1431q1252L5553l6387l6699N0378
2029e852k045Q5487k9327p0819L1248k8706n440L4276M0068K029j6377J1140J8949
2016F4631o8506k3676N5783k8956m7213p5424R4132O4183m3642r0008O0494J7113
2004b1089J5889N859p3279P584N488L5043k966m7733L2049k2446R529l9462J06527
$$ plain form
1991 10993 99 -45386 -69086 -63457 24778 13272 -91668 -69931 -35346 -18380 -32278 -59285
1979 -59285 -13593 -23457 -9746 -2145 -11160 18016 38275 25138 43556 11284 21730 15854 -7741
1966 -7741 6299 20781 -13381 -73108 -5219 63768 42462 79450 39575 4801 -14047 -10696
1954 -10696 -35609 2786 -11965 -51972 -33724 -51845 -4830 2126 -635 -30553 -27391 -53837
1942 -53837 -34547 41284 43865 39360 35183 34636 70727 5678 7563 37287 86976 69370 27192
1929 27192 -7359 50486 109940 94344 65428 106802 97332 8470 -9559 -27565 2679 -74595
1917 -74595 -63929 53770 21048 8021 -38894 -58253 39248 59187 21611 -7699 -20619 47189
1905 47189 74975 -11405 12462 -26209 -146069 -119589 -69871 -53086 4827 -76897 -98555 -77963
$$ packed form
1991A0993j0894m5485k3700N629Q8235j1506j04940K1737L4585J6966j3898k7007
1979e9285M5692r864J3711P601r015K9176K0259j3137J8418l2272J0446n876k3595
1966g741J4040J4482l4162n9727O7889O8987k1306L6988l9875l4774j8848L351
1954a0696k4913L8395j4751m0007J8248j8121M7015O956k761k9918L162k6446
1942e3837J9290P5831K581m505m177n47L6091o5049J885K9724M9689j7606m2178
1929B7192l4551N7845N9454j5596k8916M1374r470q8862j8029j8006L0244p7274
1917g4595J0666J17699l2722j3027m6915j9359R7501J9939l7576k9310j2920O7808
1905D7189K7786q6380K3867l8671j19860K6480M9718J6785N7913q1724k1658K0592
$$ plain form
1893 -77963 24576 7000 -29265 -28926 -61797 5895 9123 79723 -3594 -62992 7071 60623
1881 60623 8600 -42932 -31534 -10001 7918 8602 -20085 -4810 2902 23588 28852 -14710 6563
1868 6563 -31890 -45673 -19842 -23007 -47560 -95677 -40336 -5422 -34204 -35540 -36663 23427 1215
1855 1215 -42657 22021 54293 20890 31111 -56662 -46094 -22733 10746 12536 -4948 -47596
1843 -47596 -57589 -39711 -7441 38530 78510 43209 8200 29956 48536 28434 -4135 27209
1831 27209 98731 49893 22619 37784 50914 88081 1887 -44386 21275 -9191 -41305 36856
1819 36856 64199 -10709 -84287 -54574 -12422 47768 20914 -66991 6883 56031 2930 -38166
1807 -38166 -33401 35936 4846 11523 37434 16495 -41018 -40002 -7538 55327 25856 8082
$$ packed form
1893g7963J02539j7576l6265L39l2871O7692L228P0600q3317n9398P0063N3552
1881F0623n2023n1532J1398K1533J7919O84k8687J5275P712K0686N264m3562K1273
1868F563l8453j3783K5831l165k4553m8117N5341L4914k8782j336j123O0090k2212
1855A215m3872O4678L2272l3403J0221q7773J0568K3361L3479J790j7484m2648
1843d7596r993J7878L2270M5971L9980l5301l5009K1756J8580k0102l2569L1344
1831B7209P1522m8838k7274J5165J3130L7167q6194m6273O5661l0466l2114P8161
1819C6856K7343p4908p3578K9713M2152O0190k6854q7905P3874M9148n3101m1096
1807c8166M765O9337l1090O677K5911k0939n7513J016L2464O2865k9471j7774
$$ plain form
1795 8082 -12079 2631 27644 59436 20904 -2731 1709 -14509 63192 76462 7095 -53216
1783 -53216 6343 -4247 12413 -23626 -23584 27799 32083 -13812 -23661 -87740 -26870 -38866 -104614
1770 -104614 -84931 -54639 -26365 -19478 19839 65793 18491 17068 98678 46665 29952 35394
1758 35394 40976 56387 50647 -44633 9946 64192 11572 62415 32780 6321 69140 70462
1746 70462 51387 -12097 8412 48328 94584 46871 32102 4864 -11530 64945 52425 15395
1734 15395 5314 -44921 -24799 7708 58703 -86478 -1156 18213 -2824 14915 3077 8535
1722 8535 -2918 24488 10557 10314 -47545 -68842 -75996 -36030 -53988 -11588 -2214 11669 -7332
1709 -7332 -80953 -18385 -34996 -21153 8280 37812 23088 2503 -41712 -88014 41774 8377
$$ packed form
1795H082k0161J4710K5013L1792l8532k3635M440j6218P7701J3270o9367o0311
1783e3216N9559j0590J6660l6039M2N1383M284m5895r849o4079O0870j1996o5748
1770a04614J9683L0292K8274O887L9317M5954m7302j423Q1610n2013j6713N442
1758C5394N582J5411n740r5280N4579N4246n2620N0843k9635k6459O2819J322
1746G0462j9075o3484K0509L9916M6256m7713j4769k7238j6394P6475j2520l7030
1734A5395j0081n0235K0122L2507N0995j45181Q5322J9369k1037J7739j1838N458
1722H535j1453K7406j3931k43n7859k1297p154L9966j7958M2400R374J3883j9001
1709g332p3621O2568j6611J3843K9433K9532j4724k0585m4215m6302J29788l3397
$$ plain form
1697 8377 -25845 -96374 -92672 -93914 -12991 68387 44559 49743 50310 -19629 -31090 13101 49523
1684 49523 55111 20016 60198 39960 12369 9775 68074 52776 41913 70314 -5718 -14088
1672 -14088 46616 79359 101654 114086 82374 98455 87086 59275 -36139 32500 -1734 -30043
1660 -30043 -6779 -55889 -80904 -25907 26520 35223 43273 58690 23498 -7714 25413 14703
1648 14703 15146 27326 48539 43205 4796 -33472 32213 1075 -5869 57231 68138 -24505 16394
1635 16394 57429 20752 70488 23799 24970 32780 24341 -12417 -27018 67163 112407 75962
1623 75962 42573 26843 36722 68801 35906 77040 46704 6384 34965 31101 24093 -22317
1611 -22317 -8807 35254 4440 29016 41527 10284 28752 24910 27281 65891 51908 6763
$$ packed form
1697H377l4222p0529L702j242Q0923Q1378k3828N184N67o9939j1461M4191L6422
1684D9523N588l5095M0182k0238k7591k594N8299j5298j0863K8401p6032q370
1672a4088O0704L2743K2295J2432l1712J6081j1369k7811r5414O8639l4234k8309
1660c0043K3264m9110k5015N4997N2427Q703Q050J5417l5192l1212L3127j0710
1648A4703M43J2180K1213n334l8409l8268O5685l1138o944O3100J0907r2643M0899
1635A6394M1035l6677M9736m6689J171P810q439l6758j4601R4181M5244l6445
1623G5962l3389j5730R879L2079l2895M1134l0336m0320K8581l864p008m6410
1611b2317J3510M4061l0814K4576J2511l1243J8468l842K371L8610j3983m5145
$$ plain form
1599 6763 47423 43100 59226 43223 33024 14952 -12432 72193 24294 -51691 -34732 -7389
1587 -7389 23113 51791 47693 50459 30298 39449 101720 108599 77844 76674 74648 60905 44540
1574 44540 15782 26228 68277 54878 62071 -16201 -35712 -55022 82 77758 15346 -16312
1562 -16312 -13298 -5196 -46383 -51590 -43118 -28740 -29498 18178 54664 49532 44378 -17036 -35226
1549 -35226 -25413 -54981 43957 13606 -14704 -8595 -56990 -3483 2925 -11931 -87052 -70956
1537 -70956 -101217 -73367 -80187 -60952 17506 44054 47358 -10376 5920 -6793 3458 -18523
1525 -18523 -79293 -64714 43514 7330 6767 10989 -11110 -27653 16129 52960 68034 85203
1513 85203 83889 133023 110869 89782 68624 19531 22956 61083 51656 58689 66450 44890 36267
$$ packed form
1599F763M0660m323J6126j6003j0199j8072k7384Q4625m7899p5985J6959K7343
1587g389L0502K8678m098K766k0161R151O2271O879l0755j170k026j3743j6365
1574D4540k8758J0446M2049j3399P193p8272j9511j9310N5104P7676o2412l1658
1562a6312L014Q102m1187n207Q472J4378p58M7676L6486n132n154o1414j8190
1549c5226R813k9568R8938l0351k8310O109m8395N3507O408j4856p5121J6096
1537g0956l0261K7850o820J9235P8458K6548L304n7734J6296j2713J0251k1981
1525a8523o0770J4579J08228l6184n63M222k2099j6543M3782L6831J5074J7169
1513H5203j314M9134k2154k1087k1158m9093L425L8127r427P033P761k1560q623
$$ plain form
1500 36267 152425 119273 23525 -14449 -30656 -72276 3933 61569 85634 69595 47622 20950
1488 20950 24959 142584 139414 118118 87148 71936 123102 109966 110604 68480 27280 27251 -38282
1475 -38282 16445 -54518 -59506 -98630 -85905 31059 73254 47069 595 18657 79726 8429
1463 8429 -5666 16799 48855 84825 37777 55971 -9498 -76234 -11559 -6556 -38339 -19647
1451 -19647 -56014 40506 106436 79624 -13630 -35924 -25812 18921 4681 -18921 -18469 -5357
1439 -5357 12412 -53548 -33471 -24715 -49946 -60460 45047 34512 -21648 -52692 -20243 -22228
1427 -22228 -26045 -557 -32705 -22186 18780 63394 30615 24698 10039 35609 -4088 -4952 64442
1414 64442 71768 66597 59075 7827 3295 -40762 -25782 116144 64510 -1110 -36885 9352
$$ packed form
1500C6267J16158l3152r5748l7974j6207m1620P6209N7636K4065j6039k1973k6672
1488B0950M009J17625l170k1296l0970j5212N1166j3136O38m2124m1200k9o5533
1475c8282N4727p0963m988l9124J2725J16964M2195k6185m6474J8062O1069p1297
1463H429j4095K2465L2056L5970m7048J8194o5469o6736O4675N003l1783J8692
1451a9647l6367R6520O5930k6812r3254k2294J0112M4733j4240k3602M52J3112
1439e357J7769o5960K0077Q756k5231j0514J05507j0535n6160l1044L2449j985
1427b2228l817K5488l2148J0519M0966M4614l2779n917j4659K5570l9697q64O9394
1414F4442P326n171p522n1248m532m4057J4980J41926n1634o5620l5775M6237
$$ plain form
1402 9352 89266 122304 100169 84266 15967 -10367 90290 41863 -36440 -6339 -5240 41797
1390 41797 41908 16670 -1031 -44609 32248 85778 84025 20158 -68907 -1525 63639 -10526
1378 -10526 81524 142760 36335 28426 38857 18314 43101 8875 41045 -19541 -13344 60808
1366 60808 85488 37066 62306 124279 97944 115932 124477 28586 -45727 369 44499 54706
1354 54706 60493 59057 23083 47269 46353 -13804 -41170 -33195 -35261 29050 -11750 -30076 -33704
1341 -33704 26918 135756 109636 70299 48381 46662 76934 53069 57097 56623 52863 12438 23486
1328 23486 6234 2373 44116 59985 108507 119815 124323 80533 104650 94591 47224 35932
1316 35932 83167 103602 59263 16866 38023 98905 137837 141721 128055 75856 88885 92817
$$ packed form
1402I352P9914L3038k2135j5903o8299k6334J00657m8427p8303L0101J099M7037
1390D1797J11k5238j7701m3578P6857N3530j753o3867q9065O7382O5164p4165
1378a0526R2050O1236j06425p909J0431k0543K4787l4226L2170o0586O197P4152
1366F0808K4680m8422K5240O1973k6335J7988Q545r5891p4313M6096M4130J0207
1354E4706N787j436l5974K4186r16o0157k7366P975k066O4311m0800j8326l628
1341c3704O0622J08838k6120l9337k1918j719L0272k3865M028m74l760m0425J1048
1328B3486j7252l861M1743J5869M8522J1308M508m3790K4117j0059m7367j1292
1316C5932M7235K0435m4339m2397K1157O0882L8932L884j3666n2199J3029L932
$$ plain form
1304 92817 63473 24820 -5409 100888 159452 114746 77083 77429 98798 118552 60383 122181
1292 122181 87553 59774 29471 14361 77341 51949 82443 31890 5555 20654 33018 36325
1280 36325 38229 -15108 13375 30089 -13680 -3521 72402 42993 37104 98645 102608 98808 -1320
1267 -1320 -15966 59667 72700 4500 31417 22755 -26016 49539 77148 68448 86413 69570
1255 69570 91827 98702 106681 -3167 -51443 -6789 86075 113292 38288 32891 -37883 -10418
1243 -10418 48793 62375 26347 -33345 -26663 38548 11023 5552 20202 9489 -56755 -74728
1231 -74728 61181 53861 10078 4930 51491 17618 -26991 -20435 35210 63007 22823 70581
1219 70581 -2589 -28077 55083 67823 82751 61836 22717 22042 2160 32252 2706 18782
$$ packed form
1304I2817k9344l8653l0229J06297N8564m4706l7663L46K1369J9754n8169O1798
1292A22181l4628k7779l0303j5110O2980k5392L0494n0553k6335J5099J2364L307
1280C6325J904n3337K8483J6714m3769J0159P5923k9409n889O1541L963l800j00128
1267a320j4646P5633J3033o8200K6917q662m8771P5555K7609q700J7965j6843
1255F9570K2257O875P979j09848m8276M4654R2864K7217p5004n397p0774K7465
1243a0418N9211J3582l6028n9692O682O5211k7525n471J4650j0713o6244j7973
1231g4728J35909p320m3783n148M6561l3873m4609O556N5645K7797m0184M7758
1219G0581p3170k5488Q3160J2740J4928k0915l9119o75j9882L0092k9546J6076
$$ plain form
1207 18782 -19685 -9598 60908 -20344 -18694 -11195 36171 66172 7398 17267 58597 51324 60364
1194 60364 22378 11902 20327 96215 120858 52389 103131 75400 70401 25938 27134 47927
1182 47927 74541 32651 35439 1934 -6476 25568 -87189 -95735 49638 68789 20728 -48119
1170 -48119 -99086 -28294 -16474 -49154 -54651 23288 12528 45032 27773 -23094 9574 32653
1158 32653 97227 13217 -28295 -35338 4357 43652 15083 123846 41987 -28503 -89257 -50538
1146 -50538 38661 71828 27982 17976 -45919 -40569 -27001 -522 67043 68478 27667 10752
1134 10752 11012 35861 23376 8798 40157 19400 -56997 -41538 1436 -24963 39174 8321
1122 8321 -10159 68128 103156 55818 -6181 -26486 24338 33354 -4699 28327 11994 20992
$$ packed form
1207A8782l8467J0087P0506q1252J650P499M7366L0001n8774R869M1330p273R040
1194F0364l7986j0476Q425P5888K4643o8469N0742k7731m999m4463J196K0793
1182D7927K6614m1890K788l3505q410L2044j12757q546J45373J9151m8061o8847
1170d8119n0967P0792J1820l2680n497P7939j0760L2504j7259n0867L2668K3079
1158C2653O4574q4010m1512p043L9695L9295k8569J08763q1859p0490o0754L8719
1146e0538Q9199L3167m3846j0006o3895N350J3568K6479O7565J435m0811j6915
1134A0752K60K4849j2485j4578L1359k0757p6397J5459M2974k6399O4137l0853
1122H321j8480P8287L5028m7338o1999k0305N0824R016l8053L3026j6333Q998
$$ plain form
1110 20992 32934 52137 82251 16863 -33969 -30856 10502 -17702 -1194 -56395 -37775 -21995
1098 -21995 -3565 -6827 37530 -47015 -18669 -41570 -66085 15334 2291 -12405 -29732 -35765
1086 -35765 6745 19983 56857 99515 36617 34676 36822 47036 -17414 -35713 -57455 10789
1074 10789 13544 -10726 -47963 -19608 -23155 -82119 1448 4096 -6179 28509 34571 -60506 -74331
1061 -74331 -29257 26656 69363 23399 38115 -8115 11193 -19470 -67552 -40094 31374 -22441
1049 -22441 -8205 -35481 -48757 22770 19334 44122 36665 96457 86218 36882 61772 32885
1037 32885 51542 77368 -34431 -11027 -18806 -82267 -93553 -43249 -8979 -39546 49103 61357
1025 61357 -3966 -18843 110 20368 35578 54023 1693 59094 -15295 -30677 29350 -2906
$$ packed form
1110B0992J1942J9203L0114o5388n0832L113M1358k8204J6508n5201J8620J5780
1098b1995J8430l262M4357q4545K8346k2901k4515Q1419j3043j4696j7327o033
1086c5765M2510J3238L6874M2658o2898j941K146J0214o4450j8299k1742O8244
1074A0789K755k4270l7237K8355l547n8964Q3567K648j0275L4688O062r5077j3825
1061g4331M5074N5913M2707m5964J4716m6230J9308l0663m8082K7458P1468n3815
1049b2441J4236k7276j3276P1527l436K4788p457N9792j0239m9336K4890k8887
1037C2885J8657K5826j11799K3404p779o3461j1286N0304L4270l0567Q8649J2254
1025F1357o5323j4877J8953K0258J5210J8445n2330N7401p4389j5382O0027l2256
$$ plain form
1013 -2906 -56897 -24845 3133 38732 10744 -2380 90312 99003 49728 72762 36230 -9747
1001 -9747 102125 44207 -29038 38636 55954 8263 52363 28101 59192 -40574 -68557 4751
989 4751 -8152 22102 -24993 -6742 17561 30201 21131 15112 -38132 -30752 -1904 42227 -6543
976 -6543 16529 42147 -25165 -3210 7893 -44556 -63879 -14311 25114 -25038 -41420 -49716
964 -49716 -43680 -657 -17510 50577 31604 -31091 -17067 -20657 19038 35793 43445 -14456 -99394
951 -99394 -32864 11156 4881 -9678 -46665 -30446 -9104 -77387 -48508 32483 60949 -38822
939 -38822 -37498 -89634 23727 -22265 -55901 46727 -12626 -3222 -29805 16859 128824 159600
927 159600 101486 79256 145777 39727 -25622 -61836 -4591 75637 50759 105020 39068 61961
$$ packed form
1013b906n3991L2052K7978L5599k7988j3124R2692Q691m9275K3034l6532m5977
1001i747J11872n7918p3245O7674J7318m7691M4100k4262L1091r9766k7983P3308
989D751j2903L0254m7095J8251K4303J2640r070o019n3244P380K8848M4131m8770
976f543K3072K5618o7312K1955J1103n2449j9323M9568L9425n0152j6382q296
964d9716O036M3023j6853O8087j8973o2695J4024l590L9695J6755P652n7901q4938
951i9394O6530M4020o275j4559l6987J6219K1342o8283K8879Q0991K8466r9771
939c8822J324n2136J13361m5992l3636J02628n9353R404k6583M6664J11965L0776
927A59600n8114k2230O6521j06050o5349l6214N7245Q0228k4878N4261o5952K2893
$$ plain form
915 61961 85356 52182 83540 71220 56664 69442 58529 29866 77136 99873 69917 13744
$$ packed form
915F1961K3395l3174L1358j2320j4556J2778j0913k8663M7270K2737k9956n6173
$$ [...]
##END NTUPLES=NMR SPECTRUM
##END=
