##TITLE=1H_CG-1206-A1
 CDCl3
 8 sc, 
 25.6.2024
##JCAMPDX= 6.0         $$ Bruker NMR JCAMP-DX V2.0
##DATA TYPE= NMR SPECTRUM
##DATA CLASS= NTUPLES
##ORIGIN= UXNMR, Bruker Analytische Messtechnik GmbH
##OWNER= root
$$ XWIN-NMR		Version 3.5
$$ Tue Jun 25 16:01:25 2024 Russian Standard Time (UT+4h)  she@DPX200
##.OBSERVE FREQUENCY= 200.1312
##.OBSERVE NUCLEUS= ^1H
##.ACQUISITION MODE= SIMULTANEOUS
##.ACQUISITION SCHEME= undefined
##.AVERAGES= 8
##.DIGITISER RES= 18
##SPECTROMETER/DATA SYSTEM= spect
##.PULSE SEQUENCE= zg30
##.SOLVENT NAME= DMSO
##.SHIFT REFERENCE= (INTERNAL, DMSO, 0, 14.9966)
##AUDIT TRAIL= $$ (NUMBER, WHEN, WHO, WHERE, WHAT)
$$ ##TITLE= Audit trail, XWIN-NMR		Version 3.5
$$ ##JCAMPDX= 5.01
$$ ##ORIGIN= Bruker BioSpin GmbH
$$ ##OWNER= she
$$ F:/spectra/data/she/nmr/H-F/1/pdata/1/auditp.txt
$$ ##AUDIT TRAIL=  $$ (NUMBER, WHEN, WHO, WHERE, WHAT)
(   1,<2024-06-25 16:00:11.71 +0400>,<she>,<DPX200>,
      <created by zg, POWCHK disabled, PULCHK disabled
       configuration hash MD5:
       00 E9 B6 7A A2 85 ED C7 34 08 36 98 17 FE 4E 26
       data hash MD5: 16K
       7B 9D 91 FF A8 E7 D2 96 B5 BC C5 3D 86 BD B9 A7>)
(   2,<2024-06-25 16:00:15.35 +0400>,<she>,<DPX200>,
      <Start of raw data processing
       efp BC_mod = 2 LB = 0.24 FT_mod = 6 PKNL = 1 PHC0 = -25315.78 PHC1 = 12.18748 SI = 16K 
       data hash MD5: 16K
       CE 2E 73 41 5D 53 23 4D 71 F0 3F 16 C1 FC 0E 11>)
(   3,<2024-06-25 16:00:34.57 +0400>,<she>,<DPX200>,
      <pk PHC0 = 2.463911 PHC1 = -5.8 
       data hash MD5: 16K
       A4 B3 D7 8D 27 A2 15 71 4B F5 AC 59 7E 78 15 C9>)
(   4,<2024-06-25 16:00:38.15 +0400>,<she>,<DPX200>,
      <abs ABSG = 5 
       data hash MD5: 16K
       C9 F1 51 66 D8 AE 66 69 03 F7 A4 C1 80 93 4A 0A>)
$$ ##END=
$$ 
$$ hash MD5
$$ E6 E9 88 AD ED E5 02 23 A0 20 84 C3 4C 50 72 D7
##$RELAX= 
##$RELAX= 
##$RELAX= 
##$RELAX= 
##$RELAX= 
##$RELAX= 
$$ Bruker specific parameters
$$ --------------------------
##$DU= <F:/spectra>
##$EXPNO= 1
##$NAME= <H-F>
##$PROCNO= 1
##$TYPE= <nmr>
##$USER= <she>
##$AMP= (0..31)
100 100 100 100 100 100 100 100 100 100 100 100 100 100 100 100 100 100 
100 100 100 100 100 100 100 100 100 100 100 100 100 100 
##$AQSEQ= 0
##$AQ_mod= 1
##$AUNM= <au_zg>
##$AUTOPOS= <>
##$BF1= 200.13
##$BF2= 200.13
##$BF3= 200.13
##$BF4= 200.13
##$BF5= 200.13
##$BF6= 200.13
##$BF7= 200.13
##$BF8= 200.13
##$BYTORDA= 1
##$CFDGTYP= 0
##$CFRGTYP= 5
##$CHEMSTR= <none>
##$CNST= (0..31)
1 1 145 1 1 1 1 1 1 1 1 1 1 1 1 1 1 1 1 1 1 1 1 1 1 1 1 1 1 1 1 1 
##$CPDPRG= <>
##$CPDPRG1= <>
##$CPDPRG2= <>
##$CPDPRG3= <>
##$CPDPRG4= <mlev>
##$CPDPRG5= <mlev>
##$CPDPRG6= <mlev>
##$CPDPRG7= <mlev>
##$CPDPRG8= <mlev>
##$CPDPRGB= <>
##$CPDPRGT= <>
##$D= (0..31)
0 1.2 0 0 0 0 0 0 0 0.06 0 0.03 0 0 0 0 0.0002 0 0 0 0 0 0 0 0 0 0 0 0 
0 0 0 
##$DATE= 1719316811
##$DBL= (0..7)
120 120 120 120 120 120 120 120 
##$DBP= (0..7)
150 150 150 150 150 150 150 150 
##$DBP07= 0
##$DBPNAM0= <>
##$DBPNAM1= <>
##$DBPNAM2= <>
##$DBPNAM3= <>
##$DBPNAM4= <>
$$ [...]
##$SUBNAM3= <"">
##$SUBNAM4= <"">
##$SUBNAM5= <"">
##$SUBNAM6= <"">
##$SUBNAM7= <"">
##$SUBNAM8= <"">
##$SUBNAM9= <"">
##$SW= 18.0517418723606
##$SWIBOX= (0..15)
0 0 2 0 0 0 0 0 0 0 0 0 0 0 0 0 
##$SW_h= 3612.71676300578
##$TD= 16384
##$TD0= 1
##$TE= 0
##$TE2= 300
##$TE3= 300
##$TEG= 300
##$TL= (0..7)
0 120 120 120 120 120 120 120 
##$TP= (0..7)
150 150 150 150 150 150 150 150 
##$TP07= 0
##$TPNAME0= <>
##$TPNAME1= <>
##$TPNAME2= <>
##$TPNAME3= <>
##$TPNAME4= <>
##$TPNAME5= <>
##$TPNAME6= <>
##$TPNAME7= <>
##$TPOAL= (0..7)
0.5 0.5 0.5 0.5 0.5 0.5 0.5 0.5 
##$TPOFFS= (0..7)
0 0 0 0 0 0 0 0 
##$TUNHIN= 0
##$TUNHOUT= 0
##$TUNXOUT= 0
##$USERA1= <user>
##$USERA2= <user>
##$USERA3= <user>
##$USERA4= <user>
##$USERA5= <user>
##$V9= 5
##$VALIST= <valist>
##$VCLIST= <CCCCCCCCCCCCCCC>
##$VD= 0
##$VDLIST= <DDDDDDDDDDDDDDD>
##$VPLIST= <PPPPPPPPPPPPPPP>
##$VTLIST= <TTTTTTTTTTTTTTT>
##$WBST= 1024
##$WBSW= 4
##$XGAIN= (0..3)
0 0 0 0 
##$XL= 0
##$YL= 0
##$YMAX_a= 243837
##$YMIN_a= -347643
##$ZGOPTNS= <>
##$ZL1= 120
##$ZL2= 120
##$ZL3= 120
##$ZL4= 120
##$ABSF1= 14.9167
##$ABSF2= -3.135147
##$ABSG= 5
##$ABSL= 3
##$ALPHA= 0
##$AQORDER= 0
##$ASSFAC= 0
##$ASSFACI= 0
##$ASSFACX= 0
##$ASSWID= 0
##$AUNMP= <proc_1d>
##$AZFE= 0.1
##$AZFW= 0.1
##$BCFW= 0
##$BC_mod= 2
##$BYTORDP= 0
##$COROFFS= 0
##$CY= -3
##$DATMOD= 1
##$DC= 0
##$DFILT= <>
##$DTYPP= 0
##$F1P= 0
##$F2P= 0
##$FCOR= 1
##$FTSIZE= 16384
##$FT_mod= 6
##$GAMMA= 0
##$GB= 0
##$INTBC= 1
##$INTSCL= 3.70164e-10
##$ISEN= 128
##$LB= 0.24
##$LEV0= 0
##$LPBIN= 0
##$MAXI= 10000
##$MC2= 0
##$MEAN= 0
##$ME_mod= 0
##$MI= 1.114404
##$NCOEF= 0
##$NC_proc= -6
##$NLEV= 6
##$NOISF1= 3.799351
##$NOISF2= 2.8
##$NSP= 0
##$NTH_PI= 0
##$NZP= 0
##$OFFSET= 14.99656
##$PC= 1
##$PHC0= -25313.31
##$PHC1= 6.38748
##$PH_mod= 1
##$PKNL= yes
##$PPARMOD= 0
##$PSCAL= 0
##$PSIGN= 0
##$REVERSE= no
##$SF= 200.130005096251
##$SI= 16384
##$SIGF1= 3
##$SIGF2= 2
##$SINO= 5.538805
##$SIOLD= 16384
##$SREGLST= <1H.CDCl3>
##$SSB= 0
##$STSI= 16384
##$STSR= 0
##$SW_p= 3612.71676300577
##$SYMM= 0
##$S_DEV= 0
##$TDeff= 16384
##$TDoff= 0
##$TI= <>
##$TILT= no
##$TM1= 0
##$TM2= 0
##$TOPLEV= 0
##$USERP1= <user>
##$USERP2= <user>
##$USERP3= <user>
##$USERP4= <user>
##$USERP5= <user>
##$WDW= 1
##$XDIM= 16384
##$YMAX_p= 372774354
##$YMIN_p= -257677
$$ End of Bruker specific parameters
$$ ---------------------------------
##NTUPLES= NMR SPECTRUM
##VAR_NAME=  FREQUENCY,     SPECTRUM/REAL,   SPECTRUM/IMAG
##SYMBOL=    X,             R,               I
##VAR_TYPE=  INDEPENDENT,   DEPENDENT,       DEPENDENT
##VAR_FORM=  AFFN,          ASDF,            ASDF
##VAR_DIM=   16384,         16384,           16384
##UNITS=     HZ,            ARBITRARY UNITS, ARBITRARY UNITS
##FACTOR=    0.220516191357247, 1,           1
##FIRST=     3001.26164858696, 0,            0
##LAST=      -611.455114418815, 0,           0
##MIN=       -611.455114418815, -257677,     0
##MAX=       3001.26164858696, 372774354,    0
$$ Real data points
##PAGE= N=1
##DATA TABLE= (X++(R..R)), XYDATA
$$ [...]
10982 -93147 -141099 -68271 -119836 7207 -20914 -9282 -4686 -52648 -73192 -48631 -110338 -29334
10970 -29334 -20334 -97703 -86896 -73073 -27823 -87544 10473 74977 111775 51862 22207 -13688
10958 -13688 -100700 -88261 -18746 16056 -68572 -56942 -13458 -38086 -16061 12694 50398 1642
10946 1642 13256 -32469 -54946 -68763 -186397 -137162 -127772 -115719 -122634 -112423 19805 122502
10934 122502 -3365 -136746 -107181 -153655 -60840 -44008 -103087 -111164 40884 -14441 -74137
10923 -74137 -15407 27513 -559 -12100 -102330 -162238 -187632 -200112 -124362 -95450 -93876 -44145
10911 -44145 -6406 -45024 -94965 -98251 -129667 -158122 -58308 -75065 -54731 -79179 -103007 -17347
10899 -17347 593 3864 -59760 -149877 -69774 -14803 -3937 -15746 163 -62941 -95440 -76196
10887 -76196 -140785 -214019 -40678 -68548 -68657 -3486 -121108 -158523 -104383 -60939 24323 -17966
10875 -17966 -72136 -34951 -35000 -2460 -68819 -94152 -27911 -54320 -144409 -134538 6365 -1718
10863 -1718 -52331 -90936 -37466 -138082 -239972 -93817 -61556 -80450 -7911 81337 109668
10852 109668 84407 -28286 -108633 -5269 101782 87957 7118 -24192 -120577 -119100 -109886
10841 -109886 -25542 -60826 -97598 -20610 -31479 -19651 -34848 37459 73051 -33744 -110335
10830 -110335 18606 -18278 -66067 -80440 -171358 -173575 -151217 -154833 -9897 -111970 -110442
10819 -110442 -22334 -55118 -76208 -92862 -56077 -54654 53033 33201 27740 18138 14078 99519
10807 99519 40473 -82465 -78036 -119048 -213849 -148556 -162157 79250 18947 -68779 -45841
10796 -45841 -33459 -30468 -103387 -93389 -38280 46992 17852 -8357 -80323 -105961 -104686 -164566
10784 -164566 -9707 21055 -39705 43601 -45478 -88807 -40103 -38143 -100200 -95308 -101407 -124810
10772 -124810 -9715 5043 8017 -69590 -47577 11837 31778 72754 -78149 -47292 -6169
10761 -6169 105299 145174 -2292 -55933 -31118 -14467 -17785 -11301 -23612 -25424 -8310 -3328
10749 -3328 -24207 -76054 17402 604 -73979 -40225 -25746 -25482 -77843 22974 33359 103940
10737 103940 -22444 -78762 -69845 85126 4137 -62776 42363 43940 85105 -22454 -23335
10726 -23335 -15332 -28148 -62689 -28 -20400 -51301 -56133 -52386 -88002 -61837 -64910 3711
10714 3711 35861 19760 40213 66337 -49380 -21935 -53741 27704 -3758 -31138 79469
10703 79469 30251 -23510 -56543 -62876 -109118 -46775 38282 -19871 12964 101071 -421 -29707
10691 -29707 -38196 -94095 -37009 -73711 -18534 112502 72961 6371 63340 171476 -4788
10680 -4788 -93746 -18898 22043 -41887 -49723 -27997 7807 5795 15510 -27833 -39000 3011
10668 3011 -42542 -70807 34472 101509 35399 56126 -17706 -58405 75132 14026 -80734
10657 -80734 76833 33526 71662 93284 149971 149391 10821 13216 -3981 -46356 -103748 -86820
10645 -86820 -25786 75817 98637 -8071 50333 1065 -7974 12859 -21151 -88666 -26675
10634 -26675 -36641 -76343 34728 16499 37509 26694 -120002 -75371 6754 37416 27877 7935
10622 7935 -32283 43123 77477 6692 -31609 71545 91633 -490 -45573 -6572 -3845 2409
10610 2409 -29944 23148 20655 -51864 108811 -2416 38552 17220 34587 -63149 -13600 3721
10598 3721 32907 117893 94986 61627 125499 17522 68757 -82 -12481 -14406 6049 67689
10586 67689 59988 62612 62673 68337 118665 29781 29721 68738 43522 -67178 -33440 55588 613
10573 613 51397 38986 46981 39234 34141 40056 78796 100565 95759 107972 59842 50991 145241
10560 145241 -46531 -106386 -72220 1865 11102 -8205 20795 -20057 -84997 -46904 -111929
10549 -111929 -36057 -2854 12897 30675 -8207 116977 153808 51989 75264 68261 9806
10538 9806 118665 117191 80597 9971 -26600 114656 104895 143526 134418 65512 44400 125732
10526 125732 10981 -35841 -26414 58679 82357 117187 85011 77141 66057 50657 41860 13528
10514 13528 59687 53946 117489 127194 13768 19884 46056 88643 85202 83538 106494 60333
10502 60333 197455 118936 190526 249854 88340 133522 136607 162957 134484 175967 178968 239472
10490 239472 167146 201867 209755 280000 385918 249272 385393 431176 525087 562020 540234
10479 540234 461356 558737 502176 572681 599014 501395 418363 436478 523035 496538 421968
10468 421968 461624 403109 372193 361849 355477 348017 373036 224679 235457 260361 138882
10457 138882 188494 168971 178803 262078 212732 192991 208566 350045 414350 317728 292502
10446 292502 210575 246937 211707 181972 172429 230565 301560 281093 152948 158896 202555 230133
10434 230133 204890 143311 156238 196693 240208 182119 166265 173617 199772 150159 136261 229660
10422 229660 247514 203181 183933 207815 228585 201824 158350 139431 229389 289678 371630
10411 371630 315995 314249 278455 143334 230044 291798 241615 193727 159760 205571 230348
10400 230348 284385 189367 149437 217090 233218 348927 351545 374850 309831 286108 223508
10389 223508 290183 355090 312763 209908 273975 280025 297797 247611 308229 391446 457627
10378 457627 312818 257519 303262 308392 300624 285284 221077 309298 339786 331309 248421 261477
10366 261477 236769 190434 188563 248709 296375 324942 286722 224988 355845 471111 386088
10355 386088 442505 428733 413915 409468 307367 485504 423837 339737 268778 358868 362070
10344 362070 395199 378549 383097 264874 273703 292712 285253 400441 425927 321217 351485
10333 351485 310645 294582 379920 391121 295029 372821 418343 408224 425014 401317 489289
10322 489289 478014 388521 420824 250056 345509 419767 446502 418947 446655 479499 471063
10311 471063 506995 532914 495981 426654 463008 572379 650710 498662 520678 531908 582771
10300 582771 612347 668430 614207 521621 557846 508803 412973 446545 408045 472250 489602
10289 489602 363736 421527 543836 528145 541448 576881 603760 675051 678603 650624 661477
10278 661477 587671 543659 587202 537655 580733 669348 628864 653693 769597 766876 756781
10267 756781 735582 736290 699744 705201 755447 756867 804477 780969 718474 646887 563457 653643
10255 653643 675983 743817 694752 693821 685906 685796 639003 638878 615988 668122 782158 709022 781990
10242 781990 752183 610688 657734 637800 695609 774790 705161 682940 720511 775161 812879
10231 812879 858933 747603 718108 733322 742314 769089 776279 617020 667962 772753 865571
10220 865571 874332 876599 776110 963496 915187 885902 855065 903702 1041885 976080 875914
10209 875914 800936 892780 945062 1042683 1008993 989201 1067296 1068756 1085979 1076186 1159715 1231488
10197 1231488 1214841 1195942 1219104 1352969 1396660 1281938 1238900 1343188 1307302 1232338 1201720
10186 1201720 1310675 1413599 1403968 1394484 1416055 1409378 1436343 1417895 1479442 1500370 1416200
10175 1416200 1454738 1519362 1514025 1462387 1554915 1512048 1459817 1564966 1689964 1772850 1716617
10164 1716617 1644750 1791751 1834407 1780983 1784217 1872625 1962625 2083113 2124627 2014070 2122028
10153 2122028 2222509 2285210 2283306 2325744 2320678 2375615 2496930 2555504 2612434 2722143 2798998
10142 2798998 2758864 2740578 2720370 2705920 2864908 3026435 2986027 3009820 3170250 3205580 3271884
10131 3271884 3435076 3534785 3586920 3690015 3776796 3784228 3997916 4037234 4012180 4124072 4104879
10120 4104879 4162317 4263951 4278342 4300730 4444627 4413091 4485457 4604138 4735410 4751052
10110 4751052 4768038 4893996 4931262 4972695 5100984 5209910 5351216 5499749 5628561 5608257
10100 5608257 5679066 5873754 6026810 6163876 6254374 6418138 6700200 6966314 7088468 7204999
10090 7204999 7386077 7706524 7901610 8089291 8374937 8648195 8855411 9011049 9240521
10081 9240521 9624774 9946576 10208896 10719463 11126850 11376868 11861449 12368276 12875989
10072 12875989 13469347 14096549 14649642 15169398 15927631 16847784 17918486 18955896 20055785
10063 20055785 21302873 22744209 24444201 26156611 28055083 30232563 32629292 35310966
10055 35310966 38274944 41438091 44898417 48707610 52669198 56875692 61025534 64902367
10047 64902367 68339517 71356552 73296538 74359411 74292377 73070669 70838117 67643736
10039 67643736 63768470 59491696 54919282 50529723 46267177 42224117 38740584 35399501
10031 35399501 32559950 29975856 27679048 25574350 23680100 21973131 20557266 19293119
10023 19293119 18168411 17068725 16142086 15257736 14591003 13856847 13222033 12717531 12134690
10014 12134690 11708392 11196697 10674794 10276525 9805749 9296985 8931534 8568243 8257456
10005 8257456 7843059 7443109 7090595 6627672 6418992 6209471 6056154 5821995 5587640
9996 5587640 5400862 5201968 4956618 4795328 4673637 4487342 4367193 4200538 4030475 3917790
9986 3917790 3887246 3714363 3596925 3530862 3337769 3315195 3222194 3017599 2990800 3021809 2898388
9975 2898388 2691087 2618884 2571311 2398646 2375227 2429449 2387393 2285018 2210019 2198670 2079341
9964 2079341 2079045 2108840 2050263 2083375 1890943 1789132 1866914 1836715 1828293 1884231 1851516 1846484
9952 1846484 1808119 1806533 1735099 1647705 1678085 1697419 1619030 1484362 1402409 1372377 1410521
9941 1410521 1409930 1357874 1387339 1322411 1330474 1323774 1317746 1260457 1200359 1196022 1196703 1254955 1192247
9928 1192247 1140781 1125016 1292734 1360825 1265692 1166363 1125397 1075510 1008836 985714 947276
9917 947276 954922 1064838 969922 968148 972851 910899 874275 915495 843952 828395 878811 962655
9905 962655 806642 749766 747856 861487 834981 793987 735003 744873 791648 699988 592382
9894 592382 558465 604655 485368 606938 638531 625079 693757 784774 773497 736401 774328
9883 774328 825005 764891 817874 803706 826867 888714 860201 842020 708834 650006 654741 757254
9871 757254 644584 688384 735053 699665 612300 703134 825710 814842 838143 726237 819646
9860 819646 833582 742233 767486 823716 939343 975988 992285 949344 1034039 1078146 1063149
9849 1063149 1069496 1010184 935872 912008 847104 819646 820533 770501 775603 802721 756642 796247
9837 796247 821890 690914 694329 658091 652299 663120 649000 515957 558920 621067 613040 664921
9825 664921 697279 667725 617564 717753 709733 625694 662679 645557 568306 622965 730311
9814 730311 704492 682797 720347 741208 740820 691934 638985 805939 904664 929262 869160 999944
9802 999944 1017194 1061055 1069409 1162044 1205665 1206778 1343312 1373707 1355137 1315434 1184559 1127290
9790 1127290 1066229 1006610 991785 1019125 964054 926159 957343 1043127 1077538 1160693 1276898
9779 1276898 1290732 1357556 1416818 1360102 1413469 1330001 1255630 1253747 1191798 1184889 1073847 993815
9767 993815 1022271 1153917 1112955 1117329 1060374 1075926 1128229 1176673 1326390 1389366 1376228
9756 1376228 1504114 1626879 1554506 1452832 1430295 1322544 1333490 1274792 1264889 1221108 1176368
9745 1176368 1161281 1176103 1212214 1235281 1260298 1209844 1270464 1260975 1316078 1423666 1455550
9734 1455550 1383478 1422241 1415409 1335947 1263076 1199464 1182508 1175805 1129925 1038918 992391 985470
9722 985470 1065509 997983 963988 1049470 975922 928393 1090324 1067632 1052259 996330 1005389 1030774
9710 1030774 1032708 1032299 965673 983305 1031986 953861 888062 873213 957675 945515 1107068 1139472
9698 1139472 970329 925033 958550 1056809 992034 979736 946813 975074 964409 1079606 1148864
9687 1148864 1092285 1052650 1075325 1054088 1042753 1068120 1039394 952970 1068979 1162984 1219464
9676 1219464 1161704 1149652 1152808 1069115 1045120 984798 1057727 1059551 1077929 1134651 1258882 1246178
9664 1246178 1241098 1282464 1370008 1266989 1248937 1336403 1399132 1371487 1298757 1325756 1337577
9653 1337577 1270770 1303320 1354085 1337516 1353796 1419442 1496155 1448868 1450084 1493189 1541212 1509584
9641 1509584 1496445 1563182 1628171 1730089 1634387 1684643 1583005 1629584 1707848 1721234 1793657
9630 1793657 1839565 1786773 1726357 1794240 1835136 1887511 1993593 2179628 2127776 2131942 2180060
9619 2180060 2196166 2084578 2187209 2254399 2414920 2405896 2442428 2497682 2592322 2638943 2639307
9608 2639307 2697281 2709848 2668984 2634607 2693391 2813663 2758106 2816127 2920661 2874934 2995800
9597 2995800 3061080 3064362 3051014 3101228 3063538 3163239 3187530 3268778 3339150 3300821 3333485 3377545
9585 3377545 3485396 3446141 3508339 3571678 3607566 3639450 3801069 3941398 4007590 4121602 4303052
9574 4303052 4462716 4485431 4702818 4941471 5235809 5516645 5576113 5853720 6185644 6577887
9564 6577887 7032027 7471871 7917969 8377349 9050907 9706396 10379296 10871314 11303810 11582811
9554 11582811 11763880 11932504 11925737 11934864 11783494 11455615 11209950 11031075 10929051 10696670
9544 10696670 10404780 10166536 9744405 9476265 9146087 8874781 8795671 8753663 8825065 8938678
9534 8938678 8990810 9066320 9367884 9710164 10145082 10608259 11117997 11914837 12741264 13316488
9524 13316488 13839851 14128437 14135254 14063534 13886276 13698747 13534241 13368725 13208450 12891303
9514 12891303 12490715 11952589 11330668 10450331 9543838 8873354 8284202 7811727 7314900
9505 7314900 6917576 6646751 6360963 6066004 5863155 5623377 5521031 5299195 5253835 5173340
9495 5173340 5046298 4968463 4925637 4961709 4871224 4793044 4720643 4659624 4500573 4461429 4474292
9484 4474292 4440133 4364018 4363064 4380611 4283403 4272070 4235812 4261330 4111196 3979689 4042031
9473 4042031 4022466 4105740 4067174 4018977 3964815 4039325 4047196 4145692 4202310 4270827 4312181 4273235
9461 4273235 4285548 4278654 4231333 4313303 4419528 4475780 4406763 4497949 4507648 4585300 4582631 4613188
9449 4613188 4678890 4551476 4495059 4471568 4437763 4495280 4504487 4618427 4697023 4794948 4896853
9438 4896853 4895179 4907996 4973491 4982169 5012752 5148009 5267872 5330900 5353334 5444109 5486453
9427 5486453 5727326 5860229 5995374 6029081 6094335 6246722 6406413 6439204 6558172 6599786
9417 6599786 6764047 6871559 6897313 7056501 7222196 7373863 7580936 7814264 7978865 8242856
9407 8242856 8600554 8884960 9164361 9616523 10170707 10714382 11370219 12010298 12611063 13173075
9397 13173075 13803612 14695032 15628664 16461073 17401759 18405961 19509874 20889406 22328687
9388 22328687 23710329 25525598 27606642 30261886 33131839 36734131 40575147 45064500
9380 45064500 50481460 58232835 67837747 77906536 80558806 74668838 65468747 53546928
9372 53546928 44590501 38141653 33136714 29539155 27072929 25543364 24445289 23226916
9364 23226916 22137931 21190795 20389135 19638636 18970003 18173561 17480628 17007628 16507187
9355 16507187 15925981 15340519 14776005 14178700 13549211 13007152 12493205 12067063 11795455
9346 11795455 11419468 11056412 10861467 10653558 10465736 10279088 10188311 9829413 9611944 9613490
9336 9613490 9608257 9447050 9510502 9541320 9420501 9477965 9466208 9498706 9556910 9669938 9658957
9325 9658957 9741728 9800236 9789003 9555811 9423985 9278257 9351790 9291368 9322989 9360606 9279800
9314 9279800 9120172 8935361 8782596 8618263 8552873 8536846 8487640 8620869 8736106 8751549
9304 8751549 8914200 9046040 9228280 9394266 9712141 9836477 10067255 10478708 10830618 11157231
9294 11157231 11400804 11614083 11718908 11960022 12168110 12380270 12665908 12827349 12781661 12715272
9284 12715272 12623072 12534764 12452058 12199116 11906476 11619365 11363873 11018073 10857270 10757106
9274 10757106 10705226 10626643 10782341 10775931 10765652 10847405 10994543 11191399 11354436 11437780 11353370
9263 11353370 11181700 11090365 11014284 10866294 10994458 11003567 10866224 10687953 10462931 10292378
9253 10292378 10285421 10274174 10323295 10274833 10425867 10663940 10974252 11468565 11898661 12313312
9243 12313312 12833630 13455927 13965386 14427679 14850308 15253194 15770289 16284585 16854631
9234 16854631 17205826 17376242 17206659 17034492 16926244 17007423 17230501 17394502 17585405 17769770
9224 17769770 17907592 17835282 17746149 17551302 17188977 16859829 16659532 16741726 17012979 17401788
9214 17401788 18120103 18837062 19564869 20296857 20868595 21445008 22094050 22484182 22707929
9205 22707929 22903923 22966617 22986295 23004186 23058820 23051461 22778581 22213184 21520573 20630095
9195 20630095 19652308 18762048 18088022 17611797 17215124 17000245 16752947 16545119 16391398
9186 16391398 16389236 16599471 16875246 17348499 17863784 18380894 18629213 18750834 18826573 18825179
9176 18825179 18719724 18691725 18669789 18739926 18809809 18737799 18877182 18915824 18716485 18420292
9166 18420292 18013193 17350670 16665781 15807886 14911789 13945851 13094040 12139266 11417447
9157 11417447 10789123 10111558 9725375 9319959 8870668 8662249 8537427 8378542 8351936 8260820
9147 8260820 8160909 8091601 8057042 7889576 7664963 7523004 7417483 7379449 7213714 7110526
9137 7110526 6889428 6575055 6298880 6017595 5736565 5483744 5212211 4955368 4622252 4469734
9127 4469734 4389137 4035704 3846509 3874902 3810404 3647358 3477076 3348724 3201326 3118829
9117 3118829 3127470 2991894 2985404 2990133 2955055 2854774 2782036 2773444 2708395 2733527 2614920 2452391
9105 2452391 2548049 2494517 2397244 2345242 2278903 2334458 2365829 2304005 2156197 2086033 2133183
9094 2133183 2032489 2156818 2186194 2114450 2143914 2107512 2056165 2090104 2045842 2005946 1993949
9083 1993949 2002663 2009786 1908028 1880207 1855653 1861785 1830596 1764200 1702589 1771861 1831637 1946967
9071 1946967 1959777 1774638 1706452 1737114 1801106 1717834 1677953 1688737 1686503 1739938 1661491
9060 1661491 1689197 1796441 1872329 1833469 1827980 1803246 1725576 1824944 1827528 1804550 1829850 1858020
9048 1858020 1840795 1925755 1809380 1730262 1741659 1813661 1944787 1989467 2049727 2185237 2243613
9037 2243613 2218420 2256939 2228679 2260851 2387783 2543516 2559584 2579716 2524923 2617628 2702859
9026 2702859 2688649 2840807 2964350 3059543 3124724 3323154 3346573 3465139 3655078 3765209
9016 3765209 3874244 3872924 3795844 3674825 3578700 3523503 3596042 3489491 3517986 3579743 3700433
9005 3700433 3750997 3755357 3733386 3552617 3417278 3292040 3072164 2997263 3194443 3093585
8995 3093585 3083864 3187271 3315193 3358784 3375393 3460360 3427459 3455309 3537626 3527785 3591116
8984 3591116 3737743 3873134 4030585 4319638 4509164 4689636 4851225 4990173 5155225 5163260
8974 5163260 5126136 5036062 4934807 4775801 4616412 4539050 4597701 4604453 4601927 4479407 4475654
8963 4475654 4437192 4269677 4063676 3813469 3477249 3297302 3072233 3028343 3109761 3068783
8953 3068783 2965371 2992736 2879150 2907880 2828421 2738257 2687931 2608415 2604162 2587790 2576941
8942 2576941 2463636 2516169 2600824 2724417 2732073 2844862 2900307 2949510 2973013 2891493 2811817
8931 2811817 2852055 2688090 2602828 2492815 2454665 2442081 2443776 2545465 2614040 2547264 2538394
8920 2538394 2404959 2186077 2131730 2002545 1916371 1804755 1653933 1519658 1497808 1455866
8910 1455866 1507484 1488241 1556032 1515210 1450748 1416705 1461670 1484963 1444015 1402832 1404402 1449807
8898 1449807 1432255 1464728 1426554 1411947 1243114 1068443 986240 1017486 976385 1013998 1092088
8887 1092088 1045045 890540 898740 915770 873153 920424 978620 928252 849533 783847 732536
8876 732536 847729 825369 756506 778671 710561 718028 787042 774930 698616 660512 827060
8865 827060 888906 912468 860871 756066 866724 857854 819573 849435 714278 715346 725291 692894
8853 692894 769024 794735 712888 697764 744030 781008 789809 628040 477414 503820 598860
8842 598860 559278 673129 681703 653524 565815 530630 510265 605019 691480 605284 630104 667841
8830 667841 643591 698143 673330 594294 624000 547598 562330 595323 604575 552602 595874 693851
8818 693851 637919 581724 642977 645445 599682 620813 688788 622511 466363 462914 544749 511146
8806 511146 549729 453544 479500 557889 490819 574502 596987 541812 481634 438773 464591 538447
8794 538447 571230 567901 512194 480013 585403 589354 648242 664073 554531 603364 653075 593328
8782 593328 591029 495800 432978 397726 414151 424857 388537 397970 396016 477248 417890 492899
8770 492899 582059 530707 449630 375398 348644 334748 420506 357420 309478 461649 379433
8759 379433 382815 545879 348262 299861 389352 419444 471651 440562 433145 432086 475443 572173
8747 572173 565765 503189 492975 441022 502942 526370 546214 576360 468915 421134 480051 408416
8735 408416 388133 460269 438650 502046 434582 357745 397867 446711 410495 400403 397335 372035
8723 372035 330277 348960 329441 362728 345008 286415 522084 464854 448405 460618 548075
8712 548075 537668 582087 650934 618523 670014 722486 791913 812415 886439 977749 951236 1118521
8700 1118521 1353086 1303260 1406255 1440319 1453033 1430033 1302772 987916 866646 833523
8690 833523 765145 771729 602887 550685 566385 484735 525176 516740 501104 400116 423094 380395
8678 380395 292428 201757 142211 169596 280515 302258 371709 318165 311733 440200 366839
8667 366839 318880 233594 279286 269179 338396 363495 348367 237728 217845 221887 208086 207420
8655 207420 259688 150394 135642 258338 295854 329792 218686 156822 131327 190005 218069
8644 218069 171265 204703 250332 259778 211715 117316 84079 211380 127116 133899 140891 116527
8632 116527 202567 278418 187042 204571 141145 149272 226348 171092 118928 92466 230145 212490
8620 212490 145496 115431 125239 79963 105180 300017 323092 167671 191877 221984 208411
8609 208411 205221 154103 186467 274378 231313 105376 105985 134473 128325 123061 121699 177037 205776
8596 205776 135924 79520 159426 150245 107989 152167 166573 165093 127918 159817 167035 124251
8584 124251 164366 132869 204119 178616 162633 141213 146281 119626 108232 105096 85911 -4232
8572 -4232 -78647 77743 125519 166190 63266 45771 103881 1374 42384 43352 147291 132559
8560 132559 97437 67897 83604 131445 138126 169685 191689 83267 60600 14360 -68449 79199
8548 79199 28983 71414 78579 79647 207244 78402 24531 173803 40348 -7147 22451
8537 22451 76867 109177 103877 18897 -81088 -16129 -19567 78538 119182 56580 50040 75107
8525 75107 37704 -69713 4413 -29033 134302 158642 49425 130323 154855 136408 104942
8514 104942 161738 143601 39643 -30924 36936 125604 109676 122555 158496 22774 41678
8503 41678 93372 24051 781 -74452 -88674 72681 513 -52356 52063 20061 15023 -30652
8491 -30652 -78459 -48856 3708 76125 696 -60598 -60490 -17159 -82771 -80689 -27976 3170
8479 3170 57618 11200 7735 -48350 -86482 -44905 -13543 -28145 -20623 62131 131046 35381
8467 35381 -20391 -118791 -136537 -145427 -135960 23750 16184 -27391 -88362 -87897 -28703 -67851 -62485
8454 -62485 -94508 -65011 -52000 -35520 -9353 -33831 -62584 -25677 39206 -21260 -69963 -79415
8442 -79415 -54637 -92541 -66614 -58474 -83187 23818 76253 38464 83814 -6662 2994 -59954
8430 -59954 -46363 15121 -45993 -9087 -14462 -52873 -15431 -31153 -47521 1996 98103 96491
8418 96491 -24217 -64069 -23504 71888 68314 11612 -63715 35976 -58316 -80948 -26193 6060
8406 6060 -70227 -81892 -76184 -90184 -61103 -12741 -37220 -38675 -18107 -5776 -39344 -17079
8394 -17079 -19124 -46477 -72676 -86853 -79137 -100011 -188273 -202294 -105760 -40614 -79226 -117697
8382 -117697 -23532 -36043 -48339 -124594 29087 52614 -28793 -106086 -135656 -137063 -135274 -45975
8370 -45975 -24509 20270 -39568 -19482 -3064 -71046 -61840 -46019 1080 -63993 -26225 85723
8358 85723 133145 -19606 7736 31552 -8696 74855 15427 -69232 -7104 -6852 -28962 -47275
8346 -47275 -45710 -91778 -53383 32371 -63507 -44035 -8979 104000 115772 44861 28491 -11531
8334 -11531 -164731 -35594 82283 -21609 21191 -61472 -85013 17361 71787 79396 176954
8323 176954 108971 48762 -47425 -49568 -26581 -24180 -50773 -144179 -114447 -43478 -122138 -64524
8311 -64524 -7623 -57510 -23798 848 43483 -79379 -27407 -36280 -43695 15672 -7084 18495
8299 18495 20660 -19115 80318 52967 97065 151252 46116 5358 49720 -31462 -51560 31101
8287 31101 -54497 -23143 57482 74737 26894 -3693 15281 -35767 -30683 -26240 12316 56721
8275 56721 -51906 -54371 -38025 22851 34248 -6274 55494 1092 -45315 9031 135366 124946
8263 124946 67713 43740 115090 270123 117139 -44057 -100433 53768 120731 48374 82650
8252 82650 -46172 -16590 -9700 -42036 -20129 71847 41519 -52183 18839 -6783 7359 53333
8240 53333 122044 93784 102173 22181 25636 125048 149860 59040 48432 125261 60234 92533
8228 92533 16077 9955 -39202 17361 31873 15012 19095 -67608 -20133 -19287 38746 106363 38509
8215 38509 51912 31686 81313 -10908 -19973 59744 56160 -60950 -116843 -54163 84104 24787
8203 24787 19754 -22137 18976 33929 69870 -23600 59526 127672 250897 365681 1119483
8192 1119483 1471452 -105751 -157684 -162889 -171622 -142106 -158221 71030 70270 16152 -133638
8181 -133638 -26816 57874 -26316 -70352 -69683 -35477 503 -50998 -26394 -19391 -66149 -75813
8169 -75813 -75947 -74557 -128740 -61707 25360 18947 -124992 -129857 44776 -62795 -56301 -24542
8157 -24542 5329 32870 11696 -89313 36350 35394 42527 4033 107146 20420 -35825 79856
8145 79856 8211 110826 177015 283156 217909 21184 -33884 -57559 -115437 -185851 -123088
8134 -123088 754 -5932 31674 6512 -50830 -17917 -16472 35145 -50703 -158042 -19775
8123 -19775 35375 -73663 -150000 -37804 -7322 -49739 72392 127631 7307 37297 -44244
8112 -44244 -105714 -99929 -127727 -106637 -98616 -31304 -39108 43626 77104 49220 8035 58641
8100 58641 -18427 9716 122642 -80117 -186103 -177707 -40637 53679 41726 58269 67888
8089 67888 24247 20126 -20582 -49850 -63616 -25619 41977 27756 -39094 33635 4344 104614
8077 104614 -27275 9506 28069 98218 46693 -45151 27916 -817 -4093 -10818 -25928 -46239
8065 -46239 7396 -60324 -79020 -92818 -106100 -95432 12308 7570 82717 47509 87099 37389
8053 37389 73508 69708 -71042 -181423 -91191 -67185 65367 49836 -14826 -94592 -173888
8042 -173888 -154266 -110541 -24778 58404 59025 58616 -57890 -154768 -33304 56310 -46599 -41067
8030 -41067 -105750 -214707 -80309 -26854 86492 85527 -22786 4578 -1606 -91173 -80910 -98541
8018 -98541 -79371 -83883 -105243 -37037 -39246 40112 -13136 -64928 -10719 -5045 -86203 -48810
8006 -48810 -56905 -48315 17880 44917 118484 -15573 -83584 -54163 -138103 -119109 -49532 34956
7994 34956 89218 -1564 49390 42740 27896 47680 53659 -23720 17987 54112 -62242 -57161
7982 -57161 19769 11547 87097 50737 -24539 -1836 97266 95073 72542 -24087 -1336 9347
7970 9347 -6820 -73157 -68982 -51402 -43093 -46832 8328 59361 74433 75374 83711 -5323 -57704
7957 -57704 39097 94451 5637 -6 40257 44171 -28850 -90844 -133613 -42744 -67716 -64060
7945 -64060 -18515 48427 84530 38476 40306 3489 -82455 -140303 -87673 -80281 -85301 -55693
7933 -55693 -11109 -20155 21051 -79142 -91321 -126246 -82778 -74334 -56718 -80463 -23970 19323
7921 19323 -16879 -43818 -57954 -100332 -36663 -37408 14628 -32804 -58162 -19460 -79412 23187
7909 23187 42437 -23564 -36369 5932 -27158 -61832 -68348 -152988 -184915 -61629 -98359 -59376
7897 -59376 -33672 -42985 -7740 -11620 54173 85645 121841 36025 45849 39089 36435 45524 138039
7884 138039 127773 174971 54378 -36087 -81778 -44811 18478 108244 150197 80998 69273
7873 69273 54620 116000 30621 59244 110522 118122 184319 142106 92690 89024 51992 13918
7861 13918 85781 202222 117325 59461 -9516 -38213 95731 121844 161736 170094 146798 141078
7849 141078 120024 208611 172285 133305 162078 177250 145580 38306 28988 31021 56406 168751
7837 168751 64775 -37743 -12308 -15403 -24760 181499 161835 93726 37412 145527 180627
7826 180627 125571 108079 30223 18523 157186 137727 73400 91242 74419 122157 6790
7815 6790 77809 -45773 27112 -36903 -109811 44279 -55252 -23540 -19253 17939 44241 2477
7803 2477 61038 69335 77643 76469 10496 20279 -60194 -61092 -3704 91471 107262 61138 127363
7790 127363 154517 148801 104572 12737 -26703 6830 51752 35151 9259 3814 -81408 -97119
7778 -97119 -33912 -29108 7104 -37013 -44460 -4218 109913 39460 -77885 -15595 -42206 15392
7766 15392 114087 188893 127003 26462 -11864 8743 12993 -1373 34406 -23831 32324 51873
7754 51873 38365 25088 -97915 -27300 -29803 -33519 -48280 -9765 20027 -11411 64163 130197
7742 130197 139039 133482 59727 24547 11944 -2613 -108603 -119379 -125970 -95203 -53105 21079
7730 21079 47680 7530 33719 -20158 119930 78991 33872 -16385 -29941 -16031 59512 39884
7718 39884 -23914 -2881 -37223 -21562 -1144 -8371 -43732 -63318 32353 27214 85121 -4481
7706 -4481 -68817 76831 -56363 -90867 6549 61427 33422 -33043 -35183 89817 107762 123958
7694 123958 62470 -15962 -54111 32907 -11821 49775 71279 21428 20700 6966 3398 19009
7682 19009 162918 170514 65794 -109518 -61640 -8902 54503 203048 185933 210045 237243
7671 237243 275511 194180 164294 171019 107031 126515 38540 30450 48264 191709 241243 222486
7659 222486 189652 166937 192315 157034 181646 291980 249508 282095 227297 132801 189147
7648 189147 345050 348612 265945 176985 175014 227773 249953 237951 245973 182172 218072 354312
7636 354312 357422 253847 118770 170903 158420 130988 224801 191291 112266 94861 32105
7625 32105 60765 62836 136216 179877 86287 -3056 148652 228814 150503 123666 243525 219934
7613 219934 139357 50421 188726 185246 70154 60677 133841 206611 165929 -50583 -85443
7602 -85443 97109 237373 116732 76850 114064 106683 124462 73121 40653 79162 44582
7591 44582 71783 146421 94253 67461 19443 38529 -52725 17280 -37890 -54090 -17778 27020
7579 27020 94315 144682 124551 68837 67527 120449 133969 128985 69546 24372 78412 -18004
7567 -18004 -33885 37534 29025 -56259 -28599 105588 50742 45644 53167 43549 89899 77420
7555 77420 19024 92359 175760 151189 107448 120095 165144 163970 70144 95183 100717 154869
7543 154869 7482 -9320 -17648 -22745 22195 -22306 -52460 50607 119193 108836 131013 15775
7531 15775 -78281 -113181 -49421 -37195 -6931 77355 84215 -1451 111007 86365 3418 -42615
7519 -42615 1811 38420 159685 159974 98529 94129 33618 74788 33086 12215 -6286 35729
7507 35729 174348 152659 162709 62978 -22756 -30150 -34467 -37839 -41263 8076 117262 231243
7495 231243 97953 41310 58025 30939 6282 30489 67470 30757 53633 50580 22834 113865
7483 113865 162866 46595 72872 -55671 -75095 46371 181958 155364 99903 123343 95016
7472 95016 54970 28532 44281 37560 85885 45898 -15672 21749 122477 51458 149884 180768
7460 180768 131992 176483 221671 383995 456959 475334 407646 246633 248630 91503 48484
7449 48484 14324 -29561 49972 113042 96689 9821 -19845 46460 136231 176560 176348 161823
7437 161823 52428 83902 134076 167165 121294 40150 23106 25848 45826 -445 34865 30783
7425 30783 24634 44173 -4702 33352 70573 115149 29961 66067 68303 25124 54731 19596
7413 19596 63132 110373 181191 100238 179133 171935 100922 132790 126066 58781 57725 18328
7401 18328 73396 156747 117849 82234 180578 156813 114762 145875 130954 197982 178223 63778
7389 63778 27274 -17879 53725 151769 154574 73783 140329 128346 86403 110662 61692 28193
7377 28193 27419 28552 17377 27571 4832 47632 210802 190564 141874 79204 78959 90898 130907
7364 130907 275078 220770 249981 301277 159348 138169 286906 282807 151441 207835 269570
7353 269570 155223 188651 208083 254499 278142 142472 151250 179794 224143 219462 173760 134551
7341 134551 83735 63826 130032 134758 120389 112301 166029 157390 50980 86035 50822 109140
7329 109140 145652 169588 75808 59520 28825 129216 123609 141334 135985 86888 103852 133197
7317 133197 70856 92427 153241 92949 28106 153101 151217 183888 144817 80102 185015
7306 185015 99745 165520 61766 117290 131067 38895 88721 94728 106872 160505 150872 89720
7294 89720 14604 -914 65174 122744 158021 158484 199865 133355 95270 205290 202087 75055
7282 75055 -2940 22415 56674 3568 65544 94773 105502 115539 34485 195022 165752 124032
7270 124032 128770 177893 103019 113007 105631 62236 44551 61006 219501 213076 208203 136118
7258 136118 196396 195344 193560 178503 260028 306771 202574 117840 143182 210183 192536 197076
7246 197076 145473 110158 190388 246435 209697 132773 172447 236054 274924 233360 262412 320462
7234 320462 286958 165204 83999 116772 99159 110348 50665 70694 108295 74864 34319
7223 34319 5679 129539 265340 233254 143417 60951 5673 84795 18178 5292 106108
7212 106108 126587 102584 83289 105882 155126 241866 155280 52932 20181 -45143 3455
7201 3455 171160 142767 111689 130765 115357 8405 45551 99837 131211 213304 150754 216389
7189 216389 137838 40601 133016 130541 116869 114772 125785 49718 86974 63298 160171 80784
7177 80784 64505 104647 149916 137076 118900 118800 -3219 -17528 92390 141206 55295 30643
7165 30643 -11926 36314 23733 108176 278416 305727 179368 47757 79118 173879 215781
7154 215781 142728 100457 132480 138765 181135 111988 50564 72865 118791 25780 16158 22254
7142 22254 -4440 60533 81947 -6616 3388 122911 108296 126343 148554 160093 184483 261057
7130 261057 209968 167579 196520 149177 218558 162449 152128 222054 176267 135211 149551 242933
7118 242933 273694 229764 182566 208786 225330 96559 119889 83006 225292 255903 291798
7107 291798 218800 181630 130500 9688 156184 209318 180885 212868 222650 186721 273051
7096 273051 264772 287090 256193 55454 124530 208744 232007 392606 340333 251787 232026
7085 232026 218988 283729 158325 92253 213893 194280 152617 137193 141511 160124 209195
7074 209195 182101 69915 58683 79366 50443 134986 281997 282154 239093 274435 244609 238887
7062 238887 253368 250050 230978 315027 180176 190280 168236 128749 142848 229700 285184 205150
7050 205150 237078 265302 226739 174901 262402 160185 145799 240963 286680 260945 273983
7039 273983 191286 293498 330034 291311 352294 162912 127502 259781 385890 389306 284440
7028 284440 193828 371634 366663 352829 370119 305133 268727 321094 360916 261365 326692 381337
7016 381337 434032 447015 452751 388030 319523 414806 466478 419260 342962 255122 164114 137068
7004 137068 186702 251206 263616 210563 214221 200419 318176 385515 330986 289768 309002 244752
6992 244752 231684 215011 283812 195887 194347 215969 188959 239963 246174 307482 349334 192647
6980 192647 221902 272334 244341 310495 336755 315187 299397 360656 361383 380311 381239 191646
6968 191646 203362 270164 273870 385548 364196 346472 375355 317878 258080 357844 345046 419436
6956 419436 447561 386265 284395 384523 464856 427814 456069 447070 450368 439955 439555 493520
6944 493520 462323 453713 280874 303935 360238 384111 385267 366104 364739 391073 414039 460480
6932 460480 409299 474271 545297 484206 369443 436550 460373 399081 460907 503139 396739
6921 396739 373295 336123 346623 373391 417422 514826 520834 399686 369694 392205 383541 340120
6909 340120 415645 492358 510606 519190 500629 512551 467054 569870 476795 525239 508284 476295
6897 476295 471261 417494 376651 499697 492142 497080 462630 406881 422251 490689 583630 560495
6885 560495 435448 377311 349333 424115 400326 582011 579706 465664 518731 564765 507905
6874 507905 439411 379481 412001 467282 488361 534128 581081 494708 437122 538313 528214
6863 528214 589075 508157 476429 472721 490762 538657 591582 609099 509449 530792 536037 410913
6851 410913 397806 432871 545420 463888 472631 495931 548503 537339 576063 631397 520754
6840 520754 532547 567382 604141 532134 567019 552510 665318 687809 674758 613681 570655
6829 570655 507993 572395 577669 643080 804825 786870 719849 699432 702558 753312 731767 623560
6817 623560 724429 631423 563071 599205 447236 455100 556545 458625 521023 671400 662807
6806 662807 620450 503775 531159 650850 613356 697110 709677 721560 760032 750769 691685
6795 691685 704709 752412 746064 795542 808023 844048 882814 769801 814731 789803 831955 768390
6783 768390 848449 861731 724614 713991 776157 817073 711402 777959 872660 919503 935915
6772 935915 1006574 1045826 994298 963767 961944 988532 1066774 1093334 987683 922238 966928 1001533
6760 1001533 1087446 1053644 1072344 1030773 1016704 980642 934277 927646 983930 1083749 1071092 1053400
6748 1053400 1024085 967126 1044213 1115162 1138080 1144965 1056346 1142843 1132825 1177928 1173621 1125344
6736 1125344 1118471 1188865 1222343 1236278 1155840 1202781 1211207 1155424 1274154 1316377 1268617 1210112
6724 1210112 1216986 1188283 1241934 1254262 1173179 1204842 1149443 1157180 1242903 1395292 1400864 1336296
6712 1336296 1189204 1295262 1365941 1312580 1290710 1292964 1341346 1386535 1329110 1295554 1472513
6701 1472513 1379018 1374353 1377906 1422192 1463234 1480592 1516458 1505787 1400638 1536751 1586060
6690 1586060 1624143 1615633 1610102 1564798 1546989 1668109 1487316 1461890 1621226 1663551 1732814
6679 1732814 1786453 1697070 1668541 1706267 1642250 1733534 1782843 1736144 1757711 1776134 1751893
6668 1751893 1834850 1890002 1940015 1859045 1812124 1929890 1936461 1933500 1977062 2045102 2026630 2051490
6656 2051490 2167763 2278896 2193617 2205787 2299936 2236871 2347744 2416071 2322641 2365693 2379089
6645 2379089 2431468 2547632 2474625 2470664 2665754 2776693 2774477 2829747 2971860 3030320 3080435
6634 3080435 3310046 3404184 3457312 3644971 3884287 3973077 3944355 4088280 4241974 4431897
6624 4431897 4663035 4935548 5174372 5430434 5842139 6137328 6499357 6785408 7023424 7137918
6614 7137918 7253801 7070839 6830665 6690967 6414401 6156844 6112934 6186230 6175254 6132294
6604 6132294 6112035 6278660 6410688 6524490 6659544 6809355 7051345 7452721 7790580 8227632
6594 8227632 8746552 9284191 9862167 10497106 11141107 11768924 12330935 12501113 12310814 11723837
6584 11723837 10986459 10357424 9605964 8960565 8405860 8015486 7688945 7447168 7204912
6575 7204912 7001680 6879548 6816018 6761663 6785790 6939945 7073066 7127232 7246466 7539894
6565 7539894 7744861 7988559 8347523 8634622 9008060 9179664 9201859 8939778 8647772 8260609
6555 8260609 7695290 7226384 6906679 6638749 6341806 6109988 5830352 5777915 5621090 5484087
6545 5484087 5447579 5357029 5260468 5294001 5330881 5303013 5231325 5239547 5253328 5231532 5356904
6534 5356904 5435248 5355526 5437615 5555618 5699937 5762872 5853978 5812555 5946480 6026423 6214950
6523 6214950 6437414 6523334 6733960 6905712 7136855 7305326 7645820 8000202 8368881 8701005
6513 8701005 9083335 9506612 9944856 10298799 10624289 10794909 10818703 10588778 10452341 10313824
6503 10313824 10061111 9918082 9903369 9897521 9888791 10021561 10272481 10472469 10736855 11071043
6493 11071043 11517950 12022795 12651895 13384484 14151440 15014337 15926116 16907336 17965662
6484 17965662 19080103 20280990 21167617 21868359 22306453 22196484 21670658 20576300 19289516
6475 19289516 17940595 16566368 15529969 14723288 13979942 13472556 13222964 12971277 12956509
6466 12956509 13030390 13072648 13320640 13705948 14062652 14540983 15163786 15866370 16654712 17430770
6456 17430770 18039494 18704152 19371006 19669638 19474063 18709355 17781676 16715834 15347127
6447 15347127 13983780 12969137 11968059 11241952 10624487 10135721 9603378 9267181 8982385
6438 8982385 8742338 8523240 8298707 8185421 8084702 8120657 8130788 8265721 8478228 8518122
6428 8518122 8615036 8780166 8860943 8788420 8554123 8222870 7696398 7142853 6702866 6222549
6418 6222549 5831823 5419551 5243512 5045910 4818225 4634240 4407238 4236900 4159059 4062979
6408 4062979 3905481 3750442 3617868 3491253 3345455 3319781 3132214 3011673 2953639 2887863
6398 2887863 2850015 2797944 2740860 2676208 2667446 2610301 2605328 2628029 2428438 2339023 2378081 2366970
6386 2366970 2389938 2307018 2207746 2204991 2211461 2034658 2026987 2117649 2101500 2020535 1966905 2058545
6374 2058545 2077010 2114651 2107125 2043144 1991865 1985178 2040110 2074760 2001180 1997578 2100030 1968862
6362 1968862 1925841 1861151 1823842 1939030 1907494 1872971 1852116 1809281 1869904 1970699 1958940
6351 1958940 1933290 1826546 1813600 1891431 1893736 1877993 1923960 1953940 1928283 1946392 2001771
6340 2001771 1978699 1913991 1971331 1934432 1853032 1858293 1926270 2043472 1964184 1980806 1923898
6329 1923898 1834890 1925572 1967978 1998482 2026255 2098878 2175867 2041722 1931637 1879031 1950784
6318 1950784 1984779 1922044 1975128 1995059 2017983 2065606 1987359 2025338 2033689 2019712 1931173 1990240
6306 1990240 1911791 2049711 2078482 2015504 2073794 2061630 2030075 2022799 1984449 1939331 1964706
6295 1964706 1945490 1962666 1937742 1949254 1862386 1882369 1982651 2007484 1961168 1860829 1924246
6284 1924246 2039660 2050394 1985367 1978118 1901051 1926507 2015406 2072636 2119043 2140836 2109632
6273 2109632 2133142 2169095 2173069 2221065 2194626 2168058 2114680 2105628 2160111 2137800 2117811 2098959
6261 2098959 2165769 2211295 2159798 2172651 2189633 2210965 2154470 2293760 2326552 2356031 2359346
6250 2359346 2314984 2409384 2405256 2432741 2500394 2541037 2611183 2693790 2851778 2841534 2866975
6239 2866975 2933883 3056657 3254922 3306304 3375754 3558393 3735761 3997725 4168656 4429993
6229 4429993 4665892 5169466 5617005 6049053 6138155 5918629 5658455 5140611 4619714 4264216
6219 4264216 3915942 3795486 3657410 3544603 3431632 3323306 3311446 3325206 3236096 3300680
6209 3300680 3304496 3346705 3290140 3253652 3317569 3236822 3228515 3321083 3391733 3466489 3537546 3568124
6197 3568124 3661786 3598281 3580571 3631429 3668621 3589077 3538905 3556319 3581727 3624020 3671445
6186 3671445 3656605 3654597 3626405 3614503 3651082 3657765 3614402 3676855 3745684 3652188 3656866 3777365
6174 3777365 3783581 3915690 3954374 3862091 3957222 4048482 4113773 4102051 4076569 4093856 4117453
6163 4117453 4309448 4388710 4490182 4507663 4670928 4799450 4835284 4843950 4886770 4920782 4961698
6152 4961698 5053483 5143132 5064433 5156316 5301604 5479277 5610585 5681801 5788949 6016485
6142 6016485 6176800 6473563 6731560 6994585 7400960 7743817 8134408 8554667 9030247 9528321
6132 9528321 9833363 9952940 9866206 9638873 9266175 8965125 8727927 8390085 8236208 8167943
6122 8167943 8109033 8073052 8087341 8117423 8150075 8311038 8438355 8729863 8907862 9285915
6112 9285915 9748436 10096959 10564838 11149719 11769098 12451412 13103869 13803411 14344166 14395411
6102 14395411 14066295 13378255 12625525 11861297 11195058 10502928 10096351 9713629 9375959
6093 9375959 9214376 9032438 8872970 8804941 8627026 8558993 8457339 8398007 8596487 8651050
6083 8651050 8891312 9091729 9263978 9445460 9752326 10001480 10199023 10422041 10442245 10304622
6073 10304622 9940989 9678460 9364644 9049185 8745245 8538452 8324614 8259874 8053013 7979097
6063 7979097 7917174 7966880 7944211 7835581 7756915 7731415 7746495 7793106 7889671 8054427 8163517
6052 8163517 8369725 8397845 8525364 8740479 8902781 9094710 9378850 9599390 9801681 10129049
6042 10129049 10593410 11061543 11528326 12064276 12588168 13088951 13640882 14173156 14463339
6033 14463339 14626597 14577889 14360426 14114780 13770999 13402795 13281362 13178504 13091828 13123280
6023 13123280 13185688 13368007 13664162 13935290 14259348 14742620 15298304 16019439 16816392 17755991
6013 17755991 18821037 19855767 21113764 22373362 23398293 24129267 24319377 23785899 23031334
6004 23031334 21820688 20490868 19289860 18219422 17314533 16491824 15892750 15595601 15294890
5995 15294890 15087125 15037116 15158758 15273464 15493599 15881084 16392721 17039304 17765894 18726800
5985 18726800 19686198 20469692 21130270 21473907 21292631 20672419 19690248 18484836 17284378
5976 17284378 16115616 15098200 14057773 13438843 12760185 12171044 11761711 11434702 11273421
5967 11273421 11149213 10897728 10804448 10859235 10725849 10848342 10999101 11171780 11291368 11514182
5957 11514182 11710767 11792483 11690070 11516331 11299524 11087165 10935105 10814357 10723226 10691556
5947 10691556 10735527 10982820 11179374 11379019 11370915 11167862 10942082 10584757 10163664 9740024
5937 9740024 9474754 9314810 9161223 8993183 8934565 8897036 9047919 9133572 9285883 9514457
5927 9514457 9781226 10130107 10575191 11081847 11469007 12010510 12530092 13125449 13805840 14038124
5917 14038124 13854788 13519361 12818410 11926044 11181966 10501798 10037411 9627559 9253406
5908 9253406 9049682 8834083 8690115 8531376 8349115 8291679 8131398 8084890 8163747 8327313
5898 8327313 8467562 8660703 8982149 9137470 9238294 9332103 9269739 8891153 8531879 8142836
5888 8142836 7528047 7102956 6680897 6399069 6114174 5792534 5591765 5387130 5181071 5058031
5878 5058031 4999813 4917584 4863391 4699454 4483641 4399398 4398938 4216792 4160279 4063659 3981685
5867 3981685 3966525 3907187 3772379 3817687 3829357 3713061 3704222 3794749 3821246 3754286 3592159
5856 3592159 3545330 3488161 3514126 3536043 3490502 3443192 3509063 3445055 3342947 3382507 3356988
5845 3356988 3377978 3394671 3408306 3467963 3541124 3441513 3387113 3327939 3283885 3202003 3165565
5834 3165565 3212203 3296911 3412872 3377684 3346864 3370094 3388314 3346496 3311866 3263912 3284059
5823 3284059 3364633 3336592 3381269 3382358 3394794 3419461 3388198 3429821 3512844 3484272 3465129 3522901
5811 3522901 3558073 3501004 3556743 3550138 3501038 3435099 3457451 3497631 3453594 3515568 3456972 3446648
5799 3446648 3619988 3660643 3537624 3505505 3609450 3674313 3607067 3627748 3736417 3801296 3748752
5788 3748752 3718891 3745345 3844370 3878843 3904424 3952348 3947931 3969826 4140968 4195826 4217362
5777 4217362 4290048 4403000 4582456 4572825 4638423 4725068 4850655 5136729 5233112 5361105 5629114
5766 5629114 5862559 5972650 5887653 5704000 5541899 5480386 5256417 5065880 4845550 4707304
5756 4707304 4583269 4572232 4613602 4503238 4468234 4531183 4608063 4602410 4521153 4496803 4545280
5745 4545280 4469355 4406263 4470139 4571836 4602287 4563133 4635874 4668814 4635285 4547489 4576157
5734 4576157 4642914 4589149 4632494 4750776 4724676 4720128 4807995 4779705 4764797 4794859 4861970
5723 4861970 4779229 4761359 4862234 4847425 4849786 4886029 4886202 4960034 5087187 5200857 5213871
5712 5213871 5301631 5393445 5523113 5638597 5784847 5970340 5967567 6016993 6251657 6607415
5702 6607415 6818885 6982350 7105749 7141504 6871332 6815891 6631747 6425224 6332841 6117668
5692 6117668 5995474 6013892 6045515 6035237 6126148 6148162 6102275 6201112 6222498 6284772 6256044
5681 6256044 6234174 6421916 6442381 6630715 6678566 6478850 6539078 6603747 6574242 6559606 6413975
5670 6413975 6468881 6588629 6632822 6638363 6537101 6516280 6562335 6570805 6784040 6839763 6884086
5659 6884086 6817395 6791130 6748411 6706370 6831083 6763353 6799326 6899506 6915930 6903428 6988031
5648 6988031 7016099 7001639 6967478 7031267 7182657 7142462 7143712 7163563 7319622 7432272 7458073
5637 7458073 7461749 7629840 7703701 7723939 7851493 7898260 8034448 8000331 8030351 8262483 8328249
5626 8328249 8343220 8427046 8567606 8504473 8399507 8486288 8488876 8439461 8557886 8726881 8837734
5615 8837734 8932471 9077394 9219291 9334623 9433910 9478369 9586492 9638517 9739177 9887759
5605 9887759 9919066 9969008 10084176 10067128 10156328 10208763 10071463 10117669 10162364 10165008 10126505
5594 10126505 10214714 10251329 10257451 10287126 10277403 10373193 10511399 10516895 10436834 10430128 10447565 10647240
5582 10647240 10800061 10823643 10798242 10771507 10835275 10805348 10825026 10984524 11071430 11142026 11378737
5571 11378737 11558452 11741945 11999596 12264827 12423623 12553340 12769742 12944022 13072046
5562 13072046 13234120 13312779 13510744 13517611 13641046 13912071 14029604 14122158 14122564 14190912 14297264
5551 14297264 14488840 14549961 14674112 14800711 15163646 15444872 15772824 16238472 16715652 17024214
5541 17024214 17364471 17710554 18018162 18235842 18328864 18641936 18827267 18923183 19075936 19134141
5531 19134141 19271826 19386029 19492420 19706608 19946769 20135308 20319306 20436768 20649751
5522 20649751 20848139 20968070 21153629 21380718 21627088 21915708 22140216 22480896 22799146
5513 22799146 23014062 23324083 23749905 24056806 24500168 25093710 25649003 26297772 26896042
5504 26896042 27404133 27889185 28486828 29087514 29597541 30253345 30886180 31446573 31958968
5495 31958968 32581521 33092752 33633943 34232437 34776922 35420254 36121301 36802759 37604176
5486 37604176 38671089 39907119 41329861 42838147 44464191 46170144 48223381 50628443
5478 50628443 53155510 55995981 59288804 62899897 66911417 71371243 76168946 81610010
5470 81610010 87924063 95010560 103069413 112253275 122836080 134877579 148947871 165301660
5462 165301660 183573746 204028841 227519738 255815856 289988807 327126851 357780724
5455 357780724 372774354 368963011 342474513 302798088 260332850 219385954 186195199
5448 186195199 161523394 143173090 129207572 118309400 109220708 101263404 94095027
5441 94095027 87804777 82120276 76875116 72432690 68780556 65597638 63202876 61276614
5433 61276614 59713425 58478251 57369242 56445635 55489370 54683073 53993693 53457178 52912003
5424 52912003 52389751 51950276 51653827 51411599 51039706 50952865 51074777 51328731 51751886 52458185
5414 52458185 53449135 54675894 56335224 58187723 60290234 62756768 65542485 69040825
5406 69040825 72847518 77298614 82332272 88146453 94772507 102293769 111036958 121466424
5398 121466424 133810858 148035294 164286109 182649964 203755637 229147245 259521084
5391 259521084 293375073 323838719 342356971 349637636 341253155 312154867 275547417
5384 275547417 237250036 199118428 168042469 144972002 127172702 113136742 102189247
5377 102189247 93187939 85141797 77949779 71465924 65688040 60535898 55912825 51945753
5369 51945753 48719941 46119475 43857061 42179947 40361604 38849513 37488533 36136561
5361 36136561 34839936 33556141 32270579 31141328 30105982 29250761 28232598 27134375
5353 27134375 25862940 24694591 23535053 22603675 21794868 20978455 20379096 19856474 19461351
5344 19461351 18947154 18360393 17885081 17413818 17117143 16729608 16382708 15967821 15492875
5335 15492875 15053092 14626304 14242048 13833731 13496974 13284433 12945216 12664510 12391611
5326 12391611 12209507 12020134 11792069 11594046 11436575 11239302 11018647 10912832 10652329
5317 10652329 10563055 10416363 10314597 10236207 10244403 10112574 9986860 9903727 9838693 9850918 9861051
5306 9861051 9851885 9981408 10081854 10171609 10467734 10598416 10660379 10727247 10789142 10932737 11050059
5295 11050059 11083890 10986775 11069766 11167693 11186232 11229071 11242207 11295354 11395413 11494163 11777603
5284 11777603 12045949 12315678 12532942 12805927 13088775 13483602 13829150 14154885 14489388
5275 14489388 14821848 15182077 15568366 15820768 16337693 16718579 17006722 17404686 17701711
5266 17701711 17832311 18115754 18412151 18598778 19060914 19596589 20069211 20559214 21085473
5257 21085473 21849420 22548901 23046373 23594272 24050067 24435261 24818644 25160724 25519982
5248 25519982 25853831 25908647 26093107 26233731 26350784 26317879 26282642 26396451 26528132 26619175
5238 26619175 26824406 26917541 27243882 27478054 27764689 28166453 28551637 28925806 29353546 29792501
5228 29792501 30057593 30458472 30762954 30950577 31114356 30975121 30813778 30572667 30251130
5219 30251130 29926675 29446273 29113909 28725289 28282743 27942251 27579116 27235168 26917859
5210 26917859 26678764 26343840 26147101 25927302 25835468 25661705 25439624 25257573 25105909 24776847
5200 24776847 24537406 24291403 24045578 23814018 23548404 23265786 22856729 22561744 22183185
5191 22183185 21791622 21395759 20991215 20730210 20387166 20116468 19823573 19584910 19490520 19506834
5181 19506834 19526728 19502867 19583668 19830877 20009725 20254773 20634869 20885343 21143979 21365410
5171 21365410 21716659 21877611 22216915 22493107 22768308 23114116 23332863 23530489 23746458
5162 23746458 23972094 24277606 24490820 24716276 25020109 25252543 25443828 25735581 25852684
5153 25852684 26074874 26245861 26410297 26542948 26772919 26839262 26971011 27230168 27506937 27720258
5143 27720258 27906409 28013685 28178318 28180983 27940511 27741081 27677384 27476245 27275940 27362167
5133 27362167 27311263 27201237 27089740 26886289 26512114 26027531 25478394 24872675 24151474 23447766
5123 23447766 22721566 22206277 21393196 20818646 20318568 19851420 19432328 18977171 18554167
5114 18554167 18198367 17956136 17672442 17526913 17326467 17106064 16922585 16818986 16668219
5105 16668219 16524734 16342114 16119275 15728874 15370219 15068923 14665910 14244542 13700654
5096 13700654 13236483 12839254 12557297 12145708 11790324 11437024 11137297 10915522 10773477
5087 10773477 10699850 10459781 10471292 10424047 10417351 10427444 10525757 10571773 10600320 10747379 10921648
5076 10921648 11172232 11430447 11945491 12249973 12516730 12694419 12744102 12863641 12787278 12652015
5066 12652015 12512392 12343933 12018343 11655949 11275678 10971843 10702944 10598954 10494174
5057 10494174 10496992 10469597 10563147 10676646 10762893 10834249 11058032 11422342 11591132 11970453
5047 11970453 12389559 12832310 13301226 13699991 13922635 14079769 13946362 13507166 12968629
5038 12968629 12319768 11674221 11058451 10583883 10205883 9759949 9518484 9308619 9169656
5029 9169656 8992824 8942415 8821723 8744947 8606378 8622466 8788731 8892427 8884349 8946297 9030950
5018 9030950 8981921 8991360 8833050 8616596 8236023 7868544 7432882 7021766 6736228 6343907
5008 6343907 6090344 5887740 5689429 5510860 5442335 5248853 4998693 4855088 4665957 4618855
4998 4618855 4618801 4508216 4348213 4270377 4215006 4187600 4210334 4170172 4062674 3961178 3959566
4987 3959566 3897180 3904695 3957886 3991502 3885221 3828478 3830860 3837236 3786711 3730936 3633027 3503989
4975 3503989 3612646 3524060 3463699 3436078 3294999 3322717 3378044 3229262 3304674 3383445 3371876
4964 3371876 3328966 3365616 3450707 3436640 3434220 3511002 3336618 3367107 3354291 3404841 3453637
4953 3453637 3339212 3347756 3401051 3449064 3566406 3553986 3473445 3461731 3487730 3413590 3405211
4942 3405211 3352017 3359511 3458509 3474644 3522053 3584766 3589656 3494537 3506088 3496658 3456785 3524805
4930 3524805 3577911 3545875 3662426 3681378 3839485 3878265 3799268 3807220 3879052 3919501 3981620
4919 3981620 3985148 4122129 4231480 4298026 4430646 4435595 4384371 4519776 4699328 4856376 5063759
4908 5063759 5099822 5273664 5553297 5652855 5799037 5910459 5952842 6089276 6141620 6073303
4898 6073303 6006030 5800679 5734631 5558154 5553181 5396314 5278750 5342898 5181228 5167037 5166377
4887 5166377 5152112 5107115 5180957 5092710 4990210 4921244 5007756 4962268 4999339 5114574 5126665
4876 5126665 5189788 5284774 5355558 5449842 5491228 5487906 5570875 5682518 5872229 5901264 5971926
4865 5971926 6084743 6279292 6366582 6490203 6622418 6709048 6906300 6904855 7012326 7179871
4855 7179871 7321388 7284605 7285253 7345380 7496932 7637383 7718123 7794724 8023843 8255960 8356158
4844 8356158 8515313 8781211 9034729 9450604 9817415 10061052 10464394 10941417 11463315 12145033
4834 12145033 12699159 13309250 14232200 15152064 16099448 17268265 18545234 20044350 21768401
4825 21768401 23468995 25404942 27735031 30374718 33224332 36404058 39767129 43750665
4817 43750665 48330449 53402381 57901802 60965027 61131901 58481685 53748554 47753482
4809 47753482 41719924 36465619 32182648 28768327 26167575 24020254 22164158 20448580
4801 20448580 18933371 17670664 16446741 15288825 14337123 13472877 12884083 12278433 11732559
4792 11732559 11418056 11068399 10784420 10539969 10237342 10069353 9915091 9668313 9385617
4783 9385617 9221215 8989650 8808592 8783679 8608043 8514052 8417195 8339679 8289013 8291496 8424154
4772 8424154 8467773 8601741 8864686 9034295 9110520 9432364 9813020 10263417 10649705 11170184
4762 11170184 11667163 11976773 11931930 11740081 11227061 10359905 9579115 8883227 8207809 7693330
4752 7693330 7338651 7016247 6788769 6706946 6599589 6426224 6315756 6176908 6057363 5958750
4742 5958750 5815837 5775243 5688254 5685754 5687287 5717322 5683034 5550194 5421812 5373330 5323684
4731 5323684 5273231 5381629 5312735 5279875 5260675 5278214 5304425 5440419 5431433 5448540 5451050
4720 5451050 5338221 5368935 5264706 5291447 5349157 5381125 5440551 5378652 5258487 5318320 5382346
4709 5382346 5324951 5180833 5181502 5250332 5199367 5169263 5096888 5035944 5096874 5146491 5139810 5153814
4697 5153814 5045719 5159694 5146105 5051854 5043363 5202002 5160440 5209928 5236315 5192330 5191421
4686 5191421 5176314 5153140 5182993 5146710 5152912 5205176 5184371 5193883 5134859 5158762 5063385 5001943
4674 5001943 4924302 5075416 5075147 4994384 4961624 4885057 4902252 4834411 4926500 4868141 4831980 4760529
4662 4760529 4702945 4750293 4811001 4854861 4791485 4833040 4837985 4812618 4830385 4954018 4899775
4651 4899775 4846587 4875109 4939830 4858821 4886763 4908035 4825043 4849354 4838277 4845861 4827376 4729757
4639 4729757 4585789 4658387 4804685 4727527 4621453 4657629 4681052 4656336 4616084 4489917 4589773
4628 4589773 4716621 4665974 4657791 4567603 4552106 4712307 4743858 4712401 4760552 4792509 4789286
4617 4789286 4785638 4861689 4803268 4766237 4850495 4825631 4708020 4793828 4825028 4896149 4976456
4606 4976456 4966546 5009660 4923644 4805222 4911048 5119264 5182841 5207727 5189224 5243754 5325480
4595 5325480 5276027 5306761 5417702 5576595 5582121 5599937 5747359 5805365 5827954 5954369 6141635
4584 6141635 6099044 6193614 6337102 6403387 6515197 6648604 6759387 6841771 6956484 7108736
4574 7108736 7245251 7290817 7311524 7399631 7451514 7586528 7691251 7812375 7839316 8039673
4564 8039673 8188264 8308734 8493781 8697083 8831155 8868087 8986099 9242953 9373616 9610949
4554 9610949 9856162 9988612 10172020 10383511 10494198 10616430 10903992 11117192 11335582 11620930
4544 11620930 11916958 12108179 12289740 12568319 12938600 13225919 13533094 13878601 14139014
4535 14139014 14401601 14544666 14549952 14844010 15105652 15292612 15558750 15637875 15784290 16069540
4525 16069540 16259633 16624970 16759896 16986530 17264026 17468598 17691794 17919532 18127574
4516 18127574 18420822 18664451 18978389 19328538 19686904 20141710 20549320 20917691 21291576
4507 21291576 21749483 22054239 22288681 22795593 23165066 23459028 23670044 23958224 24327408
4498 24327408 24703807 24999133 25273213 25524056 25795318 25978334 26090798 26485977 26616595
4489 26616595 26685856 26772406 26986850 27145821 27357183 27593438 27843529 28166982 28373058 28666741
4479 28666741 28981912 29305942 29670693 30021202 30472653 30944059 31390924 31972774 32566345
4470 32566345 33097539 33609797 34130339 34758382 35370734 35759101 36117902 36248351 36369883
4461 36369883 36511260 36483492 36451608 36360968 36222988 36027845 35781693 35576484 35243031 34980765
4451 34980765 34946151 34755676 34709214 34915874 34857188 34831336 34902825 34750986 34665236 34536375
4441 34536375 34551419 34491355 34366399 34241353 34066254 33768719 33455091 33098457 32716560 32193265
4431 32193265 31546165 30970670 30373933 29734718 28998461 28203854 27374581 26701961 26085694
4422 26085694 25479891 25006746 24531172 24196676 23759947 23427473 23143253 22757591 22402953
4413 22402953 22183660 21923809 21628198 21322763 21027715 20761562 20528841 20235132 19838846
4404 19838846 19687440 19400543 19101523 18763566 18416609 18054606 17730813 17409326 17079447
4395 17079447 16739379 16435706 16203266 15981687 15758988 15621537 15452061 15085673 14761860
4386 14761860 14597364 14432902 14227067 14042583 13845595 13663992 13428133 13198495 12858812
4377 12858812 12731841 12569119 12295542 12102737 11867982 11731100 11534330 11209971 10956907
4368 10956907 10834299 10752139 10582724 10397829 10229759 10127803 10108628 9962519 9754097 9532939
4358 9532939 9364654 9096270 8880629 8644084 8513900 8383450 8101219 7847432 7653589 7535631
4348 7535631 7395377 7183144 7092608 6927841 6707860 6658746 6600198 6395672 6215965 6239998
4338 6239998 6147886 5998515 5956734 5923264 5842864 5731768 5539620 5571017 5498827 5518810 5416501
4327 5416501 5296588 5192888 5090075 5044472 4979545 4908546 4901380 4972554 4781186 4717349 4694489
4316 4694489 4736114 4690840 4540634 4527776 4653461 4565528 4432147 4470877 4495843 4498962 4563663
4305 4563663 4403021 4323385 4417227 4473484 4347106 4295011 4332031 4290874 4331058 4212673 4275706
4294 4275706 4261885 4168986 4190286 4197241 4226021 4230445 4166125 4048078 4029193 4088393 4195034
4283 4195034 4108107 4139626 4230881 4143323 4084317 4015110 3965485 3924769 4004249 3999990 4060731 4050373
4271 4050373 4081608 4059458 4025234 4032474 4104025 4184500 4048090 4053466 4055645 4056430 4006324 4064719
4259 4064719 4010478 4010063 4015423 4007695 4001154 3999185 3983744 3962559 3912657 3939611 3889797 3889556 3983862
4246 3983862 4090516 4082343 4107450 4088386 4054690 3980982 3998148 4168590 4079025 3969298 3976293
4235 3976293 3950487 4002514 4180696 4127961 4146553 4126986 4134277 4085469 4057373 4165046 4115594
4224 4115594 4128110 4037161 4059750 4023628 4056266 4046858 4003959 4066085 4181837 4106635 3977204
4213 3977204 4033808 4067548 4084571 4079354 4187062 4084208 4038140 3929623 3919782 4002962 4085637
4202 4085637 4024225 4039170 4056064 4039470 4018531 4045626 4033047 4085584 4134013 4237617 4204902
4191 4204902 4147510 4117828 4192438 4118448 4138810 4148161 4069818 4055417 4015281 4149273 4151486 4060765
4179 4060765 4064019 4008971 3951405 3969503 3986633 3995170 4031539 3831059 3815824 3900134 3907527 3907591
4167 3907591 3867352 3900969 3929898 3949784 3868233 3752543 3787741 3885142 3850162 3843972 3879928
4156 3879928 3899619 3810897 3841221 3897527 3882364 3884634 3807498 3845179 3821343 3762514 3769239 3758792
4144 3758792 3850650 3908880 3934733 3903787 3918313 3867567 3917910 4004322 3917640 3815528 3861050
4133 3861050 3856649 3859895 3752702 3877096 3875616 3812243 3826980 3860273 3896459 3860719 3939328 3966895
4121 3966895 4044583 4035619 4048143 3991390 3915099 4048960 4008688 4035685 3945653 3927293 4020131
4110 4020131 4073881 4008730 3942530 3907100 3972323 4039511 4055968 4012773 4175865 4160132 4073781
4099 4073781 4076545 4143834 4089061 4076124 4095911 4039349 4051824 4106907 4217141 4186796 4134149
4088 4134149 4166798 4243978 4338989 4403202 4428393 4466255 4428271 4387608 4346521 4401091 4466202
4077 4466202 4478637 4460230 4634268 4617215 4575184 4621334 4650322 4681387 4811756 4787368 4782709
4066 4782709 4811447 4900381 4936912 4978594 5020670 4995402 5061726 5094390 5156441 5225095 5152416
4055 5152416 5177654 5301906 5324702 5357508 5390818 5435881 5492150 5486254 5645195 5774719 5803049
4044 5803049 5819042 5853291 5788143 5919343 6099563 6091714 6125863 6165764 6151942 6147205 6217873
4033 6217873 6358387 6457317 6481761 6466063 6547855 6612287 6725153 6796629 6940060 7095926 7104015
4022 7104015 7160847 7177168 7224377 7346385 7480522 7559612 7642697 7754928 7797433 7955911 8137947
4011 8137947 8201480 8347375 8398101 8453391 8538157 8720342 8830235 8982977 9255199 9398553
4001 9398553 9478040 9521322 9684438 9859586 9921682 10082799 10237544 10366791 10538072 10666336
3991 10666336 10831951 10919962 11046338 11081910 11258386 11545118 11676130 11832270 11976232 12095450
3981 12095450 12298598 12425838 12620725 12874992 13092160 13322863 13546235 13733166 13899738
3972 13899738 14231542 14495084 14653388 14848047 15115668 15319477 15722799 16023056 16377353
3963 16377353 16600055 16896035 17340951 17634199 17930215 18173490 18569636 18907983 19124926
3954 19124926 19336705 19766254 20144726 20415620 20767676 21000298 21426960 21806276 22234752
3945 22234752 22667496 23029699 23517938 24114552 24641288 25167293 25797169 26481482 27078847
3936 27078847 27903779 28745659 29578446 30544641 31639698 32767118 33965432 35277816 36671962
3927 36671962 38181132 39866696 41650660 43466948 45342690 47413925 49403552 51660898
3919 51660898 53874783 55921269 58164445 60093578 61897767 63386555 64322593 64593013
3911 64593013 64401617 63708336 62606898 61079975 59361391 57614572 55810980 54039938
3903 54039938 52193697 50131108 48167911 46293902 44340015 42438880 40552663 38682127
3895 38682127 37118524 35669319 34197054 32796473 31581417 30552233 29517738 28453699
3887 28453699 27587028 26919327 26290019 25619423 25010796 24309076 23680220 23187228 22620717
3878 22620717 22026200 21404723 20792476 20369049 19932727 19429299 18956777 18476696 18076468
3869 18076468 17656964 17145406 16721996 16191365 15885648 15483794 15106788 14903261 14624916
3860 14624916 14326818 14048312 13739512 13349736 13013784 12777111 12411303 12153192 11887751
3851 11887751 11726051 11439939 11263025 11083003 10803418 10706148 10511005 10372063 10169642 10075250
3841 10075250 9857329 9705980 9571877 9475719 9327360 9189092 9060702 8906471 8788159 8659124
3831 8659124 8531374 8479851 8382183 8216787 8163074 8049322 7920950 7892628 7969096 7907553 7799822
3820 7799822 7697268 7569321 7509642 7376715 7234163 7092848 6998002 6998540 7110317 7061408 6899037
3809 6899037 6775977 6803321 6763019 6702560 6653729 6598759 6457443 6388992 6389031 6393898 6351701 6193931
3797 6193931 6157559 6090405 6100388 5981565 5955896 5986639 5922808 5929066 5794543 5713871 5656143
3786 5656143 5594517 5612721 5579317 5594682 5540232 5356862 5321194 5239205 5282787 5271418 5240329
3775 5240329 5258495 5283104 5215040 5116528 5073130 4969776 5006695 5037554 4906345 5012556 5136342
3764 5136342 5011885 4874861 4875042 4849466 4948760 4994074 4934698 4904866 4898695 4893977 4966779 4856551
3752 4856551 4847771 4714747 4699388 4714634 4706785 4668489 4649627 4613468 4639517 4677133 4576690
3741 4576690 4563092 4500577 4505858 4541050 4512548 4396300 4291323 4293428 4438760 4418032 4412581
3730 4412581 4310071 4265902 4282343 4242874 4225682 4276418 4185463 4191969 4090851 4119564 4234501
3719 4234501 4254678 4169713 4205500 4147425 4146458 4122613 4108687 4142619 4029811 3948898 3985563 3964646
3707 3964646 3913545 3878324 3716851 3740779 3828730 3767502 3751557 3762089 3791282 3747506 3733901
3696 3733901 3680720 3697374 3753093 3740844 3680835 3712121 3720879 3780440 3866457 3729121 3762527
3685 3762527 3806736 3722587 3764722 3711843 3689137 3765979 3782035 3798508 3781512 3866293 3764842
3674 3764842 3759030 3880202 3910516 4000566 3897131 3953318 3971924 3936574 4009529 4184452 4277826
3663 4277826 4206505 4202319 4240560 4184063 4197100 4238198 4334883 4466490 4425014 4373808 4408774
3652 4408774 4546019 4668079 4707590 4718584 4766305 4774590 4886724 4837517 4862934 4876466 4938636
3641 4938636 5033102 4993383 4988487 5017638 4965284 5077216 5284377 5444185 5384080 5408597 5549515
3630 5549515 5522745 5616450 5550442 5681546 5772833 5871263 6030539 6174943 6333485 6428965 6534032
3619 6534032 6672073 6882218 7127541 7306324 7406807 7613112 7837677 7877417 8087534 8318389
3609 8318389 8525051 8750236 8896636 9173518 9416701 9687167 9954554 10171863 10469594 10604360
3599 10604360 10765362 10987842 11080090 11188970 11238482 11401302 11566598 11746682 11793647 11990822
3589 11990822 12338431 12626684 12748623 13039877 13277393 13605244 14101563 14576386 14984747
3580 14984747 15537720 15990760 16419675 16895925 17423350 17962192 18496254 18919299 19181405
3571 19181405 19288974 19201704 18814347 18327082 17730446 17233560 16687187 16312178 16121870 15833041
3561 15833041 15741040 15669881 15755541 15897159 16068054 16208703 16483298 16853478 17176731 17409637
3551 17409637 17781961 18108267 18337159 18707819 18907494 19045086 19025362 19013277 18782209 18466266
3541 18466266 18058970 17614382 17138905 16602866 15995780 15495173 15052516 14488779 14152287
3532 14152287 13825408 13688778 13289034 13062592 12974250 12928094 12959221 12854481 12762125 12815061
3522 12815061 12635720 12459872 12272793 11922578 11663377 11455689 11049208 10656462 10209649
3513 10209649 9673458 9268262 8978239 8542439 8075119 7796324 7620251 7368971 6984861
3504 6984861 6824223 6596398 6379591 6172160 5968148 5873301 5684321 5584804 5429979 5160994
3494 5160994 5040435 5006058 4909629 4828260 4668451 4679874 4504089 4318173 4153789 4103265
3484 4103265 4041643 3806735 3696530 3671765 3491605 3383747 3305799 3271269 3180893 3089346 3108948
3473 3108948 2931410 2677908 2533246 2529437 2541522 2498725 2546119 2497770 2381107 2336179 2402823
3462 2402823 2284148 2206337 2296948 2295712 2186344 2061340 2001535 1916258 1930631 1917863 1921628
3451 1921628 1920490 1899981 1937900 1932463 1801873 1701199 1659086 1579454 1499534 1491798 1524357 1523763
3439 1523763 1429002 1391372 1383000 1379096 1280388 1282139 1356260 1418826 1303588 1357465 1300973 1236655
3427 1236655 1217247 1252311 1253036 1192566 1134430 1136450 1060904 1063100 983861 978640 1034719 963996
3415 963996 1050000 985087 889323 892831 888250 809437 849399 858837 731931 671567 703228 646522
3403 646522 752492 681046 629776 699480 624721 666451 722800 665247 622528 593740 527612
3392 527612 592518 624925 560632 579323 548265 503864 523607 609576 645535 525160 491465
3381 491465 476594 469266 526327 475213 544919 607538 543007 464795 490656 402623 315150 414867
3369 414867 419912 387667 443259 493442 579431 444056 294097 317707 402966 379390 426939
3358 426939 411379 364940 444112 331387 327460 324312 361857 441032 477077 412578 357030 264209
3346 264209 337408 370004 424201 279603 261951 279024 304152 288950 321296 298543 274782
3335 274782 256358 221550 204601 280248 226475 305514 311615 382218 516890 364487 333146
3324 333146 394981 460450 293131 272371 354478 426568 354723 241386 205389 200467 251312
3313 251312 252806 334044 299258 339177 272861 290634 324818 257412 248904 140914 185107 166805
3301 166805 157339 110830 198338 198692 216488 241155 307760 236725 255524 211269 266639 254097
3289 254097 223143 369192 333847 274934 290031 278281 255052 263683 268381 247806 158379 62608
3277 62608 87646 96860 167415 149927 51856 39231 128769 236132 299153 262439 340845 244437
3265 244437 227039 265133 277127 201057 203392 276077 258191 238602 291962 224169 197220 281882
3253 281882 186116 262197 306079 263857 367138 254790 158759 156938 199964 219390 164691
3242 164691 132746 158374 292062 259226 148731 82962 111937 143104 128271 92024 76431
3231 76431 12448 128091 172532 107916 84116 104383 179246 155778 194629 151906 112994 43690
3219 43690 82723 50524 25900 162143 141826 136238 165128 230699 145485 113629 147495 140348
3207 140348 123392 102455 73771 3201 62716 47708 12990 73067 154213 110213 30531 47328
3195 47328 89518 34765 -59252 57831 76411 72906 -44539 -7455 49294 -103345 39184
3184 39184 150483 58690 72317 67260 75178 47964 108705 113754 216225 175972 16850 28310
3172 28310 35446 104587 119289 35798 63143 88422 163666 -18254 39005 8626 -38882 88173
3160 88173 16160 42551 166218 23917 -37947 -164126 -55167 41119 108450 108019 102815 109703
3148 109703 41711 50802 155576 131310 60362 28213 55485 86433 10770 -6317 20644 131957
3136 131957 10998 36500 -18926 -79360 -68447 23323 39470 28289 117758 81952 -72005
3125 -72005 -28291 -47569 -16991 30110 70211 87509 108521 145055 59487 122778 116652 148885
3113 148885 114445 36189 63420 -66608 -70321 -56385 645 36891 4484 -6548 50050 41309
3101 41309 63983 109430 99725 71185 99153 44422 40242 161404 81164 37913 -52936 -34640
3089 -34640 111381 19024 7927 10640 -38885 -77414 16312 43517 -12947 -57155 6278 -15513
3077 -15513 -26273 -25325 12427 -61293 -92019 35781 51357 38533 42726 26635 5558 52422
3065 52422 -34927 17550 50470 -66778 20084 -20065 143059 134346 45192 66499 90827 93729
3053 93729 38060 46276 28284 51518 38332 -4459 58562 85890 -6161 56798 143702 164273
3041 164273 292844 238279 213186 165084 188270 61058 -4024 96189 105547 183437 127896
3030 127896 28627 12031 16915 40890 12535 40598 34629 -54389 87937 112907 129196 34763
3018 34763 72742 -18852 -102365 -28571 58021 57297 36007 33543 98238 45959 55797 169052
3006 169052 103651 -90132 21339 74670 31433 68449 36395 13177 27491 63294 195148
2995 195148 136215 88471 138454 138206 96078 66305 -35688 86506 188873 58949 905
2984 905 23417 13222 68301 173393 179675 140065 50438 158140 185687 219577 172135 75588
2972 75588 -31024 22134 -18156 -6095 31517 65459 87778 96440 -50948 -134404 86533
2961 86533 102756 -5841 -34330 27563 3766 17173 57737 96804 75524 109862 90643 21920
2949 21920 119889 140584 38635 83739 167089 107121 107722 198652 89670 -3366 64046 54552
2937 54552 85404 127259 96550 134023 161321 132640 117578 81319 50907 206461 255254 292763
2925 292763 223595 183444 264935 257817 223069 69607 184645 301252 267258 240400 238019
2914 238019 126989 143626 184394 216839 283413 225916 170173 224388 164861 166343 216264 310849
2902 310849 270953 200772 329561 356494 362072 422595 403745 295150 289405 255160 300532 317679
2890 317679 373762 386979 324253 314948 314874 311158 289206 293951 488979 470677 417350 382425 327017
2877 327017 314326 266573 294279 316689 340499 503436 595733 600458 616761 652683 640391 586701
2865 586701 592733 636308 513918 612811 719349 608822 720795 712600 706670 791301 906540
2854 906540 880082 814585 773163 852971 877423 895395 931560 962100 845961 898073 927320
2843 927320 1019878 1067232 1020015 1018062 1016417 1178703 1140851 1058781 997849 1076086 1205179 1161564
2831 1161564 1076140 1047897 1208074 1117974 1177759 1167332 1200923 1430079 1451231 1509280 1495733
2820 1495733 1546584 1548454 1585823 1726184 1802654 1701974 1593543 1683953 1851477 1902843 1840718
2809 1840718 1940101 2044648 2014256 2055071 2195992 2368659 2438823 2529031 2683605 2885945
2799 2885945 2948926 3145622 3327819 3510602 3841808 4144853 4390143 4752854 5163041 5595912
2789 5595912 6149408 6687708 7270211 8024752 8529191 9221201 10142121 11331261 12689392
2780 12689392 14346300 16103297 18099226 20337352 23277964 27189946 31659416 34027370
2772 34027370 32052212 28847411 24165938 19306575 15867393 13382181 11477711 10087983
2764 10087983 9038738 8441783 7785075 6939758 6442935 6058249 5710136 5196521 4687319
2755 4687319 4111725 3749164 3460777 3324010 3086323 2776660 2701880 2608662 2458472 2384704
2745 2384704 2338123 2265525 2115497 2006736 1968425 1876529 1788311 1631771 1478912 1403056 1253204
2734 1253204 1288798 1225194 1091202 991174 979118 1043753 938187 874950 797928 760658 784242
2723 784242 733401 669061 620527 600915 576512 596982 633893 699053 604466 579955 506162 524853
2711 524853 511779 347795 192654 260559 276673 284645 350867 341017 338886 457338 395393 261288
2699 261288 212773 152789 198255 250659 295189 233662 195634 262999 410215 264843 165469
2688 165469 195293 240263 187097 213578 205510 234245 180145 174598 101173 70533 164367 272633
2676 272633 191009 104460 135431 110430 38521 67716 126665 66458 228535 232266 96102
2665 96102 160077 50896 74666 177778 198112 130793 71757 75771 -33829 48661 152522
2654 152522 229087 143049 13380 4296 -12846 22463 25014 22262 154167 130312 73526 -97825
2642 -97825 -99879 -54035 20283 -51097 -66387 -70580 -149876 -167375 -19657 -10749 27107 63518
2630 63518 19840 41035 12564 31333 -90493 -135242 50223 79163 35709 -2186 -76189
2619 -76189 58437 111054 80264 100546 -34116 -31830 19268 -51351 -88065 -32091 88206
2608 88206 -22284 -108373 31750 15790 -156108 -215850 -159938 -147788 -121194 -65323 -85344
2597 -85344 -54409 -87161 -147616 -106069 -111807 -137117 -104405 -111674 -34929 -31480 -4298 -57427
2585 -57427 -130081 20204 101078 94318 126999 -47344 66676 23265 65287 172936 164200
2574 164200 -35542 -43035 -124495 -160624 -133909 -15038 -23064 -104382 -123234 -172412 -132306 -157094
2562 -157094 -108481 -184251 -97507 -77440 -50943 48740 65573 -36188 -80776 -52562 -155683
2551 -155683 -61944 7631 5325 90065 -34046 -106210 -88904 -5070 -39579 -40785 54642 100826
2539 100826 89937 -2177 -3727 -98017 -119680 -86546 -150829 -71342 -67709 -102671 -139442 -62667
2527 -62667 -68811 -40390 -30812 1263 3578 -39949 -95723 -121539 -14838 -33159 -37827 23143
2515 23143 144999 34438 12397 83318 -31035 -51447 34290 79608 48746 79559 98138
2504 98138 123924 64647 96102 25602 -5990 20290 38151 54692 -1779 -93483 -85768 -33795
2492 -33795 -87669 -61411 -126878 -140579 -86580 -67657 -77254 -43991 15757 53314 17088 -61535
2480 -61535 -4064 -59051 -120903 -123001 -50319 -50509 -64393 -105213 -40249 21510 -125063 -193802
2468 -193802 -102114 -76978 -139337 -218551 -159932 -90488 -48555 -123327 -167697 -134490 -62643 -35612
2456 -35612 -143993 -128061 -68275 72410 34892 -40129 -31807 17615 97177 -16582 -8261 -28424
2444 -28424 -89496 19416 45059 15610 -19568 -64559 -19322 -23984 16752 -88397 -152233 -27814
2432 -27814 -9097 -44903 -127295 -55196 2216 31851 -81886 -197119 -36212 -11531 44900
2421 44900 22843 58410 78705 -24067 -132497 -145545 -87133 -118129 -122031 -155046 -84616 -97758
2409 -97758 -17381 53551 -4942 -58343 36697 -111199 -179546 -112580 -121628 -123011 -123679 10799
2397 10799 -21107 -62381 -78348 -117404 -91295 -120283 -120027 -91017 -68022 -69943 -26648 -51860
2385 -51860 -80432 -84474 -25864 -87473 -110210 -108890 -61324 -10428 -59875 -56435 -56527 -96850 -113220
2372 -113220 -69440 -92482 -198652 -137017 -257677 -225661 -34478 -21677 -60232 -102223 -73594
2361 -73594 -19505 -30544 -96600 -78439 3210 24808 -20179 -163501 -137335 -23501 -56103
2350 -56103 -42480 -47687 -146714 -76964 54592 -16717 -48991 -44944 -28514 -15742 -5721 46429
2338 46429 -75153 -60333 -49936 -122672 -180654 -119485 -72753 8647 39976 -40391 -81414 -22431
2326 -22431 88612 -45836 -89144 -199088 -160478 -225880 -227367 -112649 13230 58545 -20778
2315 -20778 -54558 -68306 -83338 -122692 -74494 -14517 -10535 -36119 -62609 50250 51952 37656
2303 37656 9843 -69032 -18776 -19561 18400 -62528 -28992 54737 48152 65528 -48183 -4561
2291 -4561 -40545 37959 -35018 -65237 -46117 -36814 23614 -62116 -48941 -12978 -131758 -104526
2279 -104526 -54892 -93863 -133780 -128275 -62794 -92730 -110530 -47871 -30405 -127838 -132251 -74155
2267 -74155 -79427 -104766 -87760 18669 -66056 -123330 -37912 -100419 -87312 -166700 -174107 -50954
2255 -50954 -64665 -58870 33293 12136 -71167 -115670 -120243 -59522 -10282 -6838 35898 18049
2243 18049 9448 46715 1105 -40110 -48828 15917 -11060 -16774 24839 -18063 5578 -1591 -26057
2230 -26057 -27488 -90612 -139277 -18047 17455 -65091 69035 -87690 -213325 -172561 -154364
2219 -154364 -88629 -124315 -132252 -147482 -106010 -97434 -87892 -71105 34780 78305 117239 81049
2207 81049 2782 13207 -26734 -75656 11847 85183 -34271 -32165 -17766 -4956 32139 -41645
2195 -41645 -46958 -75874 -37864 93648 78306 -41990 -7796 12559 55688 -2478 -50102 -142093
2183 -142093 -132341 -106864 -58131 12922 -28142 -36014 63504 38676 -44622 -48940 -115624 -48068
2171 -48068 -5189 -33905 -75061 -27034 60432 13700 22087 72225 24489 -11295 79170 96164
2159 96164 5857 6085 -38086 -15398 -78110 -103973 -103619 -24610 49197 45680 52807 -48802 -3219
2146 -3219 -39412 -40593 -63514 -39842 34159 18407 -117091 -131237 -110664 -118335 -9405 8813
2134 8813 126484 19577 -120012 -155745 -162862 -109699 -71117 -92733 -37438 -148518 -164856
2123 -164856 -127031 -161646 -83231 -19807 -43035 -32151 29161 38487 352 -53982 -34794 48332
2111 48332 14992 -6124 19367 -4055 -18273 3292 -46304 -129728 -45342 43717 -37353 22200
2099 22200 71590 -48692 -41013 -86638 -103575 -16772 -2642 -95458 -96995 -138232 -96838 -7585
2087 -7585 -103453 -54004 -59964 -93137 24928 35388 -19803 -150060 -144718 -58102 7786 -72068
2075 -72068 -11556 -121634 -112484 -48952 -27869 34081 -26654 -85377 -39574 -18109 -7865 -62376
2063 -62376 -51356 -114107 -75829 -5314 -105247 -22920 -29199 -22818 -118024 -96331 -25117 48094
2051 48094 -15310 -63810 -64366 -107808 -122341 -106603 -71467 -109566 -11664 81394 111965 142485
2039 142485 70816 32815 -17510 32319 53986 -15342 -110573 -35508 42574 -46044 -167634
2028 -167634 -30575 76557 -78046 -82487 -66341 -129224 -10605 -61420 -106015 -28190 48839
2017 48839 -98555 -141488 71685 3892 -63196 80144 84848 -42701 -52890 4053 -80697
2006 -80697 -65185 -51717 -3774 -14037 -172111 -112984 -12593 7996 46373 67888 32139
1995 32139 -102556 -77778 -38443 -82282 39795 49640 -7766 -9194 20703 88549 79450 60318
1983 60318 -29205 -63224 -20867 -10777 15829 -47204 11532 48091 -88649 -128896 -90654 -72884
1971 -72884 -24746 -100537 -112038 -80152 -162316 -101116 3991 20718 -11650 -99469 -107973 -137271
1959 -137271 -46105 -48998 -74765 12005 39477 20584 3200 -52432 -55176 -13561 78521 -33185
1947 -33185 -24508 -19633 48082 -24761 19293 20619 24760 17891 14866 39320 -1871 71334 24556
1934 24556 31333 -45852 15390 43336 21821 46382 26283 85744 99914 87380 3966 -70233
1922 -70233 -106259 -32651 123614 35375 39867 -13754 -36949 -39511 -96767 -34602 14827 62809
1910 62809 24006 373 -8189 40109 30278 -99019 -23938 -9051 54829 62274 40573 40394 22188
1897 22188 -137135 -65875 -66090 -46537 -5564 7406 -14734 -41001 15936 53114 57653 -76742
1885 -76742 -54132 -13195 -26304 57838 128181 132167 -58758 -79396 -18163 -103710 -77740 -26978
1873 -26978 -23461 14501 17558 37340 81678 37546 60813 -8066 -81534 -74036 13430 70420
1861 70420 61622 7703 22805 -3040 -47795 -46321 -17657 63119 47125 26982 -16431 -82636
1849 -82636 -80845 -110190 -34290 -71232 43710 49360 -37291 206 -18957 -81780 -2086 259
1837 259 -44962 106237 80197 -59629 96164 -28085 76667 88500 33307 74343 17948
1826 17948 5791 16982 16423 -77369 -112053 -64823 47581 -13592 -36499 38426 79914 -30819
1814 -30819 -2432 -13408 -59366 11629 37302 -126390 -85243 -135897 -112932 -72387 -15490 -63939
1802 -63939 -89479 19912 -41061 -16290 21451 -29475 4949 41625 47901 -18583 -26052 108713
1790 108713 77945 97630 116014 -5094 24146 48291 61008 -22450 -117699 -96731 9036
1779 9036 -34144 -58964 -57121 3114 30077 1861 -20770 -97545 -23098 -3191 -59599 -5565
1767 -5565 99704 53739 -4285 92526 56699 -62678 5273 51073 120882 131426 172875 135005
1755 135005 59859 -51470 -1846 -83066 -41442 -38757 12694 95215 74392 113924 -39667
1744 -39667 -34192 -34716 9153 -63138 -35090 -11394 75779 -15304 25489 89843 -38579 -125030
1732 -125030 -202 95394 28565 -80585 -4961 107954 109442 50308 -74196 -26984 -48707
1721 -48707 -26489 -64344 -73827 45795 55327 63423 43029 -61904 -80166 -49999 50010 -17501
1709 -17501 -54609 -9375 34450 -6872 1140 46446 72819 27404 84580 117487 37642 -60588
1697 -60588 -13939 30167 -13635 20104 -30775 -94361 -52740 13557 8301 61688 33452 -2622
1685 -2622 -23213 -57614 -23920 -4065 5976 -53459 -92157 -66623 -119560 -68446 -73118 17077
1673 17077 -61100 -103235 -66457 -99221 -58042 -51859 -16273 119251 236000 65616 3973
1662 3973 15520 76889 8813 79751 134938 45790 2158 127018 45225 -24262 -14055 8968
1650 8968 -10853 22880 67773 134336 66863 -31811 57019 34843 19540 -14173 12020 102976
1638 102976 32075 27912 125336 141766 -13044 -46059 21413 -62692 -85665 -50656 30800 28954
1626 28954 -9088 12452 6695 -21429 93830 117450 6827 -92925 -25071 13085 12120 -34725
1614 -34725 -50892 11070 84197 144533 109229 107443 -54311 -60356 -67154 -84570 -114664 8291
1602 8291 156912 70328 117480 102960 115969 31838 -81796 -38234 -59679 -399 101607
1591 101607 -12500 -82831 -57174 13407 -41362 -19709 39207 -45859 6336 83546 -18892
1580 -18892 -68230 -52073 -110751 -27354 25114 -98966 -40875 81607 147984 -62380 -13574
1569 -13574 -23923 63849 41474 -55050 -113134 -110251 -61593 24067 19940 6625 24919 32632
1557 32632 13637 30748 -40263 -51194 -29930 -99556 -97662 -38275 -54531 -25864 -56619 21385
1545 21385 -11821 -14152 105442 9925 -81865 -108883 -35376 -62306 84801 65325 138578 108749
1533 108749 106302 76686 115870 167806 83585 71025 8528 -99570 3235 33862 81009
1522 81009 172330 80594 20267 -4645 124943 39598 -93408 -36831 -34329 -7425 35385 48417
1510 48417 366 -29096 -32799 -24831 37880 -49502 -108635 36094 62738 9594 -53994 24760
1498 24760 58161 -5954 18508 21092 -31902 -84544 -155889 -19464 -11845 -12586 -42807 -25171
1486 -25171 33644 158975 144935 142734 42341 -5320 43197 7258 -10729 -83891 -22055 33937
1474 33937 -3104 -35961 -17227 -17061 -45293 72136 185498 106590 20516 -2102 -62476 -33247
1462 -33247 34812 120109 25187 -22377 -28354 -35402 -3233 80102 26651 55750 121868 51297
1450 51297 86977 90774 1437 -49453 -82722 -80825 -65383 26048 -12694 -44213 -17010 -61553
1438 -61553 -63032 -49871 43859 -40938 -46119 -30713 -21032 -44318 -10606 -75496 -18324 31183
1426 31183 -102552 -76235 55 -37321 -64669 -122323 -109261 -145531 -66384 32009 -27097 -23940
1414 -23940 8257 9217 73986 27151 70375 56405 54139 13571 16994 136846 32908 -60481
1402 -60481 -3314 -53630 -36664 -119422 16781 43873 58214 -8461 -44100 -122976 -86968 -89881
1390 -89881 -90171 -81868 -62535 18164 -38514 -53921 9677 21796 23601 68619 19510 73759 -37815
1377 -37815 -21964 57512 44518 61286 -2790 -71921 -13212 -9707 8336 -24434 -97351 -16611
1365 -16611 66754 32412 -18243 19082 120627 44874 24251 48970 94779 6857 -20188 -29775
1353 -29775 -27612 -33605 3821 9304 -89146 -90095 -87679 -33161 52918 35658 60716 21756 -45689
1340 -45689 48713 166884 83828 35472 -62310 21768 88213 98474 -5749 -33955 85688
1329 85688 150936 138288 136059 -12665 -88846 -104724 22755 76480 5946 91169 -15158
1318 -15158 -57083 39306 16823 10761 99862 129089 120814 216933 131071 86382 84762 77009 120202
1305 120202 115463 104175 9713 9659 -59726 2833 62466 -6142 -13870 -25878 -16204 68226 35264
1292 35264 74622 51019 49369 82797 42565 -76726 -30846 19977 -37500 -35027 -85844 -94494
1280 -94494 -129614 -137817 -51446 -168235 -139438 -148579 -25772 3908 14641 -46018 47405 117343
1268 117343 101066 158671 44954 -37421 -33998 36614 42273 38167 24773 27367 73291 72345 82745
1255 82745 102081 17692 -47751 -22078 -13830 -72263 -138066 -73297 66262 31884 61130 161974
1243 161974 88921 -67308 -89310 14651 28928 -4010 51298 95242 98349 96787 151379 53879
1231 53879 79795 46373 48230 124450 150091 112461 5884 -54432 -32844 95817 51022 84947
1219 84947 137078 68276 38673 -47988 -14964 79546 24609 -44008 54778 -91828 -131347 -143031
1207 -143031 -75187 -82883 -137932 -123640 -113909 -59930 -5530 36071 31855 -62604 -81140 29257
1195 29257 -144236 -207375 -148186 -131596 -26811 -54709 -7802 35249 -31682 -12300 11149
1184 11149 -21306 83827 118101 -684 49725 108998 127636 132676 95771 65043 -52129
1173 -52129 65317 156788 200269 91163 43772 823 -68618 12476 31169 54252 -43509
1162 -43509 -47186 -146396 -141262 -153091 -57757 -21230 52366 2207 -58572 -12362 20837 32485
1150 32485 83013 82714 69115 -36540 -1716 10338 79610 85610 86775 30338 -45047 -55667
1138 -55667 -99495 -85257 -132758 -51339 -98591 -133545 66502 38218 49169 26981 12135 -11350
1126 -11350 -8909 17516 40831 -68489 20106 171289 133045 26161 -67468 -30146 -82881
1115 -82881 25684 829 -89991 -116542 -53779 -79506 -32877 74165 147055 49592 76855
1104 76855 29299 18835 -75586 -66705 -12372 -9303 -89726 -97242 -46675 22623 -28241 -41512
1092 -41512 -89372 -74804 36004 20511 -56579 -53535 -12689 -6107 49309 -21937 -78022 -61193
1080 -61193 85104 143899 62634 -89767 33624 109671 41870 94281 122685 99761 116833
1069 116833 156940 62696 21732 -31289 -52696 -15089 -13703 42818 36503 -47162 -7005 -10429
1057 -10429 -83798 -61394 111443 120900 78299 151744 118653 90933 123948 -8331 21275 91037
1045 91037 96333 24954 31376 52018 -3888 48581 110069 170508 92689 149693 199583 181451
1033 181451 -14873 897 56296 48018 219058 227782 120803 82568 9845 67644 129443
1022 129443 56766 27234 53332 -4227 429 13102 36360 -39896 -148081 -94756 56446
1011 56446 14294 11120 -40394 -35704 30501 17649 -26913 -79402 -134740 -68732 -31616 16739
999 16739 -815 13067 25100 -5421 15270 -97554 -10833 55011 -45930 1122 -30610 -10992
987 -10992 71175 65629 44913 49909 -12868 28639 -29682 -72673 -4893 -157681 -189421 -94752
975 -94752 -18690 18715 50459 26237 2928 -70804 -57756 47831 60330 38427 67596 -1807
963 -1807 26523 44336 11412 55005 115718 -26779 -65750 -121865 -70537 65784 149107 155582
951 155582 49028 94011 90004 -8845 74897 -17521 12789 -105090 -83248 -46342 -14472 100969
939 100969 74053 37931 -86919 -32743 34180 41446 16704 -15056 -16481 629 -39813 -103076
927 -103076 -6807 -14766 81195 44859 -14270 -44467 -43634 20168 10876 -44800 -89462 -75098 -30028
914 -30028 7247 -35089 -51011 -91997 -99504 -10535 103841 -22279 -72470 -40063 -26532 -48516
902 -48516 -124373 -116726 37486 17869 -56954 -72874 -33666 -88063 -67920 53355 76765 116668
890 116668 93429 82511 90396 43283 25985 -111710 -30071 -8014 65787 -74630 -132544 -8641
878 -8641 208390 88355 -8164 75609 88140 18682 -8826 -81796 -29567 63423 2303 42619
866 42619 21769 88947 21003 -2905 -22756 112986 55680 23839 -57831 -39947 47872 88538
854 88538 13276 -121808 -55549 44077 59016 175451 118970 146050 26475 -68883 -111270
843 -111270 -44222 55980 -45743 -21141 -33330 -20332 -22984 43494 32432 -15912 -8123 62313
831 62313 80562 76996 -2943 -3875 -49770 36787 99559 192753 129279 37493 237 90740 10340
818 10340 -109898 -29944 -5662 51591 24854 -44638 -32551 84492 116504 134374 -969
807 -969 -51645 24002 139126 76843 559 66779 9704 -52180 61130 -39720 -92932 -42217
795 -42217 -66592 -65240 -36295 -25611 -9127 -2375 -65731 1029 7098 137631 113433 27457
783 27457 28789 -33771 2383 48162 6390 19713 90475 167520 229408 179924 128333 51997
771 51997 -3484 -30781 -7633 -23758 -37440 -41701 11594 26963 52249 -50280 -25672 61561
759 61561 114384 66433 8923 21239 -1834 21114 -9720 86463 -16113 -85966 -86347 -73543
747 -73543 -55453 -51315 70872 76669 24120 30714 97959 100427 72903 156756 149660 159259 47219
734 47219 3119 -55761 -6681 103055 55200 60320 79165 19092 -28485 31908 106118 1440
722 1440 -2919 -64755 -99364 -29136 -79426 21533 -12979 -27547 -18354 39249 -37984 86123
710 86123 101470 43005 57368 92820 82315 -9322 -28080 14822 47470 -12757 -99843 -125998
698 -125998 -73814 -71795 -8372 91166 99307 71471 -8991 1567 3828 35786 42674 10527 2841
685 2841 -166140 -172726 9974 65788 -42516 -71303 -24980 -26727 90879 69156 32425 3052
673 3052 23861 -29143 -11433 99925 83964 -28121 -18242 55279 -42794 -7676 48176 -25781
661 -25781 -43238 -2070 -78589 17346 18234 -28156 -6592 99194 139 -27182 40485 37127
649 37127 -46166 -304 149757 105597 112218 68379 3555 20362 -35992 -6870 23791 26033
637 26033 596 -22313 -16085 -33261 37823 30110 -43630 21255 71126 -18391 -74557 -65302 -37539
624 -37539 -24336 -37517 -36485 -9897 -47301 -127802 17027 108110 69056 154460 149096 51666
612 51666 150926 88667 74929 9269 -80923 -121639 -119090 -30035 -67869 -33910 708 41678
600 41678 16767 33821 156462 218882 -10175 -106989 -69971 -36401 30267 -43378 50965 145837
588 145837 -1930 -75928 82784 -36820 -67939 -16889 -9856 2601 26290 -9888 -13688 -37792
576 -37792 -77994 -79041 -98587 -32837 18177 -31966 -73158 24737 62688 -25529 -7138 13518
564 13518 74677 16213 -75391 53301 13433 -23518 -23682 -34677 -46295 -74785 -92342 2503
552 2503 -40742 9772 66147 15212 -75958 -156373 2368 113001 -64710 -169787 -168673 -81350
540 -81350 -102163 -7724 55046 -29335 -145146 -72281 -35907 -72600 -49575 -42383 -42841 -51641 -32819
527 -32819 -10974 19695 41235 106480 137094 38086 -7243 24555 -7747 -114861 -141716 -98752
515 -98752 -52755 -118949 -105685 9169 -13916 68542 69743 115413 76385 -2395 16718 -28022
503 -28022 20822 -43074 6269 -1579 -50739 -108163 -129859 -31343 10689 41730 126131 108733
491 108733 88168 54820 -28724 36323 127209 66347 22826 -74503 -57236 -9346 -37735 -29475
479 -29475 -82205 -37373 -105876 -143996 -33487 75781 25917 130850 255174 124356 -78172
468 -78172 6089 30289 88828 -7555 -52486 32789 56436 74227 57246 65022 -35795 -73260
456 -73260 -91860 -97385 45957 22745 -9599 125393 -2129 26456 61394 148044 159236 58372
444 58372 469 -25923 22093 36383 96813 18943 9624 10883 -39237 -7327 112395 127784
432 127784 99410 -30976 19440 10650 -21512 20660 -35202 -21668 -49161 -50645 -16710 48245
420 48245 -21245 -15384 141782 104888 56360 -11266 -6261 15810 8868 38383 35600 98751 118681
407 118681 20060 43092 56510 28922 68520 1490 -24001 35927 33695 -21021 10537 31797
395 31797 44717 16261 -42637 -89499 -81685 52072 2618 -84474 -120051 -61751 -68090 -74677
383 -74677 -78987 -58331 9839 20484 72217 -25412 -130443 -66801 -47111 42973 22820 -6222
371 -6222 -41158 -97023 -43893 -101364 -67216 52329 198400 64373 103626 33096 49992 27413
359 27413 -80402 29529 -56899 37 30237 14390 -25780 818 -49837 2108 -41244 -95129
347 -95129 -19708 -60566 -103756 -96503 12070 30441 7205 38913 -31876 -30209 33455 -31319
335 -31319 5825 80544 60853 -5098 4058 -35286 -3473 60089 120063 23709 -1205 11220
323 11220 -29080 29287 106307 91047 49357 -104893 -117398 -102904 78409 26171 -27268 47850
311 47850 -1384 546 52895 173790 126146 46244 24331 -31537 43464 116673 -17904 -11773
299 -11773 -68038 -130021 -64914 -78540 58221 156203 77829 -69316 -87196 -116751 -66496 44446
287 44446 101626 61719 35023 -26440 -95712 -172450 -156592 48343 91057 147632 69342 23643
275 23643 -23506 82373 54002 47373 43669 146551 45662 -2781 12145 -49295 -13638 -134558
263 -134558 -155783 18008 90418 3061 -43182 16491 42650 -26648 -72896 -26968 -178403
252 -178403 -44248 7746 -17150 85332 111194 78226 39977 -27497 38746 10678 -116265
241 -116265 26054 22069 1743 -29858 65315 14571 -20088 -91162 -35588 -116604 -153556 -59683
229 -59683 -24174 -37372 28171 123504 65631 72866 59571 17820 70021 47652 -34008 13632
217 13632 2316 -205065 -257722 -225355 -98779 -104278 -124906 -83927 51718 -4539 -26816 -54551
205 -54551 -36389 -22754 -34187 106327 58576 -76375 -154879 -122036 2039 11046 -16799 60565
193 60565 55302 103189 -3546 1138 58937 24727 -114057 -30372 -127745 -137988 -138723 -93450
181 -93450 23138 127154 100225 34935 26773 44676 111680 89917 90346 -7267 -7989 -20679 -43468
168 -43468 -5492 70163 95957 12920 -27968 -89001 -84973 -149498 -142299 -69428 -80026 -50800
156 -50800 -46430 -15598 83881 12593 -29663 39603 -30981 -21405 -65427 -43624 -52351 -76612 -13173
143 -13173 -39505 85250 88521 -20784 7614 74029 78243 19780 17834 35839 -11004 -47223
131 -47223 -24662 48818 83571 157745 145321 57788 38997 25789 -54786 29807 102010 -13316
119 -13316 -22545 21656 68515 -36393 -14118 -8792 2004 -10891 -34753 -36473 -116293 -91558
107 -91558 -50053 24751 115670 93538 26078 -49051 -36225 10035 -59650 -153237 -189155 -190466
95 -190466 -103240 -27889 -7863 -8102 -113589 -140507 -61695 -30721 -12753 85657 94166 80765
83 80765 93373 93946 103090 79072 -27329 -22478 -16329 -1835 7283 4351 -19593 -59369 4292
70 4292 9495 -5660 -70425 -80512 -72219 9889 -1759 10562 15717 15268 -66155 -31996 -41847 22193
56 22193 16297 -14198 -59310 -90055 -78914 7205 27146 49874 566 -4291 47661 5950 -43618
43 -43618 -37937 -12540 -49403 19663 20398 -2539 -52956 -879 -49261 15001 108391 77400 -36376
30 -36376 -73686 217 -27837 -31029 -48419 -38723 -52632 -43966 11893 34119 8877 94986 52746
17 52746 -44005 -4912 -18161 -52683 -90118 -63784 -34628 -61426 -124637 -17881 17895 -16170
5 -16170 -38452 34099 62044 45367 19268
0 19268
$$ Imaginary data points
##PAGE= N=2
##DATA TABLE= (X++(I..I)), XYDATA
16383 -859969 -766817 -656759 -659495 -662321 -644728 -634180 -636814 -562081 -550636 -593540 -510034 -548886
16371 -548886 -563287 -531158 -464155 -455698 -448048 -453922 -447344 -463269 -447555 -439359 -429070 -351964
16359 -351964 -363154 -325111 -296936 -274728 -217570 -254092 -206229 -174971 -178701 -125280 -76385 -110863
16347 -110863 -160212 -44333 -50245 -18089 -43347 9303 34133 41006 82060 28437 -21630 40977
$$ [...]
##END NTUPLES=NMR SPECTRUM
##END=
