##TITLE=1H_CG-1206-A
 CDCl3
 8 sc, 
 25.6.2024
##JCAMPDX= 6.0         $$ Bruker NMR JCAMP-DX V2.0
##DATA TYPE= NMR SPECTRUM
##DATA CLASS= NTUPLES
##ORIGIN= UXNMR, Bruker Analytische Messtechnik GmbH
##OWNER= root
$$ XWIN-NMR		Version 3.5
$$ Tue Jun 25 15:50:42 2024 Russian Standard Time (UT+4h)  she@DPX200
##.OBSERVE FREQUENCY= 200.1311
##.OBSERVE NUCLEUS= ^1H
##.ACQUISITION MODE= SIMULTANEOUS
##.ACQUISITION SCHEME= undefined
##.AVERAGES= 8
##.DIGITISER RES= 18
##SPECTROMETER/DATA SYSTEM= spect
##.PULSE SEQUENCE= zg30
##.SOLVENT NAME= DMSO
##.SHIFT REFERENCE= (INTERNAL, DMSO, 0, 14.417)
##AUDIT TRAIL= $$ (NUMBER, WHEN, WHO, WHERE, WHAT)
$$ ##TITLE= Audit trail, XWIN-NMR		Version 3.5
$$ ##JCAMPDX= 5.01
$$ ##ORIGIN= Bruker BioSpin GmbH
$$ ##OWNER= she
$$ F:/spectra/data/she/nmr/H-F/1/pdata/1/auditp.txt
$$ ##AUDIT TRAIL=  $$ (NUMBER, WHEN, WHO, WHERE, WHAT)
(   1,<2024-06-25 15:49:36.93 +0400>,<she>,<DPX200>,
      <created by zg, POWCHK disabled, PULCHK disabled
       configuration hash MD5:
       00 E9 B6 7A A2 85 ED C7 34 08 36 98 17 FE 4E 26
       data hash MD5: 16K
       57 BA 7B 53 70 0F 9A 2F A6 2A E9 9F 7E 0D E3 6B>)
(   2,<2024-06-25 15:49:39.32 +0400>,<she>,<DPX200>,
      <Start of raw data processing
       efp BC_mod = 2 LB = 0.24 FT_mod = 6 PKNL = 1 PHC0 = -25313.89 PHC1 = 9.987479 SI = 16K 
       data hash MD5: 16K
       E8 89 9C B2 D8 DC 59 A3 BB C5 90 B0 56 CE 34 FC>)
(   3,<2024-06-25 15:50:00.71 +0400>,<she>,<DPX200>,
      <pk PHC0 = -1.884828 PHC1 = 2.2 
       data hash MD5: 16K
       0C 77 6B 3C 50 B3 EC A2 F9 D6 FD E6 82 F9 A2 26>)
(   4,<2024-06-25 15:50:04.09 +0400>,<she>,<DPX200>,
      <abs ABSG = 5 
       data hash MD5: 16K
       69 9C B2 7A 60 28 47 1A 65 02 0C 83 44 87 CE 4F>)
$$ ##END=
$$ 
$$ hash MD5
$$ 2C CF 47 15 1E 26 EA F5 74 6C FA 53 79 60 6D 90
##$RELAX= 
##$RELAX= 
##$RELAX= 
##$RELAX= 
##$RELAX= 
##$RELAX= 
$$ Bruker specific parameters
$$ --------------------------
##$DU= <F:/spectra>
##$EXPNO= 1
##$NAME= <H-F>
##$PROCNO= 1
##$TYPE= <nmr>
##$USER= <she>
##$AMP= (0..31)
100 100 100 100 100 100 100 100 100 100 100 100 100 100 100 100 100 100 
100 100 100 100 100 100 100 100 100 100 100 100 100 100 
##$AQSEQ= 0
##$AQ_mod= 1
##$AUNM= <au_zg>
##$AUTOPOS= <>
##$BF1= 200.13
##$BF2= 200.13
##$BF3= 200.13
##$BF4= 200.13
##$BF5= 200.13
##$BF6= 200.13
##$BF7= 200.13
##$BF8= 200.13
##$BYTORDA= 1
##$CFDGTYP= 0
##$CFRGTYP= 5
##$CHEMSTR= <none>
##$CNST= (0..31)
1 1 145 1 1 1 1 1 1 1 1 1 1 1 1 1 1 1 1 1 1 1 1 1 1 1 1 1 1 1 1 1 
##$CPDPRG= <>
##$CPDPRG1= <>
##$CPDPRG2= <>
##$CPDPRG3= <>
##$CPDPRG4= <mlev>
##$CPDPRG5= <mlev>
##$CPDPRG6= <mlev>
##$CPDPRG7= <mlev>
##$CPDPRG8= <mlev>
##$CPDPRGB= <>
##$CPDPRGT= <>
##$D= (0..31)
0 1.2 0 0 0 0 0 0 0 0.06 0 0.03 0 0 0 0 0.0002 0 0 0 0 0 0 0 0 0 0 0 0 
0 0 0 
##$DATE= 1719316176
##$DBL= (0..7)
120 120 120 120 120 120 120 120 
##$DBP= (0..7)
150 150 150 150 150 150 150 150 
##$DBP07= 0
##$DBPNAM0= <>
##$DBPNAM1= <>
##$DBPNAM2= <>
##$DBPNAM3= <>
##$DBPNAM4= <>
##$DBPNAM5= <>
$$ [...]
##$SUBNAM3= <"">
##$SUBNAM4= <"">
##$SUBNAM5= <"">
##$SUBNAM6= <"">
##$SUBNAM7= <"">
##$SUBNAM8= <"">
##$SUBNAM9= <"">
##$SW= 18.051750892319
##$SWIBOX= (0..15)
0 0 2 0 0 0 0 0 0 0 0 0 0 0 0 0 
##$SW_h= 3612.71676300578
##$TD= 16384
##$TD0= 1
##$TE= 0
##$TE2= 300
##$TE3= 300
##$TEG= 300
##$TL= (0..7)
0 120 120 120 120 120 120 120 
##$TP= (0..7)
150 150 150 150 150 150 150 150 
##$TP07= 0
##$TPNAME0= <>
##$TPNAME1= <>
##$TPNAME2= <>
##$TPNAME3= <>
##$TPNAME4= <>
##$TPNAME5= <>
##$TPNAME6= <>
##$TPNAME7= <>
##$TPOAL= (0..7)
0.5 0.5 0.5 0.5 0.5 0.5 0.5 0.5 
##$TPOFFS= (0..7)
0 0 0 0 0 0 0 0 
##$TUNHIN= 0
##$TUNHOUT= 0
##$TUNXOUT= 0
##$USERA1= <user>
##$USERA2= <user>
##$USERA3= <user>
##$USERA4= <user>
##$USERA5= <user>
##$V9= 5
##$VALIST= <valist>
##$VCLIST= <CCCCCCCCCCCCCCC>
##$VD= 0
##$VDLIST= <DDDDDDDDDDDDDDD>
##$VPLIST= <PPPPPPPPPPPPPPP>
##$VTLIST= <TTTTTTTTTTTTTTT>
##$WBST= 1024
##$WBSW= 4
##$XGAIN= (0..3)
0 0 0 0 
##$XL= 0
##$YL= 0
##$YMAX_a= 595770
##$YMIN_a= -946237
##$ZGOPTNS= <>
##$ZL1= 120
##$ZL2= 120
##$ZL3= 120
##$ZL4= 120
##$ABSF1= 14.45558
##$ABSF2= -3.59627
##$ABSG= 5
##$ABSL= 3
##$ALPHA= 0
##$AQORDER= 0
##$ASSFAC= 0
##$ASSFACI= 0
##$ASSFACX= 0
##$ASSWID= 0
##$AUNMP= <proc_1d>
##$AZFE= 0.1
##$AZFW= 0.1
##$BCFW= 0
##$BC_mod= 2
##$BYTORDP= 0
##$COROFFS= 0
##$CY= -3
##$DATMOD= 1
##$DC= 0
##$DFILT= <>
##$DTYPP= 0
##$F1P= 0
##$F2P= 0
##$FCOR= 1
##$FTSIZE= 16384
##$FT_mod= 6
##$GAMMA= 0
##$GB= 0
##$INTBC= 1
##$INTSCL= 3.70164e-10
##$ISEN= 128
##$LB= 0.24
##$LEV0= 0
##$LPBIN= 0
##$MAXI= 10000
##$MC2= 0
##$MEAN= 0
##$ME_mod= 0
##$MI= 1.114404
##$NCOEF= 0
##$NC_proc= -6
##$NLEV= 6
##$NOISF1= 3.799351
##$NOISF2= 2.8
##$NSP= 0
##$NTH_PI= 0
##$NZP= 0
##$OFFSET= 14.41702
##$PC= 1
##$PHC0= -25315.78
##$PHC1= 12.18748
##$PH_mod= 1
##$PKNL= yes
##$PPARMOD= 0
##$PSCAL= 0
##$PSIGN= 0
##$REVERSE= no
##$SF= 200.13002107938
##$SI= 16384
##$SIGF1= 3
##$SIGF2= 2
##$SINO= 5.538805
##$SIOLD= 16384
##$SREGLST= <1H.CDCl3>
##$SSB= 0
##$STSI= 16384
##$STSR= 0
##$SW_p= 3612.71676300578
##$SYMM= 0
##$S_DEV= 0
##$TDeff= 16384
##$TDoff= 0
##$TI= <>
##$TILT= no
##$TM1= 0
##$TM2= 0
##$TOPLEV= 0
##$USERP1= <user>
##$USERP2= <user>
##$USERP3= <user>
##$USERP4= <user>
##$USERP5= <user>
##$WDW= 1
##$XDIM= 16384
##$YMAX_p= 339934212
##$YMIN_p= -559590
$$ End of Bruker specific parameters
$$ ---------------------------------
##NTUPLES= NMR SPECTRUM
##VAR_NAME=  FREQUENCY,     SPECTRUM/REAL,   SPECTRUM/IMAG
##SYMBOL=    X,             R,               I
##VAR_TYPE=  INDEPENDENT,   DEPENDENT,       DEPENDENT
##VAR_FORM=  AFFN,          ASDF,            ASDF
##VAR_DIM=   16384,         16384,           16384
##UNITS=     HZ,            ARBITRARY UNITS, ARBITRARY UNITS
##FACTOR=    0.220516191357247, 1,           1
##FIRST=     2885.2784852926, 0,             0
##LAST=      -727.438277713178, 0,           0
##MIN=       -727.438277713178, -559590,     0
##MAX=       2885.2784852926, 339934212,     0
$$ Real data points
##PAGE= N=1
##DATA TABLE= (X++(R..R)), XYDATA
$$ [...]
8942b19879j8697n4124K4066J2364J712K5233Q2144l5074M903p6524n3917m9455
$$ -219879 -238576 -292700 -268634 -256270 -254558 -229325 -147181 -182255 -177352 -253876 -307793 -357248
8930c57248J9229J20729n769N523M853r844J10697k0717K39j10440J6760K1541
$$ -357248 -338019 -217290 -223059 -217536 -212683 -222527 -111830 -132547 -132308 -242748 -225988 -204447
8918b04447o059M8894l4026o962p736j9970r238k129P8530r9705k6995k263n8119
$$ -204447 -210506 -161612 -195638 -202600 -210336 -230306 -239544 -241673 -163143 -262848 -289843 -292106 -350225
8905c50225n0892P3923n135p9395J01622q321J17212K4941r4699k344Q6490p8313
$$ -350225 -401117 -327194 -332329 -411724 -310102 -318423 -201211 -176270 -270969 -273313 -186823 -265136
8893b65136j25909L9654L5922m3218J34251r0080J04471J825j7895l4254r6425
$$ -265136 -391045 -351391 -315469 -358687 -224436 -314516 -210045 -208220 -226115 -260369 -356794
8882c56794k7928L9516j132L8710J4996J7295o0382r8060J082J69251o959j7612
$$ -356794 -384722 -345206 -346338 -307628 -292632 -275337 -335719 -433779 -432697 -263446 -270405 -288017
8870b88017R6038j5201k1694m7116m0212M3291L7044L173J07283o4928j11496
$$ -288017 -191979 -207180 -228874 -275990 -316202 -272911 -235867 -232694 -125411 -190339 -301835
8859c01835M5894l7115m5332P8190R3377R5J3740j681j06053j492l1791J18650
$$ -301835 -255941 -293056 -338388 -260198 -166821 -166726 -152986 -154667 -260720 -262212 -294003 -175353
8847a75353L4822m6039N0698O1479j9787m788L7914J9722k5676q222P279P1859
$$ -175353 -140531 -186570 -135872 -74393 -94180 -98968 -61054 -41332 -67008 -75230 -67951 3908
8835C908m9393l9592M2047Q9708M5633j23643P2825Q6427j15480M048L3567q2245
$$ 3908 -45485 -85077 -43030 46678 92311 -31332 41493 127920 12440 16488 50055 -32190
8823c2190J4938J16775o0171k0151J16580q4993J6182J9678o9215J00868o99r3037
$$ -32190 -17252 99523 39352 19201 135781 50788 66970 86648 17433 118301 117602 24565
8811B4565l4569N3102M6127k1642n6418l8582L2476j29822k2886J31277p457j52925
$$ 24565 -10004 43098 89225 67583 11165 -27417 5059 -124763 -147649 -16372 -23829 -176754
8799a76754M9977Q2359p9480K9693Q7782K9650P568j52498q884L0787k7179J14111
$$ -176754 -126777 -44418 -123898 -94205 -6423 23227 30795 -121703 -130587 -99800 -126979 -12868
8787a2868J1775O9770k1633j7822K2693Q8677k1028J14131r0882j08384J2438
$$ -12868 -1093 68677 47044 29222 51915 140592 119564 233695 142813 34429 46867
8776D6867r5148M3991R995Q2705k3177J30653O8735j36514p4449j01585N0602
$$ 46867 -48281 -4290 5705 88410 65233 195886 264621 128107 53658 -47927 2675
8765B675Q301m5628l2956m9004k6049J26746L4449m6843J15136j58586J3992n4102
$$ 2675 10976 -34652 -67608 -116612 -142661 -15915 18534 -28309 86827 -71759 -57767 -111869
8753a11869N2851m4449r4659p1440l9786J74949P0515j49521j29166J41151R793
$$ -111869 -59018 -103467 -198126 -269566 -309352 -134403 -63888 -213409 -342575 -201424 -191631
8742a91631K0182O7325P4735o7883k3315j4913K0931L1566L1553P0114n8209q9798
$$ -191631 -171449 -104124 -29389 -97272 -120587 -135500 -114569 -83003 -51450 18664 -39545 -129343
8730a29343k1176j4175R327k5260m028k8525J01285N484L734K7436q3818p1490
$$ -129343 -150519 -164694 -155367 -180627 -184655 -213180 -111895 -106411 -102677 -75241 -159059 -230549
8718b30549M2673J08687j9880q3112j1961O7143Q588n2612J625L6357Q4037j02378
$$ -230549 -187876 -79189 -99069 -182181 -194142 -126999 -118411 -171023 -169398 -133041 -49004 -151382
8706a51382O0029J5840n3121O1901q5948J24766q7110J782L8053k4183K6380l5305
$$ -151382 -91353 -75513 -128634 -66733 -152681 -27915 -115025 -113243 -75190 -99373 -72993 -108298
8694a08298k3252L8751k9397j7912L5486k3153m626r6608K2021L7203L7315K15097
$$ -108298 -131550 -92799 -122196 -140108 -104622 -127775 -132401 -229009 -206988 -169785 -132470 82627
8682H2627m2389j29369K3278n236l3136M9099M0888n2285R5786j00417r585j7481
$$ 82627 40238 -89131 -65853 -71089 -104225 -55126 -14238 -66523 29263 -71154 -80739 -98220
8670i8220Q48q6639j0932J01803L8159J11458p8014P241J245l2913K0357M4370
$$ -98220 -97372 -184011 -194943 -93140 -54981 56477 -21537 -14296 -13051 -45964 -25607 18763
8658A8763J8016j12693M2589Q2354K1764j0348j73542J5925L5516O5501K1701
$$ 18763 36779 -75914 -33325 49029 70793 60445 -113097 -97172 -61656 3845 25546
8647B5546j16153j6553M8417p6228j5926n7615J44060p4087j9367M0274j8629
$$ 25546 -90607 -107160 -58743 -134971 -150897 -208512 -64452 -138539 -157906 -117632 -136261
8636a36261J7810j16905o9131N7815J8066l4204Q0643O5970j29060n3582R3733
$$ -136261 -118451 -235356 -304487 -246672 -228606 -262810 -182167 -116197 -245257 -298839 -205106
8625b05106J03407j00523l2235J34984j12382r285K0450r11k0659O1888n903N1508
$$ -205106 -101699 -202222 -234457 -99473 -211855 -221140 -200690 -201601 -222260 -160372 -166275 -114767
8613a14767j0144n9595J1508N9181j11873J31921j4537o4119J75214j0379j0355
$$ -114767 -124911 -184506 -172998 -113817 -225690 -93769 -108306 -172425 2789 -7590 -17945
8602a7945K5753q717j03982n6144m2372q0853N2286O6577l4041M6596j30542N5821
$$ -17945 7808 -909 -104891 -161035 -203407 -284260 -231974 -165397 -199438 -152842 -283384 -227563
8590b27563j2018Q0469L4438p245L5905J7030l6655M0337N2111p9905q7272p3654
$$ -227563 -239581 -159112 -124674 -131919 -96014 -78984 -115639 -75302 -23191 -103096 -190368 -264022
8578b64022N1049J71287J2186l2756p8798J37998K877j78365J8075j29177J5217
$$ -264022 -212973 -41686 -29500 -62256 -141054 -3056 -179 -178544 -160469 -289646 -274429
8567b74429Q992N9400j3706o777L816K6382P7689j2099p0025l0853N822M1502
$$ -274429 -265437 -206037 -219743 -226520 -222704 -196322 -118633 -130732 -200757 -231610 -225788 -184286
8555a84286J9695K8027k7871Q241L67k1051K2995j21501l9472P2688P62l0330
$$ -184286 -164591 -136564 -164435 -156194 -155827 -176878 -153883 -275384 -314856 -242168 -241406 -271736
8543b71736P526P7727j9551m016K5402R1905l5685j20994r1696J06607Q128k5763
$$ -271736 -264210 -186483 -206034 -210050 -184648 -92743 -128428 -249422 -341118 -234511 -226383 -252146
8531b52146p220P6857o9438j10575N3225M081K032l0437L3803O3483j7667R1577
$$ -252146 -259366 -182509 -251947 -362522 -309297 -305216 -303184 -333621 -299818 -236335 -254002 -162425
8519a62425j6050o7583l3868P0244q1979k920k7732p7052L0401k43P8311k0149
$$ -162425 -178475 -246058 -279926 -209682 -291661 -294581 -322313 -399365 -368964 -369207 -290896 -311045
8507c11045J06013o0707m6099L2535o3996K3222K5438k7240l0113j1235K5773
$$ -311045 -205032 -265739 -311838 -279303 -343299 -320077 -294639 -321879 -351992 -363227 -337454
8496c37454K5565M970R8310J6755j37633Q0062R4225J1864K2124K6284j33934
$$ -337454 -311889 -306919 -208609 -191854 -329487 -249425 -155200 -143336 -121212 -94928 -228862
8485b28862j9912j8832O0004L0790J7172R2138j43539J1564n4423j00617M3889
$$ -228862 -248774 -267606 -207602 -176812 -159640 -67502 -211041 -199477 -253900 -354517 -310628
8474c10628N9405M777n729m2997O4777j10020l6896P0033O6687o5412O49R3553
$$ -310628 -251223 -246446 -252175 -295172 -230395 -340415 -377311 -307278 -240591 -306003 -305354 -211801
8462b11801l9467O3771j01066N1923K0845r807m9067M255l0018R793N0688k4824
$$ -211801 -251268 -187497 -288563 -236640 -215795 -225602 -274669 -270414 -300432 -290639 -239951 -264775
8450b64775n2893o1052k0150Q5203j03672n10J5694K8122r2899J18860M5069L1746
$$ -264775 -317668 -378720 -398870 -313667 -417339 -417849 -402155 -374033 -466932 -348072 -303003 -271257
8438b71257Q5100k2954P8851j2179j29514O1973l0162q2550Q304n4040L2871R8674
$$ -271257 -186157 -209111 -130260 -142439 -271953 -209980 -240142 -322692 -314388 -368428 -335557 -236883
8426b36883L765m6271L7189l9183M3781l0540K4205P310j32529Q4614J74790r3457
$$ -236883 -233118 -279389 -242200 -281383 -237602 -268142 -243937 -236627 -369156 -284542 -109752 -203209
8414b03209l1739M1688n07N054m8142M7666J11091l4134R3474j07264j9266K4552
$$ -203209 -234948 -193260 -193767 -188713 -236855 -189189 -78098 -112232 -18758 -126022 -145288 -120736
8402a20736J793l6272j9351j0655p2895O1385J6730N5211m1561K2373J20681n7618
$$ -120736 -118943 -155215 -174566 -185221 -258116 -196731 -180001 -124790 -166351 -143978 -23297 -80915
8390h0915j5771O9771q9449P6383N3051M4388m0388m9126N3413K1789j1392j0030
$$ -80915 -96686 -26915 -116364 -39981 13070 57458 17070 -32056 21357 43146 31754 21724
8378B1724m1150k5338K1428n1229Q4285J55324m6302r7411J6081J23002l934l1137
$$ 21724 -19426 -44764 -23336 -74565 9720 165044 118742 21331 37412 160414 156480 125343
8366A25343L3250j20122N6937k4332J13840n9347Q3187K5875N7405R998q9289
$$ 125343 158593 38471 95408 71076 184916 125569 208756 234631 292036 302034 212745
8355B12745K0816m6848l2102J05151k8673j3284q5498L8639M3114o0496Q6795
$$ 212745 233561 186713 154611 259762 231089 217805 132307 170946 214060 153564 240359
8344B40359N4742l7086m199J06491q3442j61707O114O5495q3257M1091N3684M3916
$$ 240359 295101 258015 253816 360307 276865 115158 121272 186767 103510 144601 198285 242201
8332B42201l51j9937k3874j0472l4862m7603k4830K4697k2945p175L9638K2479
$$ 242201 241850 221913 198039 187567 152705 105102 80272 104969 82024 74849 114487 136966
8320A36966J2639m9872l4060J11616n2550o3397M211L2452j00390Q931L9995n2774
$$ 136966 149605 99733 65673 177289 124739 61342 65553 98005 -2385 6546 46541 -6233
8308f233K615o3908j03832k3977J73793r866n3003l5312J27906M0220n8354r4773
$$ -6233 -3618 -67526 -171358 -195335 -21542 -31408 -84411 -119723 8183 48403 -9951 -104724
8296a04724P3663m9735p1832k6657j3936J3719j7704K6459r1571N4830n7038O7415
$$ -104724 -31061 -80796 -152628 -179285 -193221 -179502 -197206 -170747 -262318 -207488 -264526 -197111
8284a97111r3263J00394L078m6846j04385o6534R7391J16072j23599J00353J52235
$$ -197111 -290374 -189980 -186902 -233748 -338133 -404667 -307276 -191204 -314803 -214450 -62215
8273f2215j15994q2457L9061j0674j586j08265k3170R986K0544J42165j2417k01678
$$ -62215 -178209 -260666 -221605 -232279 -233865 -342130 -365300 -355314 -334770 -192605 -205022 -406700
8261d06700j3630M8933l688N395m0152O2097M9785k933l6160l4267l02R7998P5794
$$ -406700 -420330 -371397 -375085 -369690 -409842 -347745 -297960 -300893 -337053 -371320 -371622 -273624 -197830
8248a97830R377p6656n5123J2612L6581l3786N9630q1680j0811j27530P7693P8481
$$ -197830 -188453 -265109 -320232 -307620 -271039 -304825 -245195 -326875 -337686 -465216 -387523 -309042
8236c09042n3567o566N4544N0914K2605j42178L2714j6579j1131k2348k0865k3710
$$ -309042 -362609 -369175 -314631 -263717 -241112 -383290 -350576 -367155 -378286 -400634 -421499 -445209
8224d45209L1896N6426j6279j00860J06335J52641m9775p9821O1539l4830q0247
$$ -445209 -413313 -356887 -373166 -474026 -367691 -215050 -264825 -344646 -283107 -317937 -398184
8213c98184j3908n5823N1922m067L4941L0658J26886L0859p7689j28848k9100
$$ -398184 -412092 -467915 -415993 -420060 -385119 -354461 -227575 -196716 -274405 -403253 -432353
8202d32353P3170k294r1529J16219m9325r370p8p7906m2490J07203O78572o2950
$$ -432353 -359183 -361477 -453006 -336787 -386112 -395482 -395560 -473466 -515956 -408753 269819 206869
8190B06869l22721o9070q9536l4735j18745M0734l0692J05562n6997j10782P4355
$$ 206869 -115852 -184922 -274458 -309193 -427938 -387204 -417896 -312334 -369331 -480113 -405758
8179d05758L2763n5918O1573L4870N6285J7941N2095l132j77226n3645J29528
$$ -405758 -372995 -428913 -367340 -332470 -276185 -258244 -206149 -209281 -386507 -440152 -310624
8168c10624N5236p972p6686P545O423J11403l5368n0161Q5047K1854l0676k9509
$$ -310624 -255388 -263360 -340046 -332501 -326078 -214675 -250043 -300204 -215157 -193303 -223979 -253488
8156b53488l302m9853j7239l232N6550j6613l1202o147j1952k8133N5795N7994
$$ -253488 -256790 -306643 -323882 -327114 -270564 -287177 -318379 -324526 -336478 -364611 -308816 -250822
8144b50822r8537m8399R668Q8508j6805j18765R1567P3005l8564n7514Q5972k012
$$ -250822 -349359 -397758 -388090 -299582 -316387 -435152 -343585 -270580 -309144 -366658 -280686 -282698
8132b82698M7723L298j7017n0093q7416p2428M2746J35447J9779r9018l2376P347
$$ -282698 -234975 -231677 -248694 -298787 -386203 -458631 -415885 -280438 -260659 -359677 -392053 -384706
8120c84706J16654l5812K7132j08288Q1344Q3896j02469n0932P060O4932n3133
$$ -384706 -268052 -303864 -276732 -385020 -303676 -219780 -322249 -373181 -366121 -301189 -354322
8109c54322L7925L1906j4248j2650o8634j44297Q8423R5414k2869m55Q7075j7562
$$ -354322 -316397 -284491 -298739 -311389 -380023 -524320 -435897 -340483 -363352 -363807 -276732 -294294
8097b94294p4826l2855J24652Q7133n1283r9274J7117N0076r489K2745o9739q4464
$$ -294294 -369120 -401975 -277323 -190190 -241473 -340747 -323630 -273554 -283043 -260298 -330037 -414501
8085d14501L8179L4619M8283J02261q1417n8389K8827j3878K9950l230M2814l9768
$$ -414501 -376322 -341703 -293420 -191159 -272576 -330965 -302138 -316016 -286066 -289296 -246482 -286250
8073b86250l7852j10224M5012L1674J58119M0123l4250n8879K5825q6849m7965
$$ -286250 -324102 -434326 -389314 -357640 -199521 -159398 -193648 -252527 -226702 -313551 -361516
8062c61516R2991P2926r7473J5014l3203J6778n2935k6486L0026K5533P3611o1940
$$ -361516 -268525 -195599 -293072 -278058 -311261 -294483 -347418 -373904 -343878 -318345 -244734 -306674
8050c06674J4855M1714j0657Q359R4286J9920l2525o0609o7528L2918J8011j16060
$$ -306674 -291819 -250105 -260762 -252403 -158117 -138197 -170722 -231331 -298859 -265941 -247930 -363990
8038c63990O974O8865L8560q5316M6577n953q7379n5276K0044r8492Q5428j29632
$$ -363990 -357016 -288151 -249591 -334907 -288330 -294283 -381662 -436938 -416894 -515386 -429958 -559590
8026e59590J78194L1947m735o6429m6365N6901K9007l7515j6184J12497L3490
$$ -559590 -381396 -349449 -354184 -420613 -466978 -410077 -381070 -418585 -434769 -322272 -288782
8015b88782k8705p4182n5707J48944L4972L3749n5780q0171M3626m9527J13773
$$ -288782 -317487 -391669 -447376 -298432 -263460 -229711 -285491 -365662 -322036 -371563 -257790
8004b57790O9177l5156l1261k8152J16271J4895j09204j9498j58096k2834J88518
$$ -257790 -188613 -223769 -255030 -283182 -166911 -152016 -261220 -280718 -438814 -461648 -273130
7993b73130O0002o1598K0565J42666m5509j03634m0471J5656j0218M0863M6050
$$ -273130 -213128 -274726 -254161 -111495 -157004 -260638 -301109 -285453 -295671 -254808 -208758
7982b08758J3861Q669j30489j4151k855l5667n3917K7940n9223M2235N4471L4132
$$ -208758 -194897 -186228 -316717 -330868 -333723 -369390 -423307 -395367 -454590 -412355 -357884 -323752
7970c23752N8109L2943j6205M091k3457l9179j9116M7737r8411L9478j0059R5233
$$ -323752 -265643 -232700 -248905 -244814 -268271 -307450 -326566 -278829 -377240 -337762 -347821 -252588
7958b52588O5933n8383L7984L7290o942j03540o8483N0598L3055k1606L6502J9396
$$ -252588 -186655 -245038 -207054 -169764 -176706 -280246 -348729 -298131 -265076 -286682 -250180 -230784
7946b30784j20828m215K1769N0307k4057o9419K5889o4671l9910M8345j2595J07441
$$ -230784 -351612 -355827 -334058 -283751 -307808 -377227 -351338 -416009 -455919 -407574 -420169 -312728
7934c12728N7609P9013m0084j56383O5993N5437L8148L371Q1314L5265k1632j8320
$$ -312728 -255119 -176106 -216190 -372573 -306580 -251143 -212995 -209624 -128310 -93045 -114677 -132997
7922a32997O2842K6000K6185r0037K5964N9370l4922j09780l3444N5260j10661
$$ -132997 -70155 -44155 -17970 -108007 -82043 -22673 -57595 -167375 -200819 -145559 -256220
7911b56220o4866N7924p050P8965L9562j63046K2060m4953k507Q7207N81o9000
$$ -256220 -321086 -263162 -270212 -191247 -151685 -314731 -292671 -337624 -340131 -252924 -252343 -321343
7899c21343R8566K5721N814p478o095J0591O8391m7228j5724p5106o0774K1146
$$ -321343 -222777 -197056 -191242 -198720 -204815 -194224 -125833 -173061 -188785 -263891 -324665 -303519
7887c03519j3939J63598J3251o2579j47322O8678P2056n7665k2298r9007j6729
$$ -303519 -317458 -153860 -140609 -203188 -350510 -281832 -209776 -267441 -289739 -388746 -405475
7876d05475K5637K2286k4499R321N3924o633n332j19215J34883J2249N9329o4319
$$ -405475 -379838 -357552 -382051 -372730 -318806 -325439 -330771 -449986 -315103 -302854 -243525 -307844
7864c07844J2170N7290m9805K0236j56431N1967L7299J23984Q3299m6595j13710
$$ -307844 -295674 -238384 -288189 -267953 -424384 -372417 -335118 -211134 -127835 -174430 -288140
7853b88140p7597J32978n3705j08136K8494J8841L1452R0444J4831O3556o0792
$$ -288140 -365737 -232759 -286464 -394600 -366106 -347265 -315813 -225369 -210538 -146982 -207774
7842b07774j14158N024n2671N2557p5519l4379P8650o107N8740L1686k2760p6023
$$ -207774 -321932 -316908 -369579 -317022 -392541 -426920 -348270 -354377 -295637 -263951 -286711 -362734
7830c62734J24090J10334j5154k3420K1702r2285K2594R730q7750J16832j8028
$$ -362734 -238644 -128310 -143464 -166884 -145182 -237467 -214873 -205143 -292893 -176061 -194089
7819a94089n3451k0755r6619R2284P1784k22R2186J00993j90014p5128L8039R1211
$$ -194089 -247540 -268295 -364914 -272630 -200846 -201068 -108882 -7889 -197903 -273031 -234992 -143781
7807a43781p6088p3046J16627J5938J387o206n8341Q2905O2040j35310o8044L7768
$$ -143781 -219869 -292915 -176288 -160350 -158963 -165169 -223510 -140605 -78565 -213875 -281919 -244151
7795b44151J7n3933q6135n0645L5792J09487N4157j9675J8266k359J36151p527
$$ -244151 -244134 -298067 -384202 -434847 -399055 -289568 -235411 -255086 -236820 -239179 -103028 -110555
7783a10555J3705p2032N7250j22347l1514j6424q9492Q188P3224M9722q9590m7712
$$ -110555 -96850 -168882 -111632 -233979 -265493 -281917 -371409 -363221 -289997 -240275 -329865 -377577
7771c77577R1848p5266J07998J0561l0915N1469o9097M5469k805N3707m3114l0750
$$ -377577 -285729 -360995 -252997 -242436 -273351 -221882 -290979 -245510 -248315 -194608 -237722 -268472
7759b68472Q5955j894o3071j06895N3534J40400j3855l4573o7088L0725L009m2176
$$ -268472 -182517 -184411 -247482 -354377 -300843 -160443 -174298 -208871 -275959 -245234 -242225 -284401
7747b84401M5688M1915P8571Q3371n7607o8151m4409l5524J01803K7538q8704
$$ -284401 -238713 -196798 -118227 -34856 -92463 -160614 -205023 -240547 -138744 -111206 -199910
7736a99910J863n1869j5382R5327J200r789M7423P0815L2313j8367l1472M9506
$$ -199910 -198047 -249916 -265298 -169971 -168771 -178560 -131137 -60322 -28009 -46376 -77848 -28342
7724b8342n6329n1474J1967J8219K7401j2065O0384O435n2086N2273O8824l1346
$$ -28342 -84671 -136145 -124178 -105959 -78558 -90623 -30239 -23804 -75890 -23617 45207 13861
7712A3861R4732r2829k900p4676L9672J5076o1700m802M5760P9034n5037n9895
$$ 13861 108593 15764 12864 -61812 -22140 -7064 -68764 -73566 -27806 51228 -3809 -63704
7700f3704J4064L9384l0926L268J15986l0040j06428k6506k3210K8952J00130
$$ -63704 -49640 -10256 -41182 -37914 78072 48032 -58396 -84902 -108112 -79160 20970
7689B0970o6160L1157R6594j02556j09970P7326J83195l9379r9346N7952k3392
$$ 20970 -45190 -14033 82561 -19995 -129965 -52639 130556 91177 -8169 49783 26391
7678B6391L68L447q1246N4235l8053o6348n2552K3074J20382j6689k4069Q9506
$$ 26391 26759 30206 -51040 3195 -34858 -101206 -153758 -130684 -10302 -26991 -51060 38446
7666C8446o3012L6165j41713P185k1716K0404J31788l4875q5588K0038r3501J10762
$$ 38446 -24566 11599 -130114 -122929 -144645 -124241 7547 -27328 -112916 -92878 -186379 -75617
7654g5617M4825p0767j6072J6198K4359m1287N8974j34071J1813k5200N5638K8512
$$ -75617 -30792 -101559 -117631 -101433 -77074 -118361 -59387 -193458 -181645 -206845 -151207 -122695
7642a22695l5301j7255j6163K4272J13118m7135q0652R3626k8704j12656k3155
$$ -122695 -157996 -175251 -191414 -167142 -54024 -101159 -181811 -88185 -116889 -229545 -252700
7631b52700J87046M6377j16524o2027R708M5545q2739p4175l4138R4861P2880
$$ -252700 -65654 -19277 -135801 -197828 -188120 -142575 -225314 -299489 -333627 -238766 -165886
7620a65886Q1360l9338p5482k3065K7504O1440q9942K5479Q3547j10164m6454
$$ -165886 -84526 -123864 -199346 -222411 -194907 -133467 -223409 -197930 -114383 -224547 -271001
7609b71001J09929j9422n1536K8624l1861J0879M8824l4301m468R0432K2981p9994
$$ -271001 -161072 -180494 -232030 -203406 -235267 -224388 -175564 -209865 -214333 -123901 -100920 -180914
7597a80914N590M4264m6825Q534p0117k8239R092M3830N3913k5376o3009K832
$$ -180914 -175324 -131060 -177885 -169351 -239468 -267707 -258615 -214785 -160872 -186248 -249257 -246425
7585b46425J07432l9526N5556q5904J9492Q0557k4233n4901J05736M1178j08849
$$ -246425 -138993 -178519 -122963 -208867 -189375 -108818 -133051 -187952 -82216 -41038 -149887
7574a49887l2970J7096k5518M0197j9357r3214M2035N6674k6204j02478L3365
$$ -149887 -182857 -165761 -191279 -151082 -170439 -263653 -221618 -164944 -191148 -293626 -260261
7563b60261O6862K0189R784O4982j03997N8376N8298k2135P3256q5534j17247
$$ -260261 -193399 -173210 -163426 -98444 -202441 -144065 -85767 -107902 -34646 -120180 -237427
7552b37427N2663P3414o0970N5225o423m7147N2490Q3577o0712J601N3723k8972
$$ -237427 -184764 -111350 -172320 -117095 -123518 -170665 -118175 -34598 -95310 -93709 -39986 -68958
7540f8958K2270j07094n0871q691P6450K9740j21635j6835R4243M3802J09692
$$ -68958 -46688 -153782 -204653 -213344 -136894 -107154 -228789 -245624 -151381 -107579 2113
7529B113P8669j15957r2922J9919O9410o652l9010O8891j13089J8272R3041j45405
$$ 2113 80782 -35175 -128097 -108178 -38768 -45420 -84430 -15539 -128628 -110356 -17315 -162720
7517a62720j11535R2117J7873n9225J15221J9151j4637M2387J04718n0370O037
$$ -162720 -274255 -182138 -164265 -223490 -108269 -89118 -103755 -61368 43350 -7020 -983
7506i83m4679j15900O9512p6843O362O1682O1870K8449m4919l2240j6492n8182
$$ -983 -45662 -161562 -92050 -168893 -162531 -100849 -38979 -10530 -55449 -87689 -104181 -162363
7494a62363k2381j4547M2109j0089R3793L2268q8428N4296n1003k5271N3243P329
$$ -162363 -184744 -199291 -157182 -167271 -73478 -41210 -129638 -75342 -126345 -151616 -98373 -91044
7482i1044K633p139P6140L7796j03672j13777q0230Q3745L2669K3621n3932O3372
$$ -91044 -88411 -95550 -19410 18386 -85286 -199063 -279293 -195548 -162879 -139258 -193190 -129818
7470a29818k738r6436J6085J20215O9167j12484Q182n4435M2437L4693J1639J3393
$$ -129818 -132556 -228992 -212907 -92692 -23525 -136009 -127827 -182262 -139825 -105132 -93493 -80100
7458h0100j5223J19057O696k7412j35604N9520K2908N531J41747L7026j13644
$$ -80100 -95323 23734 30430 3018 -132586 -73066 -50158 -44627 97120 134146 20502
7447B0502j6602k338p2259O5245O1447p6189j10460m7074K09751N683J1541L2423
$$ 20502 3900 1562 -70697 -5452 55995 -20194 -130654 -177728 32023 37706 49247 81670
7435H1670j2349n1214q5420R9495p0818l8175J30916M1097m8565O5620J9577L2472
$$ 81670 69321 18107 -67313 32182 -38636 -76811 54105 95202 46637 112257 131834 164306
7423A64306j1000l2687l5331k2061p478R1496j14081l8810J21435K4939M2554
$$ 164306 153306 120619 85288 63227 55749 147245 33164 -5646 115789 140728 183282
7412A83282J6316j4986j4393K0452o7109q5908R245l2970J34709L1926j5895Q7808
$$ 183282 199598 184612 170219 190671 123562 37654 46899 13929 148638 180564 164669 252477
7400B52477k7402l039K190j5236N4926o7815p673N9761j67128N6551J07061q8557
$$ 252477 225075 222036 224226 208990 263916 196101 188428 248189 81061 137612 244673 156116
7388A56116l410n7916N878R4005l2745k1075P904k8096Q681L8184J28351K0908
$$ 156116 152706 94790 100668 194673 161928 140853 148757 120661 129342 167526 295877 316785
7376C16785m6992K9474n8673M5613k0437n354m576k7552j7087J49351O6574n9323
$$ 316785 269793 299267 240594 286207 265770 260416 255840 228288 211201 360552 427126 367803
7364C67803m7593o8011l30j2735l822O3544m3554R6851O5156j44743P414j1090
$$ 367803 320210 252199 251869 239134 235312 298856 255302 352153 417309 272566 279980 268890
7352B68890L0155l8663J19545O8169j00079p029n2375k97N077J4275q5J3773L0893
$$ 268890 299045 260382 379927 448096 348017 340988 288613 288316 293393 307668 307583 321356 352249
7339C52249j3622P4379k4961L3521L7170k4295J24001R2449J1978l2387l531K0824
$$ 352249 338627 413006 388045 421566 458736 434441 558442 650891 662869 630482 626951 647775
7327F47775r7576J3109n89J41p398J21451j303q2819k9246L6099L0234j7500K0726
$$ 647775 550199 563308 562719 562860 555462 676913 675610 592791 563545 599644 629878 612378 633104
7314F33104J8284j12j3192O863k9632L2822O5172J11648L6840M9864J1947l6851
$$ 633104 651388 651276 638084 644947 615315 648137 713309 824957 861797 911661 923608 886757
7302H86757L3669R2887j1366n7927P342r3154P9835l103o0101Q7791j19665n851
$$ 886757 920426 1013313 1001947 944020 951362 858208 938043 934940 874839 962630 842965 837114
7290H37114J10919O3430k257k0616j2939N055Q5672N7215l2392L6361N9594Q8303
$$ 837114 948033 1011463 1009206 988590 975651 980706 1066378 1123593 1091201 1127562 1187156 1275459
7278A275459O6833P0043O2300j6819r4016m445j27475J7978O3855J292P3655o3373
$$ 1275459 1342292 1412335 1474635 1457816 1363800 1359355 1231880 1249858 1313713 1315005 1388660 1325287
7266A325287N1723O0870M206j40028P1427J80120k5674M6717J18443k4186n3257
$$ 1325287 1377010 1437880 1442086 1302058 1373485 1553605 1527931 1574648 1693091 1668905 1615648
7255A615648O1965J26530J26466J2814r111J5045P2342Q8311M6717Q8970p5466
$$ 1615648 1677613 1804143 1930609 1943423 1934312 1949357 2021699 2110010 2156727 2245697 2170231
7244B170231p4076Q2067j22586K9481j0170l4982J3280o2623J32468L9688m4670
$$ 2170231 2096155 2178222 2055636 2085117 2074947 2039965 2053245 1990622 2123090 2162778 2118108
7233B118108n363P4297R2903J20646Q0579N0735J53255K3712l7222P1429O1946
$$ 2118108 2112745 2187042 2279945 2400591 2481170 2531905 2685160 2708872 2671650 2743079 2805025
7222B805025l8885J00504l7376L1973k0326k0517M8618l3500M9556r7578M5225
$$ 2805025 2766140 2866644 2829268 2861241 2840915 2820398 2869016 2835516 2885072 2787494 2832719
7211B832719n1864m3152P4804j776N7832R6516J06516O3714P799M5518O0911L9833
$$ 2832719 2780855 2737703 2812507 2810731 2868563 2965079 3071595 3135309 3143108 3188626 3249537 3289370
7199C289370M1078K38005j0731l0727n5585k3803L8884j06564J0170M4551L8184
$$ 3289370 3330448 3568453 3557722 3526995 3471410 3447607 3486491 3379927 3390097 3434648 3472832
7188C472832M633J1176o1485p3312O5724l4941Q8239R7156m7532K16025P7721
$$ 3472832 3477465 3488641 3427156 3353844 3419568 3384627 3472866 3570022 3522490 3738515 3816236
7177C816236L0294J36268j8865j66334m1482o78N0638N3077K1143k7731P3778
$$ 3816236 3846530 3982798 3963933 3797599 3756117 3755439 3806077 3859154 3880297 3852566 3926344
7166C926344o7710j3048M9642L1172P2057Q8609J38674N4944Q9972R2246J66729
$$ 3926344 3858634 3845586 3895228 3926400 3998457 4087066 4225740 4280684 4370656 4462902 4629631
7155D629631J03623n8923O9438J32768K168O1743K157L9957J53843L6779k4749
$$ 4629631 4733254 4674331 4743769 4876537 4878705 4940448 4942605 4982562 5136405 5173184 5148435
7144E148435K24728M3984K04636J14477p6076J24262J97974P6320R1617K16119
$$ 5148435 5373163 5417147 5621783 5736260 5660184 5784446 5982420 6058740 6150357 6366476
7134F366476J15850L06511K48708K60898J85791J88825J98837L72152L68284L47607
$$ 6366476 6482326 6788837 7037545 7298443 7484234 7673059 7871896 8244048 8612332 8959939
7124H959939M45429M78738N50145N15135M94825K08495K51075N262l741l3512
$$ 8959939 9405368 9884106 10434251 10949386 11444211 11652706 11903781 11909043 11905302 11871790
7114A1871790R1390L28558L92294O31368M76788M70448O03821M59174K70567K09014
$$ 11871790 11963180 12291738 12684032 13315400 13792188 14262636 14866457 15325631 15596198 15805212
7104A5805212R8943o495J48291L27251M50510N97500P77707R43997J004453J192774
$$ 15805212 15904155 15897660 16045951 16373202 16823712 17421212 18198919 19142916 20147369 21340143
7094B1340143J100049Q84118L77812j41815l81975l74624l03714j13637q8072
$$ 21340143 22440192 23324310 23702122 23560307 23178332 22803708 22499994 22386357 22298285
7085B2298285m4553Q3150j45040k66489k38074m49437l54739l37427j19933p6561
$$ 22298285 22253732 22336882 22191842 21925353 21687279 21237842 20883103 20545676 20425743 20349182
7075B0349182j06540J31781J43301L85563K69679O13588O36105P63181P09016
$$ 20349182 20242642 20374423 20517724 20903287 21172966 21786554 22422659 23185840 23894856
7066B3894856M94325J25116m58195p30707q63231o40540m62978k95483l11463
$$ 23894856 24389181 24514297 24056102 23325395 22462164 21821624 21358646 21063163 20751700
7057B0751700m12474l89782m26440l31651l74716k46005m4725o6455L7454l8484
$$ 20751700 20339226 19949444 19523004 19191353 18816637 18570632 18525907 18459452 18496906 18458422
7047A8458422o1502j65441j17052l771k8885L1635K33478K90604J24237K02556
$$ 18458422 18396920 18231479 18114427 18110656 18081771 18113406 18346884 18637488 18761725 18964281
7037A8964281J80920K33284L7837N5673Q7031J12540J96742K97530L46364K76741
$$ 18964281 19145201 19378485 19416322 19471995 19559026 19671566 19868308 20165838 20512202 20788943
7027B0788943M23366M62905L43072J60618M10759K96568K68364L33410L15330
$$ 20788943 21212309 21675214 22018286 22178904 22589663 22886231 23154595 23488005 23803335
7018B3803335L93405M05634O11391O84517O93637O66444R37843J032708R90700
$$ 23803335 24196740 24602374 25213765 25898282 26591919 27258363 28196206 29228914 30219614
7009C0219614J277152J277914J579829J544636J816270K014984K246378K524408
$$ 30219614 31496766 32774680 34354509 35899145 37715415 39730399 41976777 44501185
7001D4501185K616458K826089K906013K812666K578193K120699J898735J571287
$$ 44501185 47117643 49943732 52849745 55662411 58240604 60361303 62260038 63831325
6993F3831325R22328n5445r76683j525837j823956j612639j287440p77554k27754
$$ 63831325 64753653 64698208 63721525 62195688 60371732 58759093 57471653 56694099 56466345
6984E6466345L20898O42500J110258J584464K088076K583875L145295L685291
$$ 56466345 56787243 57429743 58540001 60124465 62212541 64796416 67941711 71627002
6976G1627002M219008M808779N343923N914376O345096O455524N754844M901528
$$ 71627002 75846010 80654789 85998712 91913088 98258184 104713708 110468552 115370080
6968A15370080M176352L485891K388563J10304k642527m679636n286112m955464
$$ 115370080 119546432 123032323 125420886 125531190 122888663 118209027 112922915 107967451
6960A07967451m472838m383019m201188m374927m065757l503575k910588j983900
$$ 107967451 103494613 99111594 94910406 90535479 86469722 82966147 80055559 78071659
6952G8071659j224403l85586L16653J001822J739558K529893L093323L399328
$$ 78071659 76847256 76461670 76778323 77780145 79519703 82049596 85142919 88542247
6944H8542247L666223L663424L488250L367682L176949K553671J598154P84202
$$ 88542247 92208470 95871894 99360144 102727826 105904775 108458446 110056600 110840802
6936A10840802K56263K88421M709j235530l332901n978348p737919q151143p856645
$$ 110840802 111097065 111385486 111390195 110154665 106821764 100843416 93105497 84954354 77097709
6927G7097709o749836n563001m670986l833370l061457k683033k131535j656910
$$ 77097709 70347873 64784872 60113886 56280516 53219059 50536026 48404491 46747581
6919D6747581j232013p56442n04582k86471K89246N86299P40415J015771J349589
$$ 46747581 45515568 44759126 44254544 43968073 44257319 44843618 45584033 46599804 47949393
6910D7949393J590874J631860J366810N51469m83059j886196l001534l596273
$$ 47949393 49540267 51172127 52538937 53090406 52607347 50721151 47719617 44123344
6902D4123344l724682l509729l009173k735777k381750j992169j836839j606088
$$ 44123344 40398662 36888933 33879760 31143983 28762233 26770064 24933225 23327137
6894B3327137j457064j296664j141987r63384q51319r07775o63277n84888n29682
$$ 23327137 21870073 20573409 19431422 18468038 17616719 16708944 16045667 15460779 14931097
6885A4931097n62557n10314l82069l86490m47683m79413l63314k66271k91063
$$ 14931097 14368540 13858226 13476157 13089667 12641984 12162571 11799257 11532986 11241923
6876A1241923k73499l16389l03429k18720j76826l06455k40178k09112l38757
$$ 11241923 10968424 10652035 10348606 10129886 9953060 9646605 9406427 9197315 8858558
6867H858558k60101k44635k40519j80678j00949j50379r7605j41715j42722j58179
$$ 8858558 8598457 8353822 8113303 7932625 7831676 7681297 7583692 7441977 7299255 7141076
6857G141076n8792p2048k6635j69436j71146N5980q3018K3355r2401j38825j32330
$$ 7141076 7082284 7010236 6983601 6814165 6643019 6698999 6615981 6639336 6546935 6408110 6275780
6846F275780M4649p9740q7183n2639j08163L3778j28365q3804o8717n3426L0882
$$ 6275780 6320429 6240689 6153506 6100867 5992704 6026482 5898117 5814313 5745596 5692170 5723052
6835E723052o1064o4143p3819r110M9136j7154o7035l3476l0395O7867M2795j07209
$$ 5723052 5661988 5597845 5524026 5514916 5564052 5546898 5479863 5446387 5415992 5483859 5526654 5419445
6823E419445N0798J9366l3530J81716L9258j408j2951j33141k8441m8438n2022
$$ 5419445 5470243 5489609 5456079 5637795 5677053 5675645 5662694 5529553 5501112 5452674 5400652
6812E400652l5165J0830J51000O3045j68720J8569N7886j23859l9139K266l2569
$$ 5400652 5365487 5376317 5527317 5590362 5421642 5440211 5498097 5374238 5335099 5337365 5304796
6801E304796O3571m9058p5570l5402K2544M5797j1662n2992L6260o0245L4602
$$ 5304796 5368367 5319309 5243739 5208337 5230881 5276678 5265016 5212024 5248284 5188039 5222641
6790E222641K7051J1673o0285K4205M6879n0391o8636p5792L7506p1441J5471
$$ 5222641 5249692 5261365 5201080 5225285 5272164 5221773 5153137 5077345 5114851 5043410 5058881
6779E058881j04697l7752N1933p5747p2302l9261o9638j59801J2954J38251j07003
$$ 5058881 4954184 4916432 4968365 4892618 4820316 4781055 4711417 4551616 4564570 4702821 4595818
6768D595818j1271L0564j55335M6363j0984r4117P6336j1786o2667O4152J9637
$$ 4595818 4584547 4615111 4459776 4506139 4495155 4401038 4477374 4465588 4402921 4467073 4486710
6757D486710j3185K8642l6906j29749M8263P1083k6445p8421J24152J9511l325
$$ 4486710 4473525 4502167 4465261 4335512 4383775 4454858 4428413 4349992 4474144 4493655 4490330
6746D490330M7775o4574L4118J5175O7004q4394J01445K6599J9803N1574N5229
$$ 4490330 4538105 4473531 4507649 4522824 4589828 4505434 4606879 4633478 4653281 4704855 4760084
6735D760084K05004J40602L7171N0590N3757j42682O5r1390l8794N5926k4574
$$ 4760084 4965088 5105690 5142861 5193451 5247208 5104526 5104591 5013201 4974407 5030333 5005759
6724E005759J22310o8654n6642P5671R1120R2087J56998J72155M6663l7626Q7505
$$ 5005759 5128069 5059415 5002773 5078444 5169564 5261651 5418649 5590804 5637467 5599841 5687346
6713E687346M0451J84643K16132Q8580J65996J79082K02381J43985R2954J35102
$$ 5687346 5727797 5912440 6128572 6217152 6383148 6562230 6764611 6908596 7001550 7136652
6703G136652J43593M6128J05804M2732J63640J19865Q8894K48046L58480L34229
$$ 7136652 7280245 7326373 7432177 7474909 7638549 7758414 7847308 8095354 8453834 8788063
6693H788063M00687M63410L81391M52439O36533N58692N08054K47490J61716Q1630
$$ 8788063 9188750 9652160 10033551 10485990 11122523 11681215 12189269 12436759 12598475 12680105
6683A2680105q192n0317J04092K17454J23589K43785K46814j45471j23325k23638
$$ 12680105 12671913 12621596 12725688 12943142 13066731 13310516 13557330 13411859 13288534 13064896
6673A3064896j84346j0488J2485K96173J70985M30462M88227N18925P54563Q25589
$$ 13064896 12880550 12870062 12882547 13178720 13349705 13780167 14268394 14787319 15541882 16367471
6663A6367471P58266O21710K92063J94180j7033j27355j09199k36409m6032m1878
$$ 16367471 17125737 17747447 18039510 18233690 18216657 18089302 17980103 17743694 17697662 17655784
6653A7655784J55115L65868J93952j96751m74927o20762p02404m50778l05236
$$ 17655784 17810899 18176767 18370719 18173968 17699041 17078279 16375875 15925097 15619861
6644A5619861k55110n7245J59771J17741L37313K13948K74402K28854J99700m8353
$$ 15619861 15364751 15307506 15467277 15585018 15922331 16136279 16410681 16639535 16839235 16790882
6634A6790882k39232j84161k75566k07968j92944k62113r4667j09102j40252j45931
$$ 16790882 16551650 16367489 16091923 15883955 15691011 15428898 15334231 15225129 15084877 14938946
6624A4938946j30997r8517j40469k66446l35887l69447j63708j38289j00398M2142
$$ 14938946 14807949 14709432 14568963 14302517 13966630 13597183 13433475 13295186 13194788 13236930
6614A3236930J09603N7980L9932J40862K98965J61882R6128o1008r3768l5127
$$ 13236930 13346533 13404513 13444445 13585307 13884272 14046154 14142282 14081274 13987506 13952379
6604A3952379m0938k94937j09692m958j27155Q5353j28930J4084n5615R2834k1965
$$ 13952379 13911441 13616504 13506812 13501854 13374699 13460052 13331122 13345206 13289591 13382425 13360460
6593A3360460J13737m1234J40967O5013Q3085J14500J93415K69533J66820L79005
$$ 13360460 13474197 13432963 13573930 13638943 13722028 13836528 14029943 14299476 14466296 14845301
6583A4845301K17977K43703L33315K12779L26850K80112K37120J88480K35979
$$ 14845301 15063278 15306981 15640296 15853075 16179925 16460037 16697157 16885637 17121616
6574A7121616J63283L11613L51000M15858L97233L98148M94721L91502M36658
$$ 17121616 17284899 17596512 17947512 18363370 18760603 19158751 19653472 20044974 20481632
6565B0481632M18290K86406K94582M13676L30886K80021L06521M74987M05265
$$ 20481632 20899922 21186328 21480910 21894586 22225472 22505493 22812014 23287001 23692266
6556B3692266K86436M85673M35061M70328O48800M85031N37291N81756O56401
$$ 23692266 23978702 24464375 24899436 25369764 26018564 26503595 27040886 27622642 28279043
6547B8279043O80726P77073Q54833Q02808J024361J310272J106506J215052J418494
$$ 28279043 28959769 29736842 30591675 31394483 32418844 33729116 34835622 36050674 37469168
6538C7469168J486667J547770J674070J775524J995040K156076K350939K603980
$$ 37469168 38955835 40503605 42177675 43953199 45948239 48104315 50455254 53059234
6530E3059234K964831L453692L649185L847222L883821L695792L225955K847486
$$ 53059234 56024065 59477757 63126942 66974164 70857985 74553777 77779732 80627218
6522H0627218K337573J668867L45121r90297k039736k636974k481163j844273
$$ 80627218 82964791 84633658 84978779 83988482 81948746 79311772 76830609 74986336
6514G4986336j263523o29365m5006N10929J045188J786144K373177L220005L828898
$$ 74986336 73722813 73093448 73048442 73559371 74604559 76390703 78763880 81983885 85812783
6505H5812783M339789N102225N976564P030169P926798Q839337Q887756Q306488
$$ 85812783 90152572 95254797 101231361 108261530 116188328 125027665 133915421 142221909
6497A42221909P282291O468017M569076O35881m713295r143580j1145172j0828311
$$ 142221909 149504200 155972217 160541293 161177174 156463879 147320299 136175127 125346816
6489A25346816r403806p762597o068025m600413l680054k717189j861190r99015
$$ 125346816 115943010 108180413 102112388 97511975 93831921 91114732 89253542 88254527
6481H8254527k93545M89470J342588K068428K963745L688821M545052N154620
$$ 88254527 87960982 88450452 89793040 91861468 94825213 98514034 103059086 108213706
6473A08213706N651128O181186O571930O274244M487706O89750l971386p989613
$$ 108213706 113864834 120046020 126617950 132892194 137379900 138069650 134098264 126108651
6465A26108651j0140367j0555158r799982q487222p180064o052731m872455l977621
$$ 126108651 115968284 105413126 95613144 87125922 79945858 73893127 69020672 65043051
6457F5043051l618528l134292k631540k093164j737910j213717q81774m39381
$$ 65043051 61424523 58290231 55658691 53565527 51827617 50613900 49732126 49292745
6449D9292745j77858K56081M77429O54577Q77359R64589O20348P3921p89766k085235
$$ 49292745 49114887 49370968 49848397 50502974 51380333 52344922 52965270 53039191 52249425 50164190
6439E0164190k830807l362812l312460k815526k434340k237915j828708j566712
$$ 50164190 47333383 43970571 40658111 37842585 35408245 33170330 31341622 29774910
6431B9774910j505607j178009r22052q07213p14839n24117l34761m21575k15524
$$ 29774910 28269303 27091294 26169242 25362029 24647190 24123073 23788312 23366737 23151213
6422B3151213k11804j34074j04352J68378O3023J84368J54017J09262J29825l6317
$$ 23151213 22939409 22805335 22700983 22869361 22932384 23116752 23270769 23380031 23509856 23473539
6412B3473539m68773p74744r11075q93203p94831o73610n85491o18753m64091
$$ 23473539 23004766 22230022 21318947 20425744 19630913 18957303 18371812 17753059 17288968
6403A7288968m95648l50661l85280j84177j54777k32687m04104q3821K3423j04348
$$ 17288968 16793320 16442659 16057379 15873202 15718425 15485738 15081634 14997813 15021236 14916888
6393A4916888n5904j79373j95835k89073o74708o27600n17597m44603m67279l69935
$$ 14916888 14860984 14681611 14485776 14196703 13521995 12894395 12376798 11932195 11464916 11094981
6383A1094981q3393o4549j30522k8913p6803M5575J30335J01593K19657L07475
$$ 11094981 11011588 10947039 10816517 10787604 10710801 10756376 10886711 10988304 11207961 11515436
6373A1515436n9680O1566J96530r5037m45234o85188p71451o06301n46185m53745
$$ 11515436 11455756 11517322 11713852 11618815 11173581 10488393 9716942 9110641 8564456 8110711
6363H110711l40861k91375k09703j75054k12550j56065q4487k66823k15241j96735
$$ 8110711 7769850 7478475 7268772 7093718 6881168 6725103 6640616 6373793 6158552 5961817
6353E961817j29367j47351j39151j64753q6959l5644l9460r6574j64129j96209
$$ 5961817 5832450 5685099 5545948 5381195 5294236 5258592 5219132 5122558 4958429 4762220
6343D762220j8237j3118Q6972j08913j99052J6214k1464j63706j14337j83541
$$ 4762220 4743983 4730865 4817837 4708924 4509872 4526086 4504622 4340916 4226579 4043038
6333D043038o6651r3554j2109J16111K034j33944P9024P575k8632R5700Q151j65471
$$ 4043038 3976387 3882833 3870724 3986835 3988869 3854925 3933949 3941524 3912892 4008592 4016743 3851272
6321C851272m7184l1391L2302m0886j04873r7464k0692j16476q9291J1623n9125
$$ 3851272 3804088 3772697 3804999 3764113 3659240 3561776 3541084 3424608 3335317 3346940 3287815
6310C287815m7613k110k5885j14526J02050K4168J4276P706n9515L3762R5332
$$ 3287815 3240202 3238092 3212207 3097681 3199731 3223899 3238175 3245881 3186366 3220128 3315460
6299C315460O2863O3810n7069j3278l3312Q3267j04864n0156K7075k5437q0031
$$ 3315460 3378323 3442133 3385064 3371786 3338474 3421741 3316877 3266721 3293796 3268359 3188328
6288C188328K2847J22540m5605J5562o0044j52493p4649l8528j15875q106n6873
$$ 3188328 3211175 3333715 3288110 3303672 3243628 3091135 3016486 2977958 2862083 2853977 2797104
6277B797104l3971m5598m339N3482k2326J52691k1902k2849k3136O4625k4358
$$ 2797104 2763133 2717535 2713196 2766678 2744352 2897043 2875141 2852292 2829156 2893781 2869423
6266B869423J80990M8868O9962J86037j5156J1798j59J56735K6404P6803K18467
$$ 2869423 3050413 3099281 3169243 3355280 3340124 3351922 3351763 3508498 3534902 3611705 3830172
6255C830172J98494J63715R9653j09071r3995k91231j53255j05471j22522p5132
$$ 3830172 4028666 4192381 4292034 4182963 4088968 3797737 3644482 3539011 3416489 3341357
6245C341357P0229K1250P1090J27384R1160J57070J66880K3718J76448K16734
$$ 3341357 3411586 3432836 3503926 3631310 3722470 3879540 4046420 4070138 4246586 4463320
6235D463320J20150R1845j04605j85386k05513j89353p1189Q5688o4950l2723
$$ 4463320 4583470 4675315 4570710 4385324 4179811 3990458 3919269 4004957 3940007 3907284
6225C907284R6708J09139P2316J72996J40520J6637j67725j03905k99142j51381
$$ 3907284 4003992 4113131 4185447 4358443 4498963 4515600 4347875 4243970 3944828 3793447
6215C793447p7619k05949o7280j5131r770r3863j45466J55977k82K1249O4912
$$ 3793447 3715828 3509879 3442599 3427468 3417698 3323835 3178369 3334346 3334064 3355313 3420225
6204C420225J00445l491M6746J10835J55565P4354J7817Q9706J80276J76030K05598
$$ 3420225 3520670 3517179 3563925 3674760 3830325 3904679 3922496 4012202 4192478 4368508 4574106
6193D574106K40743J37115N0595j7989M71j58825k78506l27678j00261q6785q6278
$$ 4574106 4814849 4951964 5002559 4984570 4985041 4826216 4547710 4220032 4119771 4032986 3946708
6182C946708K0340l3179l0948m632o4589j0124O7104J614L5395L8685j32406O8704
$$ 3946708 3967048 3933869 3902921 3898289 3833700 3823576 3890680 3892294 3927689 3966374 3833968 3902672
6170C902672Q6077K9158q9831n3740p8643K638l1307j07060M8433M4973n5360
$$ 3902672 3988749 4017907 3928076 3874336 3795693 3798331 3767024 3659964 3708397 3753370 3698010
6159C698010l4966N788O8521J15075R2561K5555N1907J66442R0073L8637J13411
$$ 3698010 3663044 3668832 3737353 3852428 3944989 3970544 4022451 4188893 4278966 4317603 4431014
6148D431014O9687M3475J00711K0978k0402j08414J0932n0336m4192l0232m1263
$$ 4431014 4500701 4544176 4644887 4665865 4645463 4537049 4547981 4497645 4453453 4423221 4381958
6137D381958P601N0776m0981J1125J11184M5764J06264O2215J39360J5254O5671
$$ 4381958 4389559 4440335 4399354 4410479 4521663 4567427 4673691 4735906 4875266 4890520 4956191
6126D956191J10629J3057L0413O2770L9087J9273j91676n8642m6098p985J04033
$$ 4956191 5066820 5079877 5110290 5173060 5212147 5231420 5039744 4981102 4935004 4927019 5031052
6115E031052N0223M1686O0990j60329M4079L0641j3292J37169M2745N0981l9400
$$ 5031052 5081275 5122961 5183951 5023622 5067701 5098342 5085050 5222219 5264964 5315945 5276545
6104E276545O8060J64783M8905o0815J57679Q9783K8277J04033K00938J37166
$$ 5276545 5344605 5509388 5558293 5497478 5655157 5744940 5773217 5877250 6078188 6215354
6094F215354N9316J63388J44971m8486j80088n8393k631j29089o7968j27766j17179
$$ 6215354 6274670 6438058 6583029 6534543 6354455 6296062 6293431 6164342 6096374 5968608 5851429
6083E851429l1341j0130K2922j37922N3211O3590j11754j40144O6034l1443n9731
$$ 5851429 5820088 5809958 5832880 5694958 5748169 5811759 5700005 5559861 5625895 5594452 5534721
6072E534721J63173J47463K8887J05768J42266L8458O1541M178J50596J81855
$$ 5534721 5697894 5845357 5874244 5980012 6122278 6160736 6222277 6226455 6377051 6558906
6062F558906J07332J28252J43374M7291M7246J66434k798j28372n3026r7071j2887
$$ 6558906 6666238 6794490 6937864 6985155 7032401 7198835 7196037 7067665 7014639 6917568 6904681
6051F904681p4415m1938j3783r9707r6881J71197J26385p5446N6747P920q5347
$$ 6904681 6830266 6788328 6774545 6674838 6577957 6749154 6875539 6800093 6856840 6864760 6779413
6040F779413N3632P363Q1704J64619R1550J44971J66845J02392J02272K8671K7519
$$ 6779413 6833045 6840408 6922112 7086731 7178281 7323252 7490097 7592489 7694761 7723432 7750951
6029G750951K04559N8288Q4092J88146J55702K012Q8066L3431N3110K08046J11778
$$ 7750951 7955510 8013798 8097890 8286036 8441738 8443750 8531816 8565247 8618357 8826403 8938181
6018H938181J55408J00505J39131k5728N3934K29035K81501L01099J86896J22613
$$ 8938181 9093589 9194094 9333225 9307497 9361431 9590466 9871967 10173066 10359962 10482575
6008A0482575P218K46462J28296K81307K43260K10130K56102K52672L99252L83979
$$ 10482575 10489793 10736255 10864551 11145858 11389118 11599248 11855350 12108022 12507274 12891253
5998A2891253L74587M34338M39655M30485L62448K30005J96603K16582L74628
$$ 12891253 13265840 13700178 14139833 14570318 14932766 15162771 15359374 15575956 15950584
5989A5950584K67955K95057K95340K87207M04870L69510K65944L54850L72195
$$ 15950584 16218539 16513596 16808936 17096143 17501013 17870523 18136467 18491317 18863512
5980A8863512O35048N36361N32824O12489O05072M48947N05345N74541M62855
$$ 18863512 19498560 20034921 20567745 21180234 21785306 22234253 22739598 23314139 23776994
5971B3776994N27896O95982O72565Q05162P41916P15051P23176P16925Q21176
$$ 23776994 24304890 25000872 25673437 26478599 27220515 27935566 28658742 29375667 30196843
5962C0196843P69795R89751J094507J171220J210638J218407J198804J279690
$$ 30196843 30966638 31956389 33050896 34222116 35432754 36651161 37849965 39129655
5954C9129655J222654J368987J255802J352159J581142J512604J575120J789458
$$ 39129655 40352309 41721296 42977098 44329257 45910399 47423003 48998123 50787581
5946E0787581K193155K649759L094316L526016L909760M547197N500138O422875
$$ 50787581 52980736 55630495 58724811 62250827 66160587 70707784 76207922 82630797
5938H2630797P146090P824099Q928377R971671J1662657J3577238J5728149J7996327
$$ 82630797 89776887 97600986 106529363 116501034 128163691 141740929 157469078 175465405
5930A75465405K0623007K4590365L0838434L5449406L1831583J9322834J813178
$$ 175465405 196088412 220678777 251517211 286966617 318798200 338121034 339934212
5923C39934212k1756880l7144874m0292944l8649268l0202005k2017586j6290034
$$ 339934212 318177332 281032458 240739514 202090246 171888241 149870655 133580621
5916A33580621j2670977j0151598q561481p384005o323305n138093m092318l165761
$$ 133580621 120909644 110758046 102196565 94812560 88489255 83351162 79258844 76093083
5908G6093083k420587j728415j563049j004621p72710m01855J31513M23013P52589
$$ 76093083 73672496 71944081 70381032 69376411 68603701 68201846 68333359 68756372 69508961
5899F9508961J146694J701604K382440L129039L886521M821819N547477O265286
$$ 69508961 70655655 72357259 74739699 77868738 81755259 86577078 92124555 98389841
5891I8389841P014943Q168028R652604J1533923J3861478J5968412J8496236K2456824
$$ 98389841 105404784 113572812 123225416 134759339 148620817 164589229 183085465 205542289
5883B05542289K8575722L6345697L3999649J3232385k990332j0766829l0573087
$$ 205542289 234118011 270463708 304463357 317695742 314705410 303938581 273365494
5876B73365494m5350030m0401968k9547243k1128311j5949114j2764685j0376740
$$ 273365494 228015464 187613496 158066253 136937942 120988828 108224143 97847403
5869I7847403q798612p862402o959479n929580m895777m269424l866097l200938
$$ 97847403 89048791 81186389 74226910 68297330 63401553 59132129 55266032 52065094
5861E2065094k643758k172268j914903j585438j608494j528032j294347j312560
$$ 52065094 49421336 47249068 45334165 43748727 42140233 40612201 39317854 38005294
5853C8005294j236852j087660j056593r65997r29405q62679o60250o49689m83723
$$ 38005294 36768442 35680782 34624189 33658192 32728787 31866108 31205858 30556169 30072446
5844C0072446m31069n10567m10305m65708l40423l13325k24920k15168j01058
$$ 30072446 29641377 29130810 28720505 28254797 27914374 27601049 27376129 27160961 27059903
5835B7059903r5769k10731j31556k5137j014J611Q6346L2786J87550K55011K69008
$$ 27059903 26964134 26753403 26621847 26596710 26595696 26597307 26683653 26716439 26903989 27159000 27428008
5824B7428008L60897M98260P09534P54582K34100m44621o70503o81104l57120
$$ 27428008 27788905 28287165 28996699 29751281 29985381 29540760 28870257 28189153 27832033
5815B7832033k11412n0770M7899J64654J89281J19830K58029K13559L19813M32996
$$ 27832033 27620621 27569851 27617750 27782404 27971685 28091515 28349544 28563103 28882916 29315912
5805B9315912K76949L38809N68343L78970M29630O72555N74545O66620O56403
$$ 29315912 29592861 29931670 30500013 30878983 31308613 31981168 32555713 33222333 33878736
5796C3878736O87181P50355P91077R43364J045966J018649J176487J243789J249966
$$ 33878736 34565917 35316272 36107349 37050713 38096679 39115328 40291815 41535604 42785570
5787D2785570J333290J502675J535961J476260J647148J703618J849364J922643
$$ 42785570 44118860 45621535 47157496 48633756 50280904 51984522 53833886 55756529
5779E5756529J954557K255149K239551K371690K641628K900531L024434L192089
$$ 55756529 57711086 59966235 62205786 64577476 67219104 70119635 73144069 76336158
5771G6336158L569663M065005M682323M572999K323256K35713p34397j064081
$$ 76336158 79905821 83970826 88653149 93226148 95549404 95785117 95050720 93986639
5763I3986639k45867K14543Q39240P59003Q43856Q31770M93306M32315K89892
$$ 93986639 93740772 93955315 94794555 95553558 96397414 97229184 97722490 98154805 98444697
5754I8444697L38301M93222N93073N78729P91297R18899J186043J488316J731813
$$ 98444697 98782998 99276220 99869293 100448022 101239319 102158218 103344261 104832577 106564390
5745A06564390J917903K111324K174243K354003K227474K171122K027653J773838
$$ 106564390 108482293 110593617 112767860 115121863 117349337 119520459 121548112 123321950
5737A23321950J434715J133931Q39235K61349j23380p54417j221871j469408j620161
$$ 123321950 124756665 125890596 126729831 126991180 126867800 126113383 124891512 123422104 121801943
5728A21801943j699449j689941j674662j498814j521705j326656j065264q85805
$$ 121801943 120102494 118412553 116737891 115239077 113717372 112390716 111325452 110439647
5720A10439647o89290m06856l40313n8933K8010K5991J13009K06279N8792K7610
$$ 110439647 109750357 109343501 109003188 108944255 108972265 108998256 109111265 109317544 109376336 109403946
5710A09403946r8899m21754n27641p10131r23776j259527j198913j376579j533696
$$ 109403946 109305047 108883293 108355652 107645521 106721745 105462218 104263305 102886726 101353030
5701A01353030j443105j457174j437339j227196r84717p11925n14108k36399M1160
$$ 101353030 99909925 98452751 97015412 95788216 94803499 94091574 93577466 93341067 93382227
5692I3382227K52937O51109Q29489J251877J467603J841436K092112K133196K278221
$$ 93382227 93635164 94286273 95115762 96367639 97835242 99676678 101768790 103901986 106180207
5683A06180207K430670K431911K257967K272395K019132J765467J439686J084361
$$ 106180207 108610877 111042788 113300755 115573150 117592282 119357749 120797435 121881796
5675A21881796N35205M02788P4197J72363K76338L72339L92767O96532R86000
$$ 121881796 122417001 122819789 122893986 123066349 123342687 123715026 124107793 124804325 125790325
5666A25790325J232075J469978J727634J904700K189430K280913K280469K340351
$$ 125790325 127022400 128492378 130220012 132124712 134314142 136595055 138875524 141215875
5658A41215875K392501K232316J932547J587745J202047J072793O37222M75873
$$ 141215875 143608376 145840692 147773239 149360984 150563031 151635824 152273046 152748919
5650A52748919j55487l94070o58212p86669p42981p61761o29867m09811l98877
$$ 152748919 152593432 152199362 151541150 150754481 150011500 149249739 148619872 148210061 147811184
5641A47811184l5695L41098M24159P25350Q65518Q92703J177549J266006R96945
$$ 147811184 147775489 148116587 148540746 149266096 150131614 151024317 152201866 153467872 154464817
5632A54464817P04158K75409m52072j101495j731999k400947l045805l564235
$$ 154464817 155168975 155444384 154992312 153890817 152158818 149757871 146712066 143147831
5624A43147831m060748m140028m426862m344530m194255m131979l747869l495686
$$ 143147831 139087083 134947055 130520193 126175663 121981408 117849429 114101560 110605874
5616A10605874l146721k632668k183323j751209j594314j486252j221853j237859
$$ 110605874 107459153 104826485 102643162 100891953 99297639 97811387 96589534 95351675
5608I5351675j310688j285601j224584j524017j697015j761072k051264k231466
$$ 95351675 94040987 92755386 91530802 90006785 88309770 86548698 84497434 82265968
5600H2265968k474610k725802k836587k915556k835197k911580k841966k870042
$$ 82265968 79791358 77065556 74228969 71313413 68478216 65566636 62724670 59854628
5592E9854628k716875k566764k656940k345750k163310j891503j641717j565072
$$ 59854628 57137753 54570989 51914049 49568299 47404989 45513486 43871769 42306697
5584D2306697j421524j408190j132500j010945p97597p61191p65680o77347n58677
$$ 42306697 40885173 39476983 38344483 37333538 36535941 35774750 35009070 34331723 33773046
5575C3773046n02799n65941m01541m33370m46894o02964o03930m92316m13584
$$ 33773046 33270247 32704306 32302765 31869395 31422501 30819537 30215607 29723291 29309707
5566B9309707l58178l78536n35974o23711n43679o89556o47031n59571m40377
$$ 29309707 28951529 28572993 28037019 27413308 26869629 26180073 25533042 24973471 24533094
5557B4533094m01007k54245m41195k11373k28721k45677k13103k23045k61543
$$ 24533094 24132087 23877842 23436647 23225274 22996553 22750876 22537773 22314728 22053185
5548B2053185l45825k80353k18198k72162m05214n03524l74858m52426l69191
$$ 22053185 21707360 21427007 21208809 20936647 20531433 20027909 19653051 19200625 18831434
5539A8831434k55456n24664m27328m96338l26119l50031m89072m57139k76334
$$ 18831434 18575978 18051314 17623986 17127648 16801529 16451498 15962426 15505287 15228953
5530A5228953l06873m01147j91562l69539k45985k59345k89858k43027j63896
$$ 15228953 14922080 14520933 14329371 13959832 13713847 13454502 13164644 12921617 12757721
5521A2757721j48786k54124k94529k94658j95178k29754j87561j66792k07289
$$ 12757721 12608935 12354811 12060282 11765624 11570446 11340692 11153131 10986339 10779050
5512A0779050l26258k62700k08185k82173n5005j96432l32499j22699j30945j92448
$$ 10779050 10452792 10190092 9981907 9699734 9644729 9448297 9115798 8993099 8862154 8669706
5502H669706j01917j93051k02336o3400j60934k13604j26669J01774j23328n6458
$$ 8669706 8567789 8374738 8172402 8109002 7948068 7734464 7607795 7709569 7586241 7529783
5492G529783l6523j85943j22011N9841j22594N4966r5473O6006j06660j17559
$$ 7529783 7493260 7307317 7185306 7245147 7122553 7177519 7082046 7148052 7041392 6923833
5482F923833r7462m4876p0591q7355Q6653p7697J7681r41m2183N9715K3808J0400
$$ 6923833 6826371 6781495 6710904 6623549 6710202 6632505 6650186 6649245 6607062 6666777 6690585 6700985
5470F700985Q2617p498j32142R11L6071o7177j02803k60608n5406j55393l0593
$$ 6700985 6783602 6776104 6643962 6644873 6680944 6613767 6510964 6250356 6194950 6039557 6008964
5459F008964n0966n4536j38463l1148k9181m4955j3795q6699J2246j3240q4521
$$ 6008964 5957998 5903462 5764999 5733851 5704670 5659715 5645920 5559221 5571467 5558227 5473706
5448E473706N849j5587r1790m1212l1695k498r4440m0583J1248R405j80420j46567
$$ 5473706 5479555 5463968 5372178 5330966 5299271 5296773 5202333 5161750 5172998 5182403 5001983 4855416
5436D855416k2169l564Q0200j70665L5608l8560p9620J479m5939K9584p9726k9876
$$ 4855416 4833247 4829683 4909883 4739218 4774826 4736266 4656646 4658125 4612186 4641770 4562044 4532168
5424D532168M9362j5526j7874L3199j08825J1752P1415l7877o1985j82581K7498
$$ 4532168 4581530 4566004 4548130 4581329 4472504 4484256 4555671 4517794 4455809 4273228 4300726
5413D300726J07104p353P5057N1670r9373K7471J00378n2569J02999j27259J0755
$$ 4300726 4407830 4400477 4475534 4527204 4427831 4455302 4555680 4503111 4606110 4478851 4489606
5402D489606Q4123J7337P7206J0166J21427Q1985K5623j8251J073J13449q7569
$$ 4489606 4573729 4591066 4668272 4678438 4799865 4881850 4907473 4889222 4890295 5003744 4916175
5391D916175L2012M1725N8473L7871O2887Q7374j46804P7023j1419P4356L4331
$$ 4916175 4948187 4989912 5048385 5086256 5149143 5236517 5089713 5166736 5155317 5229673 5264004
5380E264004R0233L7709O159K2029L1557k25O2362O2382P2436P1651j32118J67026
$$ 5264004 5354237 5391946 5398105 5420134 5451691 5451466 5513828 5576210 5648646 5720297 5588179 5755205
5368E755205K8776P9432J16608q1723L6389l5746N1589J9288M5145J03526K2032
$$ 5755205 5783981 5863413 5980021 5898298 5934687 5898941 5950530 5969818 6014963 6118489 6140521
5357F140521K1845q1353n854L0614m429m722J14222N9950P798K23073L1705Q8048
$$ 6140521 6162366 6081013 6075159 6105773 6101344 6096622 6210844 6270794 6278592 6501665 6533370 6621418
5345F621418Q5192K826Q0052L2436K15098L5985K3577J55803Q6379K7938J1847
$$ 6621418 6706610 6709436 6789488 6821924 7037022 7073007 7096584 7252387 7338766 7366704 7378551
5334G378551J00795J6435p2904J66733J86177M0750L1667l1504J47292J67801
$$ 7378551 7479346 7495781 7422877 7589610 7775787 7816537 7848204 7816700 7963992 8131793
5324H131793J4301m7567R7218J34307Q5070J00815J00393J68102J22669J37070
$$ 8131793 8146094 8098527 8195745 8330052 8415122 8515937 8616330 8784432 8907101 9044171
5314I044171J04051J99507J70357J53942J61220J07094J43477J27685M2444P0585
$$ 9044171 9148222 9347729 9518086 9672028 9833248 9940342 10083819 10211504 10253948 10324533
5304A0324533J29173J79291P8521O9349R5875N5390K07214J71255L72259L37809
$$ 10324533 10453706 10632997 10711518 10780867 10876742 10932132 11139346 11310601 11682860 12020669
5294A2020669J87217J50674L37922L40858L42343M38612O12663P54732Q31900
$$ 12020669 12207886 12358560 12696482 13037340 13379683 13818295 14430958 15185690 16017590
5285A6017590R31042R57018R66954J118608J302938J379256J441770J620752K024050
$$ 16017590 16948632 17905650 18872604 19991212 21294150 22673406 24115176 25735928 27759978
5276B7759978K263856K762562L037654L543321L979294M430417M649376L528991
$$ 27759978 30023834 32786396 35824050 39367371 43346665 47777082 52426458 55955449
5268E5955449P43204k423119m609091n567523n184325m313401l485167k872205
$$ 55955449 56698653 54275534 49666443 44098920 38914595 34601194 31116027 28243822
5260B8243822k235823j851747j385849j290437j157234r54874j004262r56157
$$ 28243822 26007999 24156252 22770403 21479966 20322732 19367858 18363596 17407439
5252A7407439q16163o78791o40076m69007m82743k70175k00381l87465k77625
$$ 17407439 16591276 15912485 15272409 14803402 14320659 14050484 13850103 13462638 13185013
5243A3185013j93135k35492k07185k57708p3470j85371l53001l62285k76527k00287
$$ 13185013 12991878 12756386 12549201 12291493 12218023 12032652 11679651 11317366 11040839 10840552
5233A0840552n5382n4578q7452No5593r6410q1921j38614M0774q0549j46911J9876
$$ 10840552 10785170 10730592 10643140 10643145 10577552 10481142 10399221 10260607 10301381 10220832 10073921 10093797
5221A0093797p2610p8521j50897p0834j28993n4750j53464o0166m1644n2901K5690
$$ 10093797 10021187 9942666 9791769 9720935 9591942 9537192 9383728 9323562 9281918 9229017 9254707
5210I254707q0386j96199l2393R9515J7968l7046L7214l6900n8397Q0369m073
$$ 9254707 9174321 8978122 8945729 9045244 9063212 9026166 9063380 9026480 8968083 9048452 9044379
5199I044379K4176K210J10917J4249j7862N0260R414J54782K3224J02260J7156
$$ 9044379 9068555 9070765 9181682 9195931 9178069 9228329 9237743 9392525 9415749 9518009 9535165
5188I535165k22911j04445k3983j5731j7010J06575k9782k2137K1234P3362j6683
$$ 9535165 9312254 9207809 9183826 9168095 9151085 9257660 9227878 9205741 9226975 9300337 9283654
5177I283654Q5316O7753j27248j9396R6114J29479L3044k2995J9160Q6314J08222
$$ 9283654 9368970 9436723 9309475 9290079 9386193 9515672 9548716 9525721 9544881 9631195 9739417
5166I739417J8291o3422J46322J35937j5615k6368O4855J90814L5738Q7396P7572
$$ 9739417 9757708 9694286 9840608 9976545 9960930 9934562 9999417 10190231 10225969 10313365 10390937
5155A0390937Q2727J46418Q3533L3854P9274J17240O2844Q753P5689o8J04957
$$ 10390937 10473664 10620082 10703615 10737469 10816743 10933983 10996827 11005580 11081269 11081201 11186158
5144A1186158J67458L9571Q3877J04987Q5401J23771J68682K9531J54245K46903
$$ 11186158 11353616 11393187 11477064 11582051 11667452 11791223 11959905 11989436 12143681 12390584
5134A2390584O5989L7416J44129L8419J70661J26956J98915J07860J54180J75887
$$ 12390584 12456573 12493989 12638118 12676537 12847198 12974154 13173069 13280929 13435109 13610996
5124A3610996N4711K16421J77424J68339J59070Q8517K76457J04473K35193J85451
$$ 13610996 13665707 13882128 14059552 14227891 14386961 14475478 14751935 14856408 15091601 15277052
5114A5277052K82935L42025J61750J91727O2669L76587K46253K38403J33432K07211
$$ 15277052 15559987 15902012 16063762 16255489 16318158 16694745 16940998 17179401 17312833 17520044
5104A7520044K65903K37338L32967L34169L91077K17065L08341K90547L89939
$$ 17520044 17785947 18023285 18356252 18690421 19081498 19298563 19606904 19897451 20287390
5095B0287390L01695L23300L39106L65835L64102L59217L77919K95604L36145
$$ 20287390 20589085 20912385 21251491 21617326 21981428 22340645 22718564 23014168 23350313
5086B3350313L81223L42455L54375L89760M43762O77546N14354N25537M49172
$$ 23350313 23731536 24073991 24428366 24818126 25261888 25939434 26453788 26979325 27428497
5077B7428497N50629N88941N03308M58421M87669O51166N97177N58717P68174
$$ 27428497 27979126 28568067 29071375 29529796 30017465 30668631 31265808 31824525 32592699
5068C2592699O99814P67985P91556Q04091Q99099Q21735R25772R59248J101951
$$ 32592699 33292513 34060498 34852054 35656145 36555244 37376979 38302751 39261999 40363950
5059D0363950J138286J087563J148315J171229J184843J076610J215021J218717
$$ 40363950 41502236 42589799 43738114 44909343 46094186 47170796 48385817 49604534
5051D9604534J282936J287154J443740J389595J313973J400228J580807J469866
$$ 49604534 50887470 52174624 53618364 55007959 56321932 57722160 59302967 60772833
5043F0772833J253212J274723J376292J428563J285361J323088J328642J412263
$$ 60772833 62026045 63300768 64677060 66105623 67390984 68714072 70042714 71454977
5035G1454977J442377J739570J609648J702036J744706J580309J687068J616293
$$ 71454977 72897354 74636924 76246572 77948608 79693314 81273623 82960691 84576984
5027H4576984J597045J523766J453298J565107J428621J456902J657125J638116
$$ 84576984 86174029 87697795 89151093 90716200 92144821 93601723 95258848 96896964
5019I6896964J711263J812158J859259K052815J791580J799883J895005J883371
$$ 96896964 98608227 100420385 102279644 104332459 106124039 107923922 109818927 111702298
5011A11702298J725050J733395K018762J988146K107548K155245J983071J995005
$$ 111702298 113427348 115160743 117179505 119167651 121275199 123430444 125413515 127408520
5003A27408520J947239J546808J544956J515038J466287J408541J214676J255045
$$ 127408520 129355759 130902567 132447523 133962561 135428848 136837389 138052065 139307110
4995A39307110J439101J525913J649221J879712J994226K311086K435406K561762
$$ 139307110 140746211 142272124 143921345 145801057 147795283 150106369 152541775 155103537
4987A55103537K672729K833543K968382L022434L155007L452859L702446L865746
$$ 155103537 157776266 160609809 163578191 166600625 169755632 173208491 176910937 180776683
4979A80776683M069595L996080M014546L735471L287232K877330K413928J941666
$$ 180776683 184846278 188842358 192856904 196592375 199879607 202756937 205170865 207112531
4971B07112531J321456Q91723N72608L24320j65034m16328n84102p50029p38415
$$ 207112531 208433987 209325710 209898318 210222638 210057604 209641276 209057174 208307145 207568730
4962B07568730o15530n97503o08941m37719m74209l00582j58390k29981k43927
$$ 207568730 206953200 206355697 205746756 205309037 204834828 204534246 204375856 204145875 203901948
4953B03901948k97330l79211m00440l91355n23429j108129j568916j966491k308978
$$ 203901948 203604618 203225407 202824967 202433612 201910183 200802054 199233138 197266647 194957669
4944A94957669k842999l178652l605367m040750m305826m378429m346782m370135
$$ 194957669 192114670 188936018 185330651 181289901 176984075 172605646 168258864 163888729
4936A63888729m342756m333893m169746l742092l348847l058546k789631k497098
$$ 163888729 159545973 155212080 151042334 147300242 143951395 140892849 138103218 135606120
4928A35606120k314240j992701j851219j775996j723050j600910j616893j626147
$$ 135606120 133291880 131299179 129447960 127671964 125948914 124348004 122731111 121104964
4920A21104964j667440j552447j576482j746461j585430j591594j826255j881307
$$ 121104964 119437524 117885077 116308595 114562134 112976704 111385110 109558855 107677548
4912A07677548j875433j808715j742471j821157j923564j827721j761495j794366
$$ 107677548 105802115 103993400 102250929 100429772 98506208 96678487 94916992 93122626
4904I3122626j701242j490528j384483j298439j039242r87657q81850r23908r72062
$$ 93122626 91421384 89930856 88546373 87247934 86208692 85221035 84339185 83415277 82443215
4895H2443215j048535q83513j037876j211436j152016j248677j247922j081102
$$ 82443215 81394680 80511167 79473291 78261855 77109839 75861162 74613240 73532138
4887G3532138j171868j200804j209714j077340j056823j029704j112967j209707
$$ 73532138 72360270 71159466 69949752 68872412 67815589 66785885 65672918 64463211
4879F4463211j065296j124044j170558r70465j026310r27496q07474p44743j047081
$$ 64463211 63397915 62273871 61103313 60132848 59106538 58179042 57371568 56626825 55579744
4870E5579744j069098j030196j124955j202173j217584j314769j415083j257219
$$ 55579744 54510646 53480450 52355495 51153322 49935738 48620969 47205886 45948667
4862D5948667j385813j256777j046555j071883r78742r25765r24232p94387p11265
$$ 45948667 44562854 43306077 42259522 41187639 40208897 39283132 38358900 37564513 36853248
4853C6853248p78433o67257o28703o40142n90190n62055m61428n72696m81306
$$ 36853248 36074815 35407558 34778855 34138713 33548523 32986468 32525040 31952344 31471038
4844C1471038n10503n10049l82482m76126n66375n83807n35806l63616m11882
$$ 31471038 30960535 30450486 30068004 29591878 29025503 28441696 27905890 27542274 27130392
4835B7130392m97563m81870l82513l02162l65150l08794l83523l26608l27487
$$ 27130392 26632829 26150959 25768446 25466284 25101134 24792340 24408817 24082209 23754722
4826B3754722l30303k87459k37420k17768k09569j95098k40540j91500j93086
$$ 23754722 23424419 23136960 22899540 22681772 22472203 22277105 22036565 21845065 21651979
4817B1651979p9086j45766j77206j98487j12103j99128k11448j41135j14729j71316
$$ 21651979 21572893 21427127 21249921 21051434 20939331 20740203 20528755 20387620 20272891 20101575
4807B0101575k44134j63299n6327j56533j07689j16902k34616j80483o2493j71566
$$ 20101575 19857441 19694142 19637815 19481282 19373593 19256691 19022075 18841592 18779099 18607533
4797A8607533k19834j30618k04573j50178p9919j81771j52483j62582r4496j68146
$$ 18607533 18387699 18257081 18052508 17902330 17822411 17640640 17488157 17325575 17231079 17062933
4787A7062933k24837j80140O049j08514j96907J9040J0495j30561j32056q7236
$$ 17062933 16838096 16657956 16664005 16555491 16358584 16377624 16388119 16257558 16125502 16038266
4777A6038266L825j89425j25741L9783q1780k4616o0513N3347j76766o2887L5249
$$ 16038266 16042091 15852666 15726925 15766708 15684928 15660312 15599799 15653146 15476380 15413493 15448742
4766A5448742n8549j45678o0478l3030M4658k614j5333q0852j5650l1914r0049
$$ 15448742 15390193 15244515 15184037 15151007 15195665 15193051 15177718 15096866 15081216 15049302 14959253
4755A4959253K7117p6519L4129O5431R2906k4094q9916J20640l6230p6397M6131
$$ 14959253 14986370 14909851 14943980 15009411 15102317 15078223 14988307 15108947 15072717 14996320 15042451
4744A5042451o9734M8961m4944j686J39207L7643L9688P5454O0846L6639j6851
$$ 15042451 14972717 15021678 14976734 14975048 15114255 15151898 15191586 15267040 15327886 15364525 15347674
4733A5347674R6893J06467J4414q7178J8317o2409O1318K8517r4324J17378M7134
$$ 15347674 15444567 15551034 15565448 15478270 15496587 15434178 15495496 15524013 15429689 15547067 15594201
4722A5594201R4477p4845p8612K01593J09984J21583k8658Q718J06473J17961
$$ 15594201 15688678 15613833 15535221 15736814 15846798 15968381 15939723 15948441 16054914 16172875
4712A6172875J52735J9615O2855R1834J16676N7258M5298Q9616P1639p277m4293
$$ 16172875 16325610 16345225 16408080 16499914 16616590 16673848 16719146 16808762 16880401 16873124 16828831
4701A6828831j6989n6688J02908J09945j7257L1893R1969j1179j51616j2001j292
$$ 16828831 16811842 16755154 16858062 16968007 16950750 16982643 17074612 17063433 16911817 16899816 16898524
4690A6898524P5563j0274J6276J12723k6548J22425J02852j8781Q0687R142P8492
$$ 16898524 16974087 16963813 16980089 17092812 17066264 17188689 17291541 17272760 17353447 17362589 17441081
4679A7441081J56281R0107K1970K9519j0277P4551r741K3675m0408M3321n841
$$ 17441081 17597362 17687469 17709439 17738958 17728681 17803232 17793491 17817166 17776758 17820079 17814238
4668A7814238P0692K954j32405l6795l4160K4471O060k5203J18123k3826K655
$$ 17814238 17884930 17887884 17755479 17718684 17684524 17708995 17715055 17689852 17807975 17784149 17786804
4657A7786804p7509L8102O2567J40732Q0043K8751R0488K624r5515J7206J84001
$$ 17786804 17709295 17747397 17809964 17950696 18030739 18059490 18149978 18152602 18057087 18074293 18258294
4646A8258294P8176M9028O9477j0843j9824P8770k0823p4585J0663Q5717J44896
$$ 18258294 18336470 18385498 18454975 18444132 18424308 18503078 18482255 18407670 18418333 18504050 18648946
4635A8648946M3880j9305k6088j14065J41053p4917J38514l4207l0459n2687J28220
$$ 18648946 18692826 18673521 18647433 18533368 18674421 18599504 18738018 18703811 18673352 18620665 18748885
4624A8748885J17810J54569J04345q634K2805M8664K7575R1791R8371N305P4241
$$ 18748885 18866695 19021264 19125609 19116975 19139780 19188444 19216019 19307810 19406181 19411486 19485727
4613A9485727j4283L3198O5631j1764J1521k2051J02429J37733J09850l6683J29422
$$ 19485727 19471444 19504642 19570273 19558509 19570030 19547979 19650408 19788141 19897991 19861308 19990730
4602A9990730R2664J32131N3877M5824P6360O7508M6891J28701J83345K1643J35115
$$ 19990730 20083394 20215525 20269402 20315226 20391586 20459094 20505985 20634686 20818031 20839674 20974789
4591B0974789M9158Q3921L06689J84864R7142J61062P7190K36939K32394J02407
$$ 20974789 21023947 21107868 21414557 21599421 21696563 21857625 21934815 22171754 22404148 22506555
4581B2506555J16756K79687J53786J78147K29808J24054J14021K87025J44712
$$ 22506555 22623311 22902998 23056784 23234931 23464739 23588793 23702814 23989839 24134551
4572B4134551J22988K72990K70926N2185J48049J93605L56864K48036J26147K25393
$$ 24134551 24257539 24530529 24801455 24853640 25001689 25195294 25552158 25800194 25926341 26151734
4562B6151734K17329K29946J27469J71898L93062K92969J57829K13530L09625
$$ 26151734 26369063 26599009 26726478 26898376 27291438 27584407 27742236 27955766 28265391
4553B8265391K84294L06797K60243J89163L41494K83959K67572K78572L37591
$$ 28265391 28549685 28856482 29116725 29305888 29647382 29931341 30198913 30477485 30815076
4544C0815076L37536L18869L47255L05826M33491L41323L69245L58095M25871
$$ 30815076 31152612 31471481 31818736 32124562 32558053 32899376 33268621 33626716 34052587
4535C4052587L04473M00254N26309N37985M17487M99579N84641M78414N81247
$$ 34052587 34357060 34757314 35283623 35821608 36239095 36738674 37323315 37801729 38382976
4526C8382976M62739N46365O48917O33508O58254N20130P42761P15645O56886
$$ 38382976 38845715 39392080 40040997 40674505 41332759 41852889 42595650 43311295 43968181
4517D3968181O45731O66215P84664P17892P36585O33684O74102P11096P16304
$$ 43968181 44613912 45280127 46064791 46782683 47519268 48152952 48827054 49538150 50254454
4508E0254454P65038Q66733R32305Q97229Q88436R30556Q93211J037516R21983
$$ 50254454 51019492 51886225 52818530 53715759 54604195 55534751 56427962 57465478 58387461
4499E8387461R22165R53012J044331J021792J010316J184370J191628J145997
$$ 58387461 59309626 60262638 61306969 62328761 63339077 64523447 65715075 66861072
4491F6861072J082990J131522J333200J256931J260748J223197J380099J286049
$$ 66861072 67944062 69075584 70408784 71665715 72926463 74149660 75529759 76815808
4483G6815808J237812J204226J381965J325208J246528J374510J519594J443420
$$ 76815808 78053620 79257846 80639811 81965019 83211547 84586057 86105651 87549071
4475H7549071J556055J659648J607361J845974J863791J825323J906129K037626
$$ 87549071 89105126 90764774 92372135 94218109 96081900 97907223 99813352 101850978
4467A01850978K165055K287301K390714K541722K753583L033797L180085L354039
$$ 101850978 104016033 106303334 108694048 111235770 113989353 117023150 120203235 123557274
4459A23557274L690407M253514M517663M876118N201938N651948O046671O506186
$$ 123557274 127247681 131501195 136018858 140894976 146096914 151748862 157795533 164301719
4451A64301719P050834P573757P933707Q438923Q782359R212927R427596R780098
$$ 164301719 171352553 178926310 186860017 195298940 204081299 213294226 222721822 232501920
4443B32501920R758920R466989Q821264P409508N583747L208030J50556l003468
$$ 232501920 242260840 251727829 260549093 267958601 273542348 276750378 276900934 273897466
4435B73897466n752711p792502r128315r801460r929606r799476q954468q118227
$$ 273897466 268144755 260352253 251223938 241422478 231492872 221693396 212738928 204620701
4427B04620701p385331o789849n950930n585333n045084m734173m588952m117674
$$ 204620701 197235370 190445521 184494591 178909258 173864174 169130001 164541049 160423375
4419A60423375l969202l585073l410946l257119k983884l011870k717666k647603
$$ 160423375 156454173 152869100 149458154 146201035 143217151 140205281 137487615 134840012
4411A34840012k494278k331925k354735k214412k184640k287770k345830k401843
$$ 134840012 132345734 130013809 127659074 125444662 123260022 120972252 118626422 116224579
4403A16224579k440634k610424k689583k553841k359109k467958k297167k381373
$$ 116224579 113783945 111173521 108483938 105930097 103570988 101103030 98805863 96424490
4395I6424490k193819k162163k150819k032465j975875j710336j672337j570777
$$ 96424490 94230671 92068508 89917689 87885224 85909349 84199013 82526676 80955899
4387H0955899j559564j451103j377814j345657j224849j057479j083551r47688
$$ 80955899 79396335 77945232 76567418 75221761 73996912 72939433 71855882 70908194
4379G0908194r94344r60712q00379p57220q01252m89711n81743p64831j082918
$$ 70908194 69913850 68953138 68152759 67395539 66594287 66104576 65522833 64758002 63675084
4370F3675084j226042j191624j288993j053847q92976q67613q07619q10895q19141
$$ 63675084 62449042 61257418 59968425 58914578 58021602 57153989 56346370 55535475 54716334
4361E4716334p38774o20660o04590p03904o26937n21320o53412n14057l70599
$$ 54716334 53977560 53356900 52752310 52048406 51421469 50900149 50246737 49732680 49362081
4352D9362081m05289n49700m25869m34322l81161l30268k55545l88444k80790
$$ 49362081 48956792 48407092 47981223 47546901 47165740 46835472 46579927 46191483 45910693
4343D5910693j92016k84447j70301k61201m73106n92917o69939o31962n32801
$$ 45910693 45718677 45434230 45263929 45002728 44529622 43936705 43266766 42634804 42102003
4334D2102003m49592m45586m51541l81792m34156l37190m73585m31904l36244
$$ 42102003 41652411 41206825 40755284 40373492 39939336 39602146 39128561 38696657 38360413
4325C8360413l48425l73878l42395k85422k61589l73002l02356l07713l08752
$$ 38360413 38011988 37638110 37295715 37010293 36748704 36375702 36073346 35765633 35456881
4316C5456881j76870k49960k83487k56335k42387k51897k71538k05993k51834
$$ 35456881 35280011 35030051 34746564 34490229 34247842 33995945 33724407 33518414 33266580
4307C3266580k92840j41322p7218k39001j88694j14380r0082j76625j85583k23216
$$ 33266580 32973740 32832418 32755200 32516199 32327505 32213125 32123043 31946418 31760835 31537619
4297C1537619k17002j45034j98440o4506P0475j58805k20885j27708j21841o9699
$$ 31537619 31320617 31175583 30977143 30912637 30983112 30824307 30603422 30475714 30353873 30284174
4287C0284174q4624j79967j02090j82518o5339m3348j27558j93598j17486L3467
$$ 30284174 30199550 30019583 29917493 29734975 29669636 29626288 29498730 29305132 29187646 29221113
4277B9221113k2992j85468k41138j36851k13205j16951j04408k20908k30784j52941
$$ 29221113 29198121 29012653 28771515 28634664 28421459 28304508 28200100 27979192 27748408 27595467
4267B7595467p4895j78843j88501k18144k19090j20465j06884j72391j51618k19840
$$ 27595467 27520572 27341729 27153228 26935084 26715994 26595529 26488645 26316254 26164636 25944796
4257B5944796j85565j61136k35721j00674p2836j14600k20292j63408p5541q141
$$ 25944796 25759231 25598095 25362374 25261700 25188864 25074264 24853972 24690564 24615023 24606882
4247B4606882o9914j51241j54172l33165n7508j07499j28084q7119k42136j43011
$$ 24606882 24536968 24385727 24231555 23898390 23840882 23733383 23605299 23518180 23276044 23133033
4237B3133033k14302j22851j89971q5520k13544k42475j65890j39956j59303m6815
$$ 23133033 22918731 22795880 22605909 22520389 22306845 22064370 21898480 21758524 21599221 21552406
4227B1552406q3227j28704j30759k09792M1442k3043p1979o2370j75901n3307
$$ 21552406 21469179 21340475 21209716 20999924 21041366 21018323 20946344 20883974 20708073 20654766
4217B0654766M5052j62722o8965O4280P7524M3101l9702J5225M6352M9811l7510
$$ 20654766 20699818 20537096 20468131 20532411 20609935 20653036 20613334 20628559 20674911 20724722 20687212
4206B0687212O5059R3346J34759k7348M3530L5950O4144M9252K5835Q599J12344
$$ 20687212 20752271 20845617 20980376 20953028 20996558 21032508 21096652 21145904 21171739 21180338 21292682
4195B1292682K2597J29439J28209J02713K18479R7251L04466K22507J34680K50445
$$ 21292682 21315279 21444718 21572927 21675640 21894119 21991370 22295836 22518343 22653023 22903468
4185B2903468J19519J85867K63808K27123K76462K60761K03605L07847L55868
$$ 22903468 23022987 23208854 23472662 23699785 23976247 24237008 24440613 24748460 25104328
4176B5104328K39254K74737K91486K75039K64728K63212K86111J19657K23999
$$ 25104328 25343582 25618319 25909805 26184844 26449572 26712784 26998895 27118552 27342551
4167B7342551K47414K84939L06561K06251L27675M04851L67467K18332L78139
$$ 27342551 27589965 27874904 28181465 28387716 28715391 29120242 29487709 29706041 30084180
4158C0084180K60036M18431L39832M82072M63840L15261M61104N07290M69430
$$ 30084180 30344216 30762647 31102479 31584551 32048391 32363652 32824756 33332046 33801476
4149C3801476P40690N75239N32737Q35212Q91057Q01761Q25039Q23043Q57553
$$ 33801476 34542166 35117405 35650142 36485354 37376411 38178172 39003211 39826254 40683807
4140D0683807Q29808Q17088Q25659R88643J000222J002765J174919J209861J237095
$$ 40683807 41513615 42330703 43156362 44145005 45145227 46147992 47322911 48532772 49769867
4131D9769867J385544J348245J356479J172117J200110J079216J001355R29092
$$ 49769867 51155411 52503656 53860135 55032252 56232362 57311578 58312933 59242025
4123E9242025Q79248Q14088O18561P94099P11149Q74443J020810R50233J005337
$$ 59242025 60121273 60935361 61553922 62348021 63059170 63933613 64954423 65904656 66909993
4114F6909993J157238J265939J518337J608342J784928J902362J997693K209516
$$ 66909993 68067231 69333170 70851507 72459849 74244777 76147139 78144832 80354348
4106H0354348K284713K306929K513929K793982K867881K794922K838566K556389
$$ 80354348 82639061 84945990 87459919 90253901 93121782 95916704 98755270 101311659
4098A01311659K354134J641992R37207m317p85735j442191j962261k064836j845627
$$ 101311659 103665793 105307785 106244992 106240675 105454940 104012749 102050488 99985652 98140025
4089I8140025j502377j109971p57097k50016J58913O50009Q37068J030739J251788
$$ 98140025 96637648 95527677 94770580 94520564 94679477 95329486 96166554 97197293 98449081
4080I8449081J484417J620315J550609J638294J634793J479219J419956J333826
$$ 98449081 99933498 101553813 103104422 104742716 106377509 107856728 109276684 110610510
4072A10610510Q37105O22284k1n19650j032632j458574j852282k221894k481347
$$ 110610510 111447615 112069899 112069878 111550228 110517596 109059022 107206740 104984846 102503499
4063A02503499k847160k800807k633880k482420k174142j925307j716960j206619
$$ 102503499 99656339 96855532 94221652 91739232 89565090 87639783 85922823 84716204
4055H4716204j004384p77021o79174m29791k88716m84777m29967p32037q65503
$$ 84716204 83711820 82934799 82255625 81825834 81537118 81052341 80622374 79890337 79024834
4046G9024834r94116j083901j562487j860734k150151k227825k441804k501229
$$ 79024834 78030718 76946817 75384330 73523596 71373445 69145620 66703816 64202587
4038F4202587k525746k456554k376062k305861k044177j877236j726356j769796
$$ 64202587 61676841 59220287 56844225 54538364 52494187 50616951 48890595 47120799
4030D7120799j496362j316952j230182j239912j102436j077071r95600r57559
$$ 47120799 45624437 44307485 43077303 41837391 40734955 39657884 38662284 37704725
4022C7704725r51186p61292p57951p47349p66884p40861p90884r16638q14091
$$ 37704725 36753539 35992247 35234296 34486947 33720063 32979202 32188318 31271680 30457589
4013C0457589p87516q29488o86060o66072p58903p51153o09304m88105p23958
$$ 30457589 29670073 28840585 28154525 27488453 26729550 25978397 25369093 24880988 24157030
4004B4157030n96849n84545n06188m76966m07628m14739n38686m33272l56985
$$ 24157030 23560181 22975636 22469448 21992482 21584854 21170115 20631429 20198157 19841172
3995A9841172l77379m17961m43842m03524k99759k54302j47068k69899j81476
$$ 19841172 19463793 19045832 18601990 18198466 17898707 17644405 17497337 17227438 17045962
3986A7045962k38059l18449k01166k74056k76242j84513j56023j96195l64162
$$ 17045962 16807903 16489454 16288288 16014232 15737990 15553477 15397454 15201259 14837097
3977A4837097k24498k04131k14919l54790j92671j97630l18128l02102k69675
$$ 14837097 14612599 14408468 14193549 13838759 13646088 13448458 13130330 12828228 12558553
3968A2558553l07875j98160m3716l88136l10987k12590p1228k04072j67968j05840
$$ 12558553 12250678 12052518 12008802 11620666 11309679 11097089 11025861 10821789 10653821 10547981
3958A0547981k75630p1015q7170m4985j52864j43861l7718j95996k56880p5104
$$ 10547981 10272351 10201336 10114166 10069181 9916317 9772456 9734738 9538742 9281862 9206758
3948I206758j88205k35375k28730j16323p0338j67860k18816j97308p1081j31771
$$ 9206758 9018553 8783178 8554448 8438125 8367787 8199927 7981111 7783803 7712722 7580951
3938G580951j14045j16378j45167j75195j34936j62097j28478J3375k2133j15878
$$ 7580951 7466906 7350528 7205361 7030166 6895230 6733133 6604655 6618030 6595897 6480019
3928F480019k30348j85728j6645j18267p2112o7057j19417o8952J5864q0180j87188
$$ 6480019 6249671 6063943 6047298 5929031 5856919 5789862 5670445 5601493 5617357 5537177 5349989
3917E349989j15497N8962j31558p5979m4535l0644k2161k6824j62160j6341q9696
$$ 5349989 5234492 5293454 5161896 5085917 5041382 5010738 4988577 4961753 4799593 4783252 4693556
3906D693556j07186q7153r0220L6142L9966q9784N7391j13744p8405r65p1779
$$ 4693556 4586370 4499217 4408997 4445139 4485105 4395321 4452712 4338968 4260563 4259598 4187819
3895D187819N9372q6849J4326k5974j07742k12578o7237L9612J87623n204k8540
$$ 4187819 4247191 4160342 4174668 4148694 4040952 3828374 3761137 3800749 3988372 3983168 3954628
3884C954628J5816n5411j96053m7308l023l7992J8301j07585r6411P6326j05578
$$ 3954628 3970444 3915033 3718980 3671672 3668649 3630657 3648958 3541373 3444962 3521288 3415710
3873C415710L8605J15590j17793j19066m8621J33518l0792j56959J9522m0556
$$ 3415710 3454315 3569905 3452112 3333046 3284425 3417943 3387151 3230192 3249714 3209158
3863C209158p7043J9223o1346O4809r5328j8099P9572J4401k9734p0733r939k3239
$$ 3209158 3132115 3151338 3089992 3154801 3059473 3041374 3120946 3135347 3105613 3034880 3024941 3001702
3851C001702m6001q204J19213j22535m7293L9283K2158n2457l5742K0027L8289
$$ 3001702 2955701 2947497 3066710 2944175 2896882 2936165 2958323 2905866 2870124 2890151 2928440
3840B928440l6769m4861J5544j33878O1516M5922l7187k0332j14791N4359m0035
$$ 2928440 2891671 2846810 2862354 2728476 2789992 2835914 2798727 2778395 2663604 2717963 2677928
3829B677928J1602k1980j1907j1541l3282m833J4228l5008J2777m1533J00981
$$ 2677928 2689530 2667550 2655643 2644102 2610820 2605987 2620215 2585207 2597984 2556451 2657432
3818B657432N6439l9132k9307l8851l640L0424L3263O8195m0248m4597N9111j06118
$$ 2657432 2713871 2674739 2645432 2606581 2602941 2633365 2666628 2734823 2694575 2649978 2709089 2602971
3806B602971n8005L9299m0479j92515l448n1297N3336L9578M4433N0704q3200
$$ 2602971 2544966 2584265 2543786 2351271 2347823 2296526 2349862 2389440 2433873 2484577 2401377
3795B401377r463K7340m9451J74050p9171j52677J31971Q5417p7950p5884n267
$$ 2401377 2391914 2419254 2369803 2543853 2464682 2312005 2443976 2529393 2451443 2375559 2370292
3784B370292l0820n1301O7517j18732n1544K1292O8090Q0106k3530j42456n9427
$$ 2370292 2339472 2288171 2355688 2236956 2185412 2206704 2274794 2354900 2331370 2188914 2129487
3773B129487P4445k4968p6926L7133M8587j59911O5169O035J7412p5688j04506
$$ 2129487 2203932 2178964 2102038 2139171 2187758 2027847 2093016 2099051 2116463 2040775 1936269
3762A936269J18849j90885j47796J44014J6341j8546p4947j9713O9380p2160j25526
$$ 1936269 2055118 1864233 1716437 1860451 1876792 1858246 1783299 1763586 1832966 1760806 1635280
3751A635280j295Q1453n5155N226k9138M6863j41345k848l1673j02773k643M961
$$ 1635280 1633985 1715438 1660283 1665509 1636371 1683234 1541889 1539041 1507368 1404595 1401952 1406913
3739A406913Q8122l047L5113J2327j4471j4589N5893m2062q9878J69029q533j30642
$$ 1406913 1495035 1491988 1527101 1539428 1524957 1510368 1566261 1524199 1434321 1603350 1594817 1464175
3727A464175l2185q0711R1439J3705K3566q1193m3139k9003j1281j6169L3076
$$ 1464175 1431990 1351279 1442718 1456423 1479989 1398796 1355657 1326654 1315373 1299204 1332280
3716A332280R6926r0607p0458j11117R9667K0455q762K9905m7865p1556O9456
$$ 1332280 1429206 1338599 1268141 1157024 1256691 1277146 1268384 1298289 1250424 1178868 1248324
3705A248324K5641j07772n5661K9595k7411o085P1446r9275J4886J14320q4435
$$ 1248324 1273965 1166193 1110532 1140127 1112716 1106631 1178077 1078802 1093688 1208008 1123573
3694A123573j20703R9201L2522j812o7046n7133l2916M6374J5375o7441l0085
$$ 1123573 1002870 1102071 1134593 1132781 1065735 1008602 975686 1022060 1037435 969994 939909
3683I39909P0108R0961o7356o0229k3636K045L2830J4565M8073n5785k7509k8651
$$ 939909 1010017 1100978 1033622 973393 949757 951802 984632 999197 1047270 991485 963976 935325
3671I35325o0345l1099J30749j0296M1600j12363m152j2229m0893k402R0899J2295
$$ 935325 874980 843881 974630 964334 1005934 893571 889419 877190 836297 833895 924794 937089
3659I37089p5564o8266l964p3203M7007j2611j5289P944J0669K6634l158j1634
$$ 937089 861525 793259 789295 716092 763099 750488 735199 743143 753812 780446 777288 765654
3647G65654n8678J06379m0862j09200K6213L3266p3726R7893R448p5193l9922
$$ 765654 706976 813355 772493 663293 689506 722772 649046 746939 756387 681194 641272
3636F41272K2570J1988r6692n5824P9469L8904J9291M4857r7041r7607Q7917j1045
$$ 641272 663842 675830 579138 523314 602783 641687 660978 705835 608794 511187 599104 588059
3624E88059L4332J5607o1117l6474o626L1751m7218m972K0588L3883k0074m3886
$$ 588059 622391 637998 576881 540407 533781 565532 518314 513342 533930 567813 547739 503853
3612E03853M5843o700o2345K6072J00024r2991J5944m4211m0128p6038N6013R2694
$$ 503853 549696 542996 480651 506723 606747 513756 529700 485489 445361 369323 425336 518030
3600E18030K5591J0283O854o8299L8405k8136m8826j01953J42830q0516j20016
$$ 518030 543621 553904 560758 492459 530864 502728 453902 351949 494779 414263 294247
3589B94247J58280O4905O9690j5391n27Q214m4693j07467K0427l5135q6105R6449
$$ 294247 452527 517432 587122 571731 571204 579418 534725 427258 447685 412550 326445 422894
3577D22894P0074p6549N49p9171l0630M7774N1556J1506K6177p2003R1854o2329
$$ 422894 492968 416419 416968 337797 307167 354941 406497 418003 444180 372177 464031 401702
3565D01702m016N2324j56191N7425r901k8348m8842J10989m7413l9445N8612Q757
$$ 401702 397686 450010 293819 351244 341343 312995 264153 375142 327729 288284 346896 355653
3553C55653j12192r7468K0491R9523l1796P1045k9128l4366J181k7265k6309N9694
$$ 355653 243461 145993 166484 266007 234211 305256 276128 241762 242943 215678 189369 249063
3541B49063M4231n5579j9944j6757n543L6224R9710j40761N5390p6766l2886j9608
$$ 249063 293294 237715 217771 201014 195471 231695 331405 190644 246034 169268 136382 116774
3529A16774M7699Q895L7723K7779J3607n3600M123R4355p8074j26407M1630K17799
$$ 116774 164473 173368 211091 238870 252477 198877 203000 297355 219281 92874 134504 352303
3517C52303m1020l5167k39m0179j7972j17774N3355L7113m5188j07085Q9095R119
$$ 352303 311283 276116 275877 235698 217726 99952 153307 190420 145232 38147 127242 136361
3505A36361k9300J85803n3666k8643K8880m2866K3775L7795j33935O435k0113
$$ 136361 107061 292864 239198 210555 239435 196569 220344 258139 124204 130639 110526
3494A10526K9064j7269r493P7598O7977P0579o6320p7085m0179p3861J47000J3631
$$ 110526 139590 122321 112828 190426 258403 328982 262662 185577 145398 71537 218537 232168
3482B32168l2558n1594k4904N0261r7529O7668L3747P9405N2617n080q5806L8267
$$ 232168 199610 148016 123112 173373 75844 143512 177259 256664 309281 304201 218395 256662
3470B56662j04020o5262k0721Q8639J0477J48441M5486o5166k8000l2678j8052
$$ 256662 152642 87380 66659 155298 165775 314216 359702 294536 266536 233858 215806
3459B15806p8179O987O8515j4215j03039j8667L45M9063l4921J1499K5129l7508
$$ 215806 137627 144614 213129 198914 95875 77208 77553 126616 91695 103194 128323 90815
3447I0815L0020m9346R1038o317L6768P8339p2635l7923J12121J0748l7869M133
$$ 90815 120835 71489 162527 156210 192978 271317 198682 160759 272880 283628 245759 249892
3435B49892o6327r5079J71369O2474j52702k6463l5856L2995L6816J2163j7270
$$ 249892 183565 88486 259855 322329 169627 143164 107308 140303 177119 189282 172012
3424A72012o8303Q8258r629K4406P4867q5012R21N7991L3389m5685Q1020K6925
$$ 172012 103709 191967 182338 206744 281611 196599 197520 255511 288900 243215 324235 351160
3412C51160o5523m0207j3540Q8166m7504l5752M1429j18095j2828M7746N9315
$$ 351160 285637 245430 231890 320056 272552 236800 278229 160134 147306 195052 254367
3401B54367m7867N2470J0121p2743J3608J35972j7002M5865J03802N6006k0624
$$ 254367 206500 258970 269091 196348 209956 345928 328926 374791 478593 534599 513975
3390E13975q2511k5113l851Q9735N931J7293J0982L0862l3152j6965P9470N1542
$$ 513975 431464 406351 402500 492235 498166 515459 526441 557303 524151 507186 586656 638198
3378F38198P6427L037J5792K4596M0943j9662l3480k6299Q3788Q2092J55205r0062
$$ 638198 714625 717662 733454 758050 798993 779331 745851 719552 803340 885432 1040637 950575
3366I50575m1433l7672o215K808n8869M0698Q8627O8648O1338k544J06948j21974
$$ 950575 909142 871470 865255 868063 809194 849892 938519 1007167 1068505 1065961 1172909 1050935
3354A050935o003J4392l6051R2746M6733N3761J28390M1359k5653j2673M3154
$$ 1050935 1044932 1059324 1023273 1116019 1162752 1216513 1344903 1386262 1360609 1347936 1391090
3343A391090Q4279J25764J269J02216J5484J8224j09633J9625K04427J80603O0400
$$ 1391090 1475369 1601133 1602402 1704618 1720102 1738326 1628693 1648318 1852745 2033348 2093748
3332B093748j5612k8916J13613R7542k5770K14052O7865J00159J59841J33024
$$ 2093748 2078136 2049220 2162833 2260375 2234605 2448657 2516522 2616681 2776522 2909546
3322B909546J16330J80038J89627J73174K68243L31502L77516M62721N96253M20125
$$ 2909546 3025876 3205914 3395541 3568715 3836958 4168460 4545976 5008697 5604950 6025075
3312F025075M76416O02668O14690N09964P16065Q30903J006612J366951J791092
$$ 6025075 6501491 7104159 7718849 8228813 8944878 9775781 10782393 12149344 13940436
3303A3940436J920295K336112K945239M571078L398285j932510k761446j358894
$$ 13940436 15860731 18196843 21142082 25713160 29111445 27178935 24417489 23058595
3295B3058595j889209l672328k835802k267005j776600j428008r84748p34331
$$ 23058595 21169386 17497058 14661256 12394251 10617651 9189643 8204895 7470564
3287G470564n48875l19262k43816l12128m59645m37602k64334m91418m19393l01624
$$ 7470564 6921689 6602427 6358611 6046483 5586838 5149236 4884902 4393484 3974091 3672467
3277C672467l37267j87838k00808k78395j57825n2830j17954j15231j02284j25637
$$ 3672467 3335200 3147362 2946554 2668159 2510334 2457504 2339550 2224319 2122035 1996398
3267A996398r4225n0216j84312j30323O6340q1416j51327P1210j00732j41295
$$ 1996398 1902173 1851957 1667645 1537322 1603662 1522246 1370919 1442129 1341397 1200102
3257A200102n9945J4669K9699r8706p3107J4791j07570M215L5667m2435K7502
$$ 1200102 1140157 1154826 1184525 1085819 1012712 1027503 919933 924148 959815 917380 944882
3246I44882o7636j9452j4153j09329n7601n2967J8579L0633K4542q144j07711
$$ 944882 877246 857794 843641 734312 676711 623744 642323 672956 697498 689354 581643
3235E81643n2508k3120L6674Q4569m3798l2488p5312O0341q1387k3144q5845M3749
$$ 581643 529135 506015 542689 627258 583460 550972 475660 536001 454614 431470 345625 389374
3223C89374N3417j2995q6767J0912l9054N8774l597K5597j30633J00032j24110
$$ 389374 442791 429796 343029 353941 314887 373661 370064 395661 265028 365060 240950
3212B40950p4470j2126J57610J7229L5651p2369K2635q2718m5707J10228O95K7718
$$ 240950 166480 154354 311964 329193 364844 292475 315110 232392 186685 296913 297608 325326
3200C25326j0244j8243j1499L7126k9727q2422r6994J01736j4898K2787K0703
$$ 325326 315082 296839 285340 322466 292739 210317 113323 215059 200161 222948 243651
$$ [...]
##END NTUPLES=NMR SPECTRUM
##END=
