##TITLE=1H_CG-1206-A-21
 CDCl3
 8 sc, 
 27.6.2024
##JCAMPDX= 6.0         $$ Bruker NMR JCAMP-DX V2.0
##DATA TYPE= NMR SPECTRUM
##DATA CLASS= NTUPLES
##ORIGIN= UXNMR, Bruker Analytische Messtechnik GmbH
##OWNER= root
$$ XWIN-NMR		Version 3.5
$$ Thu Jun 27 14:36:16 2024 Russian Standard Time (UT+4h)  she@DPX200
##.OBSERVE FREQUENCY= 200.1313
##.OBSERVE NUCLEUS= ^1H
##.ACQUISITION MODE= SIMULTANEOUS
##.ACQUISITION SCHEME= undefined
##.AVERAGES= 8
##.DIGITISER RES= 18
##SPECTROMETER/DATA SYSTEM= spect
##.PULSE SEQUENCE= zg30
##.SOLVENT NAME= CDCl3
##.SHIFT REFERENCE= (INTERNAL, CDCl3, 0, 15.3425)
##AUDIT TRAIL= $$ (NUMBER, WHEN, WHO, WHERE, WHAT)
$$ ##TITLE= Audit trail, XWIN-NMR		Version 3.5
$$ ##JCAMPDX= 5.01
$$ ##ORIGIN= Bruker BioSpin GmbH
$$ ##OWNER= she
$$ F:/spectra/data/she/nmr/H-F/1/pdata/1/auditp.txt
$$ ##AUDIT TRAIL=  $$ (NUMBER, WHEN, WHO, WHERE, WHAT)
(   1,<2024-06-27 14:34:57.03 +0400>,<she>,<DPX200>,
      <created by zg, POWCHK disabled, PULCHK disabled
       configuration hash MD5:
       00 E9 B6 7A A2 85 ED C7 34 08 36 98 17 FE 4E 26
       data hash MD5: 16K
       F1 13 97 77 84 D4 89 C9 0A 76 FB 1E E8 42 7B A8>)
(   2,<2024-06-27 14:34:59.84 +0400>,<she>,<DPX200>,
      <Start of raw data processing
       efp BC_mod = 2 LB = 0.24 FT_mod = 6 PKNL = 1 PHC0 = -25318.94 PHC1 = 13.98748 SI = 16K 
       data hash MD5: 16K
       F1 A3 6F D1 E7 09 51 BE 9E B7 9F 36 91 F2 40 7A>)
(   3,<2024-06-27 14:35:15.18 +0400>,<she>,<DPX200>,
      <pk PHC0 = -156.1942 PHC1 = -2.6 
       data hash MD5: 16K
       15 AC 90 80 EC ED AB 2E 19 5C 03 58 0F D8 BA 17>)
(   4,<2024-06-27 14:35:18.34 +0400>,<she>,<DPX200>,
      <abs ABSG = 5 
       data hash MD5: 16K
       BF 2F 03 A3 1F E1 E8 12 FE 01 8C 65 61 35 D3 69>)
$$ ##END=
$$ 
$$ hash MD5
$$ DC 3C 1E BA 53 E3 D1 57 83 AC 22 E8 3D 32 F5 B5
##$RELAX= 
##$RELAX= 
##$RELAX= 
##$RELAX= 
##$RELAX= 
##$RELAX= 
$$ Bruker specific parameters
$$ --------------------------
##$DU= <F:/spectra>
##$EXPNO= 1
##$NAME= <H-F>
##$PROCNO= 1
##$TYPE= <nmr>
##$USER= <she>
##$AMP= (0..31)
100 100 100 100 100 100 100 100 100 100 100 100 100 100 100 100 100 100 
100 100 100 100 100 100 100 100 100 100 100 100 100 100 
##$AQSEQ= 0
##$AQ_mod= 1
##$AUNM= <au_zg>
##$AUTOPOS= <>
##$BF1= 200.13
##$BF2= 200.13
##$BF3= 200.13
##$BF4= 200.13
##$BF5= 200.13
##$BF6= 200.13
##$BF7= 200.13
##$BF8= 200.13
##$BYTORDA= 1
##$CFDGTYP= 0
##$CFRGTYP= 5
##$CHEMSTR= <none>
##$CNST= (0..31)
1 1 145 1 1 1 1 1 1 1 1 1 1 1 1 1 1 1 1 1 1 1 1 1 1 1 1 1 1 1 1 1 
##$CPDPRG= <>
##$CPDPRG1= <>
##$CPDPRG2= <>
##$CPDPRG3= <>
##$CPDPRG4= <mlev>
##$CPDPRG5= <mlev>
##$CPDPRG6= <mlev>
##$CPDPRG7= <mlev>
##$CPDPRG8= <mlev>
##$CPDPRGB= <>
##$CPDPRGT= <>
##$D= (0..31)
0 1.2 0 0 0 0 0 0 0 0.06 0 0.03 0 0 0 0 0.0002 0 0 0 0 0 0 0 0 0 0 0 0 
0 0 0 
##$DATE= 1719484496
##$DBL= (0..7)
120 120 120 120 120 120 120 120 
##$DBP= (0..7)
150 150 150 150 150 150 150 150 
##$DBP07= 0
##$DBPNAM0= <>
##$DBPNAM1= <>
##$DBPNAM2= <>
##$DBPNAM3= <>
##$DBPNAM4= <>
$$ [...]
##$SUBNAM3= <"">
##$SUBNAM4= <"">
##$SUBNAM5= <"">
##$SUBNAM6= <"">
##$SUBNAM7= <"">
##$SUBNAM8= <"">
##$SUBNAM9= <"">
##$SW= 18.0517328524113
##$SWIBOX= (0..15)
0 0 2 0 0 0 0 0 0 0 0 0 0 0 0 0 
##$SW_h= 3612.71676300578
##$TD= 16384
##$TD0= 1
##$TE= 0
##$TE2= 300
##$TE3= 300
##$TEG= 300
##$TL= (0..7)
0 120 120 120 120 120 120 120 
##$TP= (0..7)
150 150 150 150 150 150 150 150 
##$TP07= 0
##$TPNAME0= <>
##$TPNAME1= <>
##$TPNAME2= <>
##$TPNAME3= <>
##$TPNAME4= <>
##$TPNAME5= <>
##$TPNAME6= <>
##$TPNAME7= <>
##$TPOAL= (0..7)
0.5 0.5 0.5 0.5 0.5 0.5 0.5 0.5 
##$TPOFFS= (0..7)
0 0 0 0 0 0 0 0 
##$TUNHIN= 0
##$TUNHOUT= 0
##$TUNXOUT= 0
##$USERA1= <user>
##$USERA2= <user>
##$USERA3= <user>
##$USERA4= <user>
##$USERA5= <user>
##$V9= 5
##$VALIST= <valist>
##$VCLIST= <CCCCCCCCCCCCCCC>
##$VD= 0
##$VDLIST= <DDDDDDDDDDDDDDD>
##$VPLIST= <PPPPPPPPPPPPPPP>
##$VTLIST= <TTTTTTTTTTTTTTT>
##$WBST= 1024
##$WBSW= 4
##$XGAIN= (0..3)
0 0 0 0 
##$XL= 0
##$YL= 0
##$YMAX_a= 449364
##$YMIN_a= -382852
##$ZGOPTNS= <>
##$ZL1= 120
##$ZL2= 120
##$ZL3= 120
##$ZL4= 120
##$ABSF1= 15.45381
##$ABSF2= -2.59804
##$ABSG= 5
##$ABSL= 3
##$ALPHA= 0
##$AQORDER= 0
##$ASSFAC= 0
##$ASSFACI= 0
##$ASSFACX= 0
##$ASSWID= 0
##$AUNMP= <proc_1d>
##$AZFE= 0.1
##$AZFW= 0.1
##$BCFW= 0
##$BC_mod= 2
##$BYTORDP= 0
##$COROFFS= 0
##$CY= -3
##$DATMOD= 1
##$DC= 0
##$DFILT= <>
##$DTYPP= 0
##$F1P= 0
##$F2P= 0
##$FCOR= 1
##$FTSIZE= 16384
##$FT_mod= 6
##$GAMMA= 0
##$GB= 0
##$INTBC= 1
##$INTSCL= 3.70164e-10
##$ISEN= 128
##$LB= 0.24
##$LEV0= 0
##$LPBIN= 0
##$MAXI= 10000
##$MC2= 0
##$MEAN= 0
##$ME_mod= 0
##$MI= 1.114404
##$NCOEF= 0
##$NC_proc= -7
##$NLEV= 6
##$NOISF1= 3.799351
##$NOISF2= 2.8
##$NSP= 0
##$NTH_PI= 0
##$NZP= 0
##$OFFSET= 15.34253
##$PC= 1
##$PHC0= -25475.13
##$PHC1= 11.38748
##$PH_mod= 1
##$PKNL= yes
##$PPARMOD= 0
##$PSCAL= 0
##$PSIGN= 0
##$REVERSE= no
##$SF= 200.130035857265
##$SI= 16384
##$SIGF1= 3
##$SIGF2= 2
##$SINO= 5.538805
##$SIOLD= 16384
##$SREGLST= <1H.CDCl3>
##$SSB= 0
##$STSI= 16384
##$STSR= 0
##$SW_p= 3612.71676300578
##$SYMM= 0
##$S_DEV= 0
##$TDeff= 16384
##$TDoff= 0
##$TI= <>
##$TILT= no
##$TM1= 0
##$TM2= 0
##$TOPLEV= 0
##$USERP1= <user>
##$USERP2= <user>
##$USERP3= <user>
##$USERP4= <user>
##$USERP5= <user>
##$WDW= 1
##$XDIM= 16384
##$YMAX_p= 404317654
##$YMIN_p= -650298
$$ End of Bruker specific parameters
$$ ---------------------------------
##NTUPLES= NMR SPECTRUM
##VAR_NAME=  FREQUENCY,     SPECTRUM/REAL,   SPECTRUM/IMAG
##SYMBOL=    X,             R,               I
##VAR_TYPE=  INDEPENDENT,   DEPENDENT,       DEPENDENT
##VAR_FORM=  AFFN,          ASDF,            ASDF
##VAR_DIM=   16384,         16384,           16384
##UNITS=     HZ,            ARBITRARY UNITS, ARBITRARY UNITS
##FACTOR=    0.220516191357247, 1,           1
##FIRST=     3070.50112918361, 0,            0
##LAST=      -542.215633822173, 0,           0
##MIN=       -542.215633822173, -650298,     0
##MAX=       3070.50112918361, 404317654,    0
$$ Real data points
##PAGE= N=1
##DATA TABLE= (X++(R..R)), XYDATA
$$ [...]
6366B274748j5783n0068k8123k1278k2255j1971k1106l0296L7795J6363j5781
6355B112245m573J14857N9711m7108r138O3530O2697M3382O4754R8607J50765
6344B709729N6011P2572J37481O431n3372J8559k5228j26790j09976j08268J8425
6333B595574j8714r6163m4939j2926L0444l5112j4129K6938k6214P9367J21771
6322B605897J7602m0263k7219P8431J35244L1574R446N1035j1025l3067J8834
6311B836489l084M54j5167j297P5329m7314m9437J3484K2847L785N6038N5442
6299B947569J5655o2917K519N8509K9523o5078r8283l939M3290O7093N4632j2653
6287B975920j7749P2558J13450J03241N7279N4934R990K6590p376M3235j0372
$$ plain form
6366 2274748 2258965 2208897 2180774 2159496 2137241 2125270 2104164 2073868 2111663 2128026 2112245
6355 2112245 2107672 2222529 2282240 2235132 2225994 2289524 2352221 2395603 2460357 2558964 2709729
6344 2709729 2765740 2838312 2975793 2982224 2928852 2947411 2922183 2795393 2685417 2577149 2595574
6333 2595574 2576860 2480697 2435758 2422832 2453276 2418164 2404035 2430973 2404759 2484126 2605897
6322 2605897 2623499 2583236 2556017 2634448 2769692 2801266 2810712 2861747 2850722 2817655 2836489
6311 2836489 2833405 2833859 2818692 2817395 2892724 2845410 2795973 2809457 2832304 2836089 2892127 2947569
6299 2947569 2963224 2900307 2902826 2961335 2990858 2925780 2827497 2823558 2866848 2933941 2988573 2975920
6287 2975920 2958171 3030729 3144179 3247420 3304699 3359633 3369623 3396213 3388837 3432072 3421700
6276C421700N9207R8338k3163N4511m7047Q5578J35660j5998L198P4419L9798
6265C886201Q1170J02646r521O1579J94617P7377P1074J00966J28624J91790J53709
6254E040232Q9796J82593J77717J58687J22909J15794N4805q1424J3194J10017
6244E984320J30479K6422J14981J24832J37742J48422J95045J93159K37791K70688
6234G563881K90639K13949J49624K34182J77902J86656O8079J56631K71624K10211
6224I523378K64049L37639Q0178l6705j13478j12936r4537o5675K2014R9318J67321
6213A0070566J79734K68420L09344K78575L24246L20365L59279M02015M11579
6204A2924123L27653J11476N3564P4862R2536m1416O2729J21135M4659o9876M333
$$ plain form
6276 3421700 3480907 3579245 3556082 3610593 3563546 3649124 3784784 3768786 3771984 3846403 3886201
6265 3886201 3967371 4070017 4060496 4122075 4316692 4394069 4465143 4566109 4694733 4886523 5040232
6254 5040232 5130028 5312621 5490338 5649025 5771934 5887728 5942533 5861109 5874303 5984320
6244 5984320 6114799 6141221 6256202 6381034 6518776 6667198 6862243 7055402 7293193 7563881
6234 7563881 7854520 8068469 8218093 8452275 8630177 8816833 8884912 9041543 9313167 9523378
6224 9523378 9787427 10125066 10205244 10168539 10055061 9942125 9847588 9781913 9803927 9903245 10070566
6213 10070566 10250300 10518720 10828064 11106639 11430885 11751250 12110529 12512544 12924123
6204 12924123 13251776 13363252 13416816 13491678 13584214 13542798 13605527 13726662 13771321 13701445 13705778
6193A3705778r5160j94444o6578j16333l9185O9433L5592R0729L4817R7138R4111
6182A3615898M7217J15687K76299J71014K52133K55512K32416J81023J32208K52149
6172A5531556K42423K06467J50255J46707K18222K86254L03758L13965L19648
6163A7719255K08074J14523J07636R1203N3319M846J44597J28767J70616K04338
6153A8947174L69149M50301M10821M64575N47858N85548O45563O95414P58722
6144B3875125Q06554Q24089R02228J023508J112308J186875J260810J401459J540097
6135C3933053J651876J871254K028540K158157K289923K395617K300213K143054
6127E0771687K068832K110576K023421J696748J067010L43902n08774j066721
$$ plain form
6193 13705778 13610618 13416174 13349596 13233263 13194078 13263511 13299103 13389832 13424649 13521787 13615898
6182 13615898 13663115 13778802 14055101 14226115 14478248 14733760 14966176 15147199 15279407 15531556
6172 15531556 15773979 15980446 16130701 16277408 16495630 16781884 17085642 17399607 17719255
6163 17719255 17927329 18041852 18149488 18240691 18294010 18298856 18443453 18572220 18742836 18947174
6153 18947174 19316323 19766624 20177445 20642020 21189878 21775426 22420989 23116403 23875125
6144 23875125 24681679 25505768 26407996 27431504 28543812 29730687 30991497 32392956 33933053
6135 33933053 35584929 37456183 39484723 41642880 43932803 46328420 48628633 50771687
6127 50771687 52840519 54951095 56974516 58671264 59738274 60082176 59573402 58506681
6119E8506681j343678j427191j059941p34532k97921J02719M97647J073114J504231
6110E6821129J782499K375569K764472L212808L788493M391753M893576N059967
6102H5090266M990002M692697M318659L965857L891819L379099K130231k4250
6094A12434380k486536m138564m720547m336108l301881k207146j211900o91674
6086H9340024o85919j095623j595579j770484j895930j466510j047507m04945
6078G9377527K85299R21628J223012J501982J727209J750873J959899J917197
6070I0664626J485971Q55620J10845m78254p09687m92079K56987J239170J945616
6061I4878815K317044K092632O69415j724844m462973o328849o979763o647731
$$ plain form
6119 58506681 57163003 55735812 54675871 53941339 53643418 53746137 54243784 55316898 56821129
6110 56821129 58603628 60979197 63743669 66956477 70744970 75136723 80030299 85090266
6102 85090266 90080268 94772965 99091624 103057481 106949300 110328399 112458630 112434380
6094 112434380 109947844 105809280 101088733 96752625 93450744 91243598 90031698 89340024
6086 89340024 88654105 87558482 85962903 84192419 82296489 80829979 79782472 79377527
6078 79377527 79662826 80584454 81807466 83309448 85036657 86787530 88747429 90664626
6070 90664626 92150597 93006217 93117062 92638808 91929121 91437042 91694029 92933199 94878815
6061 94878815 97195859 99288491 99957906 98233062 93770089 87441240 80461477 73813746
6053G3813746n877160m952389m199310l533524k864117k357804j901528j469502
6045D6658412j171659q30180n59899l10975o620L11027O96994R09536J261217
6036D6957853J610293J617813J407193Q07014m81045j688612k805896l381898
6028D4042715l420799l163236k861022k555703k132731j913693j742071j635600
6020B4617860j449721j324025j172760j058724r71334r15595q80761p23191p18062
6011A5403687o34273n27716o67987n00475m24645l58002l13329l62438l67420
6002A1247402k35318k86362k36330k44749j96261j78769k09577j29297k09014
5993I321725k29015k02431j82349k36951k37696k59715j87125j34547k51991r5038
$$ plain form
6053 73813746 67936586 62984197 58784887 55251363 52387246 50029442 48127914 46658412
6045 46658412 45486753 44656573 44096674 43785699 43779079 44090106 44787100 45696636 46957853
6036 46957853 48568146 50185959 51593152 52400166 51919121 50230509 47424613 44042715
6028 44042715 40621916 37458680 34597658 32041955 29909224 27995531 26253460 24617860
6020 24617860 23168139 21844114 20671354 19612630 18641296 17725701 16844940 16121749 15403687
6011 15403687 14769414 14241698 13573711 13073236 12648591 12290589 11977260 11614822 11247402
6002 11247402 11012084 10725722 10489392 10244643 10048382 9869613 9660036 9530739 9321725
5993 9321725 9092710 8890279 8707930 8470979 8233283 7973568 7786443 7651896 7399905 7304867
5983G304867j43447j64328j55173r2724l9647j09220j43662q4145m6337J3385
5973F339569j9412j10007m9265r6043n1813j10348p0918o1077o4602p6276m4572
5962E585236l8568M3311j1018j24492j07877l9744o7476r7264j04644n8555p9781
5951D899128j01079n103k4844R905r771j9885j0210k8222k0850q3571o1066J9226
5939D563658n4307q2008M1460P136l3649j5308j42862n1522j5451o2870o3147
5928D091130r2072N5559k3628o1080J0794K4228k8850r9688J3996J3609M7563
5917C951561n2369l6801k1128l1409j1934k3272n3031o5309o204Q281J2809P976
5905C679170p1731q3589L7046l1295p3914m4914K924o5683P1051M9158m2763n7338
$$ plain form
5983 7304867 7161420 6997092 6841919 6749195 6709548 6600328 6456666 6372521 6326184 6339569
5973 6339569 6320157 6210150 6160885 6064842 6013029 5902681 5831763 5770686 5706084 5629808 5585236
5962 5585236 5546668 5589979 5578961 5454469 5346592 5306848 5239372 5142108 5037464 4978909 4899128
5951 4899128 4798049 4792946 4768102 4778007 4768236 4748351 4738141 4709919 4689069 4605498 4544432 4563658
5939 4563658 4509351 4427343 4468803 4475939 4442290 4426982 4284120 4232598 4217147 4154277 4091130
5928 4091130 3999058 4054617 4030989 3969909 3980703 4004931 3976081 3876393 3890389 3903998 3951561
5917 3951561 3899192 3862391 3841263 3809854 3797920 3774648 3721617 3656308 3650104 3658385 3671194 3679170
5905 3679170 3607439 3523850 3560896 3529601 3455687 3410773 3413697 3348014 3419065 3468223 3425460 3368122
5893C368122l3801P3171j1443L3023J9366L1485l9367o4568j697m992Q9531q4273
5881C374557O6543o575p0917l6306K9494K858k3163k3628j034M8472k7336l8557
5869C294408J6679j7336k8318L9482K2013P9190p5018m5048O5969N2114m083Q040
5857C408092R296j1875M7166M4161l720P7786L9192P343j8591N064L1807N9150
5845C694871K3095J145L4874K9989M2593K8846L5231Q6764N4264O8380N0883O722
5833D157657N5456O9444O7798J71655J14945J10134N4014P7549K17861J15856
5823E212369J76351J61713J41653J86031K68369K63433K08309J65557K99625K43472
5813G326882J21109J1982M2054N54n3510p6374k8658K2063j31369M6508P6491
$$ plain form
5893 3368122 3334321 3407492 3396049 3429072 3448438 3479923 3440556 3375988 3374291 3369299 3458830 3374557
5881 3374557 3441100 3434525 3363608 3327302 3356796 3359654 3336491 3312863 3311829 3360301 3332965 3294408
5869 3294408 3311087 3293751 3265433 3304915 3326928 3406118 3331100 3286052 3352021 3404135 3400052 3408092
5857 3408092 3417388 3405513 3452679 3496840 3493120 3570906 3610098 3617441 3598850 3603914 3635721 3694871
5845 3694871 3717966 3719111 3753985 3783974 3826567 3855413 3890644 3977408 4031672 4100052 4150935 4157657
5833 4157657 4213113 4282557 4350355 4522010 4636955 4747089 4801103 4878652 5096513 5212369
5823 5212369 5388720 5550433 5692086 5878117 6146486 6409919 6618228 6783785 7083410 7326882
5813 7326882 7447991 7459973 7502027 7502581 7449071 7372697 7344039 7366102 7234733 7281241 7357732
5802G357732J9342N1329J93984J55133K37227K14609K78834L67623M05437M92009
5792I773259M76448M93409N70198N74596M50433L07197J50691k4108p8124j00542
5782A2593457r9144j23916j15594l3347k02523k58889k63783j72288j84740k49652
5772A0889581p4746o1598N041R9166J50747J72706L14378L26583L98461L42591
5762A2562910J80701R1377J99364J57968M1015N3290J00057J46346J68908J35390
5752A3837326Q8606J0000j48198j81085l06518l30045l61839k76979k75872k09657
5742A1845739j89987p1551M0749L2430M5036L5908O485J10809L0030j6923J19394
5731A1988119J40190J4982J31303P6438P03J24178J54789j3068J68272M6328J0013
$$ plain form
5802 7357732 7377074 7428403 7622387 7777520 8014747 8229356 8508190 8875813 9281250 9773259
5792 9773259 10249707 10743116 11313314 11887910 12338343 12645540 12796231 12772123 12693999 12593457
5782 12593457 12494313 12370397 12254803 12221456 12018933 11760044 11496261 11323973 11139233 10889581
5772 10889581 10814835 10753237 10758278 10857444 11008191 11180897 11495275 11821858 12220319 12562910
5762 12562910 12743611 12834988 13034352 13192320 13233335 13286625 13386682 13533028 13701936 13837326
5752 13837326 13925932 13935932 13787734 13606649 13300131 12970086 12608247 12331268 12055396 11845739
5742 11845739 11655752 11584201 11624950 11657380 11702416 11738324 11744809 11855618 11885648 11868725 11988119
5731 11988119 12128309 12143291 12274594 12351032 12351735 12475913 12630702 12617634 12785906 12832234 12842247
5720A2842247P468m8823q3185m615O7246l3263J13656O0512J71082K00039L04567
5709A3596931L02568K64154L97027K73608J68185P5766J56176J47738Q1390J62761
5699A5626304J59701K19341K00044K42334K49048K69186K64692L52955J84125
5690A7767730J89002K91056L67354L68407M54367M72041N00021M75140N66093
5681B1451211O24860O67630O52110O42468O95742O54273P44910P93340R88957
5672B7915501J005358J123995J209573J241450J469871J666242J877731K005227
5664C9514948K140077K468720K696440K889409L019190L150084L156725K918092
5656F1953685K773282K765676K616357K263739J471360L18195q76203j743109
$$ plain form
5720 12842247 12849715 12800892 12717707 12713092 12780338 12747075 12860731 12921243 13092325 13292364 13596931
5709 13596931 13899499 14163653 14560680 14834288 15002473 15078239 15234415 15382153 15463543 15626304
5699 15626304 15786005 16005346 16205390 16447724 16696772 16965958 17230650 17583605 17767730
5690 17767730 17956732 18247788 18615142 18983549 19437916 19909957 20409978 20885118 21451211
5681 21451211 22076071 22743701 23395811 24038279 24734021 25388294 26133204 26926544 27915501
5672 27915501 28920859 30044854 31254427 32495877 33965748 35631990 37509721 39514948
5664 39514948 41655025 44123745 46820185 49709594 52728784 55878868 59035593 61953685
5656 61953685 64726967 67492643 70109000 72372739 73844099 74162294 73286091 71542982
5648G1542982k001011j989528j638531j083448n39233J00925P59519J204695J714337
5639F8070707K360042K958861L516208M160864M875171N588114O236600O505802
5631A04272369O463430O337493O376342O791580O910254N610894K694536j194761
5623A44262137m770039p367386q575322q440809p596288o507405n206406l927115
5615I1871367k950042j910424j109514l74779K19704O87247J137537J741942K402863
5606I1715901L176034L934161M658399N131836N494862N717998N763737M932534
5598A30525462K243776j491852n147098p964958r143317r078674q421847p174831
5590H4346661o211407n353184m424281l718667l262574k750404k260259j886321
$$ plain form
5648 71542982 69541971 67552443 65913912 64830464 64291231 64392156 65151675 66356370 68070707
5639 68070707 70430749 73389610 76905818 81066682 85941853 91529967 97766567 104272369
5631 104272369 110735799 117073292 123449634 130241214 137151468 142762362 145456898 144262137
5623 144262137 139492098 132124712 123549390 115108581 107512293 101004888 95798482 91871367
5615 91871367 88921325 87010901 85901387 85526608 85746312 86433559 87571096 89313038 91715901
5606 91715901 94891935 98826096 103484495 108616331 114111193 119829191 125592928 130525462
5598 130525462 132769238 131277386 126130288 118165330 109022013 99943339 91521492 84346661
5590 84346661 78135254 72782070 68357789 64639122 61376548 58626144 56365885 54479564
5582E4479564j543880j185290q01876m50649k69029R0771N00481P63822R80507
5573E2564421J162847Q65010K97330m74876j625519k324632k629450k647274k408179
5564D2779678k198783j851763j459121j199284j113720j126768j062532r26977
5556C1840730r56259q16499r00319j044760j171155j083302r23802q43469q95451
5547B3205714j006192q75427p26120o60987p30092p00671o33610o31880m89413
5538A6751322n24645n67630l43687l62502l63487k57767l60179l91029l73658
5529A3206738m07578l91881l41741k68723l03822k46884j96180j78621j85714
5520A0685594j10404p1181j06006l57l5735J5093J91630J46158J71257K58881
$$ plain form
5582 54479564 52935684 51750394 50948518 50497869 50228840 50319611 50820092 51583914 52564421
5573 52564421 53727268 54592278 54889608 54414732 52789213 50464581 47835131 45187857 42779678
5564 42779678 40580895 38729132 37270011 36070727 34957007 33830239 32767707 31840730
5556 31840730 30884471 30067972 29167653 28122893 26951738 25868436 24944634 24101165 23205714
5547 23205714 22199522 21324095 20597975 19936988 19206896 18506225 17872615 17240735 16751322
5538 16751322 16226677 15659047 15315360 14952858 14589371 14331604 13971425 13580396 13206738
5529 13206738 12799160 12407279 12065538 11796815 11492993 11246109 11049929 10871308 10685594
5520 10685594 10575190 10504009 10398003 10397646 10361911 10377004 10568634 10714792 10886049 11144930
5510A1144930L63201M44921K21256J2136k40520m21177m73766o07972n12058m58594
5500I472357l84618l56718k97300j62584j60425j18097j13045k75979k56611j97219
5490G149761k09647k49806j91614j96181k00259j55844m7545j89221q3702j00300
5480E525642j44571n8149n614p3026j26523n5248p1820j09702j5635k743o9096
5469D793515j05269J3535p2262j6717J5290k4771j3576l0079J5870r486P1932
5458D637982K3203n2688j40499q1116q9221j09696o8230n6854j80967j24162o9124
5447C688628p1589j43951N1714K4004j3735n254N939n0981L472J35154l8125O7560
5435C652836O9729k6770n1427j86770O2076o5407j60430q5676m5092r1666q04
$$ plain form
5510 11144930 11508131 11953052 12174308 12186444 11945924 11524747 11050981 10443009 9930951 9472357
5500 9472357 9087739 8731021 8433721 8271137 8110712 7992615 7879570 7603591 7346980 7149761
5490 7149761 6940114 6690308 6498694 6302513 6102254 5946410 5898865 5709644 5625942 5525642
5480 5525642 5381071 5322922 5317308 5244282 5117759 5062511 4990691 4880989 4865354 4862611 4793515
5469 4793515 4688246 4701781 4629519 4612802 4628092 4603321 4589745 4559666 4575536 4566050 4637982
5458 4637982 4661185 4608497 4467998 4386882 4297661 4187965 4119735 4062881 3881914 3757752 3688628
5447 3688628 3617039 3473088 3524802 3548806 3535071 3529817 3535756 3484775 3488247 3623401 3585276 3652836
5435 3652836 3722565 3695795 3644368 3457598 3519674 3454267 3293837 3208161 3163069 3071403 3070599
5424C070599l1341r577p3822j29977m6125m8828j9192n7322k2474j1705n8500
5413B561736j26776j7673L6020m8715p4153N659O9830L3395o1813n8402k9569
5402B289539K3504k2899r0153Q2550j130L8866N2402k5905l1950K0702P2058J0092
5390B417676k8651n7535o6823r4461K709n3029j6911p6444M382Q802j1998j26125
5378A901592k277j6608K0950P702q2427l5356K9957R4307l2330o8796L1868J8092
5366A866674J863K5773M8190Q2673R5914k0923N3921M4977m0706K0613P1689j68
5354B250490j0518o8742r0271o2561n6205o7515j7205L6381m4396q31J8353k394
5342A884586k4912l7648L8882N7283n957j0227P2364J13531M1356J4313m4772
$$ plain form
5424 3070599 3039258 3029681 2955859 2825882 2779757 2730929 2711737 2654415 2631941 2620236 2561736
5413 2561736 2434960 2417287 2453307 2404592 2330439 2336098 2405928 2439323 2377510 2319108 2289539
5402 2289539 2313043 2290144 2199991 2282541 2281411 2320277 2372679 2346774 2314824 2335526 2407584 2417676
5390 2417676 2389025 2331490 2264667 2170206 2172915 2119886 2102975 2026531 2030913 2039715 2027717 1901592
5378 1901592 1899315 1882707 1903657 1911359 1828932 1793576 1823533 1917840 1885510 1816714 1848582 1866674
5366 1866674 1868537 1894310 1942500 2025173 2121087 2100164 2154085 2199062 2158356 2178969 2250658 2250490
5354 2250490 2239972 2171230 2080959 2018398 1962193 1894678 1877473 1913854 1869458 1868627 1886980 1884586
5342 1884586 1859674 1822026 1860908 1918191 1912234 1902007 1974371 2087902 2129258 2143571 2098799
5331B098799N8251N6724K8422J4270O658l414q9026J1166K2489q2224M6989Q3398
5319B252502k9668j18348K1818M43M063M3614n7966k8507K5619j0471j3720J15739
5307B205118O4970J4055N6248j5844l402M37j6428L8955N7846J1937m4879r3927
5295B275086r8064O0209j3789l7269O9922L4196j3752k0855M1043K5454R2718
5284B414899k4722J2215q5553K9592n0599p783K8098L6094J5043J8335k4888r4065
5272B266666R1470L8479q2104j12697M9941k3433L33p7236m0807Q7061j133l6751
5260B159789k8012O480k2280N4440L3664n5435N2248O0607Q7843L4997o6926k2485
5248B294930l9061q1851J8505o2512K6354j6202p3641l646L1578Q8053M988n258
$$ plain form
5331 2098799 2157050 2213774 2242196 2256466 2263124 2259710 2170684 2181850 2204339 2122115 2169104 2252502
5319 2252502 2222834 2104486 2126304 2126747 2130810 2174424 2116458 2087951 2113570 2103099 2089379 2205118
5307 2205118 2270088 2284143 2340391 2324547 2321145 2321582 2305154 2344109 2401955 2413892 2369013 2275086
5295 2275086 2177022 2237231 2223442 2186173 2256095 2290291 2276539 2255684 2296727 2322181 2414899
5284 2414899 2390177 2402392 2316839 2346431 2295832 2288049 2316147 2352241 2367284 2385619 2360731 2266666
5272 2266666 2358136 2396615 2314511 2201814 2251755 2228322 2228655 2151419 2110612 2197673 2196540 2159789
5260 2159789 2131777 2138257 2115977 2170417 2204081 2148646 2200894 2261501 2349344 2384341 2317415 2294930
5248 2294930 2255869 2174018 2192523 2130011 2156365 2140163 2066522 2062876 2094454 2182507 2187495 2182237
5236B182237q5694N047l2236k6402J0047M8164J9277p2814j6645K3513L5281l5790
5224B053985O698O9712J6081L4400o2244P9567O4531m5463R2522l7728n6334J5214
5212B230941j1771m8226J7637m4722P1961J9887L5517N7674m7048o9868J27349
5201B339331P6084l7938K7957J6353M3868k342n1751N7824O3986j2949J2084J231
5189B533738m4112O1009M0757O4048L324k4969R0843M3089J1235N9704Q9960Q8531
5177C017157K3445l5383N4443Q8232R9800L5385L550R6375J20097P2411R2725
5166C668237J29575N2253J61163J8966j2129Q038q1041j42055j79033j9506o9041
5155C535427m6349L243L038L5828N6829O524l3330n1862R0184k0101J1544J03456
$$ plain form
5236 2182237 2096543 2101590 2069354 2042952 2052999 2101163 2120440 2047626 2030981 2054494 2089775 2053985
5224 2053985 2060683 2130395 2146476 2180876 2118632 2198199 2262730 2217267 2309789 2272061 2215727 2230941
5212 2230941 2219170 2170944 2188581 2143859 2215820 2235707 2271224 2328898 2281850 2211982 2339331
5201 2339331 2415415 2377477 2405434 2421787 2465655 2463313 2411562 2469386 2533372 2520423 2532507 2533738
5189 2533738 2489626 2550635 2591392 2655440 2658764 2633795 2724638 2767727 2778962 2838666 2928626 3017157
5177 3017157 3040602 3005219 3059662 3147894 3247694 3283079 3286629 3383004 3503101 3575512 3668237
5166 3668237 3797812 3850065 4011228 4030194 4018065 4026103 3945062 3803007 3623974 3604468 3535427
5155 3535427 3489078 3492321 3495359 3531187 3588016 3594540 3561210 3509348 3599532 3579431 3590975 3694431
5143C694431o50O273P1402M2074k0398L7773L9073J5838J4499N2690k8700M5311
5131C969616R512K6911L6216k4464m6051j6368J17153L2887P8607L6422L7790
5120D258231O4525K0870J44719J11073O1799Q0436O1234O4277P8800R0993L935
5109E040892M0175O0384Q3094J641Q2487J06838K521N4897J14717J13603P7145
5098E778394Q3043N7949R7225J13252Q1970O3676R6704J48881Q4617K29916J10181
5087F945808J03126J00748O2889J49670R5001L9307R7232J29015J49503J46290
5077H018589N0879J72670J88640Q9075J30852J09932K14153J75480K70717J85160
5067I606147K28699J91596K67385L93479K55125L12829M32358N13590N54724O76939
$$ plain form
5143 3694431 3693781 3700054 3771456 3813530 3793132 3830905 3869978 3885816 3900315 3953005 3924305 3969616
5131 3969616 3979128 4006039 4042255 4017791 3971740 3955372 4072525 4105412 4184019 4220441 4258231
5120 4258231 4322756 4343626 4488345 4599418 4661217 4741653 4802887 4867164 4945964 5036957 5040892
5109 5040892 5081067 5141451 5224545 5226186 5308673 5415511 5418032 5472929 5587646 5701249 5778394
5098 5778394 5861437 5919386 6016611 6129863 6211833 6275509 6372213 6521094 6605711 6835627 6945808
5087 6945808 7048934 7149682 7212571 7362241 7457242 7496549 7593781 7722796 7872299 8018589
5077 8018589 8069468 8242138 8430778 8519853 8650705 8760637 8974790 9150270 9420987 9606147
5067 9606147 9834846 10026442 10293827 10687306 10942431 11255260 11687618 12201208 12755932 13432871
5057A3432871O85968R45476R78567J001494J193045J357767J586044J957374K371002
5048B5509608K878635L711516N081591M980229K717559N0290l122545n165397
5040C6641486n120846l964925k797866j962381j435657j109220p45276o00162
5032A8905153m17486j63043J4254J30512K94685N12126P65471Q37764J075309
5023B1954745J446056J909019K528129L474075L621543J974698J216165R98695
5015C9123125j951495l545965l047849l169691l086668k427136j814266j381217
5007A8698838j083141r17135o48746o52650n45357m32056m69844l11189k13629
4998A3425091l56110l16522j79227k19251n3289j34752r1944R238P886R767J1784
$$ plain form
5057 13432871 14118839 15064315 16042882 17044376 18237421 19595188 21181232 23138606 25509608
5048 25509608 28388243 32099759 37181350 42161579 44879138 44929428 41806883 36641486
5040 36641486 31520640 27555715 24757849 22795468 21359811 20250591 19505315 18905153
5032 18905153 18487667 18324624 18338878 18469390 18764075 19276201 20041672 20879436 21954745
5023 21954745 23400801 25309820 27837949 31312024 34933567 36908265 38124430 39123125
5015 39123125 37171630 33625665 30577816 27408125 24321457 21894321 20080055 18698838
5007 18698838 17615697 16698562 16049816 15397166 14851809 14419753 13949909 13638720 13425091
4998 13425091 13068981 12752459 12573232 12353981 12300692 12165940 12073996 12083234 12091120 12100887 12112671
4987A2112671L1506J01051p517Q0990P5121N4494J06032R6365J13478J40531J21903
4976A3026625N9743P4785J26332J96495K42979K44039J71655K14232K45799K18880
4966A4821564K62174L09620K51803L03101L20272L15762L70056L33998M04081
4957A7692431L35953M71832M94150M62050N76054O36469O82156P35212O36318
4948B2722625N16289M22309L13920M54688M41132N94810O28827P13314P03048
4939B7510962Q00424Q48531R39475R59809J055640J083133J186568J297581J316561
4930C6998684J359014J488433J590912J788982J817098J904762J946763J896504
4922E0791152J903439J769986J832923J991653J808088J695901J693640J592608
$$ plain form
4987 12112671 12144177 12245228 12237711 12318701 12393822 12448316 12554348 12650713 12764191 12904722 13026625
4976 13026625 13086368 13161153 13287485 13483980 13726959 13970998 14142653 14356885 14602684 14821564
4966 14821564 15083738 15393358 15645161 15948262 16268534 16584296 16954352 17288350 17692431
4957 17692431 18028384 18500216 18994366 19456416 20032470 20668939 21351095 22086307 22722625
4948 22722625 23238914 23661223 23975143 24429831 24870963 25465773 26094600 26807914 27510962
4939 27510962 28311386 29159917 30099392 31059201 32114841 33197974 34384542 35682123 36998684
4930 36998684 38357698 39846131 41437043 43226025 45043123 46947885 48894648 50791152
4922 50791152 52694591 54464577 56297500 58289153 60097241 61793142 63486782 65079390
4914F5079390J517431J296278J190380J107533J097293J030804J049622J040283
4906G4409014J072331J325014J448549J499024J733452J887013K065459K326352
4898H7766208K474578K600786K406076K425678K255139K125741K047384J671465
4890A05773055J436469J157154P00485K58734r5749m56675o28180o74798q17939
4881A06652556r72612j075026j068003j082183j035433q71843p14084o17320m79684
4872I8736368l98821k67331j97625j50636p3548j24545r9842j89873k77896m54411
4862I6501840n66115o93916p30401p88961q75771q47564q68309r65330r60455
4853H9205018r51975r62186j029634r28037p93156q15577p08995n80643m25723
$$ plain form
4914 65079390 66596821 67893099 69083479 70191012 71288305 72319109 73368731 74409014
4906 74409014 75481345 76806359 78254908 79753932 81487384 83374397 85439856 87766208
4898 87766208 90240786 92841572 95247648 97673326 99928465 102054206 104101590 105773055
4890 105773055 107209524 108366678 109067163 109325897 109230148 108773473 108145293 107470495 106652556
4881 106652556 105679944 104604918 103536915 102454732 101419299 100547456 99833372 99216052 98736368
4872 98736368 98337547 98070216 97872591 97721955 97648407 97523862 97424020 97234147 96956251 96501840
4862 96501840 95935725 95241809 94511408 93722447 92846676 91999112 91130803 90165473 89205018
4853 89205018 88253043 87290857 86261223 85333186 84540030 83724453 83015458 82434815 82009092
4844H2009092k48720j25369O9789L33302O43126Q08777J145532J367086J475499
4835H7478114J666792J735238J783218J833767J907241J820807J686829J538554
4827A01450560J237533R33255P46136N02587M14659L29365J89422J10804N1556
4818A05965877Q7430J07223K83209L97930N15026O86906P97040R83369J138692
4809A10962702J311221J473407J624545J685879J777511J833356J904228J902904
4801A24475753J752146J784716J533374J463737J294700J170780J037139Q05362
4793A35317707P24005M21149K19293N883j03722k17543l15783l38898k59868j60016
4783A35292207O558J81421L03321N34091O57198R12086J218742J316783J279325
$$ plain form
4844 82009092 81760372 81635003 81704792 82038094 82681220 83489997 84635529 86002615 87478114
4835 87478114 89144906 90880144 92663362 94497129 96404370 98225177 99912006 101450560
4827 101450560 102688093 103621348 104367484 104870071 105284730 105614095 105803517 105914321 105965877
4818 105965877 106053307 106160530 106443739 106841669 107356695 108043601 108840641 109824010 110962702
4809 110962702 112273923 113747330 115371875 117057754 118835265 120668621 122572849 124475753
4801 124475753 126227899 128012615 129545989 131009726 132304426 133475206 134512345 135317707
4793 135317707 136041712 136462861 136682154 136688037 136584315 136366772 136050989 135712091 135452223 135292207
4783 135292207 135298765 135480186 135783507 136317598 136974796 137886882 139105624 140422407 141701732
4774A41701732J136926Q70653N94174K74766K1550m26517r54369j445564k037407
4765A39735944k582500l005022l313503l550254l654242l694802l583734l485338
4757A12866549l324843l032098k753336k529355k263512j880412j703882j589634
4749I3789477j429044j245295j197457j297501j362983j414036j585333j556371
4741H2701457j767893j996245k115209k205002k312049k519862k452815k405101
4733F4927281k384962k351664k308612k221168k273926k162514j975870j965168
4725D7283397j665157j594557j595761j400774j311220j358673j133439j080520
4717C6143296j054910r39925q27171p98392q30904p04119o25457o39215n60010
$$ plain form
4774 141701732 142838658 143709311 144303485 144578251 144599801 144173284 143218915 141773351 139735944
4765 139735944 137153444 134148422 130834919 127284665 123630423 119935621 116351887 112866549
4757 112866549 109541706 106509608 103756272 101226917 98963405 97082993 95379111 93789477
4749 93789477 92360433 91115138 89917681 88620180 87257197 85843161 84257828 82701457
4741 82701457 80933564 78937319 76822110 74617108 72305059 69785197 67332382 64927281
4733 64927281 62542319 60190655 57882043 55660875 53386949 51224435 49248565 47283397
4725 47283397 45618240 44023683 42427922 41027148 39715928 38357255 37223816 36143296
4717 36143296 35088386 34148461 33321290 32522898 31691994 30987875 30362418 29723203 29163193
4708B9163193m59669m35948m81598m18683l65056m20330m16276m22617l53710
4699B5389306m69942m31458m05942m35710m10791m50997l90674m22107m81612
4690B1490073m23656m74986m43536m65842m36836l67929m31127m87063m17594
4681A7541504k78818l51105l47908k85355k89253m03202k49542k80485k71390
4672A4784446k27993l00395l36888k47381k41771k99966k13934k54469k51244
4663A2410405k43828k73215k23059k27988k31572l04635j97627k01531k21382
4654A0285568k12793k89179j60480j35326j72657j22552j17438j65017j01946
4645H808180j79453j86323j85066p2317n8080j22324m8270r4487j48469j00886
$$ plain form
4708 29163193 28703524 28267576 27785978 27367295 27002239 26581909 26165633 25743016 25389306
4699 25389306 24919364 24487906 24081964 23646254 23235463 22784466 22393792 21971685 21490073
4690 21490073 21066417 20591431 20147895 19682053 19245217 18877288 18446161 17959098 17541504
4681 17541504 17262686 16911581 16563673 16278318 15989065 15585863 15336321 15055836 14784446
4672 14784446 14556453 14256058 13919170 13671789 13430018 13130052 12916118 12661649 12410405
4663 12410405 12166577 11893362 11670303 11442315 11210743 10906108 10708481 10506950 10285568
4654 10285568 10072775 9783596 9623116 9487790 9315133 9192581 9075143 8910126 8808180
4645 8808180 8628727 8442404 8257338 8185021 8126941 8004617 7956347 7861860 7713391 7612505
4635G612505o8868j63616m1601m9473j07029q8431q4428n7031l7675j1210r0097
4624F813046l289j9770q3585n9322m1049J3993n5624n3788o9435q5940n3114q4780
4612F217343j13397R208o3207o3650j13959J429R0272p3869K2267n3844m6206
4601E812387j06660r3502p8217j9007m0334m6423m5849m0203l1562l9880m5101
4590E225649m7947m951o8749j18594r0737j3847Q074m4728r3291Q456K4983p6950
4578D707368j05733q7841j4795Q551j8014M4176l2207l0483n6805N3149O2973
4567D530339k0079J0179q6394l485N2905J6043m4219m1481K3997Q367N0177Q3245
4555D579594n8374j9004Q5138P9784M1580n3390l094M1427k2132O7076p6048L7503
$$ plain form
4635 7612505 7543637 7380021 7338420 7288947 7181918 7093487 7009059 6952028 6914353 6903143 6813046
4624 6813046 6809757 6789987 6706402 6647080 6606031 6620024 6564400 6510612 6441177 6355237 6302123 6217343
4612 6217343 6103946 6113154 6049947 5986297 5872338 5873767 5964039 5890170 5912437 5858593 5812387
4601 5812387 5705727 5612225 5534008 5515001 5474667 5428244 5382395 5342192 5310630 5270750 5225649
4590 5225649 5177702 5172751 5104002 4985408 4894671 4880824 4888898 4844170 4750879 4759335 4784318 4707368
4578 4707368 4601635 4513794 4498999 4507550 4489536 4533712 4501505 4471022 4414217 4467366 4530339
4567 4530339 4510260 4520439 4434045 4430560 4483465 4499508 4455289 4413808 4437805 4446172 4496349 4579594
4555 4579594 4521220 4502216 4587354 4667138 4708718 4655328 4652234 4693661 4671529 4738605 4662557 4700060
4543D700060K3295L6203Q5691O4602j3048j3435M2760L5936K4179N4643J09420
4532E150306k7382j3753J43416K7840o2657q824N2139r309O4242Q6020j2958m9065
4520E340015k6445L3723O2087J036J52J7274p620K3903N8708P0374K9312M8538
4508E651057m4448J2025J01827N8392K3231J1442q140P9780J18624K755J21503
4497F128048J33969J04944J18131O7322J45852M4892J30590K01002K47407L00519
4487G622676K77225L62670K64113N8581n7043p8770N5444k7768m033j49432j65323
4476H158340j25839J1780P818N5172M873J3703N8460m254J51405N6657N7438J09407
4464H554960N1406J31749M1972Q3339K12094J29111J68309J30531Q3060O9480
$$ plain form
4543 4700060 4723355 4759558 4845249 4909851 4896803 4883368 4926128 4962064 4986243 5040886 5150306
4532 5150306 5122924 5109171 5252587 5280427 5217770 5208946 5261085 5251776 5316018 5402038 5389080 5340015
4520 5340015 5313570 5347293 5409380 5410416 5410568 5427842 5420222 5444125 5502833 5573207 5602519 5651057
4508 5651057 5606609 5618634 5720461 5778853 5802084 5813526 5805386 5885166 6003790 6006545 6128048
4497 6128048 6262017 6366961 6485092 6552414 6698266 6743158 6873748 7074750 7322157 7622676
4487 7622676 7899901 8262571 8526684 8585265 8528222 8449452 8504896 8477128 8473095 8323663 8158340
4476 8158340 8032501 8044281 8052099 8107271 8112144 8125847 8184307 8180053 8331458 8388115 8445553 8554960
4464 8554960 8606366 8738115 8780087 8863426 9075520 9204631 9372940 9503471 9586531 9656011
4454I656011P8442Q4295Q3568P1168k1983J00119J11247O7014Q9842Q6824J49806
4443A0556353K09939K03085J94046K11431L19535L27706L27869L24156M36233
4434A3110353N09281N40663O95462Q07918R19428R94280J110301J144744J388358
4425B1220788J500209J591988J922589K281307K724902L333222L858916M274771
4417D2708692L948837K232017k90646j841706j905340j779524k020743k904744
4409C8146843l420636l335888k876624k326166j926617j574087j255707j014584
4401B0416534q79724q17879p56177p21379o52309n81799o89629n84344n42822
4392A4190472m71681l34737l74530l37845l07313k74498k40960k45276l02056
$$ plain form
4454 9656011 9734453 9818748 9902316 9973484 9951501 10051620 10162867 10229881 10319723 10406547 10556353
4443 10556353 10766292 10969377 11163423 11374854 11694389 12022095 12349964 12674120 13110353
4434 13110353 13619634 14160297 14855759 15663677 16583105 17577385 18687686 19832430 21220788
4425 21220788 22720997 24312985 26235574 28516881 31241783 34575005 38433921 42708692
4417 42708692 46657529 48889546 48598900 46757194 44851854 43072330 41051587 38146843
4409 38146843 34726207 31390319 28513695 26187529 24260912 22686825 21431118 20416534
4401 20416534 19536810 18718931 17962754 17241375 16589066 16007267 15317638 14733294 14190472
4392 14190472 13718791 13384054 13009524 12671679 12364366 12089868 11848908 11603632 11301576
4383A1301576k49880j72773o6555j24643k46513j31897n1746j70851k35565j45450
4373I705703m9026j56114k06255o4730j65512r2534p9779m4232j19865j14854
4363H612802k994q6587n1118K5459l2537J3137j03472K2255r1635K9741L6252
4352H371303l5016L200p7763j2472M5346j1653J8389l5858p6751o296J00530m146
4340H278813j0681m6868m911p551m61O6808J140M9514j21J9230O6816k7786j05127
4327H278815K1292K8186L7714M2635L3786j3046R7673J3946k674J1425L7022L3095
4315H619869J8753K544n5451L2641P9848J06637O647o434N6565O8747J62595K9680
4303I122641K3783R7604Q967P5147j8155J9292N1542O2337L9641Q5269R2601P4044
$$ plain form
4383 11301576 11051696 10878923 10812368 10687725 10441212 10309315 10257569 10086718 9851153 9705703
4373 9705703 9656677 9500563 9294308 9229578 9064066 8971532 8891753 8847521 8727656 8612802
4363 8612802 8609808 8523221 8472103 8497562 8465025 8478162 8374690 8396945 8305310 8335051 8371303
4352 8371303 8336287 8339487 8261724 8249252 8294598 8282945 8301334 8265476 8188725 8182429 8282959 8278813
4340 8278813 8268132 8221264 8216353 8208802 8208341 8275149 8276289 8325803 8325682 8344912 8411728 8383942 8278815
4327 8278815 8300107 8328293 8366007 8408642 8442428 8429382 8527055 8541001 8538327 8549752 8586774 8619869
4315 8619869 8638622 8641166 8585715 8618356 8698204 8804841 8811488 8805054 8861619 8930366 9092961 9122641
4303 9122641 9146424 9244028 9252995 9328142 9309987 9329279 9380821 9443158 9482799 9568068 9660669 9734713
4291I734713N0034O703O0918J0469J23341Q0919K1237O8114J46423O8939L5875
4280A0407685L3423Q1719P6542J44518J40395R3124J00481J12532N5428J67196
4270A1413043J23494J41921J9611N3309J91684J34556J34976J27310P3338J32237
4260A2545479J29105J87128J78604K02214J62989K12228J63385P9005K08351K25133
4250A4293621K03275J98906K12641K43867K35155J70884K82085K92554K40152
4241A6373140K46436L47536K56559K32913L43658L29064L32872L69086K99724
4232A9130988L36165L44381L25386M20630M30011M02600L41533L36080L56928
4223B2424702L62193N04821N13342N20811M81979N31544N51515N76612N88998
$$ plain form
4291 9734713 9784747 9791450 9852368 9862837 9986178 10067097 10088334 10156448 10302871 10371810 10407685
4280 10407685 10441108 10522827 10599369 10743887 10884282 10977406 11077887 11190419 11245847 11413043
4270 11413043 11536537 11678458 11698069 11751378 11943062 12077618 12212594 12339904 12413242 12545479
4260 12545479 12674584 12861712 13040316 13242530 13405519 13617747 13781132 13860137 14068488 14293621
4250 14293621 14496896 14695802 14908443 15152310 15387465 15558349 15840434 16132988 16373140
4241 16373140 16619576 16967112 17223671 17456584 17800242 18129306 18462178 18831264 19130988
4232 19130988 19467153 19811534 20136920 20557550 20987561 21390161 21731694 22067774 22424702
4223 22424702 22786895 23291716 23805058 24325869 24807848 25339392 25890907 26467519 27056517
4214B7056517O41001O23445P84055O77578P65322Q52313Q01070R28377R38556
4205C4068234R54695J057922J027385J010418J107049J071347J066689J146088
4197D2509827J164294J236819J282786J196813J198984J249569J313833J163484
4189E2316409J265615J266975J217197J238876J287194J238582J302395J371924
4181F2505167J355506J407931J475874J533354J396050J474934J439402J479315
4173G4067533J483513J528554J550792J510486J683476J686171J794012J820957
4165H7125494J895641J847806J932478J912809J988082K063310K119308K175838
4157A03060766K084744K085692K050584K037474J988603K117838K035341J966673
$$ plain form
4214 27056517 27697518 28320963 29105018 29782596 30547918 31400231 32201301 33129678 34068234
4205 34068234 35022929 36080851 37108236 38118654 39225703 40297050 41363739 42509827
4197 42509827 43674121 44910940 46193726 47390539 48589523 49839092 51152925 52316409
4189 52316409 53582024 54848999 56066196 57305072 58592266 59830848 61133243 62505167
4181 62505167 63860673 65268604 66744478 68277832 69673882 71148816 72588218 74067533
4173 74067533 75551046 77079600 78630392 80140878 81824354 83510525 85304537 87125494
4165 87125494 89021135 90868941 92801419 94714228 96702310 98765620 100884928 103060766
4157 103060766 105145510 107231202 109281786 111319260 113307863 115425701 117461042 119427715
4149A19427715J955973J763583J708339J729992J830083J917102J858238J929964
4141A34120989K149323K190272K487601K527993K671203K940921L002789L213116
4133A55304207L401107L484383L696334L801160L830253L730303L645496L405465
4125A84298708L295778L330851L054363K819396K284929J887490J482824J098049
4117B03552388P54712N05575L31583K58181L3842j41199l32037l89596l12399
4108B04261050j88462j66646k1130j97535k55503l25421l53839m43987p27531
4099B01580996r02589j022470j346707j718049k080506k406239k660483k863893
4091A86580060l069657l242380l432374l617271l734313l955827l942210l798217
$$ plain form
4149 119427715 121383688 123147271 124855610 126585602 128415685 130332787 132191025 134120989
4141 134120989 136270312 138460584 140948185 143476178 146147381 149088302 152091091 155304207
4133 155304207 158705314 162189697 165886031 169687191 173517444 177247747 180893243 184298708
4125 184298708 187594486 190925337 193979700 196799096 199084025 200971515 202454339 203552388
4117 203552388 204307100 204812675 205144258 205402439 205436281 205295082 204963045 204573449 204261050
4108 204261050 204072588 203905942 203884812 203687277 203431774 203106353 202752514 202308527 201580996
4099 201580996 200678407 199655937 198309230 196591181 194510675 192104436 189443953 186580060
4091 186580060 183510403 180268023 176835649 173218378 169484065 165528238 161586028 157787811
4083A57787811l678209l510143l340166l149894k898760k692595k519131k314682
4075A33684231k118550k070305j981860j921772j766534j690455j608741j782492
4067A18743522j900530j961580j964859j846815j743719j723905j754104j830104
4059A04017906j905701j828545j864871j795332j688885j637142j540060j421325
4051I0336045j316073j196640j158627j134639r65636q12648p94040q14228p67842
4042H1375672q25345j029666j041109r83584j146569j127549j096665r65915r28449
4033G2230821j108464j039217j039683j050430j085148r97259r69982r88036r31781
4024F3020821r30206r13236r65602q11614r15031q39523q91374r76087r64547
$$ plain form
4083 157787811 154109602 150599459 147259293 144109399 141210639 138518044 135998913 133684231
4075 133684231 131565681 129495376 127513516 125591744 123825210 122134755 120526014 118743522
4067 118743522 116842992 114881412 112916553 111069738 109326019 107602114 105848010 104017906
4059 104017906 102112205 100283660 98418789 96623457 94934572 93297430 91757370 90336045
4051 90336045 89019972 87823332 86664705 85530066 84564430 83751782 82957742 82143514 81375672
4042 81375672 80550327 79520661 78479552 77495968 76349399 75221850 74125185 73159270 72230821
4033 72230821 71122357 70083140 69043457 67993027 66907879 65910620 64940638 63952602 63020821
4024 63020821 62090615 61177379 60211777 59400163 58485132 57645609 56754235 55778148 54813601
4015E4813601j011617j087663j131186j133664j199129j090343j035644j086978
4007D6037377j078130r84944r03079q67991p94147q14024p22868o87461o41609
3998C8543124o63613o10669n80125n59432n37753n50600n45266m11321m04026
3989C3680319m63124m75169m80604l81835m11015m43447l77020l70156l80277
3980B9897672l92273k33870k19965l00587l38799k47074k04485l21836k73634
3971B7365149k11413j80986j52052j62984k24389k05298j31915j75619j19206
3962B5801287j95518k38364j04857k02196k15529j47049k07769j50841k07761
3953B4131403k68834k04081j71381j60606j62698j42443j97459j84399q6339k25533
$$ plain form
4015 54813601 53801984 52714321 51583135 50449471 49250342 48159999 47124355 46037377
4007 46037377 44959247 43974303 43071224 42203233 41409086 40595062 39872194 39184733 38543124
3998 38543124 37879511 37268842 36688717 36129285 35591532 35040932 34495666 34084345 33680319
3989 33680319 33217195 32742026 32261422 31879587 31468572 31025125 30648105 30277949 29897672
3980 29897672 29505399 29271529 29051564 28750977 28412178 28165104 27960619 27638783 27365149
3971 27365149 27153736 26972750 26820698 26657714 26433325 26228027 26096112 25920493 25801287
3962 25801287 25605769 25367405 25262548 25060352 24844823 24697774 24490005 24339164 24131403
3953 24131403 23862569 23658488 23487107 23326501 23163803 23021360 22823901 22639502 22553163 22327630
3943B2327630k16738m5889j57355j77992j47850j57494j35491r2625j18796K1915
3933B1099315j67710r1144j00383O059j0476r6647k648K8530j18043l406o3668
3922B0479779j6499q3794l3028p0587k4699O3066m9109j96L3851J0972J8017L7266
3910B0365039L050J19133Q5661J5636R5327R7151N2617N5660J73989J56897Q7466
3899B1307626K06000K65105J97650J42059K13339K57457K52975K31768L48138
3890B3422117L91424K95333L10168N13920M38713M26326M93369L94226M22287
3881B7107883K59323J79659j9121o1187p8666j59232j80435j77750j10724k31744
3871B6528006k37585k79401k82645l48332j89088l09875j60731r6239j87656j35555
$$ plain form
3943 22327630 22110892 22065003 21907648 21729656 21581806 21424312 21288821 21196196 21077400 21099315
3933 21099315 20931605 20840461 20740078 20746137 20735661 20639014 20636366 20664896 20546853 20543447 20479779
3922 20479779 20463280 20379486 20346458 20275871 20251172 20314238 20265129 20264933 20298784 20309756 20327773 20365039
3910 20365039 20368089 20487222 20572883 20588519 20683846 20780997 20833614 20889274 21063263 21220160 21307626
3899 21307626 21513626 21778731 21976381 22118440 22331779 22589236 22842211 23073979 23422117
3890 23422117 23813541 24108874 24419042 24932962 25371675 25798001 26291370 26685596 27107883
3881 27107883 27367206 27546865 27527744 27466557 27387891 27228659 27048224 26870474 26759750 26528006
3871 26528006 26290421 26011020 25728375 25380043 25190955 24881080 24720349 24624110 24436454 24300899
3861B4300899m8011j61917j75435j32912j34733j19649n6951j12573j27875j5913
3851B3214930j35287l0863n3111r8201l5339j3612L7451L246k0806m2417Q870
3840B2834861L005n40j0800L4597N2506J3851k560j4554K905P3887j3640p2943
3828B2900575m3732M5673O3963m9518q1722q0695L9251Q5967N074p3941N5506
3817B2866401K0192m3092Q8903j592J3002L4891L9255Q0861J08924Q7840M0851
3806B3336436M7314L4345j4866Q5314Q0363J03639L5733J5699Q742j9941O301
3795B3719079l863Q873J17095J5487O3624j6229p8945M7085J01125P4194K438
3784B4049963N4993N9098O6578K4312Q9943M4222J51271Q0605M9630N5980J07533
$$ plain form
3861 24300899 24252888 24090971 23915536 23782624 23647891 23528242 23471291 23358718 23230843 23214930
3851 23214930 23079643 23048780 22995669 22897468 22862129 22848517 22885968 22889214 22868408 22825991 22834861
3840 22834861 22837866 22837326 22826526 22861123 22913629 22927480 22924920 22910366 22913271 22987158 22973518 22900575
3828 22900575 22856843 22902516 22966479 22916961 22835239 22754544 22793795 22879762 22884836 22810895 22866401
3817 22866401 22886593 22843501 22932404 22930812 22943814 22978705 23017960 23098821 23207745 23295585 23336436
3806 23336436 23383750 23418095 23403229 23488543 23568906 23672545 23708278 23723977 23732719 23712778 23719079
3795 23719079 23715216 23724089 23841184 23856671 23920295 23904066 23825121 23872206 23973331 24047525 24049963
3784 24049963 24104956 24164054 24230632 24254944 24344887 24389109 24540380 24620985 24670615 24726595 24834128
3773B4834128J06147R6017P6758P6493K9422O5110J17730R1201O9370Q9260J44842
3762B5796478Q1141P1320N4579P4455K05657K0307J51255J52799J24572J84094
3752B6916657K07354K16762J91222J57506J84331K29937J47060K11637J66872
3743B8629338K12435J97562K33906J95475K66068K11224K44321L54906K41759
3734C0786994K25727K14467L48551L10558L17781K97756K31167L57413K93745
3725C3384159L22923L64723K82513L65905L43438L88272L56506L83653L01691
3716C6493783L82211M23432M06497M03119M24302N35362M44729M30770M69200
3707D0413405N12083N06647M94145N12138N65985N89492N29770M75080N67493
$$ plain form
3773 24834128 24940275 25036292 25113050 25189543 25218965 25284075 25401805 25493006 25562376 25651636 25796478
3762 25796478 25877619 25948939 26003518 26077973 26283630 26303937 26455192 26607991 26732563 26916657
3752 26916657 27124011 27340773 27531995 27689501 27873832 28103769 28250829 28462466 28629338
3743 28629338 28841773 29039335 29273241 29468716 29734784 29946008 30190329 30545235 30786994
3734 30786994 31012721 31227188 31575739 31886297 32204078 32501834 32733001 33090414 33384159
3725 33384159 33707082 34071805 34354318 34720223 35063661 35451933 35808439 36192092 36493783
3716 36493783 36875994 37299426 37705923 38109042 38533344 39068706 39513435 39944205 40413405
3707 40413405 40925488 41432135 41926280 42438418 43004403 43593895 44123665 44598745 45166238
3698D5166238N93815N91882O61795O30299O37938O96560O37465P02585P48449
3689E1067026P06210P81520Q44137Q58499R40119R00519R73862R46906R80108
3680E8998906R85007J025847J053733J098563J065698J122602J117869J103909
3672F7572134J167623J159876J123406J181147J118094J165563J256118J292276
3664G7036237J371215J420844J535953J435415J628347J681127J699523J838580
3656H9647241J823549J922457K006029J981814K019614J987783K009519K086364
3648A05484370K121625K157815K209379K053921K002141J941937K104647K138510
3640A22214345J933218J993179K039131K099566K182300K216961K373056K413370
$$ plain form
3698 45166238 45760053 46351935 47013730 47644029 48281967 48978527 49615992 50318577 51067026
3689 51067026 51773236 52554756 53398893 54257392 55197511 56098030 57071892 58018798 58998906
3680 58998906 59983913 61009760 62063493 63162056 64227754 65350356 66468225 67572134
3672 67572134 68739757 69899633 71023039 72204186 73322280 74487843 75743961 77036237
3664 77036237 78407452 79828296 81364249 82799664 84428011 86109138 87808661 89647241
3656 89647241 91470790 93393247 95399276 97381090 99400704 101388487 103398006 105484370
3648 105484370 107605995 109763810 111973189 114027110 116029251 117971188 120075835 122214345
3640 122214345 124147563 126140742 128179873 130279439 132461739 134678700 137051756 139465126
3632A39465126K467002K708921K813108K974985L193265L324726L536420L782644
3624A64266197L927141M216901M523448M841733N351463N672989O165014O751821
3616B05716707P373862P979928Q782783R556002J0174906J1063724J1681248J2402292
3608B84731452J2810708J3203472J3710441J3866241J3724952J3195046J2165389
3601C77407701J0557068Q539954N665842K147089j426230m302903o255153p506955
3593C84826413q132008q828852r657781j0501193j1248780j1470206j1260797
3586C13726796j0668442r834889r106797q423700p882257p350063o989924o599288
3578B46871436o433785o315380o099408n862611n672527n544288n248983n118641
$$ plain form
3632 139465126 141932128 144641049 147454157 150429142 153622407 156947133 160483553 164266197
3624 164266197 168193338 172410239 176933687 181775420 187126883 192799872 198964886 205716707
3616 205716707 213090569 221070497 229853280 239409282 249584188 260647912 272329160 284731452
3608 284731452 297542160 310745632 324456073 338322314 352047266 365242312 377407701
3601 377407701 387964769 396504723 402170565 404317654 402891424 398588521 392333368 384826413
3593 384826413 376694405 367865553 358207772 347706579 336457799 324987593 313726796
3586 313726796 303058354 293223465 284116668 275692968 267810711 260460648 253470724 246871436
3578 246871436 240437651 234122271 228022863 222160252 216487725 210943437 205694454 200575813
3570B00575813m982395m836733m667354m527600m382299m337559m317403m211389
3562A64313081m122789l929538l815097l786336l797910l660879l493948l345080
3554A34361504l244352l198938l054726k818740k729395k588652k513508k448209
3546A11764984k310386k086083k091462k028539j852335j903730j731059j719297
3538I6042093j527546j545445j568865j481499j448632j366376j382029j314066
3530H4407635j243183j232389j155788j173807j091971j056054j033448r32908
3522G5488087r01597q79133r30039p67999p18325p46784o86407p92730p63956
3513F8301117o86574p60983p25964p38080p08789p11223o87019n89539o78925
$$ plain form
3570 200575813 195593418 190756685 186089331 181561731 177179432 172841873 168524470 164313081
3562 164313081 160190292 156260754 152445657 148659321 144861411 141200532 137706584 134361504
3554 134361504 131117152 127918214 124863488 122044748 119315353 116726701 114213193 111764984
3546 111764984 109454598 107368515 105277053 103248514 101396179 99492449 97761390 96042093
3538 96042093 94514547 92969102 91400237 89918738 88470106 87103730 85721701 84407635
3530 84407635 83164452 81932063 80776275 79602468 78510497 77454443 76420995 75488087
3522 75488087 74586490 73707357 72777318 72009319 71290994 70544210 69857803 69065073 68301117
3513 68301117 67614543 66853560 66127596 65389516 64680727 63969504 63282485 62692946 62014021
3504F2014021o97790n57519o70011o14658n65450o08942n50561n27949n83427
3495E6637714n19719m83414n33044n17747m42497m58804m97516m71593n20837
3486E2192543m20628l81709l68874m31199m15526m47467l48874m21928m50231
3477D8506107l79925l15013l60144l86471l76682l58103l28352l11258l33890
3468D5356269l33070k38192k54884k88972l07440k28841k15627k87986k36202
3459D2965055k28752k76039k04055k10000j56035k27447k57441j34486j55629
3450D1115171j62528k08271j92108j48062j08992j43763j79981k46092j87359
3441C9538015j81196j33903j59133k46709j36302j37858j93744k19285j73364
$$ plain form
3504 62014021 61316231 60758712 60088701 59474043 58908593 58299651 57749090 57221141 56637714
3495 56637714 56117995 55634581 55101537 54583790 54141293 53682489 53184973 52713380 52192543
3486 52192543 51771915 51390206 51021332 50590133 50174607 49727140 49378266 48956338 48506107
3477 48506107 48126182 47811169 47451025 47064554 46687872 46329769 46001417 45690159 45356269
3468 45356269 45023199 44785007 44530123 44241151 43933711 43704870 43489243 43201257 42965055
3459 42965055 42736303 42460264 42256209 42046209 41890174 41662727 41405286 41270800 41115171
3450 41115171 40952643 40744372 40552264 40404202 40295210 40151447 39971466 39725374 39538015
3441 39538015 39356819 39222916 39063783 38817074 38680772 38542914 38349170 38129885 37956521
3432C7956521k51493k37465k22684j80475k88944k29302j52924k23732k32983
3423C5936519l02451k43836k62178k62702k47387j85650j37857j93226k07564
3414C3893668k88802j99997j31509j58444k13451j96505j96618j68412k09537
3405C2130393j59042j95443k48353k03043j51493j76740k28656k26239k40933
3396C0300451j69710k15189k43159k08578k01772j99757j54179j08803j27870
3387B8671434j64510j08904p4914j46769j00984j14487j69609l8096m7593m8031
3377B7657537r774m2700q2128K6319k8545m3883M9633Q7547Q6098l1551L2646
3366B7701199J37066P469m0759J84205R4671Q4676J42829N7044J85014J55762
$$ plain form
3432 37956521 37705028 37467563 37244879 37064404 36775460 36546158 36393234 36169502 35936519
3423 35936519 35634068 35390232 35128054 34865352 34617965 34432315 34294458 34101232 33893668
3414 33893668 33604866 33404869 33273360 33114916 32901465 32704960 32508342 32339930 32130393
3405 32130393 31971351 31775908 31527555 31324512 31173019 30996279 30767623 30541384 30300451
3396 30300451 30130741 29915552 29672393 29463815 29262043 29062286 28908107 28799304 28671434
3387 28671434 28506924 28398020 28323106 28176337 28075353 27960866 27791257 27753161 27705568 27657537
3377 27657537 27647763 27605063 27522935 27549254 27520709 27476826 27526459 27614006 27700104 27668553 27701199
3366 27701199 27838265 27845734 27804975 27989180 28083851 28168527 28311356 28368400 28553414 28709176
3356B8709176K02401J51671J28392K28584J72186K55316K76539J89892K65719
3347C0579876K73215K87037L83143K56233L37026L33716L89575L67066L80076
3338C3586963L89948L86408M80374N60291N67824M87762N29058M89022M56778
3329C7934428M45637M37761L75626M29393M00574N15740N00409N56687N54998
3320D2151253M86826N66265N99443O57716O38526O49629P45493P98089P78203
3311D8071443P92667R32604J046251J047119J051555J154804J295126J275243
3303E6666812J440899J420988J529073J654509J755217J819898J892720J953475
3295G0133591J969336K188150K254391K423195K460769K494942K510411K460351
$$ plain form
3356 28709176 28911577 29063248 29191640 29420224 29592410 29847726 30124265 30314157 30579876
3347 30579876 30853091 31140128 31523271 31779504 32116530 32450246 32839821 33206887 33586963
3338 33586963 33976911 34363319 34843693 35403984 35971808 36459570 36988628 37477650 37934428
3329 37934428 38380065 38817826 39193452 39622845 40023419 40539159 41039568 41596255 42151253
3320 42151253 42638079 43204344 43803787 44461503 45100029 45749658 46495151 47293240 48071443
3311 48071443 48864110 49796714 50842965 51890084 52941639 54096443 55391569 56666812
3303 56666812 58107711 59528699 61057772 62712281 64467498 66287396 68180116 70133591
3295 70133591 72102927 74291077 76545468 78968663 81429432 83924374 86434785 88895136
3287H8895136K428869K270395J939968J701601J521366J544996J515012J580604
3279A03397947J467545J488780J393878J406834J521831J678704J953339K151914
3271A16460772K438942K630007K982152L145554L257268L457352L753245M106231
3263A42231523M550078M972236N603480N886509N986032M980810K733969n5539
3255A76889098j927974k519398k213963j669308j104825j341004k380141k741540
3247A60990945k665818k207935j672017j041543l39679K93848P26573J066694
3239A55151068J271041J430400J415974J428083J486777J319006J025965O00613
3231A65128927J44052j66461n99495p86872j227659j736042k521696l271024l581942
$$ plain form
3287 88895136 91324005 93594400 95534368 97235969 98757335 100302331 101817343 103397947
3279 103397947 104865492 106354272 107748150 109154984 110676815 112355519 114308858 116460772
3271 116460772 118899714 121529721 124511873 127657427 130914695 134372047 138125292 142231523
3263 142231523 146781601 151753837 157357317 163243826 169229858 174210668 176944637 176889098
3255 176889098 174961124 172441726 170227763 168558455 167453630 166112626 163732485 160990945
3247 160990945 158325127 156117192 154445175 153403632 153063953 153357801 154084374 155151068
3239 155151068 156422109 157852509 159268483 160696566 162183343 163502349 164528314 165128927
3231 165128927 165272979 165106518 164507023 163720151 162492492 160756450 158234754 154963730 151381788
3222A51381788l565883l341737k946079k834154k864084k799162k625577k378363
3214A28026749k053484j773934j663611j569177j588258j633450j752618j763289
3206A14228928j966893k198335k596072k911500l042482l053129l266656l120176
3198I2073685l061659l114902k984107k877210k874949k703059k502929k402238
3190F9552632k175399k108135j872794j739378j698198j501214j477094j476331
3182E5504089j456342j362362j383959j236774j192590j251404j217215j178297
3174D5225146j162214j132727j126995j046583j024175j070787r79913r39948
3166C6741804q73311q45369q13857p99133p54133p43259p57108p53653o11420
$$ plain form
3222 151381788 147815905 144474168 141528089 138693935 135829851 133030689 130405112 128026749
3214 128026749 125973265 124199331 122535720 120966543 119378285 117744835 115992217 114228928
3206 114228928 112262035 110063700 107467628 104556128 101513646 98460517 95193861 92073685
3198 92073685 89012026 85897124 82913017 80035807 77160858 74457799 71954870 69552632
3190 69552632 67377233 65269098 63396304 61656926 59958728 58457514 56980420 55504089
3182 55504089 54047747 52685385 51301426 50064652 48872062 47620658 46403443 45225146
3174 45225146 44062932 42930205 41803210 40756627 39732452 38661665 37681752 36741804
3166 36741804 35868493 35023124 34209267 33410134 32656001 31912742 31155634 30401981 29790561
3157B9790561n96263n72598n02311n57546n63309n07041m98988l48310m34899
3148B5209296n13836l44447l45099l76834l36656l28642l42405m01966m17303
3139B1802108l71263k63399m11065l91414l67989m10098l35513l98983l74564
3130A8477820m05870l63764k40227k98397l22805k67615k40602k70587k36150
3121A5831803j99827k52676l21328j65263j93151k47952k16220j82206j94077
3112A3859103j87638k52157k16623j83031k48570j77279k29350j99592j75509
3103A1989354k29852k64774j85562k09156k45296j74704j71745j78883j22947
3094A0206435j76669j04805j75168k27419q5985j23350j79845j27756j11386j54989
$$ plain form
3157 29790561 29194298 28621700 28119389 27561843 26998534 26491493 25992505 25644195 25209296
3148 25209296 24695460 24351013 24005914 23629080 23292424 22963782 22621377 22219411 21802108
3139 21802108 21430845 21167446 20756381 20364967 19996978 19586880 19251367 18852384 18477820
3130 18477820 18071950 17708186 17467959 17169562 16846757 16579142 16338540 16067953 15831803
3121 15831803 15631976 15379300 15057972 14892709 14699558 14451606 14235386 14053180 13859103
3112 13859103 13671465 13419308 13202685 13019654 12771084 12593805 12364455 12164863 11989354
3103 11989354 11759502 11494728 11309166 11100010 10854714 10680010 10508265 10329382 10206435
3094 10206435 10029766 9924961 9749793 9522374 9436389 9313039 9133194 9005438 8894052 8739063
3084H739063j46347j74312j36834j37039j25568j19950j25978j12231j25337p9301
3074G456166j45085l0735j12861q3639r2401p3664q2389j72917q7238m5335l0931
3063F498971j10734r9000j14402L0025R521m9994p5019p1791j22646m5869q4288
3052E764774m4778K6539m1338l8048n4827k422r3454p3158o1102l694j29093p067
3040E242332n1182J0563n4059r9301m5067l5845j8529m6136m1690k6087o1876
3029D773123j8401k2223m7582K9657p7884l002o4925o8231k0306l0217J2674L0696
3017D493379q7196l1160j1969n3508l4795M0761m3322j8947L5298k0292L9817
3006D308066l161j06823j05156L2935P0943N872j3624j6261O62n7096j23113j0329
$$ plain form
3084 8739063 8592716 8418404 8281570 8144531 8018963 7899013 7773035 7660804 7535467 7456166
3074 7456166 7311081 7280346 7167485 7083846 6991445 6917781 6835392 6662475 6575237 6529902 6498971
3063 6498971 6388237 6289237 6174835 6204860 6214381 6164387 6089368 6017577 5894931 5849062 5764774
3052 5764774 5719996 5746535 5705197 5667149 5612322 5609900 5516446 5443288 5382186 5378492 5249399 5242332
3040 5242332 5191150 5201713 5147654 5048353 5003286 4967441 4948912 4902776 4861086 4834999 4773123
3029 4773123 4754722 4732499 4684917 4714574 4636690 4633688 4568763 4500532 4480226 4450009 4462683 4493379
3017 4493379 4406183 4375023 4363054 4309546 4274751 4315512 4272190 4253243 4288541 4268249 4308066
3006 4308066 4304905 4198082 4092926 4125861 4196804 4202676 4189052 4172791 4173453 4116357 3993244 3982915
2994C982915O7834j5217n2301k4237l3110l1503L0163J0412K2887n7110k095N156
2982C903794J1249l017K5600o4991L8198K6889m2851J7253J318m5748m7217L2233
2970C852710m8859m734n597l7019m7643r864p4908k5793N6417n6008o4785n0235
2958C483682k6002L7274l1685J9073p2881J5842N0498K6557p5035p2393n4698
2947C300232M3446k0606n8439K5118o4072n9103K8847p148q4945N215k3299m430
2935C080816l0806m3665J3854j4012j2847l8540l4979m3954l694M6836l7378o0286
2923B821345n1399p5221l6466n207r313K139r146n6400q7845L9444l7510o132
2911B488289j06287o1666J6335l7995l0528m4286k6059L9630L516n4782M522k6543
$$ plain form
2994 3982915 4050749 4035532 3983231 3958994 3925884 3894381 3924544 3934956 3957843 3900733 3898638 3903794
2982 3903794 3915043 3912026 3937626 3872635 3910833 3937722 3894871 3912124 3913442 3867694 3820477 3852710
2970 3852710 3803851 3799117 3793520 3756501 3708858 3698994 3624086 3598293 3654710 3598702 3533917 3483682
2958 3483682 3457680 3494954 3463269 3482342 3409461 3425303 3475801 3502358 3427323 3354930 3300232
2947 3300232 3343678 3323072 3264633 3289751 3225679 3166576 3195423 3188275 3103330 3108545 3085246 3080816
2935 3080816 3050010 3006345 3020199 3006187 2993340 2954800 2919821 2875867 2872173 2919009 2881631 2821345
2923 2821345 2769946 2694725 2658259 2653052 2643739 2645878 2636732 2580332 2492487 2531931 2494421 2488289
2911 2488289 2382002 2320336 2336671 2298676 2268148 2223862 2197803 2237433 2240949 2186167 2190689 2164146
2899B164146K1061p0169m1014L9869m3255p1247N941L7532j9207q6257p144M1059
2887A971315q634L147O107K1081k6400K0871j16775N6J2255K583p921k5041q7713
2874A764931p085Q1344p6272K7513L5764M0299p1320q8573m5805O2030M9685R928
2862A782439j0991k3779o6247n1718l097q4797M4632j5008K9715J0458n3311j6214
2850A542082p2133K6288k0425j8799L0906p8109J1582N7226n4920l9326m1516
2839A342856J8849P384n608M3365J1429p6972K3011J4486r2687k759j4682k1116
2827A247556Q0766j3999p0500L4105l5591k3073j1952j1817L8281l281q748R436
2815A231183p057q7299P6142L3544l9839n8733k1954M728n0756j3921l4266Q6444
$$ plain form
2899 2164146 2185207 2115038 2074024 2113893 2070638 1999391 2005332 2042864 2023657 1937400 1930256 1971315
2887 1971315 1962681 1965828 1971935 1993016 1966616 1987487 1870712 1870768 1883023 1885606 1877685 1852644 1764931
2874 1764931 1757846 1839190 1762918 1790431 1826195 1866494 1795174 1706601 1660796 1722826 1772511 1782439
2862 1782439 1771448 1747669 1681422 1629704 1626607 1541810 1586442 1571434 1601149 1611607 1558296 1542082
2850 1542082 1469949 1496237 1475812 1457013 1487919 1409810 1421392 1478618 1423698 1384372 1342856
2839 1342856 1361705 1369089 1363481 1406846 1418275 1341303 1364314 1378800 1286113 1283354 1268672 1247556
2827 1247556 1328322 1314323 1243823 1277928 1242337 1219264 1207312 1195495 1233776 1230495 1221747 1231183
2815 1231183 1224126 1136827 1212969 1246513 1206674 1147941 1125987 1130715 1079959 1066038 1031772 1118216
2803A118216M093r890P802o5240j17909l4698J921l0987N7276l3681J6943O8416
2791I82262J4690q3955k678k4666K621K7331q7336L7230L8702k7095j7518j3705
2779H45883j9475L4811k124o5620P3617m0466m6706l7617K0025L6458r985o212
2767G82589m1117p2069J3989L7023J4205l9367n3673l2420m1474P7361M5824o2119
2755F28752o4924O9561K1114q9150R958P1664r856j2870o3465O2390n2500M5523
2743F16197N6324p2105m8559o5555j4612J6852j2805K9942m5111o821K1983k4249
2731D51481j898j8844L8835k205O1413j0640l6700N1632J7355J177k1182k3827
2719E06597p574k4905n2698p7564N5769M8719j9226k6552p0675k6777j0397j1479
$$ plain form
2803 1118216 1122309 1112419 1120221 1054981 937072 902374 904295 873308 930584 896903 913846 982262
2791 982262 996952 912997 910319 885653 888274 915605 828269 865499 904201 877106 859588 845883
2779 845883 826408 861219 859095 793475 867092 826626 779920 742303 762328 798786 788801 782589
2767 782589 741472 669403 683392 720415 734620 695253 641580 609160 567686 645047 690871 628752
2755 628752 563828 633389 654503 565353 575311 646975 637119 624249 560784 623174 570674 616197
2743 616197 672521 600416 551857 486302 471690 488542 475737 505679 460568 453747 475730 451481
2731 451481 449583 430739 469574 467369 528782 518142 481442 533074 550429 551606 530424 506597
2719 506597 499023 474118 421420 343856 399625 448344 429118 402566 331891 305114 294717 283238
2707B83238J6445P5741l6735p4357M3706Q0263k2834p2327N2297j9608J5426J8031
2695C59286k7647o636m8098m1069K7820Q3879O3649j7103p7460L8938m4257l8549
2683B72753k3985N9462N575n7936q9819K3581R0347r845m1915K432L8849K2302
2671B91801J7526k9111o4787m0298Q8241k201q098o6651J9192l1548P667J4971
2659A96704j6851j7431K6084k9383k3082O4897M049M8763q7196l6880K284K1922
2647A53880N9215L4729J8414m2408k398j3864q0447L3417J6854q074j0419M5694
2635B04593k0562J7180j0697k5612k6121J3054P882K0214m960J4494R0810l5066
2623B45209j28031L2252Q8567J2164m2705n5101J1014k2213J0746M7220l4500
$$ plain form
2707 283238 299683 375424 338689 264332 308038 388301 365467 293140 345437 325829 341255 359286
2695 359286 331639 325003 276905 235836 263656 347535 411184 394081 316621 355559 311302 272753
2683 272753 248768 308230 313805 255869 166050 189631 279978 270133 228218 230650 269499 291801
2671 291801 309327 280216 215429 175131 263372 261171 253073 186422 205614 174066 181733 196704
2659 196704 179853 162422 188506 159123 136041 200938 204987 253750 166554 129674 131958 153880
2647 153880 213095 247824 266238 223830 221432 207568 127121 160538 177392 169318 158899 204593
2635 204593 184031 201211 190514 164902 138781 151835 159717 179931 174971 189465 280275 245209
2623 245209 117178 149430 237997 250161 207456 152355 163369 141156 151902 199122 164622
2612A64622R386J0853p6340L2500K2939m4373o1718Q9073K8155k933m5402K4045
2600A50807K5959r337L810N249j637m236Q48K6679l1635O801J6150m0292k1140
2587A28026j22j184K8456k5632L0577K4027j6907J5050N990j3207j7018j1791
2575A46265K1836K2881m7452l5302P9151m1908l1123L1403o913J6502L3578l675
2563A85243l0192N6760K9162o8211k0410J24676J7228l1778l7436k0962M0099
2552B44179M862m6775k3457O2341K0022M4827L7872M510m7364k6406Q822L7392
2540C20825k4357j1004m988m0461L3358J9342M9282K6677J2519j3500M5114Q3631
2528D96438m3236n2635O3850L0587l9390q677L1246N5284K8666p2861k9835O38
$$ plain form
2612 164622 174008 184861 108521 141021 163960 119587 57869 146942 175097 172164 126762 150807
2600 150807 176766 167429 171239 176488 174851 170615 171463 198142 166507 173308 189458 149166 128026
2587 128026 127904 126720 155176 129544 160121 184148 167241 182291 188281 175074 158056 146265
2575 146265 168101 190982 143530 108228 187379 145471 114348 145751 138838 155340 188918 185243
2563 185243 155051 211811 240973 172762 152352 277028 294256 262478 225042 204080 244179
2552 244179 249041 202266 178809 241150 261172 305999 343871 348381 301017 274611 283433 320825
2540 320825 296468 285464 280476 240015 273373 292715 341997 368674 381193 367693 412807 496438
2528 496438 453202 400567 464417 495004 455614 446937 478183 533467 562133 489272 459437 460075
2516D60075O2984N7269L543J4634n7923j1021O0780M2809R72L5032O4116l2556
2504G00714L6979O798K2886O2956J9401p51J0956j6496O2356O361k8225j7307
2492H66628L0467M5670K7103K1700M9701m0372K7731Q2371N6389J24490N4326
2481A346204J9179J20727M3052R2881K38933J69043J60849J87780J73199K56578
2471B808425K74590K28519K26002M59114M12424N25164O82125R51146J263453
2462G830962J721315J517966L83308r51112j382219r06679l06422P9183L05218
2453H291520K33666r71975j286657r86572o23455l98392l19314l08236k18920
2444C411665k07735j73796j56277j04969j36649j40113j24523j69490j41317j62771
$$ plain form
2516 460075 523059 580328 583871 598505 540582 529561 590341 633150 634122 669154 733270 700714
2504 700714 737693 744491 767377 830333 849734 848983 859939 843443 905799 912160 883935 866628
2492 866628 897095 942765 969868 991568 1041269 1000897 1028628 1110999 1167388 1291878 1346204
2481 1346204 1365383 1486110 1529162 1622043 1860976 2030019 2190868 2378648 2551847 2808425
2471 2808425 3083015 3311534 3537536 3996650 4409074 4934238 5616363 6567509 7830962
2462 7830962 9552277 11070243 11453551 10502439 9120220 8213541 7907119 7986302 8291520
2453 8291520 8525186 7553211 6266554 5279982 4656527 4258135 3938821 3630585 3411665
2444 3411665 3203930 3030134 2873857 2768888 2632239 2492126 2367603 2198113 2056796 1894025
2434A894025j48372j55406j34050o2501j00981o8222K3892j00262j01740l4327
2424A012056n9075K7504Q728q2358r5934K1030m1114n1127n4395J5956p048q9197
2412F05026K4575k8697m2344r7034O1862O4121p2615o2444l1205K359L232q40
2400D25996l2035L5007N378m4587j3031L4365o4374j7685k6856M202J5947m1458
2388B80869M7009r9439k0672l1158O7135O3723l7285r191K3130K178q1135J646
2376B06810L3470k0881n7468k815J0500M4302n3721J2863m3023j9502L8946n669
2364A43812K1744k5721L665k8248J2881L4312j6336N996L8037n5993l6478K8553
2352A26224J3797l3208j5489j0701l2830R9062k7739l2389p595n3512P479O2429
$$ plain form
2434 1894025 1745653 1590247 1456197 1393696 1292715 1224493 1248385 1148123 1046383 1012056
2424 1012056 952981 980485 989213 906855 810921 831951 790837 739710 685315 701271 694223 605026
2412 605026 629601 600904 558560 461526 523388 587509 514894 452450 421245 423604 426836 425996
2400 425996 393961 428968 434346 389759 376728 411093 346719 329034 302178 306380 322327 280869
2388 280869 327878 228439 207767 176609 243744 307467 270182 260991 284121 286299 205164 206810
2376 206810 240280 219399 161931 159116 169616 213918 160197 173060 130037 110535 149481 143812
2364 143812 165556 139835 143500 115252 128133 162445 146109 152105 190142 134149 97671 126224
2352 126224 140021 106813 91324 80623 47793 146855 119116 86727 79132 25620 33099 95528
2340I5528p940k8305p890Q202m2565K7129l7513p0033P085M8902K0638j4424L8009
2327C6823l1276O891M3805L6733l2914j6736K5482k6492j1292O6996l0846l8668
2315B8506J0266N5289J2571l8333K6292M6444l8313m0811J6037m4781l0528l2955
2303c0316P1355N8198o4783J1867o4984m7465O9380L7830J5794n1789L0968J7896
2291E3951k5035m4467n464l9036K3361R6758p455o0024k4461j6090n2301M1931
2279e8332j9354J8656N1280P5477p8712k932K378K3211J2367O3517l7721j5718
2267C4117K0610n296p022n9316l2774K9337o0961m7458J1318O5484J10952m790
2255E4201j20777K5034p3365K0630M9287K2834J1124l8901P5179J2487N7661j6380
$$ plain form
2340 95528 87588 59283 51393 59595 17030 44159 6646 -63387 -56302 -7400 13238 -1186 36823
2327 36823 5547 12438 56243 92976 60062 43326 68808 42316 31024 98020 67174 28506
2315 28506 38772 94061 106632 68299 94591 141035 102722 61911 77948 33167 2639 -30316
2303 -30316 41039 99237 34454 46321 -18663 -66128 3252 41082 56876 5087 36055 53951
2291 53951 28916 -15551 -21015 -60051 -36690 60068 52613 -7411 -31872 -47962 -100263 -58332
2279 -58332 -77686 -59030 -7750 67727 -10985 -13917 -11539 11672 24039 87556 49835 34117
2267 34117 54727 49431 42409 -16907 -49681 -20344 -81305 -128763 -117445 -51961 58991 54201
2255 54201 -66576 -41542 -114907 -94277 -44990 -22156 -11032 -49933 25246 37733 95394 79014
2243G9014J5562l6097m6736j9809k6690j1484l5250J622L1050M023m3754m5850
2231a34399P8247L0350n9918k1593k5954l4907J41308k1905o2587L8534L6154
2220c6670L8548J4289m9012m282J3454o642J0184k4881l4462J2463k7256J6091
2208g8176k2538N6915l4847J3791O7104J085j0099o0158n320m745P4188K6147
2196B3347L9441n6050l7453R4154k308o3184P8240L4218n0008j1000n8065j446
2184a0114j7801l0533j8095L2731Q911N625l829l0790n974K3705M5729j5781n3798
2171g0014p2357P3813K2284j6092L1869l4767J795L7284P5088l9016j6400j7220
2159b3733l7684L4646O8058J4519o1258r048J4741l1353p1363L1965J00776J2733
$$ plain form
2243 79014 94576 58479 11743 -8066 -34756 -46240 -81490 -79868 -48818 -44795 -88549 -134399
2231 -134399 -56152 -25802 -85720 -107313 -133267 -168174 -26866 -48771 -111358 -72824 -36670
2220 -36670 1878 16167 -32845 -37127 -23673 -30315 -20131 -45012 -79474 -67011 -94267 -78176
2208 -78176 -100714 -43799 -78646 -64855 2249 3334 -6765 -66923 -72243 -76988 -2800 23347
2196 23347 62788 6738 -30715 63439 61131 -2053 76187 110405 60397 49397 -8668 -10114
2184 -10114 -27915 -58448 -76543 -43812 -34901 -29276 -33105 -63895 -69869 -46164 -435 -16216 -70014
2171 -70014 -142371 -68558 -46274 -62366 -30497 -65264 -63469 -26185 48903 9887 -6513 -23733
2159 -23733 -61417 -26771 41287 55806 -5452 -14500 241 -31112 -102475 -70510 30266 42999
2147D2999l9768k9793p74J0332J4418j05893P3689k5895M0101Q9174j26350j4014
2135g1774M3066n6370j4165Q8992K9682l5672l8986K2168l9334j0423N2449J0107
2123b0260k3274L1900l5073M7395j5543k8358L993O6725l4796n2905K9845q814
2111c9165J7483L535j0758O0691j525k8352j0973N173L7238J8390m1227o2777
2099e2267M4303j5632P887j2289j7595j7383n2686L8991M2107p789K4513J6524
2087a316L3169N1997j4468j04825o25r124j0699j0625k0895M64M1581n3638m5525
2074a44529P0796j95P9783l8805k378l0100O8651L9295m6772O84m416K53M922
2061b811L3836J8587j2558l5891j7021j25408N3909L6041Q676j790M4162J555
$$ plain form
2147 42999 3231 -26562 -27336 -17004 -2586 -108479 -34790 -60685 -20584 68590 -57760 -71774
2135 -71774 -28708 -85078 -99243 -10251 19431 -16241 -55227 -33059 -72393 -82816 -30367 -20260
2123 -20260 -43534 -11634 -46707 688 -14855 -43213 -39220 27505 -7291 -60196 -30351 -39165
2111 -39165 -21682 -18147 -28905 31786 30261 1909 -9064 -3891 33347 51737 10510 -52267
2099 -52267 -7964 -23596 -15709 -27998 -45593 -62976 -115662 -76671 -34564 -42353 -17840 -1316
2087 -1316 31853 83850 69382 -35443 -36068 -45192 -55891 -66516 -87411 -86947 -45366 -99004 -144529
2074 -144529 -73733 -73928 5855 -32950 -35328 -65428 3223 42518 -4254 -3570 -7986 -7733 -2811
2061 -2811 31025 49612 37054 1163 -15858 -141266 -87357 -51316 -42640 -44430 -268 1287
2049A287o6970L5396N225O6353j7954o6016M1351k3605K7741P1541p3824m9357
2037d8832m05N983n0943M2023P677l216j7996J2166j4749K1994M0786n9169L8803
2024b5878l3685K4989J8452o1443l9799q492L9374N8032Q862m514M866j3650o0884
2011i3770m2509R7727L1972K8601j03843K4236M1514L1408k1145j2508m6513L3483
1999c1347K6458J510k9710j3523n3909m9169J06814o617O6K9487l7016j9203M8916
1986b7243K5041p3776m0873J07188j1148r532o4132n161K1556l0555K8479M6943
1974c3213k8377M6826k9582j8239m1794O6145k5626j7174L3877k3264o7798N6413
1962h1806J01568j4792k81k6810O958m8061M0042k1059L0527P4649q4256J9344
$$ plain form
2049 1287 -65683 -30287 -25062 41291 23337 -42679 -1328 -24933 2808 74349 525 -48832
2037 -48832 -49237 -43254 -94197 -52174 -44497 -47713 -65709 -53543 -68292 -46298 -5512 -64681 -25878
2024 -25878 -59563 -34574 -16122 -77565 -117364 -125856 -86482 -28450 -19588 -24102 -19236 -32886 -93770
2011 -93770 -136279 -38552 -6580 22021 -81822 -57586 -16072 15336 -5809 -18317 -64830 -31347
1999 -31347 -4889 -3379 -33089 -46612 -100521 -149690 -42876 -49493 -49427 -19940 -56956 -76159 -27243
1986 -27243 -2202 -75978 -116851 -9663 -20811 -30343 -94475 -99636 -78080 -108635 -80156 -33213
1974 -33213 -61590 -14764 -44346 -62585 -104379 -38234 -63860 -81034 -47157 -70421 -138219 -81806
1962 -81806 19762 4970 4689 -22121 -15163 -63224 -23182 -44241 -13714 60935 -23321 -3977
1950c977o5014p481N3970k7484l7503R631Q769M3345M2834p064j1471j0159M1032
1937B9428J3914o9066m3421K9799J4045M6590K6215l1302j0448M7656j6798l2054
1925D558o0108J8118K6496n8540K8720R624j3211J9622N2539l9362o25L5705k3596
1912f0j23430N7594L0285N8500J1166k9694j153J4629q2039k8990O2573l6575
1900f7194M1071j25056K9285n997Q2312r349k8380k8324J0171Q1089o9926N727
1888h4571L2904M5795N9061r0632n5911K5279K6596l2955n4717O7120N9836l5541
1876c7736o6725j9909Q1224K7730o0162K3320J4854K1377m4963m9339N9531L1316
1864a9482J9498j747N778M640j7949o5951K2731J9878J816K9292j4573o8409j6790
$$ plain form
1950 -3977 -68991 -76472 -22502 -49986 -87489 -77858 -69089 -25744 17090 10026 -1445 -11604 29428
1937 29428 43342 -25724 -69145 -39346 -25301 21289 47504 16202 5754 53410 36612 4558
1925 4558 -55550 -37432 -10936 -69476 -40756 -31132 -44343 -24721 27818 -11544 -12169 23536 -60
1912 -60 -123490 -65896 -35611 22889 34055 4361 3208 17837 -64202 -93192 -30619 -67194
1900 -67194 -26123 -151179 -121894 -127891 -45579 -54928 -83308 -111632 -101461 -20372 -90298 -84571
1888 -84571 -51667 -5872 53189 -37443 -93354 -68075 -41479 -74434 -129151 -62031 -2195 -37736
1876 -37736 -104461 -124370 -43146 -15416 -75578 -52258 -37404 -16027 -60990 -110329 -50798 -19482
1864 -19482 16 -1731 4047 8687 -9262 -75213 -52482 -32604 -30788 -1496 -16069 -84478 -101268
1851a01268O5099K2014O077n757o2892P972L8998N6836K856k7712L6541j918l6532
1838C14j976N182M987l7690p8911J8258n52O6415J6054n0025P204j3960j7350
1825h2050p390M5289O560L0625n3014l069O5519m3477N761l8520O7054O693q3913
1812h3932O9333o2431L631J962J5714O6607l662k7495j4222k2772K3875k883l5678
1799g1953L8935p9505J3048N6644O0924l6520J8038p1062j0612N9743l2902l2830
1787h8052O680M0830j2127N5203K8065k8456m9442j3089K1720P292O2463j9938
1775A1149j01758K889n764K5552n2982o873P9074O3932L85j924j1366q5473M3200
1762c9959k8938p440j7988J6551j7520l0392J03613L2647l78l379m3792k1354
$$ plain form
1851 -101268 -36169 -14155 -8078 -13835 -76727 -68755 -29757 27079 29935 2223 38764 36846 314
1838 314 -1662 3520 8507 -29183 -108094 -89836 -90388 -23973 -7919 -57944 -50740 -64700 -82050
1825 -82050 -89440 -44151 -37591 -6966 -59980 -63049 2470 -41007 -35246 -73766 -6712 -19 -83932
1812 -83932 -14599 -77030 -73399 -71437 -55723 10884 7222 -20273 -34495 -57267 -33392 -36275 -71953
1799 -71953 -33018 -112523 -99475 -42831 18093 -18427 -389 -71451 -82063 -22320 -55222 -88052
1787 -88052 -81372 -40542 -52669 2534 30599 2143 -47299 -60388 -38668 -31376 31087 11149
1775 11149 -90609 -87720 -93484 -67932 -120914 -127787 -48713 15219 15604 13680 2314 -83159 -39959
1762 -39959 -68897 -76337 -94325 -77774 -95294 -125686 -22073 10574 10196 6817 -36975 -58329
1750e8329p608o501Q0522p9982p411J01025l674M170r148m9175Q434R042J3247
1737e388N536n119J1979n9025Q349j733J1553l05m1820q275J414J0771Q617M2365
1723b1081n8966M2004K5882k9339j0653k0792K5374k2666Q885P855j8629q147
1711h0273Q29J9277J587K3472P3083l0430k3538J7664J1299K3099q909l9737k1906
1698c4483k7270j6756N7327P0307j6906m1124m6644P2131O2009p9137n7514n4080
1686a12140p777N7832n884M9201j3639k3921K081J0544M2322m3605k7340L3940
1674c8386L2819k7752J4485j2386j2049Q565k3046k1831l966K3506J5295L3483
1662a1263k6029l7146K5026l3024K914j2685M6157J32828J5600j9764n0634P240
$$ plain form
1750 -58329 -65937 -72438 8084 -71898 -79309 21716 18042 22212 13064 -36111 -27677 -18635 -5388
1737 -5388 148 -4971 7008 -52017 -43668 -45401 -33848 -34153 -75973 -84248 -82834 -72063 -63446 -21081
1723 -21081 -80047 -38043 -12161 -41500 -52153 -72945 -47571 -70237 -61352 -53497 -72126 -80273
1711 -80273 -79444 -60167 -58580 -35108 37975 7545 -15993 1671 12970 36069 27160 -12577 -34483
1698 -34483 -61753 -78509 -21182 49125 32219 -8905 -55549 16582 78591 -546 -58060 -112140
1686 -112140 -119917 -62085 -67969 -18768 -32407 -56328 -54247 -43703 -1381 -44986 -72326 -38386
1674 -38386 -5567 -33319 -18834 -31220 -43269 -34704 -57750 -79581 -83547 -60041 -44746 -11263
1662 -11263 -37292 -74438 -49412 -82436 -79522 -92207 -46050 86778 102378 82614 31980 39220
1650C9220k3355o1485k44o234L9829L9945k3172J4222j0545j9121J360L2522l8994
1637a6052k4279O9427m9708K6794l3626j12395O2927r058N5143l2303k0218J09164
1625B5816p321m7959m7850n5191p503Q3536L0239M1798l8379o0127O6230N9604
1613D2893J7784n1798n9778M3821m5847J0220l8149J6513k3411j0087L1281M4865
1601b1693l3072k1904P2425J092j9086o8359L9577m2436N0997N3559k7452L1016
1589A4664O2083r283l4219k8592J064k1273P5364J645p8770J7719n8018M2441
1577a5175m7179l3940O1439Q1770n5849J1690L3088p1638n6146K6864N847L4774
1565b4455P4266l4527l9758J5665K7881l2775j695p3800k23J4866m5463Q411K1446
$$ plain form
1650 39220 15865 -45620 -45864 -52098 -12269 27676 4504 18726 8181 -10940 -9580 22942 -16052
1637 -16052 -40331 29096 -20612 6182 -27444 -139839 -76912 -85970 -30827 -63130 -83348 25816
1625 25816 18495 -29464 -77314 -132505 -140008 -56472 -26233 15565 -22814 -82941 -16711 42893
1613 42893 60677 8879 -50899 -7078 -52925 -42705 -80854 -64341 -87752 -97839 -66558 -21693
1601 -21693 -54765 -76669 -4244 -3152 -22238 -90597 -51020 -93456 -42459 11100 -16352 14664
1589 14664 76747 67464 33245 4653 5717 -15556 59808 61453 -17317 402 -57616 -15175
1577 -15175 -62354 -96294 -34855 46915 -8934 2756 35844 -35794 -91940 -65076 -59229 -24455
1565 -24455 49811 15284 -24474 -8809 19072 -13703 -15398 -89198 -89421 -74555 -120018 -111607 -90161
1552i0161k4435J1381P2341n5506J4290K8491n5109K4897j1877l8223O4250M7392
1540a2269l7012p505q14K4690K9157l7254J7077M3863p2966O4409p815l7014J5594
1527a7859j6159L0874k5730k7751j06331Q3253O5933l5103M0791m2526Q321M5201
1515B914j136k163j5354K470l4955k5021J05071M105n9283q9035L311M3117j0982
1502g6941L6248K141L4551k1333J4310P843K8599K1271k6545j6530K8809k4055
1490H368l8033L610k5245K5814k5008k0614O0106K105l3703m0486L0733N6157
1478C804l6109O0395p07k8748P967l7427m9043J4068M1429J0647m9495j6280K7413
1465e2086L5065L543l4118k5697r196K2857O0354N387r5550J0091J6731L9411
$$ plain form
1552 -90161 -114596 -103215 -30874 -86380 -72090 -43599 -98708 -73811 -85688 -123911 -59661 -12269
1540 -12269 -49281 -56786 -57600 -32910 -3753 -41007 -23930 19933 -53033 11376 3561 -33453 -17859
1527 -17859 -34018 -3144 -28874 -56625 -162956 -79703 -13770 -48873 -8082 -50608 -42287 2914
1515 2914 1778 -385 -15739 -13269 -48224 -73245 31826 35931 -23352 -112387 -109076 -65959 -76941
1502 -76941 -40693 -38552 -4001 -25334 -11024 -3181 25418 46689 20144 3614 32423 8368
1490 8368 -29665 -26055 -51300 -25486 -50494 -71108 -11002 -8897 -42600 -83086 -52353 3804
1478 3804 -32305 28090 27383 -1365 6602 -30825 -79868 -65800 -24371 -13724 -63219 -79499 -52086
1465 -52086 -17021 -13478 -47596 -73293 -82489 -59632 722 6109 -89441 -79350 -62619 -23208
1453b3208j6455l1402N903l1283L4929L4599m3919L8596k0600K4229L6907l9746
1441c1450k4069q376O2904K0601L4837m8296L097o6650L389J1863M4861l2045
1429b9334m3845J0446K1813K1449K3583Q892K8829k1873R383l6111p0097p187
1417h4052L1922L5086L9386q790l1478l4508k0428K8089l539L6745O4388j8334
1405C4487j7676j7696J1796k2867j7745K0987r1960L1544J6059O15m990K9988
1393b7458P633M7631m090k9084J6165K054k7331K948k4810K6362K7621o6765L8538
1380a0586o957m1802M3358L7329P622o3554q47M2956m5821l5363r469N4390M1965
1367A3221n7153j6070P7471P8694m7099p9082L2732J7641m6323P843J6139J5549
$$ plain form
1453 -23208 -39663 -71065 -65162 -96445 -61516 -26917 -70836 -32240 -52840 -28611 8296 -31450
1441 -31450 -55519 -63895 -991 19610 54447 6151 9248 -57402 -54013 -42150 2711 -29334
1429 -29334 -73179 -62733 -40920 -19471 4112 13004 41833 19960 29343 -6768 -76865 -84052
1417 -84052 -52130 -17044 22342 13552 -17926 -52434 -72862 -44773 -48312 -11567 52821 34487
1405 34487 16811 -885 10911 -11956 -29701 -8714 -100674 -69130 -53071 -52456 -57446 -27458
1393 -27458 -19825 27806 23716 -5368 10797 12851 -14480 -11532 -36342 -9980 17641 -49124 -10586
1380 -10586 -17543 -59345 -15987 21342 28964 -34590 -35437 7519 -38302 -73665 -83134 -28744 13221
1367 13221 -43932 -60002 17469 96163 49064 -30018 2714 20355 -25968 -18125 -1986 13563
1355A3563o8759j2122J0242j9588j8865N3555J9998R9446p4494k1759R687j9505
1343b8601R91j6788P866M6493l1620k847p563j1905N7772q5854l8875Q5696m1655
1330f6890r0735Q5391O5202J844L6940m2284K853N7748k0803l9226j8482j7491
1318d5933m3933O9949k22l2908N0813j0321r7218k1670N2966M0552j5259L9657
1306a3527K6770l918k6554k6162N4579P3808m3364O29l3781J4718K8156l9169
1294A2185L6243J8002o929o2846n0438M0132M0690R151k4608k9131P254J02710
1282I2415l6733r0879k7044M1257k9991l1293R7952q2390P737R4568n0366q032
1270b2799J4226k3945j366J6956m3640J2213O8380J7525j09606m1975K0340P3247
$$ plain form
1355 13563 -55196 -67318 -57076 -76664 -95529 -41974 -21976 77470 2976 -18783 -9096 -28601
1343 -28601 -27610 -44398 -36532 9961 -21659 -24506 -32069 -43974 13798 -72056 -110931 -25235 -66890
1330 -66890 -157625 -72234 -7032 -5188 31752 -10532 -7679 50069 29266 -9960 -28442 -45933
1318 -45933 -89866 -19917 -20139 -53047 -2234 -12555 -109773 -131443 -78477 -37925 -53184 -13527
1306 -13527 13243 9325 -17229 -43391 11188 84996 41632 42261 8480 23198 51354 12185
1294 12185 48428 66430 59501 -3345 -53783 -13651 27039 36190 11582 -17549 -10295 92415
1282 92415 55682 -35197 -62241 -20984 -50975 -82268 15684 -66706 -58969 35599 -14767 -22799
1270 -22799 -8573 -32518 -33884 -16928 -60568 -48355 20025 37550 -72056 -114031 -93691 -20444
1258b0444m1235j1061J8047L0668r010J0841P5836j9482L9324N655j01872l4589
1246e7322J1481j8469K4020p157L4539j285J3788L1484O212k1841m5285k8564
1234e8399K856N911K0421L6342o9456O1j2595O0126K1962j9367l1961r553J7543
1221c6109n1766P3973k1319K9209o333N2086L1279l2020m521n7744M0903J227
1209A8865N1902m163n7002n1810m2304J4212l8859O1091P5276O529j0854n45o5484
1196d3146J1676L9642J2776L5889L3211k3062o7895m9951j2041N9663r001R663
1184b576j2012L8691j4471l7173M0763m7039P792r0791N589P5485j1239p058O4184
1171A0145J6815o2903o164O055j5976P9935L1804j03015l0943L587j198L8663
$$ plain form
1258 -20444 -61679 -72740 -54693 -24025 -33035 -22194 53642 34160 73484 79139 -22733 -57322
1246 -57322 -45841 -64310 -40290 -47447 -12908 -14193 -405 31079 37291 15450 -29835 -58399
1234 -58399 -55543 -49632 -29211 7131 -62325 -62264 -74859 -14733 7229 -12138 -44099 -53652 -36109
1221 -36109 -87875 -13902 -35221 -6012 -12345 39741 71020 39000 34479 -23265 17638 18865
1209 18865 70767 66604 9602 -42208 -84512 -70300 -109159 -48068 27208 33737 22883 22338 -43146
1196 -43146 -31470 8172 20948 56837 90048 66986 -909 -50860 -62901 -3238 -12239 -2576
1184 -2576 -14588 24103 9632 -27541 13222 -33817 -26025 -116816 -111227 -35742 -46981 -54039 10145
1171 10145 26960 -35943 -42107 -36052 -52028 27907 59711 -43304 -74247 -70660 -71858 -33195
1159c3195j3908q880J10257m8146k0029K7524N7686L3809l5793q281m2264L076
1147B1856N869n2592M478J3794L66l26l9560m0774M7195K6500L7914J0943n0155
1134a4492M0960k0367k3654O186J7880L7885n688q6735L4214j4745j0821M0628
1122A251J2558m6269L3471K7257m6534J135m8561m0493P901P8365j7278m926N6698
1109A4575N1974L8104k0851j0603J5946K8980J6375m6986o1276k2281O874J5443
1097B6274j7604K5782j1007P4926n7030q8557P855Q9042r461l7946k748p002n0770
1084e8246r516O5101L9171K8455q4423l027O5142l3769l9006Q0454k2830k1691
1072E815l6989m3255P3582L4466o5304p358K6392j6516j5932P9470p6509l6219
$$ plain form
1159 -33195 -47103 -55983 54274 6128 -13901 13623 71309 105118 69325 61044 18780 21856
1147 21856 27725 -24867 -20389 -6595 -6229 -6555 -46115 -86889 -39694 -13194 24720 35663 -14492
1134 -14492 26468 6101 -17553 -11367 6513 44398 38710 -48025 -13811 -28556 -39377 1251
1122 1251 13809 -32460 1011 28268 -18266 -17131 -65692 -106185 -98284 -19919 -37197 -42123 14575
1109 14575 66549 104653 83802 73199 89145 118125 134500 87514 26238 3957 10831 26274
1097 26274 8670 34452 23445 98371 41341 -47216 -39361 49681 40220 2274 -474 -7476 -58246
1084 -58246 -67762 -2661 36510 64965 -19458 -22485 42657 8888 -30118 50336 27506 5815
1072 5815 -31174 -74429 -847 33619 -31685 -39043 -12651 -29167 -45099 34371 -42138 -78357
1060g8357R7849j6677j6202J5926o215O577K3296j4851K5777J3935l6717M920
1048A9261j1217n7215l7227N5757K7195J1231J0729k8582o0981O7596N3322m2647
1036G222o942N729o3964L8473m070K4536j9917J0398N2907l484p2976l774R9323
1023F3461l1369j2850l9575L9500O7964K2049r0845o2172L7956K7798N1502j9354
1011E4065o136j1567j3082M3503k3865l4346n5570l5874P6757N0201k970m211
999C6905n3004Q921L7662q905N0063m315m7992j1252k4133j277m8063L946M299
986e7145L7991M8604j5002k7106O331l2872M6217K3353j9463m507Q277J9432l5713
973a603K534N6303j08053l1265M4393M2767j4586k2896l3306R845P6075m1966
$$ plain form
1060 -78357 19492 2815 -13387 2539 -3676 2901 26197 11346 37123 51058 14341 19261
1048 19261 8044 -49171 -86398 -30641 -3446 7785 18514 -10068 -71049 -3453 49869 7222
1036 7222 280 6009 -57955 -19482 -23552 984 -18933 -8535 44372 40888 -32088 -35862 63461
1023 63461 32092 19242 -20333 19167 87131 109180 18335 -43837 -5881 21917 73419 54065
1011 54065 47929 36362 23280 66783 42918 8572 -46998 -82872 -6115 44086 41116 36905
999 36905 -16099 -7178 30484 21579 71642 67327 19335 8083 -16050 -17327 -65390 -61444 -57145
986 -57145 -19154 29450 14448 -12658 -6327 -39199 7018 30371 10908 6401 14678 34110 -1603
973 -1603 931 57234 -50819 -82084 -37691 5076 -9510 -32406 -65712 -55867 20208 -21758
961b1758L0449M0161L955m0283j2613L8118k5029j3934j3548q843O957J5666N0545
948D9843o5042N7746O5429p1399k1876O7734k3549l9972l0251K7132k3198O8984
936F1581q7870J8509L2861o3327J632J6262K0850j36j358k0937M0312P4635k0541
923G2473k4961n1478k4532Q7330L9202l0155k2114K3830K897q5888M9056j3261
911B2399k6689N6042Q618n0327o8666N9514j8069Q1945K518j5113j08324P7345
899B1193O9566n5751p6863O4102n7037j2157J2332K8086P6985n0009l3090K6644
887A4001k3160Q102K4512r289P217M80l6869K7995M7530j03777L4029K8552N1691
874G1014r51k7497p3164l1576R1054j6115N2410l2664k7742O542m4406o4351j7600
$$ plain form
961 -21758 8691 48852 52807 12524 -89 38029 13000 -934 -14482 -23325 -16368 -702 49843
948 49843 -15199 42547 107976 36577 14701 82435 58886 18914 -11337 15795 -7403 61581
936 61581 -26289 -7780 25081 -38246 -36614 -20352 498 362 -996 -21933 18379 93014 72473
923 72473 47512 -3966 -28498 58832 98034 67879 45765 69595 72492 -13396 35660 22399
911 22399 -4290 51752 60370 10043 -58623 891 -17178 64767 67285 52172 -56152 21193
899 21193 90759 35008 -41855 22247 -34790 -46947 -34615 -6529 70456 20447 -12643 14001
887 14001 -9159 -1057 23455 14166 21383 21863 -15006 12989 60519 -43258 -9229 19323 71014
874 71014 70063 42566 -30598 -62174 28880 12765 65175 32511 4769 11311 -33095 -97446 -115046
861a15046R2242j871p296J7859K2350K2864m0449j1145m5816O3526O3059j2309
849D7968n85l6736M4762q464k4787l2378K9125J0234p9786J4208O384L9477M3350
836E2772k3413j2201l2749L3615k1534m622K1691J0408j953K5243j7542j7312
824A2403l2064o3620J0744K7232j6740j0402Q7637Q5244m2084k0079R098q0317
812c2948N4350O442j5868J9919j443j5864j2010J704J4862l250J2038J2646o1404
799b0826j8549n543l208N7122m7673O4464L0396n3342N2165j4892p3794N4320
787B0640L8338q7075j2586J099j2133k1270L4950Q6495n5058M414K8957j0691
775A6080N766j8182L9708l9727L2892n1202K4270L2810K9952k2751j0931k9481
$$ plain form
861 -115046 -22804 -24675 -31971 -14112 8238 31102 -9347 -20492 -66308 -2782 60277 47968
849 47968 47383 10647 55409 46945 22158 -10220 18905 29139 -50647 -36439 -30055 9422 52772
836 52772 29359 17158 -15591 18024 -3510 -8132 13559 23967 22014 47257 29715 12403
824 12403 -19661 -83281 -72537 -45305 -62045 -72447 15190 100434 58350 38271 47369 -32948
812 -32948 21402 27844 11976 31895 30452 14588 2578 4282 19144 15894 27932 40578 -20826
799 -20826 -39375 -44918 -48126 8996 -38677 25787 56183 2841 55006 40114 -33680 20640
787 20640 58978 -28097 -40683 -39584 -51717 -72987 -38037 48458 -6600 -2186 26771 16080
775 16080 21846 3664 43372 3645 36537 -14665 9605 42415 72367 49616 38685 9204
763I204P830k2640k2659K532L3430L3799j5407k4977Q4377P355j2163m2043n7072
750a8434l6765L3672L9099M8250k2002k1850o8874R0312O0682K2776j491r6761
738B8614j1451o9430N3563P3202r178K215L252q3467O2223m482k5992m3697M5345
725B0717j1916m7827k4541l592N4721Q565R994L4429k5258n6294k1625L3695O2589
712C3657J5972j2355M0580q1880o2446q057R0129L0104m8901J6886K2408J0774
700D6871k1733o6040j5772L4646N4345N3472k8417j0748l0466j4738j3322m2460
688e4362N2125N9077o6649q765L4228j1188k359l93O7011j8678P202j1263l0830
675A5156M542r470k3222N1212k5122k2738p353J9288J5938K0049J435L5120o3387
$$ plain form
763 9204 17034 -5606 -28265 -25733 7697 41496 26089 1112 85489 92844 80681 38638 -18434
750 -18434 -55199 -21527 17572 65822 43820 21970 -46904 43408 104090 126866 125375 28614
738 28614 17163 -52267 1296 74498 65320 67535 70787 -12680 49543 45061 19069 -24628 20717
725 20717 8801 -39026 -63567 -67159 -12438 -3873 6121 40550 15292 -41002 -62627 -28932 33657
712 33657 49629 37274 77854 -4026 -66472 -74529 15600 45704 -3197 13689 36097 46871
700 46871 25138 -40902 -56674 -22028 32317 85789 57372 46624 16158 1420 -11902 -54362
688 -54362 -2237 56840 -9809 -18574 15654 4466 2107 1714 68725 50047 57249 45986 15156
675 15156 19698 10228 -12994 38218 13096 -9642 -16995 2293 18231 38280 39715 74835 11448
662A1448m3143N1471L780M850n0223n8675Q8053L8136k3055P165O7192l7785j07561
649d8347N9037J3891M4336k3421L58k7501N004K4012m087L2465j4688m5283K8454
636D4230j4867k5823L3611k8737j7034l4899K6007L6667J6305K1212k6247k2784
624G641J7756j1198m7863J3201O7186O0020j6462j6926o17n7652j3625L3461J5173
611E0095M206K3022l088R969n1131k7292p6061l822J81831r1909j6405J31650
599A31065j26736m1852M8704n1757L482N1435L5448o0902o556j5504L2018j2469
587a3624n0997M1542N2226L1772K0748o633j3421o383n5306L1459L5591j3239
575E3735J5408n686M46n5659k8026m2695K6106j4797L5790K9841J3673l9814J10
$$ plain form
662 11448 -31695 19776 23556 28406 -21817 -80492 7561 45697 22642 29807 96999 59214 -48347
649 -48347 10690 24581 68917 45496 45854 18353 23357 47369 43282 75747 61059 15776 44230
636 44230 29363 3540 37151 8414 -8620 -43519 -17512 19155 35460 56672 30425 7641
624 7641 25397 14199 -33664 -20463 46723 106743 90281 73355 72738 15086 1461 34922 50095
611 50095 54301 77323 74235 84204 33073 5781 -70280 -74102 107729 15820 -585 131065
599 131065 4329 -37523 11181 -40576 -37094 14341 49789 -11113 -17669 -33173 -1155 -13624
587 -13624 -64621 -23079 29147 60919 81667 75034 61613 55230 -76 31383 66974 53735
575 53735 69143 63457 63903 8244 -19782 -62477 -36371 -51168 -15378 14463 28136 -11678 -11568
562a1568L8532m3569L2583L3608o8473l3514J16039k4237l1812j2329j250m1495
550d7485R933R0476K4035l2020k4037P4303l8151n998r5401N3014L0107K8485
538F7261L71L6049l4057n5301l4878J3535P8755k0248K223l4480R501K2371m612
525D6490k7577N9737m5589M1959j3444q8381O9460k8223m8476L1203R805k8217
513b1253j9491M7129J4498J6112K211k1037K544k5510n4207M0249L4262J2938
501B8445O8466j5366k7632n4614p1761Q7487J01198N290l7388K7189L2706p4601
489F9419j0106j08705j4238J14860j8397L3284m0383n9215r520k9582O0470J6833
477D720k0595L8351r215N6643j3526R170m0938P927l9831m8725O5507P1303k5675
$$ plain form
562 -11568 26964 -16605 15978 49586 -18887 -52401 63638 39401 7589 -4740 -5990 -47485
550 -47485 -37552 52924 76959 44939 20902 95205 57054 51056 -44345 8669 38776 67261
538 67261 67632 103681 69624 14323 -20555 -7020 71735 51487 53710 19230 28731 51102 46490
525 46490 18913 78650 33061 75020 61576 -26805 42655 14432 -34044 -2841 6964 -21253
513 -21253 -40744 6385 20883 36995 39206 18169 20713 -4797 -59004 -18755 15507 28445
501 28445 96911 81545 53913 -701 -72462 15025 116223 121513 84125 111314 144020 69419
489 69419 59313 -49392 -63630 51230 32833 66117 25734 -33481 -43001 -72583 -12113 4720
477 4720 -15875 22476 13261 69904 56378 65548 24610 32537 -7294 -56019 9488 80791 55116
464E5116p518m9365J3541P0426L7401o604j46464L5967J279J7946K2791l4154
452A0362J2767j7039L8905o85q3479k9514N4788j7999L0432N5109m806p5829J3522
439a3466N4446J3326r0035q458N4292M6023q041j7293L7383m7906M560K8783J9373
426G2987M86M5834k7634m9896k657k5572J8377K143J06800l0395k8111j5619q6900
413b0157K3526O4233O3644J6149q7575J0197k4285K8896k3016J0910R651k7934
401D4239j3357q14R898L3287M2111l9386o0605k0029N6082n84K4647l1846J6784
388F0427K2483p6076q7153N1330O115N5734P4031Q142o7158k354J8585N9399o2661
375F0844j5128o1565o23L2716J5001r3841O9989N7568m5274k8486J5185K9961
$$ plain form
464 55116 47598 -1767 11774 82200 119601 112997 -33467 2500 3779 21725 44516 10362
452 10362 23129 6090 44995 44310 -39169 -68683 -13895 -31894 -1462 53647 48841 -26988 -13466
439 -13466 40980 54306 -35729 -44187 10105 56128 48087 30794 68177 20271 24831 53614 72987
426 72987 73473 119307 91673 41777 39120 13548 31925 34068 140868 110473 82362 66743 -20157
413 -20157 3369 67602 131246 147395 59820 70017 45732 74628 51612 62522 72173 44239
401 44239 30882 30068 39966 73253 115364 75978 15373 -4656 51426 50842 75489 43643 60427
388 60427 82910 6834 -80319 -28989 -22874 32860 106891 115033 47875 45521 64106 123505 60844
375 60844 45716 -15849 -16472 16244 31245 -62596 7393 64961 19687 -8799 6386 36347
363C6347j5339J8921m1866Q2475k6593J9651m3718l334R712o8143K4651R1752
351H4516j4107o9783M4513J0008M6958j02794K7787N0722q1321l500Q2877k0344
339E5532k0524k1527M7246L618L907j0999q324l099M7908N154q5025R390p63L3049
$$ plain form
363 36347 21008 39929 -1937 80538 53945 73596 29878 26544 36256 -31887 -7236 84516
351 84516 70409 626 45139 55147 102105 -689 27098 77820 -3501 -7001 75876 55532
339 55532 35008 13481 60727 64345 68252 57253 48929 45830 93738 98892 13867 23257 22494 55543
$$ [...]
##END NTUPLES=NMR SPECTRUM
##END=
