##TITLE=1H_CG-1204
 CDCl3
 8 sc, 
 5.6.2024
##JCAMPDX= 6.0         $$ Bruker NMR JCAMP-DX V2.0
##DATA TYPE= NMR SPECTRUM
##DATA CLASS= NTUPLES
##ORIGIN= UXNMR, Bruker Analytische Messtechnik GmbH
##OWNER= root
$$ XWIN-NMR		Version 3.5
$$ Wed Jun  5 13:56:54 2024 Russian Standard Time (UT+4h)  she@DPX200
##.OBSERVE FREQUENCY= 200.1309
##.OBSERVE NUCLEUS= ^1H
##.ACQUISITION MODE= SIMULTANEOUS
##.ACQUISITION SCHEME= undefined
##.AVERAGES= 8
##.DIGITISER RES= 18
##SPECTROMETER/DATA SYSTEM= spect
##.PULSE SEQUENCE= zg30
##.SOLVENT NAME= CDCl3
##.SHIFT REFERENCE= (INTERNAL, CDCl3, 0, 15.9673)
##AUDIT TRAIL= $$ (NUMBER, WHEN, WHO, WHERE, WHAT)
$$ ##TITLE= Audit trail, XWIN-NMR		Version 3.5
$$ ##JCAMPDX= 5.01
$$ ##ORIGIN= Bruker BioSpin GmbH
$$ ##OWNER= she
$$ F:/spectra/data/she/nmr/H-F/1/pdata/1/auditp.txt
$$ ##AUDIT TRAIL=  $$ (NUMBER, WHEN, WHO, WHERE, WHAT)
(   1,<2024-06-05 13:55:31.39 +0400>,<she>,<DPX200>,
      <created by zg, POWCHK disabled, PULCHK disabled
       configuration hash MD5:
       00 E9 B6 7A A2 85 ED C7 34 08 36 98 17 FE 4E 26
       data hash MD5: 16K
       49 20 61 BF 19 8D B9 99 F9 4D 56 66 E1 49 9B D6>)
(   2,<2024-06-05 13:55:45.98 +0400>,<she>,<DPX200>,
      <Start of raw data processing
       efp BC_mod = 2 LB = 0.24 FT_mod = 6 PKNL = 1 PHC0 = -25318.26 PHC1 = 17.78748 SI = 16K 
       data hash MD5: 16K
       A7 1E 0B 41 A7 10 00 9C 4D 28 EF 2A BD B4 3B 5A>)
(   3,<2024-06-05 13:56:04.73 +0400>,<she>,<DPX200>,
      <pk PHC0 = 8.492185 PHC1 = -12.2 
       data hash MD5: 16K
       AD AA 52 BB 80 E0 81 84 48 5F 21 0B 0B 31 C2 10>)
(   4,<2024-06-05 13:56:07.78 +0400>,<she>,<DPX200>,
      <abs ABSG = 5 
       data hash MD5: 16K
       95 D6 47 AC 32 79 A7 E9 BD BF E3 AC 79 45 80 2F>)
$$ ##END=
$$ 
$$ hash MD5
$$ 25 E3 A8 8A 4F 7B BE 86 4B 72 C7 93 ED FC D2 9B
##$RELAX= 
##$RELAX= 
##$RELAX= 
##$RELAX= 
##$RELAX= 
##$RELAX= 
$$ Bruker specific parameters
$$ --------------------------
##$DU= <F:/spectra>
##$EXPNO= 1
##$NAME= <H-F>
##$PROCNO= 1
##$TYPE= <nmr>
##$USER= <she>
##$AMP= (0..31)
100 100 100 100 100 100 100 100 100 100 100 100 100 100 100 100 100 100 
100 100 100 100 100 100 100 100 100 100 100 100 100 100 
##$AQSEQ= 0
##$AQ_mod= 1
##$AUNM= <au_zg>
##$AUTOPOS= <>
##$BF1= 200.13
##$BF2= 200.13
##$BF3= 200.13
##$BF4= 200.13
##$BF5= 200.13
##$BF6= 200.13
##$BF7= 200.13
##$BF8= 200.13
##$BYTORDA= 1
##$CFDGTYP= 0
##$CFRGTYP= 5
##$CHEMSTR= <none>
##$CNST= (0..31)
1 1 145 1 1 1 1 1 1 1 1 1 1 1 1 1 1 1 1 1 1 1 1 1 1 1 1 1 1 1 1 1 
##$CPDPRG= <>
##$CPDPRG1= <>
##$CPDPRG2= <>
##$CPDPRG3= <>
##$CPDPRG4= <mlev>
##$CPDPRG5= <mlev>
##$CPDPRG6= <mlev>
##$CPDPRG7= <mlev>
##$CPDPRG8= <mlev>
##$CPDPRGB= <>
##$CPDPRGT= <>
##$D= (0..31)
0 1.2 0 0 0 0 0 0 0 0.06 0 0.03 0 0 0 0 0.0002 0 0 0 0 0 0 0 0 0 0 0 0 
0 0 0 
##$DATE= 1717581331
##$DBL= (0..7)
120 120 120 120 120 120 120 120 
##$DBP= (0..7)
150 150 150 150 150 150 150 150 
##$DBP07= 0
##$DBPNAM0= <>
##$DBPNAM1= <>
##$DBPNAM2= <>
##$DBPNAM3= <>
##$DBPNAM4= <>
##$DBPNAM5= <>
$$ [...]
##$SUBNAM3= <"">
##$SUBNAM4= <"">
##$SUBNAM5= <"">
##$SUBNAM6= <"">
##$SUBNAM7= <"">
##$SUBNAM8= <"">
##$SUBNAM9= <"">
##$SW= 18.0517689322627
##$SWIBOX= (0..15)
0 0 2 0 0 0 0 0 0 0 0 0 0 0 0 0 
##$SW_h= 3612.71676300578
##$TD= 16384
##$TD0= 1
##$TE= 0
##$TE2= 300
##$TE3= 300
##$TEG= 300
##$TL= (0..7)
0 120 120 120 120 120 120 120 
##$TP= (0..7)
150 150 150 150 150 150 150 150 
##$TP07= 0
##$TPNAME0= <>
##$TPNAME1= <>
##$TPNAME2= <>
##$TPNAME3= <>
##$TPNAME4= <>
##$TPNAME5= <>
##$TPNAME6= <>
##$TPNAME7= <>
##$TPOAL= (0..7)
0.5 0.5 0.5 0.5 0.5 0.5 0.5 0.5 
##$TPOFFS= (0..7)
0 0 0 0 0 0 0 0 
##$TUNHIN= 0
##$TUNHOUT= 0
##$TUNXOUT= 0
##$USERA1= <user>
##$USERA2= <user>
##$USERA3= <user>
##$USERA4= <user>
##$USERA5= <user>
##$V9= 5
##$VALIST= <valist>
##$VCLIST= <CCCCCCCCCCCCCCC>
##$VD= 0
##$VDLIST= <DDDDDDDDDDDDDDD>
##$VPLIST= <PPPPPPPPPPPPPPP>
##$VTLIST= <TTTTTTTTTTTTTTT>
##$WBST= 1024
##$WBSW= 4
##$XGAIN= (0..3)
0 0 0 0 
##$XL= 0
##$YL= 0
##$YMAX_a= 532648
##$YMIN_a= -710663
##$ZGOPTNS= <>
##$ZL1= 120
##$ZL2= 120
##$ZL3= 120
##$ZL4= 120
##$ABSF1= 16.00475
##$ABSF2= -2.047146
##$ABSG= 5
##$ABSL= 3
##$ALPHA= 0
##$AQORDER= 0
##$ASSFAC= 0
##$ASSFACI= 0
##$ASSFACX= 0
##$ASSWID= 0
##$AUNMP= <proc_1d>
##$AZFE= 0.1
##$AZFW= 0.1
##$BCFW= 0
##$BC_mod= 2
##$BYTORDP= 0
##$COROFFS= 0
##$CY= -3
##$DATMOD= 1
##$DC= 0
##$DFILT= <>
##$DTYPP= 0
##$F1P= 0
##$F2P= 0
##$FCOR= 1
##$FTSIZE= 16384
##$FT_mod= 6
##$GAMMA= 0
##$GB= 0
##$INTBC= 1
##$INTSCL= 3.70164e-10
##$ISEN= 128
##$LB= 0.24
##$LEV0= 0
##$LPBIN= 0
##$MAXI= 10000
##$MC2= 0
##$MEAN= 0
##$ME_mod= 0
##$MI= 1.114404
##$NCOEF= 0
##$NC_proc= -5
##$NLEV= 6
##$NOISF1= 3.799351
##$NOISF2= 2.8
##$NSP= 0
##$NTH_PI= 0
##$NZP= 0
##$OFFSET= 15.96729
##$PC= 1
##$PHC0= -25309.77
##$PHC1= 5.58748
##$PH_mod= 1
##$PKNL= yes
##$PPARMOD= 0
##$PSCAL= 0
##$PSIGN= 0
##$REVERSE= no
##$SF= 200.129510832288
##$SI= 16384
##$SIGF1= 3
##$SIGF2= 2
##$SINO= 5.538805
##$SIOLD= 16384
##$SREGLST= <1H.CDCl3>
##$SSB= 0
##$STSI= 16384
##$STSR= 0
##$SW_p= 3612.71676300577
##$SYMM= 0
##$S_DEV= 0
##$TDeff= 16384
##$TDoff= 0
##$TI= <>
##$TILT= no
##$TM1= 0
##$TM2= 0
##$TOPLEV= 0
##$USERP1= <user>
##$USERP2= <user>
##$USERP3= <user>
##$USERP4= <user>
##$USERP5= <user>
##$WDW= 1
##$XDIM= 16384
##$YMAX_p= 340718034
##$YMIN_p= -303933
$$ End of Bruker specific parameters
$$ ---------------------------------
##NTUPLES= NMR SPECTRUM
##VAR_NAME=  FREQUENCY,     SPECTRUM/REAL,   SPECTRUM/IMAG
##SYMBOL=    X,             R,               I
##VAR_TYPE=  INDEPENDENT,   DEPENDENT,       DEPENDENT
##VAR_FORM=  AFFN,          ASDF,            ASDF
##VAR_DIM=   16384,         16384,           16384
##UNITS=     HZ,            ARBITRARY UNITS, ARBITRARY UNITS
##FACTOR=    0.220516191357247, 1,           1
##FIRST=     3195.52592193184, 0,            0
##LAST=      -417.190841073932, 0,           0
##MIN=       -417.190841073932, -303933,     0
##MAX=       3195.52592193184, 340718034,    0
$$ Real data points
##PAGE= N=1
##DATA TABLE= (X++(R..R)), XYDATA
$$ [...]
10132 -105048 -140286 -31201 -82586 -61699 -34277 -38616 -64332 -72312 -88873 -50109 -105024 -63553
10120 -63553 -2219 -22187 -8639 -81630 -168421 -106282 -9915 -23106 44118 6948 -3675 -78472
10108 -78472 -61370 -149363 -63469 -7682 -73974 -100463 -29327 -79741 -131968 -79525 -37127 -57571
10096 -57571 -102968 -102222 -171144 -140981 -46370 -60196 -68667 -103193 -118835 -123747 -51663 -22878
10084 -22878 -69908 -125470 -124268 -46091 -41486 -50061 -99679 -149540 -98932 -35527 -33744 -105715
10072 -105715 -68188 -107005 -137612 17277 -5951 18848 29617 6262 -97505 -56110 26947
10061 26947 -21766 -17666 -53951 -101056 -33623 15077 -34089 -35495 -14218 -25893 -44813 -50747
10049 -50747 -56534 -68563 -41517 -41992 -43694 -61896 -78615 -83009 -139792 -155554 -195911 -187867 -141496
10036 -141496 -53484 -55119 -44363 -34790 906 870 -111861 -107426 -62256 -74776 -101418 -45193
10024 -45193 -113111 -102302 -94369 -41749 -67854 -52823 -50619 50165 18919 -69652 -23562 -77140
10012 -77140 11033 32221 5680 -83371 -77586 -67042 -38360 -117745 -137367 -90691 -31716 4729
10000 4729 -41346 -77314 -3080 -62180 -89870 -36183 -47710 -122095 -128793 -68743 -18147 -52906
9988 -52906 -57516 4516 -30926 -18955 -83458 -61086 -15562 -15413 -14359 -69190 -82145 -40064 -5722
9975 -5722 -30621 -30279 13577 38459 34455 18336 -38965 -104646 -101410 -65081 -6019 -59524 -124373
9962 -124373 -71530 -6063 -44724 1159 93734 65005 -21939 -26948 -64435 -74495 -110514 -111808
9950 -111808 -109927 -32182 -82399 -72026 4823 -71282 -24056 -75503 -30956 -12899 -33510 21196
9938 21196 -115629 -118072 -41578 9922 -40239 3964 20689 -76742 -84957 -59097 -46110 13053
9926 13053 -22549 -69712 -29875 -29118 -36954 -71862 -104587 -44659 -70717 -111792 -129338 -77038
9914 -77038 -21387 -62580 -143269 -79568 -97578 -131502 -91681 -114923 -63944 -56085 -6501 -78599
9902 -78599 -70626 -127691 -34366 -55679 -76278 -36874 -50423 -64874 -74362 -95002 -10123 -18787
9890 -18787 -47946 -43758 -59512 -79506 -101492 -80739 -102687 -121530 -63440 -22575 26614 -21328
9878 -21328 -40505 -51172 -65919 -47910 -82386 -69272 2327 10259 30305 21234 55615 72426
9866 72426 2869 -81052 -122704 -129313 -209892 -168175 -80854 -75847 -65390 6132 -15717 -73955
9854 -73955 -95752 -1477 -71051 -89732 -77913 -74167 -83103 -41068 -10128 28539 -51098 -138054
9842 -138054 -83846 -23949 -75183 -91937 -59307 -126822 -190830 -131318 -90717 -108879 -93310 -89254
9830 -89254 -27764 -69887 -87785 -162321 -143354 -154879 -157773 -73887 -20134 -16284 -36121 -63896
9818 -63896 -99791 -75114 -82578 -30181 -47726 -86534 -32708 34351 -21668 -131334 -267610 -177383
9806 -177383 -115966 -94723 -50319 -7586 -72217 -78252 -41142 -15060 18419 -5074 -14933 1837
9794 1837 -11971 71564 77176 25540 -22943 -92215 -75277 -80834 -86718 -58652 -41883 -66167 -20864
9781 -20864 -33663 -34055 -75845 -43798 -60225 -29047 -150250 -49732 70343 -13923 -35401 -14575
9769 -14575 -54023 -112517 -6435 56043 -8956 -84188 -118065 -110710 -127971 -113480 -52682 3295
9757 3295 -76234 -86605 -41156 -40186 -58965 -5500 131164 62900 5642 38149 29497 33894 97195
9744 97195 92571 68195 18522 4533 -57032 -58188 -65032 2626 -27317 -50738 42408 61486
9732 61486 731 -57258 -74336 -44886 43 -97131 -49741 67565 20505 27359 -14909 -7403
9720 -7403 34553 -75228 313 102566 66965 64267 -22051 -35931 -26478 880 -37537 -86375
9708 -86375 -57982 -83456 -35316 55313 58410 -14840 -62022 5924 -28091 -17323 -47324 -98687
9696 -98687 18037 8196 -59646 -34582 -81483 -86146 11869 -9437 -16130 -22676 -1031 -72332
9684 -72332 -14759 -1492 27255 -21366 -65702 -23945 5754 -74893 -28034 12711 4175 -16904
9672 -16904 -20590 24189 92294 98917 -6692 38409 33380 35176 -43589 -91408 -38849 -54477
9660 -54477 98014 80464 -11000 -25743 16989 -25869 18678 16098 -31203 60830 77318 121842
9648 121842 110459 72293 22849 20711 137274 101149 14557 45700 32200 66199 69268 115829
9636 115829 135205 107340 128239 134475 113566 213667 132074 88159 110346 63576 67130 123830
9624 123830 167226 140379 182506 173357 103275 189954 244596 180980 61170 151123 103829 114853
9612 114853 176098 320347 371016 317354 333887 338958 370632 378440 412834 333692 390568 383829
9600 383829 373656 378156 346007 370442 373573 334575 309999 294621 210552 182642 211917 245882
9588 245882 199126 173789 164984 158254 139022 63400 72742 134538 102871 72889 114480 76749
9576 76749 73790 106171 72690 107856 118622 62885 141074 131495 81063 84396 162979 128597
9564 128597 42515 51830 71798 43234 79381 65047 31326 37357 57542 84241 53219 49510
9552 49510 96339 193956 149205 162516 139512 39554 70736 159684 129239 94312 84035 103962
9540 103962 122128 189455 214309 168829 114874 134905 164372 149131 129680 84646 93311 160423
9528 160423 169833 115711 128128 137643 134686 201304 136004 97021 148111 149045 168753 159671 176646
9515 176646 202828 137672 128953 104280 74468 82412 153352 106416 89137 132448 184455 193596
9503 193596 117645 219377 217614 231444 265451 228784 128349 136405 146566 133800 154023 152316
9491 152316 206688 198023 198377 192456 134458 130143 95132 100523 144560 185401 210077 264018 174995
9478 174995 174170 166344 202272 212701 199593 127392 171842 237495 232487 274884 313011 239378
9466 239378 196610 153305 159714 187081 239620 258406 295284 260874 247476 151799 221200 232689
9454 232689 125535 191097 221748 268601 316821 294365 271517 271810 222854 190938 142344 155317
9442 155317 184781 191710 93868 158136 229706 251064 245458 224468 198067 290242 299736 264375
9430 264375 237140 335617 265517 275696 266180 196363 193723 305060 240814 282572 307694 216176
9418 216176 235040 214854 233296 186461 139353 220348 285617 229672 265280 247587 251603 294217
9406 294217 369307 333836 302972 291852 315443 305461 203825 293748 328914 306995 306615 282169
9394 282169 224182 212557 288435 360538 303587 308104 319487 345584 372162 314169 275491 387647
9382 387647 366369 348653 375526 407524 473252 490974 470228 386750 376843 374919 380103 316890
9370 316890 474671 498856 439802 453078 453337 444504 419644 304885 338953 392016 351351 372285
9358 372285 380125 509768 453154 377971 441891 425923 399782 417995 383835 458393 459981 488705
9346 488705 613296 509426 485213 506845 448037 485269 526436 549882 578620 541219 623900
9335 623900 628601 594343 678045 659077 566060 612214 653529 701734 717026 670097 696645 692228
9323 692228 758859 769343 703674 731607 753378 737327 771041 744698 831922 833001 729277 797359
9311 797359 868448 903840 849547 779306 735329 783939 799066 817104 936925 944658 859061 913273
9299 913273 957449 997829 1069324 1037395 1048666 1098171 1101721 1064880 1083803 1168908 1221699 1222995
9287 1222995 1309764 1387710 1311196 1314829 1287311 1295793 1293671 1263587 1415980 1444829 1411925 1522458
9275 1522458 1543317 1563512 1601102 1628933 1711323 1753321 1740856 1798200 1902666 1938603 1930254
9264 1930254 1902680 2041509 2160773 2252286 2306492 2366323 2448617 2561583 2653985 2718913 2778949
9253 2778949 2916849 2959132 3063194 3191265 3265565 3369754 3432458 3496684 3485982 3549312 3596267
9242 3596267 3694443 3719944 3722710 3728383 3839407 3894799 3937488 4034069 4160943 4263576 4323324
9231 4323324 4366232 4400590 4507381 4540810 4573058 4668467 4811717 5010329 5145791 5314716
9221 5314716 5451021 5585028 5702925 5820698 5940886 6091841 6223454 6432718 6512777 6713876
9211 6713876 6937755 7085981 7318009 7595883 7759160 7975939 8269303 8451373 8715118 8964154
9201 8964154 9322335 9639138 9990557 10410944 10788145 11246799 11706783 12155672 12688801 13304640
9191 13304640 14020619 14757360 15698410 16666457 17669418 18830893 20133166 21422335 22951715
9182 22951715 24649347 26549989 28612039 30805517 33235299 35906429 38779446 41860244
9174 41860244 45014442 48121438 51048288 53571018 55624114 57023259 57523699 57111453
9166 57111453 55741530 53478865 50643810 47332003 43798152 40104773 36525122 33135797
9158 33135797 30130753 27374132 24845739 22831466 20950015 19205032 17741340 16521715
9150 16521715 15359645 14365053 13534423 12711593 11954306 11253197 10623414 10062077 9517290
9141 9517290 9115809 8668099 8139115 7751100 7444402 7154588 6886822 6582607 6337913 6125982
9131 6125982 5853234 5641163 5447238 5179981 4999493 4723408 4580732 4401846 4208668 4071440
9121 4071440 3995485 3878231 3730625 3517612 3458956 3454062 3345858 3239238 3076373 3004641
9111 3004641 3009470 2948147 2856263 2792377 2743163 2665663 2484871 2453919 2379147 2313847 2218082
9100 2218082 2148572 2129073 2096594 2026932 2032923 2021914 1905460 1980487 1963799 1805425 1720196
9089 1720196 1675837 1736781 1717825 1740647 1600546 1486636 1520573 1567536 1558809 1489899 1483217
9078 1483217 1482655 1486668 1484223 1411857 1348830 1377049 1405817 1306709 1298739 1299401 1278410 1271733 1184461
9065 1184461 1234893 1230553 1134775 1043978 1072285 1076201 1035917 1053579 1015061 1067259 1040000 989206
9053 989206 885499 947357 937262 918823 910664 882752 870906 838172 764287 721716 755462 716947
9041 716947 747064 821446 807718 828205 780025 751805 824599 799105 824804 837084 862889 818549
9029 818549 753731 690300 667990 693706 668628 640277 661889 668237 683518 751043 735539 727198
9017 727198 654901 675067 703932 705549 690573 659361 649291 710798 739308 719381 724340 703077
9005 703077 637010 632803 668965 667617 609097 616547 704111 674332 766177 649804 689361 715846
8993 715846 676985 688906 709618 795024 781171 760303 716281 716066 728341 700962 734291 767432
8981 767432 795406 861559 840661 806401 752899 686125 657645 640312 711217 703398 680017 670786
8969 670786 620128 643389 643583 675027 704254 717038 672740 734500 764936 694848 675945 796326
8957 796326 791781 712000 721434 695747 661676 646263 654784 648335 636988 592155 622473 630022 654731
8944 654731 758045 803855 770978 717721 708618 706212 670636 687766 627111 667135 638360 624178
8932 624178 611771 668164 667156 736349 689163 703018 713127 745923 735712 676301 680542 681977
8920 681977 655561 573131 529801 586087 621252 652174 705615 679930 614345 576528 616891 633005
8908 633005 621548 614603 669619 663075 652149 649921 661618 659202 608192 631586 647547 714867
8896 714867 789544 755841 779653 824444 826577 768558 711604 733117 828888 791828 820602 802090
8884 802090 828150 820356 838019 857314 784409 810722 853086 818681 778356 736004 691552 651262
8872 651262 699208 799048 841343 795907 799407 840354 886644 856491 813665 813735 825093 793305
8860 793305 925575 1017331 992307 980976 902678 883952 879862 872578 896314 910020 904729 840375
8848 840375 848298 835333 818691 789711 784527 713688 724981 754374 729730 810078 819293 809598
8836 809598 819723 752736 713078 704080 682390 716127 754456 802422 685832 675795 670178 707582
8824 707582 740556 674931 704552 692586 666959 621000 625405 713022 686528 653479 766088 718613
8812 718613 731530 710349 746449 694510 768326 749581 686245 710649 703851 716057 757946 785871
8800 785871 751334 712352 679267 663539 595891 647761 728444 723373 675563 666613 604865 680159
8788 680159 781262 784780 808914 835128 791411 771965 735958 764240 787650 892561 925835
8777 925835 826211 810242 802340 797728 772856 754025 794510 715259 754455 767656 786665 737853
8765 737853 681724 770619 788818 899681 986347 944004 984715 928442 894767 866968 847020
8754 847020 798635 936506 1043995 1093500 1075336 1084511 1023224 944253 945153 889256 896794 978965
8742 978965 1011714 1080536 1069977 1065763 1225122 1209810 1175867 1261026 1289714 1273310 1262539 1289305
8730 1289305 1296411 1274370 1268309 1277690 1233486 1229530 1341916 1413747 1370419 1257020 1225921 1186415
8718 1186415 1230647 1264865 1314676 1165027 1054064 1119058 1190284 1236507 1265237 1229546 1270807
8707 1270807 1292855 1254721 1249593 1281045 1378654 1394556 1349988 1312662 1397877 1450214 1450234 1385949
8695 1385949 1336299 1348654 1411450 1503598 1517659 1487491 1484132 1537655 1576122 1631286 1665824 1713778
8683 1713778 1726176 1736772 1787031 1825524 1756519 1706248 1715789 1701358 1761477 1813926 1795203 1854117
8671 1854117 1926857 1936028 1904045 1889037 1949828 1944506 2013387 2089413 2077224 2117845 2145462 2184589
8659 2184589 2277609 2276098 2311611 2469408 2517982 2572258 2607479 2754969 2820530 2811013 2817547 2959508
8647 2959508 3148298 3294798 3417843 3546035 3708810 3931967 4131281 4350518 4487208 4567748
8637 4567748 4756252 4837035 4818110 4757759 4789659 4705912 4631767 4566228 4440057 4334419 4341680
8626 4341680 4267710 4036554 3874891 3792336 3776094 3719368 3723708 3676204 3730851 3779099 3756200
8615 3756200 3809905 3960154 4101638 4203910 4382253 4470629 4802620 5182297 5351826 5462958
8605 5462958 5639922 5827805 6004851 6024728 5973835 6020757 5966641 5964594 5805351 5592535 5527207
8594 5527207 5346348 5053675 4797085 4541703 4389256 4256095 4112563 3972603 3883518 3792052
8584 3792052 3752907 3696195 3625362 3673811 3594715 3520362 3579758 3479073 3558863 3702213 3607964
8573 3607964 3518825 3471217 3453101 3382459 3366803 3339150 3388309 3394336 3483567 3513438 3479583 3433070
8561 3433070 3362771 3425268 3400598 3460503 3530593 3663251 3657750 3720066 3738763 3775597 3806331
8550 3806331 3954810 4131461 4207907 4294428 4273055 4400674 4516388 4680625 4843975 5053276
8540 5053276 5221441 5471767 5572794 5832724 6166962 6452992 6765117 7139075 7447534 7717551
8530 7717551 7968276 8224936 8422875 8741563 9005044 9258264 9563908 9857513 10186382 10582920
8520 10582920 10950319 11496345 12118675 13047758 14077552 15455081 17132236 19244498 21863645
8511 21863645 25204553 29448400 33524568 32337786 26637160 21805652 18163154 15898765
8503 15898765 14119459 12841994 11996131 11513921 11111951 10748053 10501691 10310535 10103043
8494 10103043 9918649 9653568 9428933 9093206 8697800 8239285 7830952 7402843 6914859
8485 6914859 6388903 5954993 5598669 5355672 5085784 4981774 4843868 4611186 4434893 4301832
8475 4301832 4194541 4090721 3915715 3783017 3701446 3736385 3641465 3584426 3565163 3568715 3496222
8464 3496222 3386973 3451149 3313532 3241715 3236283 3182571 3148997 3149180 3158385 3160260 3061148 3041388
8452 3041388 3060796 3014721 3007462 3070456 2960826 2954060 2988350 2955411 2954418 2985402 3021109 3011900
8440 3011900 3039150 3146226 3098901 3148677 3154738 3107111 3150115 3250420 3314655 3371303 3380673
8429 3380673 3442495 3557835 3581485 3624545 3669107 3759340 3861782 3865854 3936579 4010639 4101227
8418 4101227 4158456 4192750 4141857 4116769 4206176 4225987 4213136 4260889 4304925 4204285 4176483
8407 4176483 4119949 4080283 3934368 3848875 3979058 4059997 4033673 4023406 4139388 4242538 4302778
8396 4302778 4490628 4664199 4844368 4954262 5068940 5144844 5276002 5421471 5642400 5867332
8386 5867332 6068401 6140508 6089917 6001465 5900272 5825258 5760969 5727312 5669031 5407346 5176982
8375 5176982 5013711 4894795 4783152 4753454 4627158 4529842 4457710 4411723 4516662 4529106
8365 4529106 4616965 4553755 4582581 4636254 4717799 4738949 4848244 4916414 5044275 5125262 5169607
8354 5169607 5276243 5511722 5706439 5934093 6127316 6290362 6275609 6249575 6148821 6158782
8344 6158782 6293442 6458530 6582709 6595909 6500670 6164118 5890605 5671757 5622245 5522295
8334 5522295 5418343 5193137 4878349 4755077 4663002 4537821 4395502 4240908 4143884 4119977
8324 4119977 4117367 4015752 4007817 4072180 4025561 4066007 4181145 4206139 4373552 4429128 4512473
8313 4512473 4496182 4524636 4691971 4794279 4906554 4947837 4927387 4837374 4653729 4475184
8303 4475184 4417363 4410171 4293780 4059066 3788384 3649222 3443147 3211058 3177423 3107304
8293 3107304 3039848 2910196 2882426 2776974 2757493 2637483 2600377 2523430 2449805 2454220 2416514
8282 2416514 2402440 2436498 2438336 2341344 2434177 2472461 2431181 2402375 2358761 2218219 2169635
8271 2169635 2178710 2227489 2155452 2060355 1865954 1848440 1750051 1741533 1625972 1585496 1589576 1507558
8259 1507558 1452853 1383403 1355717 1315032 1298314 1196427 1072650 1086068 1155125 1065526 1072699
8248 1072699 1076010 952100 934306 922317 877957 904022 850234 880144 853264 883552 827831
8237 827831 809537 840775 764809 777653 856182 799303 788482 898114 873812 770655 722499
8226 722499 799057 848920 868783 806222 661747 645967 683313 650880 698886 675397 617120
8215 617120 600358 594714 678302 729544 763738 699881 645417 706091 687010 603072 644912 659696
8203 659696 716267 716350 661973 581158 679579 637924 702799 665507 657840 732266 1160485 1225071
8191 1225071 495593 461628 443982 354844 436605 398089 354717 420147 369727 407242 392602
8180 392602 467410 548091 570713 600877 515785 436086 532853 501307 471251 572133 560453
8169 560453 467953 449525 475253 500368 470309 494984 547934 529905 541325 423151 452954
8158 452954 540711 525186 497421 508229 483908 491994 521668 521052 522210 529659 530410 553957 611314
8145 611314 628308 577480 583440 572151 469232 585409 583409 528471 575378 533313 475993 415205
8133 415205 466940 453084 426468 411284 373454 450636 407876 389275 389536 442394 523613 558786
8121 558786 634471 556322 570276 516478 490286 464546 486915 598738 563922 528838 472030
8110 472030 404630 464628 515281 532954 534052 462576 463026 489283 503954 474198 372285 382174
8098 382174 469740 407883 334670 445080 429223 420744 397707 384411 365471 403474 491111 523344
8086 523344 488447 499823 457047 392255 468111 507553 488373 433811 439940 498283 377210 460158
8074 460158 445818 403466 299814 348720 433957 430628 453867 440306 489687 454796 542335 557842
8062 557842 536230 485793 516441 427169 441473 317700 338816 427581 468432 452473 385789
8051 385789 275171 371917 453492 384926 326402 388572 384802 407517 453777 403545 437505 498801
8039 498801 488611 472180 430691 347223 458718 422768 481850 630915 559936 521666 432609
8028 432609 450163 441285 436387 492572 429787 464706 493608 484954 433364 404496 450283 516271
8016 516271 491225 459802 374564 417643 393025 425214 441266 404714 397430 344991 342944 382219
8004 382219 410478 371036 346919 331107 465219 471990 407450 417391 450119 418378 465548 501214
7992 501214 524267 450513 429007 426937 510666 536668 509602 605205 652220 581525 512854 491217
7980 491217 456634 485944 537655 549384 508760 493022 478104 445511 378933 409133 355096 287600
7968 287600 349742 336266 329818 317323 326684 438622 429863 431261 298348 405574 393296 378657
7956 378657 356625 341464 317308 364779 350344 309551 333945 339903 341219 329787 341927 378819
7944 378819 393369 315186 401747 326229 294441 310218 311815 223183 183015 224567 226204 282669
7932 282669 286941 315706 313798 202477 247835 204660 162998 224055 182273 172885 124749 121352
7920 121352 238067 265142 160449 198586 189413 188593 156881 85034 141559 134257 100405 58519
7908 58519 67658 96797 126060 204738 254985 265657 248816 210524 211355 302237 188116 136213
7896 136213 154533 123908 126732 71132 102149 116817 135754 134728 57351 60713 159202 74217
7884 74217 -25477 46694 116169 162511 173826 168613 96663 -20700 -49655 48323 8536 30399
7872 30399 107200 32292 9879 -21133 -17988 -50708 56887 58077 125872 114911 -17098 69368
7860 69368 102356 123466 70678 63403 -1388 -28004 28293 60647 71203 76285 108814 131811
7848 131811 126633 26846 31037 72101 63174 51234 48804 1608 92972 112461 202810 139262
7836 139262 57320 23167 93063 81568 41067 65686 68454 37604 -16060 47591 77006 56907
7824 56907 127035 141855 126477 223950 174557 -6638 52712 201559 178537 161862 30743
7813 30743 24652 -23786 -20860 18839 -4838 115761 115490 91515 104939 96881 103235 164442 214390
7800 214390 147054 145453 84432 137082 122304 136745 179928 123084 112975 123715 151460 111197
7788 111197 97342 209033 185513 122949 25389 59152 159046 178792 121639 55324 62571 82915
7776 82915 69813 64188 64415 105207 107159 95027 86221 93964 143186 96170 137582 90295 175214
7763 175214 177125 66381 123697 109194 96138 78957 42464 102527 123556 84799 139309 142798
7751 142798 130668 96526 95808 204426 159381 99227 137899 50410 111532 159966 136405 193246
7739 193246 164629 238595 310439 300097 213277 216067 187824 255043 317692 261457 231821 273596
7727 273596 366888 399457 476680 608082 705250 663457 657976 641111 485723 487703 416202 368962
7715 368962 432901 394477 323750 310036 286998 261940 282695 276873 221060 217075 193693 189001
7703 189001 284419 266991 247757 262544 247939 190290 309054 390069 446499 478203 495756
7692 495756 501952 534876 598613 603948 546854 482673 393428 345454 230766 152725 226825 219457
7680 219457 155286 208214 135445 190727 213136 288044 259406 172162 236414 256069 309245 319495
7668 319495 305125 349560 383413 356993 368836 393475 402685 475290 533530 523981 590961 602540
7656 602540 603642 515431 505744 445909 323688 356515 309061 316061 228888 213480 227585 157273
7644 157273 168313 171029 228395 166649 264409 287863 270536 269269 298707 286934 297117 278212
7632 278212 315211 349618 451086 508732 505765 595620 612514 516456 455528 457111 312189 313667
7620 313667 259761 283913 281678 234720 150181 38751 38917 45952 72778 55481 43306 -19219
7608 -19219 137164 184631 160653 36229 83447 110704 121524 76429 48635 8289 34581
7597 34581 54758 77886 22727 -45351 -84984 -112256 7900 147684 3529 -47895 -16044
7586 -16044 -16605 11138 -60923 -103707 -65613 -60903 -77689 31923 -22864 -94025 -92402 -85975 23766
7573 23766 48910 16396 -33884 -37444 62755 -12518 -77481 -93307 -4521 -5104 3271 -125249
7561 -125249 -74345 -113773 -117689 -119290 -39186 -142923 -160211 -115127 -90109 -89422 -159463 -116000
7549 -116000 -32779 -85021 -96830 -116412 -124339 -96389 -149222 -156617 -128300 -95678 -48746 -1015
7537 -1015 -30427 -96744 -69768 -65698 -142184 -99784 6554 -62751 -160044 -195932 -185452 -159647
7525 -159647 -172054 -157353 -197444 -217009 -248784 -154406 -132117 -163705 -170768 -112380 -51267 -59867
7513 -59867 -118612 -138990 -76242 -38633 -32454 -135847 -78821 -121396 -153023 -103354 -51091 -47973
7501 -47973 -31681 33609 19233 14738 -70259 -101743 -56846 -48384 -89807 -82267 -172988 -169683 -139984
7488 -139984 -88640 -82118 -107786 -93029 -126959 -49223 53323 -16988 -39325 -23387 -48510 -50488
7476 -50488 9692 -14555 -84949 -102068 -174036 -166221 -217544 -238861 -114217 -40599 -45523 -207891
7464 -207891 -154847 -168531 -184397 -135781 -114244 -60254 -75818 -56208 -105131 -116114 -164765 -143964
7452 -143964 -139362 -95989 -67372 -90075 -160137 -164647 -69762 -76911 -99193 -124730 -71978 -111213
7440 -111213 -96994 -136803 -99187 -85663 -123327 -100752 -50400 -147208 -123668 -64055 -87930 -122182
7428 -122182 -91753 -78051 -27392 82115 70277 -18249 -85999 -100769 -59533 -69843 -97602
7417 -97602 -28003 -20423 4702 -15611 -65502 -81194 -72780 -59303 -83928 -187143 -151096 -82664
7405 -82664 -70294 -90050 -92145 -24995 -4822 -24906 -16785 3489 44197 -10312 -82487 -161651
7393 -161651 -53288 -42645 -74324 -97798 -11206 -1075 -62712 -18481 40794 -6737 8527
7382 8527 66343 -17364 -38531 -66439 -24043 -87857 -91874 -121610 -46925 -22586 -78332 -68458
7370 -68458 -32829 -106839 -163255 -113077 -45033 26904 -18516 -25981 9401 32822 -60578 -116902
7358 -116902 -95145 -27639 -58241 14477 128094 7891 -31013 25577 6648 -6654 -41596
7347 -41596 -58432 -50762 -1197 -62257 -71164 -6772 -10151 1542 -26280 26461 -83231 -60643
7335 -60643 -59595 -31082 -3463 63247 107588 73446 86235 -20610 54777 70807 -39678 -72627
7323 -72627 17683 7870 -37030 -7270 32938 12405 16337 17960 22698 41508 44137 -4339 20151
7310 20151 15655 68759 59488 101502 107692 2953 -57871 -71862 8711 41331 57258 43738
7298 43738 34366 30023 118054 134920 32318 -20226 18228 109278 55526 -14192 51050 140809
7286 140809 80500 -32046 -31451 7183 49267 85414 21624 -19650 -7016 46141 141718 60895
7274 60895 29518 80914 47521 110498 184991 174827 155533 158402 131599 47197 28135 8062
7262 8062 -10960 3583 -241 -13476 -23067 87954 139529 108271 107149 71892 97760 91976 114072
7249 114072 -22172 -4626 51671 56222 44855 1703 74797 57623 94511 94808 63859 3638
7237 3638 -33402 13894 58237 76625 92264 39317 63974 58061 111379 127674 42461 98612
7225 98612 28574 84426 130644 84818 93654 132434 163263 168892 152524 175315 103279 79652
7213 79652 90909 72834 19467 7916 7370 10820 40657 77744 95209 63146 -526 71246
7201 71246 134043 78122 70643 58628 80120 64781 80324 76053 41465 4110 -5040 -45804
7189 -45804 -85118 -27424 52182 62028 117516 68039 2076 63758 29636 75677 116264 126607
7177 126607 132910 60908 48183 72934 9711 -10306 52920 19941 10073 -28834 -29078 26693
7165 26693 15578 7180 -46930 -68370 -14729 -549 46596 93668 72246 61702 64152 -14369
7153 -14369 -52662 3516 -34999 5730 10097 -42782 84221 97041 39228 22461 -63721 -14435
7141 -14435 38803 -4059 47764 45175 93942 37670 -27154 138 54689 -41262 -40343 -21880
7129 -21880 -42787 -24859 -47432 18710 -5564 -11773 -52821 46265 30405 9136 -3002 -32685
7117 -32685 -60779 -86437 34663 16498 44642 48160 -38246 -45401 -59759 -37173 9653 -5570
7105 -5570 17907 71314 39511 -2529 -19999 -77978 -61891 -47002 -31679 -17127 -1329 48824
7093 48824 -22911 -22671 16539 22077 62744 149421 175085 103582 80609 109629 135541 45515
7081 45515 60363 85155 30516 34100 13606 -21889 77431 87261 21935 18502 94637 32571
7069 32571 59309 102339 163299 198820 158436 151487 146645 138781 163840 184665 122660 101723
7057 101723 117945 147436 130363 115130 -44113 -20726 14942 16888 29508 59054 13772 32896
7045 32896 77615 13143 56067 112943 68545 106882 79666 106563 85200 32023 -5962 53611
7033 53611 100994 65620 100924 129490 103699 75719 178598 92442 54619 -57682 -4547
7022 -4547 53623 76244 39734 37319 55914 61812 60157 82625 47991 -67667 -57183 34547
7010 34547 30203 -38724 41174 104866 51155 47303 57300 95462 117113 -17444 39491 -23110
6998 -23110 -9776 104352 90578 37833 89125 174150 168777 160759 60728 79171 162323 169074
6986 169074 225170 136403 72903 124829 110500 110410 136333 144339 126816 52157 73890 92838
6974 92838 92485 78626 104593 97975 198579 246872 200013 238491 145072 49921 192657 199776
6962 199776 155263 194618 151556 163565 147972 141823 168389 147696 140295 189512 168500 124192
6950 124192 187345 178450 119771 175235 190363 171485 61929 74441 135450 78996 201711
6939 201711 208563 172260 171129 238856 186580 184727 179821 202745 271635 221311 190662 123938
6927 123938 110600 129777 146191 99659 80262 141417 179097 144000 252308 181733 159807
6916 159807 80296 112604 163077 159377 146937 107822 149873 166172 277850 269955 267173 337060
6904 337060 284820 280841 214817 260970 176932 62078 191189 246535 205682 60201 144567
6893 144567 259837 153164 163721 263304 245746 241153 297873 255371 227556 192645 214469
6882 214469 223320 255904 252204 197705 290891 256306 266391 312850 271410 239612 204319 260136
6870 260136 311664 205768 161483 77619 160984 279088 329800 235290 248228 223830 178955
6859 178955 217209 264710 296172 238799 336470 371541 482187 440697 284560 281424 306231
6848 306231 311630 414018 341920 279806 371235 407037 394907 488641 515126 504957 518361 528842
6836 528842 478874 388702 434585 473830 363712 240869 288816 386806 393346 362119 322084
6825 322084 406542 421786 418588 415200 341956 325643 367051 341796 312221 330033 306714 274268
6813 274268 316702 290028 290755 382768 327299 243430 266608 313643 191288 218904 207130 149600
6801 149600 213945 223546 201079 245125 247581 209093 151503 166566 213325 150041 195291 182264
6789 182264 236360 320420 264208 199431 147605 181695 141992 161492 185852 234710 317288 304613
6777 304613 220633 260633 270132 301017 284057 319929 264061 212012 154216 86350 73881 69657
6765 69657 84717 173054 209215 149226 111487 172601 175665 101688 151771 196590 126806 101350
6753 101350 159713 156927 160236 200628 250579 198785 176693 106750 153511 212363 246989 222237
6741 222237 117374 151856 156202 61142 -33752 55918 170291 46828 103755 167079 164461
6730 164461 234138 239921 223751 224308 172944 189811 262370 280895 265405 220693 140718 76458
6718 76458 98360 124325 152567 117195 123348 188029 263486 230780 186276 316033 296309 252379
6706 252379 201730 104579 53196 82218 129783 112794 54076 -1066 -62312 2277 -18888 -50253
6694 -50253 -735 53374 53542 114217 85833 36146 49198 92943 135539 122044 95698 66380
6682 66380 135934 151882 153062 83891 76216 80203 74914 30837 -9120 -1729 36888 29218 55418
6669 55418 122532 40540 -17846 80928 54822 48295 8051 -30321 -104929 -78799 27667 96148
6657 96148 78635 34210 125012 54098 -4426 49121 134529 105893 119732 74928 33009 64729
6645 64729 128453 160385 160759 183765 138715 188104 128193 123796 157697 105001 150476 131485
6633 131485 127704 207121 207289 155205 129475 111285 102727 12357 -28699 -34551 3083 57186 32548
6620 32548 20864 27422 5186 -85883 -74138 12912 18439 68079 95782 85714 39192 38463 68643
6607 68643 129742 91934 90201 133647 99961 98645 146307 96144 72408 165186 143424 93728
6595 93728 61355 109219 117058 212097 187114 181130 170100 112248 90342 140196 153780 129319
6583 129319 161920 130877 33349 -21704 50272 76889 84237 88070 76220 57520 -32312 78000
6571 78000 171699 136331 110702 -17375 33878 -66163 -16575 8854 -10832 -35484 -89733
6560 -89733 -83864 -82921 -48904 22934 53379 -88539 -11043 -7933 -31579 -23963 -75679 -88650 19111
6547 19111 -12608 36674 19011 -101494 -90584 -30524 -7479 29177 52861 -2287 77300 136163
6535 136163 51218 -12347 26569 27889 107239 80681 61573 65456 5277 -73042 15688 27211
6523 27211 -38463 52627 68188 5948 -5647 -65324 -35237 -43462 -46607 13129 56692 14272
6511 14272 25764 66757 5468 -9906 -22206 35872 -6383 -44212 -71540 -52331 -24543 15776
6499 15776 -24797 68872 73620 -4574 -89812 -74702 -49677 7648 19176 -60514 -94510 -25416
6487 -25416 -7370 11511 -30054 -105368 -40675 14012 -6170 -8517 -74221 -162156 -110107 -50029
6475 -50029 19520 -21054 -5298 37183 -16402 -2006 29015 7079 -13565 -86944 -136763 -50287
6463 -50287 -4258 -4842 50490 9535 -33055 -25449 -66191 -31477 22407 38327 1277 -2351 61403
6450 61403 50014 114513 68324 52464 -51792 -11906 -125749 -80561 -4640 -23023 -46447
6439 -46447 -85005 -5747 -21156 5991 127909 118126 80596 -13472 -89536 -72700 -132807 -91066
6427 -91066 -19280 -60379 22663 25954 51841 19758 -19161 -23023 32965 34710 -55007 -116486
6415 -116486 -83530 -75937 -138539 -78432 -105036 -49990 -3752 110082 13632 -56015 -105287 -82277
6403 -82277 -34820 -63306 -47220 -97927 -43397 2810 -14756 -80227 -94435 -7169 -4183 58716
6391 58716 64095 86621 15897 11742 32244 -23816 -58737 -63357 18953 -24405 -58241 30284
6379 30284 35496 76489 115539 16415 -3378 57720 -26231 -51838 -17708 51425 7095 -4582
6367 -4582 -88157 -75282 10445 -94562 -74128 43143 30588 22766 82531 96394 63006 60635
6355 60635 40537 24941 66682 74988 79331 -5540 87925 73928 64484 11990 58287 149019
6343 149019 34155 6871 100410 92373 55828 22583 29346 65917 75736 79788 100768 176225
6331 176225 138121 155406 135607 72762 27343 6999 42504 113193 108579 88200 -36549 -55371
6319 -55371 -19891 19795 32649 83486 140093 181764 196142 290747 137687 52842 109885 61166
6307 61166 109749 108010 202595 153351 105534 27667 28169 139709 135003 97270 122419 125583 103676
6294 103676 76076 99052 58289 -3467 29094 69959 36101 86309 130994 105188 102030 186078
6282 186078 171618 101701 100414 67447 11370 91788 184673 166161 132588 193328 176899 229788
6270 229788 250926 194295 222891 259361 298483 181649 95190 145813 250499 257622 251947 213707
6258 213707 251382 292856 276444 216124 209592 325729 360942 307989 291351 425481 310367
6247 310367 359127 345113 325468 224448 218315 137324 161718 211707 95335 228512 290546
6236 290546 254242 114103 71335 131830 200707 245326 297943 278445 335201 270508 248377
6225 248377 150157 192420 234663 187695 174142 163063 174444 248630 270389 288352 340605 362515
6213 362515 272808 205529 310440 402538 317055 263575 179859 184275 209320 216613 210299 188388
6201 188388 194280 209173 215758 220284 217972 204270 135298 156847 211752 171220 207161 95318
6189 95318 170849 199963 238262 218408 197415 185348 219563 115346 117416 190030 190841 210778
6177 210778 168510 187919 223485 234174 294659 343347 275288 262491 252570 254810 290268 273285
6165 273285 264875 292936 270090 329667 419066 354470 282601 313706 388689 379832 276007 373748
6153 373748 390417 387276 342746 326064 325425 344858 283728 402721 386010 358719 293587 274200
6141 274200 409833 389679 404845 404922 342373 342830 335665 324866 399579 326734 409836 293091
6129 293091 302189 332246 280818 335057 361768 282363 263368 286020 230430 197184 277012 283324
6117 283324 219929 257784 353982 365841 403983 407761 410273 482891 502435 465796 413126 485172
6105 485172 502916 492655 400222 354258 393069 330661 362336 269039 320099 359447 369525 399450
6093 399450 350613 302674 265943 319473 276826 320909 307068 287905 246932 405519 406398 354862
6081 354862 332494 344603 340122 470721 470923 432503 462349 538538 592593 541121 595744 563297
6069 563297 507945 490851 499887 412271 399406 398393 389220 293670 239133 303944 285732 320270
6057 320270 273974 257938 323012 400557 431707 322507 259530 174492 201476 249624 198735
6046 198735 255965 325346 232754 221944 309223 333193 201780 207812 304616 292580 329852 330168
6034 330168 208489 194173 242790 303543 269131 221793 186198 200818 199158 238949 304840 397232
6022 397232 431779 291315 172142 195840 236556 113570 37139 203952 260414 308424 262068
6011 262068 213712 215851 264972 291360 331780 321783 273727 205530 198360 288983 358938 313175
5999 313175 240859 179368 241587 291050 240213 263630 200800 294582 315482 344678 300710 304534
5987 304534 397508 345104 337215 369851 282756 281230 328425 316632 297034 378861 445772 411497
5975 411497 299024 260480 270884 342220 344719 321119 355156 365163 361553 459198 410898 432945
5963 432945 472367 510871 496437 449182 482574 514186 504470 395266 358090 385757 475176 435285
5951 435285 443066 501254 496894 485513 430276 517197 567004 599292 596024 507718 410567 487881
5939 487881 536589 493036 447960 479658 514828 529248 492571 592415 600829 620289 734148 745509
5927 745509 689128 586879 664970 703390 778116 754084 701510 673909 718819 733220 703694
5916 703694 729033 729974 787541 808085 898445 959369 1004956 1038002 982257 988512 1019264 1018791 1008427
5903 1008427 1016408 964854 1014799 1064308 1033324 1047388 1128660 1053183 1124641 1282955 1381689
5892 1381689 1447308 1350321 1376057 1468796 1421524 1422067 1409175 1423815 1472800 1489251 1462270 1544300
5880 1544300 1639426 1725967 1699631 1658416 1625098 1663528 1702995 1766235 1786131 1765083 1756636 1763989
5868 1763989 1655436 1656479 1669768 1766728 1828354 1776196 1772238 1786524 1821610 1708361 1662971
5857 1662971 1656707 1648361 1690060 1773066 1784905 1813377 1921139 1933388 1882499 1894699 1853790 1837074
5845 1837074 1866555 1879945 1828470 1833191 1899690 1899867 1962085 1974742 1978041 2025867 2077969 2138453
5833 2138453 2169439 2350410 2424145 2399712 2420981 2465852 2446753 2445458 2345494 2198576 2141846
5822 2141846 2133936 2193716 2163279 2136819 2128145 2151584 2234547 2240141 2365682 2455359 2505286 2649339
5810 2649339 2765442 2881242 2985576 3084696 3246077 3413379 3619574 3782829 3780830 3615219
5800 3615219 3367813 3135547 2883369 2665473 2521561 2519556 2535522 2460941 2436910 2379537 2460036
5789 2460036 2505715 2594355 2562293 2622400 2718766 2783772 2792129 2894918 2925215 3061565 3199533
5778 3199533 3300673 3432145 3521562 3463203 3407824 3424674 3358666 3385603 3407028 3477087 3471066
5767 3471066 3655144 3779728 3970770 4250880 4481569 4508134 4522206 4480989 4195801 4044362
5757 4044362 3813493 3679258 3592137 3506066 3521574 3654285 3576211 3588259 3643671 3671634 3816057
5746 3816057 3888677 4095566 4344063 4673987 4862059 5137688 5416208 5802346 6269496 6818928
5736 6818928 7043772 7132298 6889671 6449539 5921873 5414501 4949703 4646580 4386849 4176175
5726 4176175 4095300 3982917 3876443 3825695 3764588 3717407 3752251 3825387 3853475 3842605 3911857
5715 3911857 4008151 4232376 4503380 4622639 4797714 4907827 4852609 4645309 4385670 4074619
5705 4074619 3755284 3546459 3311324 3099656 3005747 2963421 2820016 2688749 2574018 2494193
5695 2494193 2373775 2295319 2189685 2223209 2130306 2033939 1994701 2001186 2007226 1977457 1905734
5684 1905734 1897991 1879521 1880819 1888343 1949393 1936704 1920701 1947312 1906513 1859351 1969258 1975732
5672 1975732 1881582 1841787 1748739 1743079 1715101 1813937 1750160 1824860 1894823 1796181 1876285 1845616
5660 1845616 1882737 2029553 2139106 2168765 2175760 2238153 2232723 2195161 2168018 2105968 2163832
5649 2163832 2218031 2209089 2285313 2405836 2370692 2259486 2267227 2164538 2011056 1976254 1934816
5638 1934816 1839184 1741272 1678056 1743007 1662815 1649322 1723622 1639843 1711154 1793213 1756950
5627 1756950 1731624 1682009 1680192 1699523 1636322 1654750 1711050 1773603 1728235 1816411 1933165
5616 1933165 1933845 1874681 1946426 1892429 1823486 1861585 1876595 1818933 1738257 1770151 1790662 1818148
5604 1818148 1788112 1829080 1793507 1821906 1862881 1904127 1928631 2001766 2096372 2056567 2096503
5593 2096503 2135479 2269690 2363687 2370237 2388146 2365021 2390154 2389535 2358079 2381693 2440566 2594020
5581 2594020 2724374 2686886 2600460 2433725 2229659 2121293 2083597 1995302 1934946 1844345 1812769
5570 1812769 1816789 1795860 1748544 1732443 1662548 1659986 1590062 1504421 1565247 1663857 1620237 1622145
5558 1622145 1612066 1565210 1504125 1515264 1582439 1622501 1685847 1680812 1693040 1645618 1612628 1648625
5546 1648625 1591427 1590038 1549214 1597976 1465740 1456602 1549487 1510221 1580336 1610409 1540674 1545808
5534 1545808 1557316 1611745 1675962 1646540 1584672 1525804 1593419 1653137 1677466 1755269 1830870
5523 1830870 1822336 1929370 2015954 2102717 2139815 2249754 2341740 2280991 2124846 2146979 2102350
5512 2102350 2072195 2079649 2101307 2168026 2213338 2252314 2230325 2151684 2115075 2035843 1983963 1918523
5500 1918523 1899253 1863084 1917424 1997473 2006429 1995271 2054748 2077114 2100496 2209110 2285967
5489 2285967 2449898 2559868 2654997 2837182 2889506 2749361 2702036 2726202 2851879 2894916
5479 2894916 3128300 3378854 3449716 3524674 3412408 3336115 3080961 2836878 2715411 2600399
5469 2600399 2480729 2324384 2213968 2294803 2319366 2309103 2386718 2395882 2406518 2426997 2514774
5458 2514774 2661035 2848237 2948700 3136552 3255042 3321266 3528236 3653049 3673460 3622615
5448 3622615 3545742 3248048 3056424 2911262 2603469 2438173 2284348 2220349 2150373 2071953
5438 2071953 2073540 2118847 2102498 2072029 2031046 2025987 2069524 2162275 2203086 2207532 2250806 2331701
5426 2331701 2504619 2532477 2506438 2511429 2488447 2374302 2262448 2171615 2001801 1894289 1915656
5415 1915656 1960826 1938524 1909102 1868754 1769192 1842977 1948674 1952399 1896078 1904504 1909213 1885792
5403 1885792 1888703 1910301 1901680 1856396 1900333 1881600 1928304 1918353 1939069 1934055 1887427 1944632
5391 1944632 1972273 1974972 1972226 1911671 1960568 1976675 1973509 2086033 2080231 2163973 2222466 2177545
5379 2177545 2180079 2196545 2278623 2287115 2310333 2344803 2565618 2596854 2698486 2726648 2643481
5368 2643481 2657461 2722471 2810369 2951616 2959268 3009324 3058871 3078481 3117053 3270592 3358434
5357 3358434 3481054 3605729 3615526 3651436 3617913 3685394 3605014 3626853 3603838 3684129 3787729
5346 3787729 3876053 3945381 4036178 4090194 4140093 4199764 4294068 4366902 4417962 4522653 4702868
5335 4702868 4908132 4993167 5043609 5123956 5248096 5430569 5655736 5871012 5941493 6176776
5325 6176776 6451085 6714228 6925383 7057689 7231759 7246214 7167312 6966841 6845409 6669268
5315 6669268 6527450 6384282 6296206 6205346 6181456 6249984 6266637 6464431 6611910 6707853 6741789
5304 6741789 6894009 7120456 7376343 7536707 7858892 8279605 8672908 9129707 9627800 10107491
5294 10107491 10100199 9712283 9236247 8498586 7919480 7491547 7173136 6908612 6700691 6620404
5284 6620404 6486988 6472032 6513945 6462553 6490010 6568347 6676607 6817726 6856959 6997960 7247226
5273 7247226 7448700 7717467 8051346 8425891 8752837 8801452 8778783 8626276 8392533 8180118
5263 8180118 8039491 8046655 8192989 8314960 8495303 8748214 9121624 9473476 9491850 9443941
5253 9443941 9542490 9557538 9730114 10015706 10411893 10999159 11476870 12080439 12726301 13414395
5243 13414395 14097957 14672699 15233777 15759862 16199710 16637617 16882161 16988432 16768619
5234 16768619 16226434 15587905 15079643 14492711 13889484 13244845 12685707 12033278 11484937
5225 11484937 10883776 10214304 9734691 9175934 8675807 8241021 7911168 7651200 7510735
5216 7510735 7263977 7079936 6892981 6806335 6738618 6674972 6634831 6654099 6590559 6481398 6395034
5205 6395034 6346296 6363888 6318053 6274548 6223411 6057351 6013854 5970852 5863613 5694071 5663489
5194 5663489 5515047 5431560 5449301 5299961 5257890 5223918 5293835 5309193 5234204 5143163 5055884
5183 5055884 5101788 5039760 5071210 5067856 4982060 5000850 5039402 5111603 5210713 5261501 5269354 5226642
5171 5226642 5185552 5349148 5459484 5392160 5434909 5419574 5379461 5406518 5434945 5508565 5539772
5160 5539772 5598795 5694859 5766676 5929657 6053972 6241887 6316802 6225429 6185538 6120032 6047021
5149 6047021 6015099 5940554 5934512 5990485 6044956 6204420 6275308 6290124 6474358 6583820 6856120
5138 6856120 7164340 7473419 7837357 8257320 8699330 8944594 8990881 9001664 8856854 8662472
5128 8662472 8425896 8303580 8214884 8071227 8147492 8192755 8408100 8725667 9047722 9474339
5118 9474339 9956372 10474283 10784602 10915100 10916195 10559402 10160435 9600966 9222854 8958476
5108 8958476 8831088 8908815 9152131 9388530 9784514 10163601 10339582 10233623 9974917 9650553
5098 9650553 9119275 8513029 7970019 7552325 7221292 6957509 6939873 6986730 7005483 7022264
5088 7022264 7119447 7301214 7503434 7563916 7352850 7166214 6902768 6462101 6029875 5529197
5078 5529197 5243229 4965585 4730359 4444072 4367654 4278075 4232134 4206321 4179711 4195676 4156352
5067 4156352 4211660 4202848 4273211 4414415 4415280 4274290 4168951 3998952 3754384 3622744 3517019
5056 3517019 3338806 3263352 3259497 3235134 3138760 3088707 3018116 2963750 2950313 2987491 2851812
5045 2851812 2833794 2837467 2739337 2594129 2615577 2653645 2635520 2573914 2580232 2536743 2529585 2533389
5033 2533389 2462860 2427307 2455327 2465661 2448272 2509449 2441506 2342961 2277801 2294799 2357761
5022 2357761 2355395 2249653 2188227 2211895 2196704 2197988 2175661 2120883 2186611 2209742 2195963 2157103
5010 2157103 2136389 2193007 2115155 2139943 2106592 2084794 2023165 2038078 2087839 2053839 2097530
4999 2097530 2102619 2114064 2078250 2121352 2177921 2132208 2106881 2065687 2095212 2021042 1983585 2035891
4987 2035891 2072800 2116922 2108120 2085140 2148307 2120640 2016783 2041186 2058271 2088098 2171973
4976 2171973 2204613 2155849 2174333 2167886 2137537 2225835 2294654 2227305 2257514 2335613 2256642 2188531
4964 2188531 2204895 2182501 2216663 2288401 2236386 2265646 2265985 2271208 2294460 2229603 2180897 2192558
4952 2192558 2231695 2251452 2281761 2322103 2329384 2436897 2522091 2526715 2511535 2489366 2491244 2535314
4940 2535314 2640878 2734945 2807489 2966904 2964081 2978949 3080728 3132325 3134457 3177287 3200267
4929 3200267 3244431 3342320 3455983 3586051 3767826 3970799 4145900 4391721 4542840 4751968
4919 4751968 4847783 4934599 4795553 4596279 4439681 4413303 4279197 4174248 4072693 4007126
4909 4007126 4021244 3987179 4106140 4172665 4286493 4372231 4480653 4654882 4742361 4865188
4899 4865188 5074626 5294514 5567971 5857778 6180299 6546049 7084397 7618961 8336846 9126460
4889 9126460 9832509 10438409 10795853 10736768 10186052 9408066 8577929 7836486 7156249 6658142
4879 6658142 6302923 5880419 5620753 5475994 5348260 5307781 5145071 5141980 5082162 5107205
4869 5107205 5114885 5227369 5318229 5475339 5577781 5763793 5950597 6241734 6488869 6760627
4859 6760627 7185535 7747088 8410938 9138485 9841408 10107158 9833525 9206530 8502139 7689817
4849 7689817 7084835 6589186 6146109 5842133 5539559 5250922 5089944 4892336 4764522 4689289
4839 4689289 4676661 4595780 4685007 4824821 4783998 4793481 4840189 4768267 4926855 5155362 5288999
4828 5288999 5456428 5695220 6070631 6514228 6921961 7209451 7386017 7206527 6907731 6580052
4818 6580052 6052601 5673481 5308474 5070999 4822050 4698556 4641623 4600886 4584134 4554123
4808 4554123 4565576 4481884 4428876 4398361 4377140 4296239 4243148 4195931 4183336 4193456 4088398
4797 4088398 3958436 3933878 3945052 3929118 3947723 3924097 3936390 3940775 4025204 4016506 4049794 4121965
4785 4121965 4141189 4208483 4226838 4294657 4392167 4532390 4574959 4640292 4775897 4846234 4849570
4774 4849570 4907552 4963965 4940674 4938298 4865008 4822133 4791919 4783090 4741358 4647479 4620253 4529292
4762 4529292 4541959 4551818 4474642 4444334 4398774 4439431 4464410 4495197 4545014 4583526 4616081 4590871
4750 4590871 4706406 4731484 4718259 4766348 4823587 4862940 4886040 4994449 5079370 5191892 5272263
4739 5272263 5406193 5518392 5547359 5546625 5451283 5391731 5392292 5374205 5270926 5297788 5367141 5380566
4727 5380566 5423702 5353267 5352759 5338340 5466698 5424892 5470077 5519245 5570433 5686548 5747076
4716 5747076 5878226 6014350 6053040 6118137 6229835 6287285 6317078 6394900 6443845 6641359 6836724
4705 6836724 6903819 7010375 7163398 7387689 7434206 7625857 7982137 8256044 8503609 8607970
4695 8607970 8557701 8463378 8277193 8346389 8413818 8544441 8651967 8779896 8915585 9194851
4685 9194851 9597721 10068891 10635697 11043612 10953289 10572660 10254896 10125266 10011187 9952537
4675 9952537 9998329 10098938 10330954 10507829 10782325 11054653 11372032 11713426 12064541 12420750
4665 12420750 12735865 13152502 13364791 13647933 13902178 14068372 14103704 14206746 14400616 14575247
4655 14575247 14760525 14914978 15054643 15178813 15422215 15699803 15854195 15998199 16206204
4646 16206204 16316417 16504379 16782755 16996024 17142435 17440420 17801019 18048093 18435848
4637 18435848 18791837 19257156 19790577 20353251 20850719 21336515 21870675 22366227 22842549
4628 22842549 23279815 23710710 24326737 24798067 25306259 25889821 26447785 27011403 27624323
4619 27624323 28248355 28933705 29622654 30355782 31170948 31933615 32749260 33791896 34879639
4610 34879639 36086563 37308794 38627100 40013957 41601789 43261294 45041184 47023194
4602 47023194 49191874 51619442 54409812 57651781 61319832 65367790 69940524 75040035
4594 75040035 80663076 86886207 93897291 101711130 110219830 119797686 130764861 143742504
4586 143742504 158975721 177188485 198880558 225085910 258047219 296722781 328093036
4579 328093036 340718034 328885269 295482790 248239049 203285880 168345063 141413355
4572 141413355 122030543 107803227 97288280 89086221 82636015 77240357 72955545 69283949
4564 69283949 66071817 63290726 60876785 58681254 56640393 54816104 53283678 51853881
4556 51853881 50781084 49890104 49219174 48660827 48276044 47944172 47817744 47637519 47584552
4547 47584552 47634484 47854863 48008969 48254333 48581106 48937493 49356583 49845188 50537543 51421716
4537 51421716 52443133 53503859 54599077 55946341 57557835 59464880 61730530 64375558
4529 64375558 67301391 70684028 74593357 79105591 83992854 89644073 95880893 102908933
4521 102908933 110882314 120247712 131140934 143929232 159076926 177048206 198637255
4514 198637255 225215847 258704169 290880881 308610355 310674445 300875857 276954709
4507 276954709 237275521 196336764 163915295 138471977 119558196 105439327 94628133
4500 94628133 86226354 79526605 73988665 69539633 65819684 62744262 60207572 58205965
4492 58205965 56389176 55118910 54457747 54700586 54519300 52825864 49603572 46286068 43453414
4483 43453414 40797279 38540625 36580525 35023398 33664712 32519152 31681812 31000177
4475 31000177 30375646 30030111 29599426 29257729 28982811 28967310 29192027 29613486 30402877 31624410
4465 31624410 33316362 34250342 33504945 31309162 29083064 26869060 24670342 22546339
4457 22546339 20634389 19162360 17992385 17065509 16398335 15713384 15037618 14618915 14157855
4448 14157855 13775127 13484213 13028420 12601122 12287454 12018555 11724435 11477162 11324745
4439 11324745 11186251 11098440 10820893 10589188 10539761 10405978 10288436 10152237 10036246 10121618
4429 10121618 10035983 10084030 10179541 10195808 10316132 10577219 10864434 11138930 11374946 11805380
4419 11805380 12446809 13154012 14101582 14513806 13868793 12632089 11433878 10446187 9768822
4410 9768822 9266084 8851582 8471624 8130471 7847958 7665008 7492992 7326997 7077265 6845061
4400 6845061 6729960 6515469 6366815 6235942 6013968 5908711 5881773 5842366 5822301 5785147
4390 5785147 5730310 5668489 5496999 5297437 5262016 5284886 5128662 5085224 5015888 4857385 4714323
4379 4714323 4709451 4588553 4535627 4459644 4476001 4474841 4483970 4443443 4334976 4249924 4174146 4181072
4367 4181072 4090212 4067851 4062150 4019823 4005548 3931570 3952071 3919676 3800959 3734390 3692274
4356 3692274 3685677 3713413 3784836 3692327 3664988 3613025 3571036 3573358 3608382 3543497 3425087 3320113
4344 3320113 3344363 3299126 3275103 3205415 3183677 3113634 3041542 3047744 2963208 2951739 2912836 2915730
4332 2915730 2940579 2981881 3094061 3031776 2989664 2961520 2954308 2968709 2976201 2977728 3039121 3004339
4320 3004339 3063829 3024437 2929190 3036520 3133747 3048265 3147038 3194556 3218731 3211776 3216034 3356260
4308 3356260 3409617 3478320 3523162 3619499 3730117 3804622 3832858 3877626 3874865 3897901 3850011
4297 3850011 3745514 3651141 3504135 3497028 3526230 3434355 3459224 3473279 3358671 3360329 3439702
4286 3439702 3483528 3443728 3525214 3538701 3558648 3599801 3681704 3747281 3867018 3933431 3965961
4275 3965961 4027974 4123738 4297705 4463626 4590700 4717455 4914488 5141859 5477237 5611181
4265 5611181 5700445 5707242 5579521 5322738 5080866 4970477 4877722 4807372 4886644 4888511 4947540
4254 4947540 4976018 5172459 5260020 5395202 5471008 5641619 5855579 5930868 6098857 6328130
4244 6328130 6581015 6832555 7125448 7496643 7909559 8292207 8749176 9317590 9887452 10553540
4234 10553540 11384067 12265468 13207673 14383143 15650996 17061019 18628415 20542514 22559369
4225 22559369 24707648 26722935 28144939 28203714 26738798 24362876 21514360 18769968
4217 18769968 16483372 14657041 13100843 11900966 11047154 10330972 9777162 9419923 8983941
4208 8983941 8724914 8446379 8241876 7960084 7686921 7550094 7407534 7288582 7246264 7088731
4198 7088731 7041723 7104977 7029598 6868544 6721454 6352992 6010695 5679162 5405566 5140146
4188 5140146 4827316 4678405 4470376 4210886 4081563 4087418 3950835 3814566 3609418 3465832
4178 3465832 3366345 3298405 3295221 3152269 3016189 2988263 2846216 2841233 2782534 2624565 2528082
4167 2528082 2496788 2397064 2311211 2321804 2229322 2294073 2320291 2267556 2208131 2273348 2203095
4156 2203095 2071623 2044507 2097236 2049525 2088837 2045160 2011736 2022025 1983539 1917144 1851693
4145 1851693 1771770 1719075 1722963 1674562 1615423 1638248 1643287 1611261 1621056 1651066 1650001 1585580
4133 1585580 1585584 1560330 1544419 1589416 1564424 1584461 1630635 1626452 1621188 1568127 1578143 1556956 1611021
4120 1611021 1544951 1424534 1493087 1491878 1442074 1434596 1451432 1433678 1416994 1460453 1441384 1447961
4108 1447961 1399885 1419002 1414657 1312711 1390206 1392839 1448709 1433900 1494321 1456757 1416104 1396553
4096 1396553 1399484 1363696 1401765 1436789 1392248 1376799 1342570 1319910 1311299 1315576 1323170 1347528
4084 1347528 1348270 1421179 1429685 1509177 1428732 1405434 1431504 1467303 1451788 1505388 1487392 1428241
4072 1428241 1426207 1464850 1419521 1453808 1459077 1408288 1433460 1429555 1450881 1592167 1562300 1515222
4060 1515222 1518927 1498148 1524484 1640428 1599571 1628943 1641281 1582878 1621705 1671077 1711111
4049 1711111 1669984 1755258 1806596 1805170 1772173 1808022 1900890 1854538 1824356 1760999 1762103 1799612
4037 1799612 1849016 1800955 1827431 1771618 1788499 1842271 1837143 1832580 1782998 1777761 1702238 1703718
4025 1703718 1701499 1777667 1794422 1778316 1832408 1901448 1918426 1892874 1861839 1935425 1906870 1901012
4013 1901012 1986248 2001370 1973116 1998305 1946164 1967731 2110884 2164537 2035023 2025537 2076841
4002 2076841 2091978 2104374 2037170 2087860 2133120 2131867 2234856 2203286 2193094 2253751 2326330
3991 2326330 2376280 2479402 2427651 2346612 2491034 2523522 2500608 2493501 2529332 2592205 2618620
3980 2618620 2676475 2712292 2803917 2777815 2820813 2887818 2915224 2939418 2945450 3091543 3112498
3969 3112498 3109991 3152536 3147012 3142908 3229292 3222320 3204019 3229310 3293160 3338551 3330329 3421429
3957 3421429 3511958 3539077 3602441 3685471 3684971 3734997 3740459 3815795 3943343 3975188 4002123 4116474
3945 4116474 4161144 4167781 4235992 4290995 4361595 4394011 4406237 4462431 4450023 4499829 4602446
3934 4602446 4643870 4713451 4872034 4926186 5003266 5058793 5093825 5154471 5230555 5314630 5406496
3923 5406496 5465003 5519719 5570587 5644120 5738792 5702477 5704484 5781927 5773169 5649190 5674236 5726554
3911 5726554 5733249 5772316 5791248 5753066 5705883 5786592 5849793 5823275 5758526 5706540 5725359 5676979
3899 5676979 5630297 5664853 5641838 5643260 5538324 5469654 5575367 5587435 5591357 5512939 5507178 5348553
3887 5348553 5345560 5310916 5278377 5232663 5129755 5080212 4962037 4955823 4848667 4728755 4635561
3876 4635561 4619086 4618959 4540040 4467243 4401859 4412422 4422086 4494563 4508513 4425221 4255276 4014771
3864 4014771 3835290 3718878 3560387 3362447 3359484 3393279 3334623 3215193 3100806 3077035
3854 3077035 3026398 2968642 2827955 2846756 2812966 2683745 2612311 2657819 2592232 2522053 2409953
3843 2409953 2418152 2498473 2429212 2419852 2363868 2349441 2287958 2219462 2247649 2242884 2131959 2168101
3831 2168101 2116503 2004194 1946742 1903581 1969790 1966332 1876079 1902851 1866024 1752205 1834923
3820 1834923 1861595 1867983 1812592 1733255 1721120 1730313 1745644 1732466 1737598 1744825 1648528 1672631
3808 1672631 1730198 1629359 1649162 1628657 1555343 1604676 1692963 1683218 1637408 1570972 1574199 1513284
3796 1513284 1653117 1766432 1680132 1585800 1705474 1771627 1723373 1828572 1877170 1836583 1767443
3785 1767443 1882605 1981864 1984916 1932937 1818654 1844845 1821813 1777157 1735223 1813684 1736353
3774 1736353 1754800 1860347 1752779 1740003 1668274 1614057 1637124 1668628 1691006 1633880 1658835
3763 1658835 1670319 1650079 1551942 1479470 1506161 1557529 1515896 1525408 1461550 1440772 1469578 1516286
3751 1516286 1473172 1404114 1394602 1487969 1595777 1486809 1457856 1549260 1562977 1509370 1496925
3740 1496925 1525024 1478579 1484751 1495454 1453915 1453756 1426252 1460955 1485003 1494854 1563080 1567015
3728 1567015 1595102 1536873 1541751 1532018 1563101 1614988 1545101 1549625 1633150 1638189 1498103 1513214
3716 1513214 1468918 1542050 1550997 1523775 1532791 1654115 1541152 1536463 1594095 1522277 1471632 1594315
3704 1594315 1634912 1666427 1694105 1630205 1586600 1620609 1622870 1619233 1700410 1754038 1820086 1831283
3692 1831283 1849604 1767132 1727873 1684205 1794256 1771487 1736623 1849697 1843378 1837236 1818265
3681 1818265 1785984 1846845 1913951 1907077 1922504 1960016 2037394 1961615 1940112 1905527 1875195 1910015
3669 1910015 1971312 1983218 2014099 1990365 1992538 1979878 2029652 2036615 2020121 2023274 1994901 1956100
3657 1956100 1961262 2017714 2023396 1968266 1882085 1822362 1915883 1973405 2032767 2067982 2076812 1982351
3645 1982351 2009353 2109336 2035338 2095184 2038404 1945103 1959289 2085826 2107347 2071815 1970543
3634 1970543 1990726 2091992 2130942 2147342 2125404 2065651 2135850 2131984 2145000 2162534 2145984
3623 2145984 2116345 2181400 2186565 2134958 2105229 2139639 2093669 2126926 2129759 2163651 2153025 2174136
3611 2174136 2194254 2186482 2138000 2142311 2190475 2182503 2171118 2221878 2280875 2281426 2170603 2157183
3599 2157183 2208941 2234053 2305248 2279623 2290291 2306151 2308168 2413992 2403500 2364711 2338681
3588 2338681 2321691 2344621 2384765 2382301 2399250 2394777 2410784 2403352 2423657 2510294 2575215 2581582
3576 2581582 2573549 2590066 2475737 2537107 2534672 2534305 2547274 2538893 2668511 2654537 2542987 2533796
3564 2533796 2625762 2747297 2744298 2740750 2673181 2779193 2815290 2811922 2839095 2804460 2773544 2860049
3552 2860049 2768444 2823557 2890794 2947068 2879263 2866640 2883232 2949752 2915946 2902242 2906052 2864139
3540 2864139 2964557 3036781 3105355 3101933 3053986 3072488 3072659 3205121 3200215 3179460 3272093 3239278
3528 3239278 3286550 3309663 3356592 3419187 3420904 3411140 3494127 3523797 3456602 3367302 3407439 3425727
3516 3425727 3522315 3574279 3624558 3733590 3731303 3653195 3681464 3761016 3787721 3830907 3793175
3505 3793175 3874914 3933244 3925408 3989953 3936082 3887929 3973469 4012058 4049477 4125699 4106293 4170618
3493 4170618 4197294 4237540 4244565 4306345 4359237 4433489 4455095 4442262 4496718 4543740 4577693 4716710
3481 4716710 4752933 4818202 4874435 4915109 4991948 4963881 5031703 4988416 5043941 5055550 5087459
3470 5087459 5212541 5213659 5304836 5292683 5272499 5296803 5480350 5515558 5574633 5499988 5547989
3459 5547989 5585614 5612380 5645068 5655112 5616067 5621524 5750341 5734628 5688887 5659338 5762955
3448 5762955 5848463 5853361 5889576 5906929 5940283 5964613 5961698 5989429 6003009 6086457 5977407 5934959
3436 5934959 5978020 6038791 6120036 6145682 6141533 6058957 6074807 6160023 6157550 6249848 6231941 6250525
3424 6250525 6228120 6301511 6314392 6396624 6458032 6504832 6490522 6453564 6459768 6501279 6507965 6432916
3412 6432916 6439224 6462304 6426479 6492500 6528881 6610177 6608602 6659716 6690106 6707329 6796956 6776323
3400 6776323 6853150 6781678 6744876 6823203 6843063 6871754 6810904 6751912 6786495 6840507 6942718
3389 6942718 7013619 6962894 6936553 6939803 6994511 7037700 6950432 6963226 6889818 6850161 6757184 6721938
3377 6721938 6698189 6669948 6741465 6759562 6791158 6859613 6786457 6828616 6849453 6852631 6908820 6934701
3365 6934701 7010842 7002084 7068726 7099733 7108607 7100908 7024134 7018378 7051384 7087960 7196164 7250411
3353 7250411 7200028 7215759 7283439 7270426 7273901 7209402 7238674 7273566 7256498 7338216 7335957 7348497
3341 7348497 7294955 7380356 7424072 7504683 7517539 7515815 7652567 7715590 7781131 7834623 7848623
3330 7848623 7921276 7915621 7918169 8001875 8011357 7949521 7987719 7975947 8024429 8126962 8144477 8163501
3318 8163501 8169583 8139644 8143945 8187849 8208273 8234890 8219006 8320665 8427086 8337374 8311463
3307 8311463 8385065 8381435 8453136 8503380 8518857 8507119 8584561 8703977 8751661 8810231 8915737
3296 8915737 8879062 8770315 8794609 8832172 8896700 8900243 8949814 8888645 8856095 8873537 8814205
3285 8814205 8916248 8919015 8857460 8889787 8943857 8930880 9033886 8987600 8965329 8977647 9063500
3274 9063500 9102653 9186478 9215148 9160305 9172268 9138730 9165450 9152857 9199053 9296131 9314083
3263 9314083 9365009 9386481 9402957 9364227 9372438 9258879 9244252 9409013 9465019 9341354 9388290
3252 9388290 9469317 9377161 9346624 9394217 9511713 9515728 9636576 9769111 9793579 9812420 9867886
3241 9867886 9893019 9927710 9902727 10005655 10021337 9972166 9971902 10102075 10124202 10036812 10060871
3230 10060871 10074091 10132076 10215548 10223685 10206596 10286960 10324332 10285983 10245395 10331220 10448631
3219 10448631 10484220 10496780 10552220 10685996 10774998 10894226 10818982 10898185 10985385 11076167 11115347
3208 11115347 11184952 11247009 11351732 11416785 11514305 11540347 11602273 11685887 11735663 11757049 11806289
3197 11806289 11908117 11901198 12037238 12167190 12269769 12264369 12374447 12550535 12711214 12673760
3187 12673760 12712446 12850478 12975154 13095251 13177442 13283520 13419958 13536711 13634549 13810339
3177 13810339 14018194 14089858 14146943 14273421 14452176 14579769 14751351 14957624 15153105 15195340
3167 15195340 15371345 15562798 15749942 15975876 16142845 16282959 16494126 16604594 16689545 16800709
3157 16800709 17033638 17235205 17400846 17551450 17721174 17898096 18044138 18203347 18351360
3148 18351360 18711231 18911869 19132283 19402561 19620368 19821718 20049118 20293453 20601380
3139 20601380 20809739 21170430 21531707 21762471 22098862 22341413 22524573 22917196 23322198
3130 23322198 23569577 23945421 24280952 24581093 24999222 25421526 25838901 26265962 26641900
3121 26641900 27049670 27517917 27964828 28340465 28756759 29160564 29555303 29855499 30210472
3112 30210472 30640369 31067970 31531800 31910094 32299748 32744060 33243558 33716525 34215545
3103 34215545 34684991 35142650 35681419 36188365 36697852 37256764 37776188 38383401 39050684
3094 39050684 39719446 40477507 41236915 41901206 42725751 43569033 44447575 45288009 46114360
3085 46114360 46873817 47504105 48129537 48837877 49595024 50357017 51156553 51924682 52710759
3076 52710759 53558559 54450815 55315693 56250892 57181092 58153965 59230359 60363242 61442021
3067 61442021 62571623 63805889 65062636 66371697 67825731 69252018 70777038 72378601
3059 72378601 74080667 76011197 77977078 80057346 82391984 84867782 87456416 90306527
3051 90306527 93387161 96720069 100256934 104119433 108261226 112731656 117629873 122845082
3043 122845082 128264474 134092710 140171077 146460169 152953773 159392840 165781479 171777198
3035 171777198 177196214 181518247 184353886 185283769 184024746 180591343 175270993 168723221
3027 168723221 161388541 153834924 146323914 139425176 133261126 127741817 122706812 118123824
3019 118123824 113940125 110123193 106830583 103842960 101094371 98613933 96467780 94484392
3011 94484392 92720646 91238648 89885692 88657839 87463124 86282422 85281911 84354421
3003 84354421 83662720 82980462 82389049 81939825 81578106 81292003 81264918 81542643 81325274 79921894
2993 79921894 77424932 74632802 71979655 69421847 66736446 64151856 61716045 59624669
2985 59624669 57781582 56066559 54560560 53239585 52094585 50958997 49985652 49067385
2977 49067385 48213994 47459819 46688229 45904650 45257646 44694003 44151215 43647208 43134323
2968 43134323 42773394 42540470 42426110 42394130 42518606 42529495 42158561 41270399 40123270 39028954
2958 39028954 37874122 36784854 35800998 34933341 34138539 33412241 32803614 32258096 31701901
2949 31701901 31164134 30736559 30402397 30006248 29612429 29225104 28872011 28557276 28308577
2940 28308577 28020926 27689369 27284541 26951014 26736682 26551754 26311550 26002137 25741703
2931 25741703 25469246 25199323 24942286 24624102 24389770 24148977 23918258 23689479 23481392
2922 23481392 23347064 23070963 22826695 22619081 22409620 22140258 21956347 21819339 21633502
2913 21633502 21393352 21242031 21091717 20929762 20826838 20697025 20584915 20427935 20320606
2904 20320606 20216021 20016903 19898968 19740721 19618833 19482781 19368516 19325124 19192988 19025706
2894 19025706 18987216 18913954 18724115 18636024 18556107 18515994 18436550 18308164 18305461 18258064 18110805
2883 18110805 18059241 17973995 17945494 17858903 17735342 17711793 17673182 17620362 17546266 17453666 17479177
2872 17479177 17389976 17248911 17231679 17135920 17049531 16956488 16909577 16863475 16756520 16630574 16526841
2861 16526841 16446144 16371348 16287771 16055360 15973671 15870768 15703968 15513992 15461715 15397512
2851 15397512 15307767 15289121 15227267 15152654 14975417 14891420 14793499 14807322 14848471 14764687 14712926
2840 14712926 14640227 14521193 14509102 14482839 14383273 14288242 14161523 14150767 14046711 14008927 13863531
2829 13863531 13729625 13683906 13552903 13457904 13273946 13193106 13083858 12941147 12907822 12879342
2819 12879342 12865414 12880942 12854520 12866052 12882771 12829286 12800413 12827205 12730867 12737325 12776214
2808 12776214 12843979 12816069 12857980 12974493 12960763 12964131 13094539 13047629 13106318 13115173 13153690
2797 13153690 13189331 13247678 13243193 13290567 13446002 13517651 13585343 13726351 13895226 14002377 14192060
2786 14192060 14312350 14464584 14686220 14905680 15123968 15394544 15526688 15593815 15664161 15687591
2776 15687591 15770560 15899601 15952216 16070620 16316900 16489700 16726362 16926129 16997621 17077736
2766 17077736 17195799 17292975 17474484 17608981 17706717 17939207 18101484 18294963 18390577 18689383
2756 18689383 18905801 19092825 19384605 19689220 19953599 20326122 20726798 21111012 21555701
2747 21555701 21958618 22222162 22568377 22800299 23128760 23391038 23672479 24136850 24636980
2738 24636980 25146307 25690347 26094442 26483909 26883064 27338837 27882026 28428665 29112718
2729 29112718 29758894 30335076 31096906 31960319 32691030 33512628 34394485 35104738 35739588
2720 35739588 36527891 37136362 37677382 38111143 38508442 38985487 39445382 39829577 40234906
2711 40234906 40722093 41344313 41889048 42551779 43325736 44315275 45269495 46388772 47678282
2702 47678282 49006314 50428134 51822456 53424136 55075857 56827959 58561702 60401229
2694 60401229 62115053 63638150 64744669 65252846 65002684 64260205 63050900 61299327 59466861
2685 59466861 57736458 56298583 55270335 54559014 54165617 54162910 54437954 55005733 55729624
2676 55729624 56480642 57393172 58633272 59833382 61108768 62373872 63622323 64865934
2668 64865934 65889453 66823362 67715774 68180823 68241977 67753059 66857643 65472140 63837470
2659 63837470 61939674 59869820 57608837 55346712 53236032 51400764 49977255 48833638
2651 48833638 47903810 47175529 46804109 46557829 46304945 46206181 46384647 46382149 46365588 46275180
2641 46275180 45985309 45469036 44939926 44114989 43061918 41828587 40408831 38816521 36963277
2632 36963277 35197992 33539921 31909296 30373966 29037868 27846998 26693622 25683348
2624 25683348 24823436 23984452 23091223 22407321 21783740 21117849 20529684 20002162 19595813
2615 19595813 19065354 18692582 18307952 17831237 17516613 17084212 16690357 16260213 15620570
2606 15620570 15109261 14651836 14156879 13622086 13248500 12963442 12507819 12195843 11943828
2597 11943828 11631141 11311073 10996456 10817397 10588196 10293545 10083081 9705051 9535675
2588 9535675 9388380 9185864 9112028 8938414 8745885 8608110 8428678 8367572 8170444 8093592
2578 8093592 7992437 7794894 7689124 7667721 7512416 7357094 7234404 7087638 6971095 6745194
2568 6745194 6606827 6535896 6464371 6293375 6147051 5968127 5866476 5699997 5593339 5425906
2558 5425906 5328774 5294479 5199091 5098814 5050458 4994717 5003426 4999032 4810359 4723006 4714246 4726378
2546 4726378 4609537 4438981 4437361 4406765 4408805 4232013 4055418 3990895 3955070 3788522 3709194
2535 3709194 3607142 3515070 3510500 3414463 3361376 3278248 3173176 3155207 3069920 2992261 2918963
2524 2918963 2876799 2878104 2756651 2777985 2713298 2698602 2712490 2669363 2595345 2485561 2471460
2513 2471460 2411947 2428157 2286633 2231780 2326135 2199698 2175239 2099547 2076380 2085355 2065802
2502 2065802 2093215 2064147 1991902 1949156 1989320 2006957 1877107 1907975 1899482 1816794 1770880
2491 1770880 1794915 1745685 1734388 1747888 1704830 1575931 1546632 1685572 1722171 1753023 1745986
2480 1745986 1700780 1738146 1748086 1607829 1552370 1595927 1553790 1511887 1566141 1521043 1512966 1516134
2468 1516134 1540055 1521711 1489910 1421516 1411066 1520874 1435753 1397612 1390407 1324087 1294686
2457 1294686 1265948 1263339 1251753 1236935 1294349 1314276 1279662 1233166 1217008 1281335 1252332 1270961
2445 1270961 1289128 1246415 1174995 1173516 1121967 1022519 1173785 1263273 1238549 1215563 1235120
2434 1235120 1121276 1111825 1107422 1192359 1219757 1042065 1016317 1153445 1179386 1191587 1152721
2423 1152721 1045110 1040408 1007225 1080390 1003202 1063485 1022316 1084416 1078997 1095074 1109856 1130443
2411 1130443 1137768 1028506 1020814 984798 1004410 977274 1022370 979684 980804 971840 967234 933711
2399 933711 903631 992869 1005451 994313 989308 984700 980013 892514 894793 964262 922494 889169
2387 889169 904208 980592 959588 909113 980630 907021 848263 841034 858106 900366 918436 902464
2375 902464 901643 847450 750431 816054 720278 653355 689213 686795 701658 735258 690454 796634
2363 796634 747232 730359 680632 613417 580517 559903 557619 609000 604233 685501 694887 575106
2351 575106 647395 671026 632449 657455 629905 530128 532508 569607 520581 497391 480074 488235
2339 488235 561723 496567 617546 524407 401278 410647 416243 439485 504698 458052 537195 562855
2327 562855 492753 407170 390381 399887 506068 498447 528352 510542 393723 362672 423388 362888
2315 362888 276949 315024 342950 311908 337301 383431 359983 325973 332610 388416 380441 340447
2303 340447 346525 429077 408502 360237 409200 346119 293402 323510 340292 316752 331546 372373
2291 372373 366031 390545 339989 250596 188383 221059 251457 259371 197588 175306 267172 367066
2279 367066 293658 205861 245403 194808 55543 175128 240240 225023 238092 288180 240945
2268 240945 222712 227474 248557 233382 124781 117630 129260 178807 214839 198435 148685 91731
2256 91731 190079 211107 228723 308315 235171 145877 -12365 -39335 59445 115901 63176 100356
2244 100356 152835 147863 180425 175279 101644 157554 205868 172349 250220 197842 106808 82710
2232 82710 95687 134892 109300 61442 65360 45816 30829 56034 116997 108595 24824 36705
2220 36705 30779 -11598 43265 31277 -28844 -78739 -73878 -71326 -55360 -20756 12326 5844 -14365
2207 -14365 -9466 16838 -61266 19130 -42657 10526 4913 -23952 67330 -44443 -187 74831
2195 74831 15429 31947 58491 11159 44630 37553 -76004 -117754 -128904 -37423 -55206 -30740
2183 -30740 -12171 -24389 -37706 472 77452 50405 -55409 -124273 -129254 -181685 -137935 -121925
2171 -121925 -68015 23696 8624 -25625 40606 91737 4880 -57710 -41037 -76632 40604
2160 40604 40081 -30497 -72265 -74378 -89853 -69515 -79252 -127633 -122498 -27526 -28939 -84817 -67956
2147 -67956 -33278 -44646 -66439 -58373 26319 45506 41435 -72751 -96815 -125000 -188599 -103983
2135 -103983 -113972 -163714 -93231 -120667 -39524 -109308 -104645 -53147 -17470 -6468 -50119 -190423
2123 -190423 -81194 -67391 -86536 -83157 -65306 -5408 20893 -56460 -140928 -65096 -88851 -95783
2111 -95783 -81359 -37968 -27225 -23657 -33434 -44264 -69668 -78468 -97033 -121199 -111981 -54319 -100515
2098 -100515 -98163 -89110 -147008 -207920 -198376 -181100 -71607 -92123 -69842 -67433 -153290 -164580
2086 -164580 -169566 -120528 -41101 -99887 -115662 -132558 -93442 -42561 -107005 -147318 -166140 -212429
2074 -212429 -112716 -70045 -100230 -154896 -140994 -148796 -50802 -10075 -124311 -83195 -82039 -145358
2062 -145358 -108092 -127265 -141612 -106680 -44449 -72376 4599 -27940 -13319 -60664 -65938 -49196
2050 -49196 -3804 22362 22415 48396 27026 -8237 -118109 -117760 -87449 -71394 -51614 17240 30587
2037 30587 -16516 -42097 -83691 -104927 -134576 -91282 -63425 -76228 -105113 -96062 -66757 -149065
2025 -149065 -66445 -10476 36669 -2970 -29052 28937 46965 35128 84252 -10588 -13857 35468
2013 35468 11661 -13814 76945 88025 42866 77581 94685 100680 111336 112622 136054 192743
2001 192743 184726 114114 150099 154963 122507 168985 171092 166285 98859 116904 126895 148888 145056
1988 145056 68849 175528 203604 171825 146448 221418 270283 278571 307666 289961 332819 366878
1976 366878 471036 444278 356798 379143 435124 479383 378060 321137 426670 442236 500535
1965 500535 511779 458551 515846 525432 488967 473742 477520 435029 447262 462623 479701 566175
1953 566175 557826 560578 673569 729643 735408 713501 682913 844495 904334 854998 784653 826617
1941 826617 870309 896663 897498 896847 969498 1004832 1016721 991426 1050412 1101156 1177342 1274338
1929 1274338 1365021 1337647 1430042 1462921 1430431 1509288 1594610 1655878 1718898 1832839 1915066
1918 1915066 2028499 2113942 2246184 2450755 2621306 2866645 3035155 3232335 3456277 3732765
1908 3732765 4052687 4477541 4817135 5071778 5395967 5787786 6259008 6916313 7703958 8575606
1898 8575606 9655899 10963181 12535559 14369388 16635946 19971509 22565111 21321281
1890 21321281 17334501 13790545 11113194 9041451 7437888 6278247 5434617 4810412
1882 4810412 4269471 3845055 3601073 3537928 3413854 3205097 3035319 2822386 2554448 2250444
1872 2250444 2149375 1802713 1708128 1608569 1573087 1450810 1270623 1233532 1088088 992341
1862 992341 984369 880385 876644 892764 856202 803229 818335 707245 653457 732515 717984 722795
1850 722795 690218 471688 457757 457949 291013 332454 361384 402114 418038 394912 371069 321926
1838 321926 240152 224664 173898 140021 244416 226018 214816 213799 226825 176260 293399
1827 293399 338578 275833 204148 143700 189997 254108 220940 163158 163004 180783 198503 123875
1815 123875 79028 45208 3031 -21322 -5064 98448 60979 -21338 -52617 3614 32404
1804 32404 45343 76113 58856 52700 51481 10213 -31662 -57211 -73311 -37122 -62729 -58744
1792 -58744 6466 86159 -36391 -75461 49409 83660 95053 53587 -59458 -112761 -173249
1781 -173249 -163093 -152982 -41153 15822 1585 25862 22002 -26772 40735 -27950 -28364 -21347
1769 -21347 18621 37671 -63103 -150902 -100839 -88250 -125203 -60334 -40543 -53411 -42986 -19379
1757 -19379 6772 -122503 -90600 -71165 -96608 -63304 -38710 -36625 -92838 14270 -12482 -53633
1745 -53633 -26265 -49350 -82697 -46274 -101994 -93039 -59590 -85102 -132894 -100220 -98925 -129548
1733 -129548 -179612 -119921 -72411 -80357 -76838 -91090 -122251 -117312 -47953 -68340 -132132 -119473
1721 -119473 -132769 -99283 -97987 -23235 -59073 -155296 -25989 -11282 -66486 -124361 -102308 -93980
1709 -93980 -43575 -53677 -19950 -29553 -71963 -117329 -97881 -71532 -111824 -94597 -87619 -41149
1697 -41149 -44949 36569 10002 -142 -66614 -82218 -49633 -116892 -144264 -129061 -65250 -58987
1685 -58987 -44825 -111232 -91909 -90207 -169765 -187539 -63251 -115499 -162348 -108606 -102340 -146349
1673 -146349 -112404 -55473 -23961 -166604 -123565 -41193 46281 9066 -88008 -54553 -138090
1662 -138090 -189379 -245776 -177410 -193653 -139564 -142096 -167826 -107027 -54525 688 -26745 -49319
1650 -49319 -60244 -98549 -66950 -76424 -63557 -76966 -89251 -62218 -12548 -3488 -59841 -153221
1638 -153221 -100651 -47097 -31990 -47828 -149520 -128866 -83382 -150621 -122982 -48156 -36401
1627 -36401 -82306 -35196 -46696 -6903 12736 27289 -25887 36305 47151 -68621 -15574 -107272
1615 -107272 -131293 -58861 -74215 -99537 -125316 -141437 -78769 -134745 -68068 11870 -3529 -41837
1603 -41837 -148508 -44646 -52056 -91440 -55650 -60136 -51686 -62733 -31844 -66812 -154883 -273556
1591 -273556 -210576 -121078 -138087 -64942 -48361 -77530 -45416 -31233 -39797 -101812 -193774 -213034
1579 -213034 -216671 -138889 -107904 -128930 -75270 -77757 -107515 -90373 -76647 -38391 -95950 -100863
1567 -100863 -136953 -73374 -21203 -80045 -51653 -94575 -105973 -83546 -98804 -27692 -46964 -73277
1555 -73277 -48840 -51214 -104572 -145932 -110595 -133445 -67310 -66061 -104738 -66831 -64433 -82003
1543 -82003 -85582 -127670 -33355 -10564 -44235 -46586 -89976 -109020 -134863 -73706 -145216 -108917
1531 -108917 -34368 -24509 45462 21882 -15143 -3361 -18472 -102065 -90450 -84724 -108621 -161481
1519 -161481 -82428 16935 7495 -58669 -52217 -150017 -162314 -189697 -114030 -106897 -118316 -151345
1507 -151345 -179777 -114412 -149906 -120135 -104025 -166805 -131723 -173051 -188631 -155705 -119210 -164070
1495 -164070 -138640 -133822 -53483 -57640 -109215 -108491 -135197 -130499 -67227 -73699 -137048 -133193 -97209
1482 -97209 -81313 -122245 -184083 -238535 -108770 -129369 -82480 -30879 8187 -44951 -58305 -122446
1470 -122446 -167439 -146087 -96209 -92906 -108834 -89981 -74323 -69074 -47286 -86120 -147642 -179041
1458 -179041 -303933 -200787 -110336 -131106 -205379 -135314 -71628 -54907 -107942 -106857 -71709
1447 -71709 -79810 -51292 -59974 -19138 -37757 -84403 -71246 -11009 -67163 1730 -3939 -53540
1435 -53540 -74653 -104624 -93487 -40186 -40956 -119382 -150017 -151459 -106370 -45801 -31106 -3182
1423 -3182 -79700 -38600 -61640 -73942 -104375 -73341 -60017 -47463 -165397 -148073 -118930 -82220
1411 -82220 -51030 -72402 -136893 -173467 -141608 -150573 -126373 -48653 -67280 -168736 -143760 -101558
1399 -101558 -104422 -40698 -81875 -161615 -69613 -32559 -29425 -21947 -40920 -57992 -80501 -133777
1387 -133777 -53400 -6455 -64987 -35787 -56008 -64264 -109117 -126132 -51798 -142888 -116476 -75618
1375 -75618 -82148 -44638 -119272 -119714 -105388 -174111 -137007 -152907 -70187 -20034 -49881 -85579
1363 -85579 -80574 -59702 -84938 -85132 -64892 -175879 -49583 -81814 -147947 -127116 -112643 -78664
1351 -78664 -105691 -64701 12957 3747 -130751 -189272 -53715 2808 -52555 -150994 -119654 -73707
1339 -73707 -104432 -99022 -109648 7246 11351 -127560 -5603 9015 -50314 -150050 -142936 -163358
1327 -163358 -139942 -152195 -167411 -166041 -134632 -14717 -42219 -177471 -137550 -54666 -49415 -46279
1315 -46279 -110718 -77031 -64706 -97739 -183633 -48454 21524 -93749 -109811 -87799 -79494 -44290
1303 -44290 -28257 -44495 -46849 41696 40081 11471 13436 -65269 -58492 17819 50475 55266 80046
1290 80046 51086 -39064 3358 1615 -28437 -61077 -93712 -76448 -62660 -162977 -192893 -141426
1278 -141426 -85553 -74113 -77738 -86657 26232 -12030 -1297 -53345 -33863 -73646 -68070 -72454
1266 -72454 11144 73923 50497 -6094 19973 -35134 -34464 -45661 -116860 -116383 -117331 -52362 -60587
1253 -60587 -34846 -136261 -84927 -48007 -76990 -62154 -84073 -125973 -60990 -23663 54386 -51905
1241 -51905 -69949 -143456 -53774 -32394 -26714 2380 -31468 -77781 -15024 -12901 1242 -18471
1229 -18471 -59021 -30799 -58856 -50168 -102990 -46374 -72696 -127667 -163397 -86004 -29516 -39097
1217 -39097 -19332 -7170 -58880 -80797 -65491 -73855 -36652 -25922 -3409 -74119 -93107 4013
1205 4013 -12999 -33676 -28843 -63083 -65759 74956 108250 75036 16081 -25010 -33541 -29231 -40045
1192 -40045 22594 69873 15075 -8799 34122 -2171 -73532 -25358 -85702 -64547 -89085 -86293
1180 -86293 -22814 -58956 -31724 9146 -10245 31957 142 -89486 -2454 -1585 -61629 -91262
1168 -91262 -73728 -81985 -52422 58845 107197 76653 27158 -42024 -13965 -48845 -40603 -30301
1156 -30301 -18809 -15496 -99715 -58818 -54645 3301 -62082 -115146 -121764 -94402 -98786 -60311 -27482
1143 -27482 -26354 5031 -50514 -23419 -20088 -39121 -52812 11921 -13818 -26243 -70608 -48840
1131 -48840 -9328 8009 15229 -13041 -22199 502 -73046 -84251 -73183 -38193 -59096 -39190
1119 -39190 -89115 -82639 663 -22161 1215 -18904 23210 -100787 -79955 -36376 -8301 28480
1107 28480 -2479 -55375 -140122 -123740 -8823 -30376 -67386 -41346 -53019 -107560 -68193 -6539
1095 -6539 -25900 -95289 -65754 -46343 57505 23274 4495 -16308 -101618 75 6932 53959
1083 53959 63120 -37016 4709 -19647 -19888 44451 96334 144389 43442 11696 20843 9438
1071 9438 39134 -8807 41079 85522 86568 20736 -115234 29850 14108 -24930 -18264 2511
1059 2511 31860 8237 -8548 -9217 24994 17370 19851 42427 70772 -4688 -56991 -84180 -15439
1046 -15439 36150 -11447 -90469 -107178 -38875 3319 -5112 -34137 -5538 30830 77742 60070
1034 60070 -29277 4577 54732 -51456 25983 6932 -50403 -40653 -34757 -46274 -30316 8213
1022 8213 7778 72953 4834 32990 28847 21370 -66623 -116752 -86909 -31556 27606 50827 15063
1009 15063 -88390 -46001 -36231 -21584 -64814 -72235 -68696 -27308 -20106 8850 57594 -18631
997 -18631 5043 30869 -9483 61730 74521 -42084 -51497 -54553 12290 26321 -18337 -15674
985 -15674 -29064 60494 47270 11689 3391 38357 125022 73173 19322 35542 44784 61005
973 61005 -40399 -85094 -24770 9562 28073 -16492 -50727 84805 127510 14697 22772 75491
961 75491 113800 102571 67456 71102 81113 83006 26912 -42820 -34986 47095 25793 11709 16265
948 16265 56446 130603 42187 -15834 -67318 -78957 -95457 -64093 -27197 54383 10732 10088
936 10088 73996 30102 42174 77902 -28458 -68624 16697 13936 -14794 3856 77638 87142
924 87142 82936 82297 50862 40036 30435 -16148 1434 -5572 10477 33829 69204 55383 40989
911 40989 -81946 -112763 -28537 -54344 2378 8490 37281 58766 6104 23570 46966 115985
899 115985 89467 24856 -67451 55908 75773 16202 54054 34203 -34139 10766 93839 48529
887 48529 98361 37034 33202 42942 -61806 -59362 -32360 -17230 -55312 8149 31512 -76690
875 -76690 17809 -2341 26158 -47160 -21162 -39451 6323 115613 77660 38336 39535 85057
863 85057 60177 90844 110760 54145 101931 40310 26570 46514 -5172 42886 30325 61688
851 61688 74159 -30435 -51943 24717 -39937 10853 1751 83145 92652 79297 8945 27017
839 27017 84807 102294 43930 -122102 -21417 91651 65244 104253 152486 159122 253634 158947
827 158947 77119 76824 110405 84829 24445 -11491 61585 59121 34844 22735 43607 88227
815 88227 36725 92558 56595 33912 -18990 -83059 -15236 -7997 -4752 6154 54208 -7241
803 -7241 -46354 33530 15060 106495 70429 101896 144840 81794 130380 62337 2675 18933
791 18933 -46405 35711 142625 -20905 -13695 60997 17583 48216 21165 -34970 32198 53637
779 53637 18997 -11071 -50356 -4502 45122 110597 75999 -2769 33350 -19501 -86823 -33202
767 -33202 43213 24238 44505 93844 81361 22651 9111 -20949 -35434 -26540 -14495 27536
755 27536 114878 99036 111659 105940 28055 -83473 -41583 8632 20893 58778 59408 -26970
743 -26970 49024 84549 129435 81620 -17825 -66437 27102 123267 79632 72583 40043 -5631
731 -5631 27219 66048 15 51339 91789 88063 28047 41779 -29816 62932 51618 110261
719 110261 137406 85304 -15952 94790 62911 49257 25639 38 -14292 -33022 33211
708 33211 10985 17193 87683 49660 96866 131708 129982 9617 -27303 25331 44987 37990
696 37990 26300 62188 -19045 -38244 -33128 9870 26183 31815 102144 138455 44182 88110
684 88110 25979 -498 64966 108806 137267 116971 153965 107048 66422 83935 106984 161491
672 161491 94124 96426 88682 48726 51169 93289 155585 94481 81392 150582 34287 47399
660 47399 118176 199304 132317 97374 64960 111815 57366 106631 50046 18921 113129 55779
648 55779 35939 17148 90455 7742 -137343 -30822 -13302 -41428 62171 76951 3779
637 3779 -98551 18111 9611 -25504 32843 76818 36262 26095 67490 83731 64283 24277
625 24277 15437 24451 -24000 29563 -27465 24805 54214 44248 40527 33160 132946 32604 41424
612 41424 74837 27798 60290 53917 7855 84992 51098 2855 38252 -22970 56244 80016
600 80016 104174 187824 153086 129355 57023 78045 78061 26897 -27228 34009 84551 61023 -15590
587 -15590 279 22294 58459 24713 69486 70419 59497 122634 128250 104283 -30080 102733
575 102733 169816 87789 79148 -19721 11054 86336 121705 164593 171182 142342 72726 74391
563 74391 272 28241 92277 -6933 89563 127645 84926 52373 107878 121638 75423 98956
551 98956 75093 118092 84094 133484 119312 132785 194500 78557 77340 85833 43878 5371
539 5371 51305 17037 -2988 32065 33602 89751 42233 799 -8086 21018 -47617 -93048 -18307
526 -18307 18332 79184 44732 -19181 100139 176585 87175 22350 86869 16340 -42060 -84459
514 -84459 -18385 466 48602 117261 151021 96131 38939 62116 113273 8070 104930 150108
502 150108 29324 -5718 39930 133546 157641 112151 29729 12880 38537 85348 148942 134027
490 134027 72581 -2386 -68184 -17025 -985 67990 66684 -6247 111016 121566 111900 39636
478 39636 15560 23020 -29286 42314 56413 113798 151253 174323 102796 67085 127711 112408
466 112408 120125 102646 -17038 66755 130618 104052 71470 37213 33092 84070 61472 57140
454 57140 117513 104696 108903 48795 31339 11475 30694 14479 7118 43882 60675 155904
442 155904 136497 88353 6467 91913 82065 12546 13802 77026 122927 68735 45549 78465
430 78465 63026 114354 151583 91507 58711 52271 109349 160296 106092 85311 130931 149833
418 149833 120294 87453 100379 87443 100158 92789 52056 73416 122908 209799 181740 107156
406 107156 92528 90758 95238 138488 138559 101726 29212 -8654 44392 84570 45803 70742 91886
393 91886 141243 112901 31103 49360 144948 141422 88996 87705 167575 131399 63073 45405
381 45405 177005 112787 16629 45313 26262 23005 -40524 -25841 -26333 62751 46303 25086
369 25086 17107 33611 169440 176762 38908 2883 76073 154372 146454 99811 31641 30205
357 30205 42319 158922 146634 110749 134452 124570 170754 165873 37122 -35910 77701 142819
345 142819 137905 145619 89690 110657 114866 130537 41140 74850 146836 130206 141119 164289
333 164289 75405 47418 24311 85236 124536 42497 -46011 74463 39286 91753 142942 143606
321 143606 146732 122089 95554 8865 44698 107756 49198 88768 138627 45486 130494 114158
309 114158 172330 142456 40626 109087 94502 78251 82663 85791 112010 151634 55485 14742
297 14742 99726 54670 114221 172536 196099 159606 100663 127389 170703 80270 86768 18894
285 18894 60801 71198 137342 114515 172309 134467 143852 154839 149685 179523 156134 101559
273 101559 62872 85493 74970 119488 20575 87706 205128 139473 15390 107233 78377
262 78377 133572 141192 136824 108966 68272 165218 153701 141929 100723 101659 37044 36420 97053
249 97053 83549 70685 37129 5743 42069 -6549 41142 163871 187971 129253 99371 75192
237 75192 70968 120138 61298 86622 90069 147408 168282 95151 131107 62907 27131 -11690
225 -11690 4490 71808 68066 92930 59728 134661 182323 135127 92482 104977 88026 49294
213 49294 113143 55746 108984 143214 116102 102754 76249 184564 164348 75645 150977 95688
201 95688 64731 75046 115924 105759 -29780 -51515 94185 112689 79042 102952 85411 121863
189 121863 85097 39618 24569 104958 130808 130586 153879 182493 183760 128536 112111 161273
177 161273 123364 84044 38624 -19625 -21679 70946 97010 89748 43735 48573 101280 125226
165 125226 125664 148409 148396 148869 121213 90691 111347 89584 101632 139107 110350 182891 183037 173873
151 173873 187183 40603 18802 104339 93363 83079 120007 129218 137287 60952 85701 135555
139 135555 81111 90095 53539 -1625 -51896 -41619 87975 116923 130789 163427 214925 201029
127 201029 203731 164718 131297 171356 179300 138733 56154 108115 154015 106333 93374 146467
115 146467 127674 124771 138864 110174 135929 93612 152392 114916 107022 120871 106281 136592
103 136592 154069 136411 81593 101735 95458 134920 106534 116909 184256 133755 150055 115869
91 115869 98173 131359 107079 110938 98643 136254 128177 104840 114177 107860 115543 93334 97095
78 97095 87446 53812 72781 79281 63894 140727 101323 51733 128433 94865 95953 105463 84001
65 84001 95348 109599 128935 105210 69030 83248 88695 61808 97655 153186 105188 122769
53 122769 139854 152020 144442 83183 11057 86390 70500 97524 57454 44061 50887 131670
41 131670 195289 105530 161115 121723 150020 173959 139503 132190 140257 94922 119183 126383 123125
28 123125 92572 71987 93832 150908 187591 206805 174831 216866 169862 47901 49840 135703
16 135703 159399 131325 106953 90020 126304 123624 108940 109746 109340 143858 143440 136691 92251 108972
2 108972 60807 74482
0 74482
$$ Imaginary data points
##PAGE= N=2
##DATA TABLE= (X++(I..I)), XYDATA
16383 -1573874 -1544909 -1531233 -1482392 -1461970 -1404550 -1427166 -1512859 -1492739 -1402781 -1365627 -1364862 -1336753
16371 -1336753 -1326178 -1284323 -1258810 -1236277 -1214736 -1223566 -1260042 -1210213 -1131626 -1125782 -1155217 -1166319
16359 -1166319 -1151659 -1128731 -1083363 -1011553 -955168 -925313 -969866 -914572 -897703 -865547 -897724
16348 -897724 -941743 -884807 -839699 -806946 -775308 -745047 -794315 -781322 -746923 -776592 -755505
16337 -755505 -727559 -695417 -660089 -666953 -594419 -539430 -512327 -502137 -488155 -467670 -445316 -444261
16325 -444261 -513313 -484767 -420517 -499682 -443919 -385843 -377496 -314240 -279878 -269752 -312617 -263342
16313 -263342 -231155 -164499 -174453 -177875 -216528 -185107 -182953 -198885 -102742 -59887 -105587 -141402
16301 -141402 -105464 -26076 -26459 -26096 -21750 19537 58271 17163 121802 159592 130607 151554
16289 151554 198879 252418 264769 252815 262672 230741 184341 228959 268605 348819 351620 327550
16277 327550 358564 338063 360503 409787 385414 413451 464954 469306 465335 468073 470311 476347
16265 476347 588526 550798 527700 491495 517753 466845 558527 599384 600012 696744 727421 690239
16253 690239 714552 741567 708614 774772 795381 776836 748151 717355 704488 755955 699250
16242 699250 717808 746870 726741 728638 860634 827361 790347 818393 794729 864281 817369
16231 817369 774482 783942 886169 917136 909969 931200 1001584 989472 976219 969815 990282 978248
16219 978248 1015914 1035536 1067285 1084393 1110944 1058476 974981 952325 982181 1110235 1052821
16208 1052821 1076420 1136430 1127716 1126543 1109994 1087242 1087855 1021977 1016736 1049593 1114666 1169281
16196 1169281 1200178 1266900 1267762 1217447 1197659 1160553 1185778 1311908 1343210 1225440 1275066
16185 1275066 1271098 1260096 1274264 1279782 1262803 1218266 1254026 1227233 1289692 1340969 1362759 1415383
16173 1415383 1456277 1471219 1345296 1377643 1401960 1379726 1390645 1363175 1367446 1417214 1454156
16162 1454156 1436596 1446802 1395063 1323062 1338531 1419308 1458673 1468436 1454110 1348410 1439138
16151 1439138 1467661 1466474 1428734 1412236 1442793 1425366 1400660 1468017 1512471 1499166 1443787
16140 1443787 1500519 1550262 1533846 1567430 1523295 1413712 1418197 1473435 1451560 1510574 1567564
16129 1567564 1568243 1570153 1577132 1442618 1438870 1506400 1563228 1535911 1571928 1542099 1466783 1492234
16117 1492234 1519774 1566039 1550037 1599979 1669627 1650933 1556745 1592543 1622863 1591399 1555146
16106 1555146 1533994 1545955 1506399 1619941 1546794 1505455 1582821 1552750 1497513 1533851 1514280
16095 1514280 1582697 1602985 1601692 1617816 1558798 1593817 1602339 1529369 1566340 1550120 1621042 1584284
16083 1584284 1510603 1572137 1599436 1598535 1556727 1555807 1589285 1673101 1647019 1608470 1661972 1676082
16071 1676082 1612251 1595090 1567419 1567796 1593535 1531483 1518641 1536025 1508003 1534709 1647339
16060 1647339 1609816 1659883 1635649 1588029 1526309 1548886 1655999 1576899 1561408 1562099 1538663
16049 1538663 1537257 1590222 1617276 1673826 1680783 1649264 1728622 1682055 1715660 1667179 1560887
16038 1560887 1628182 1593634 1641921 1580011 1568060 1561496 1619793 1663094 1645106 1666132 1610941
16027 1610941 1656313 1658121 1707280 1762310 1738609 1716323 1748154 1778593 1720364 1736049 1700078
16016 1700078 1603455 1621073 1636440 1631541 1613478 1638803 1656249 1633961 1703997 1617258 1588041
16005 1588041 1605722 1516477 1563781 1637947 1689087 1677438 1618002 1624715 1569235 1622201 1638196
15994 1638196 1618739 1626974 1592118 1606730 1638942 1686231 1692147 1657308 1726104 1664253 1699452 1644644
15982 1644644 1669550 1657949 1746120 1793164 1826763 1798545 1660709 1677143 1639686 1632005 1662265
15971 1662265 1608751 1607632 1640836 1615279 1676886 1616919 1575804 1656221 1642614 1604473 1646983
15960 1646983 1591829 1608465 1574861 1590579 1647467 1636662 1706313 1707043 1625350 1616887 1662404 1624967
15948 1624967 1629431 1638240 1652233 1642536 1642547 1686581 1724074 1654037 1650902 1656673 1637257 1725261 1683145
15935 1683145 1717507 1688563 1623590 1626168 1623133 1670916 1709680 1648459 1556464 1619252 1690089 1623108
15923 1623108 1601345 1607874 1612721 1602249 1617334 1581317 1586522 1617457 1582797 1640373 1593247 1541767
15911 1541767 1605479 1645471 1621601 1611004 1645994 1600739 1577890 1623154 1659678 1577178 1619879
15900 1619879 1689701 1692092 1686087 1768713 1709457 1641573 1637409 1671806 1665688 1597135 1550212 1625886
15888 1625886 1685278 1754053 1735761 1706689 1646725 1623118 1575315 1573635 1641842 1711545 1717100 1749487
15876 1749487 1695542 1639688 1590986 1690500 1720364 1691864 1638388 1570453 1623057 1623827 1614328 1606206
15864 1606206 1660112 1703954 1723454 1681103 1657328 1679544 1679556 1617374 1601301 1615563 1634203 1607570
15852 1607570 1599743 1604822 1655192 1734632 1719111 1631222 1710018 1635425 1658847 1693291 1692474 1701798
15840 1701798 1637392 1666013 1699828 1692303 1641201 1633599 1699119 1690234 1732301 1745094 1723984 1712627
15828 1712627 1718169 1729246 1743559 1692725 1641853 1682870 1722303 1643276 1577397 1640107 1684010
15817 1684010 1653750 1601486 1611952 1702566 1715471 1755975 1746550 1746951 1643660 1677257 1673733 1681841
15805 1681841 1678514 1675484 1606284 1680318 1696709 1654313 1562765 1578308 1725234 1740745 1744810 1781702
15793 1781702 1767709 1764623 1739406 1715887 1694270 1665654 1641126 1635234 1672835 1569999 1571685 1581000
15781 1581000 1583169 1684165 1727598 1621835 1683353 1713759 1739836 1712428 1678888 1731397 1739302
15770 1739302 1762892 1775677 1696759 1784229 1763047 1767742 1724615 1680748 1643766 1577857 1696770
15759 1696770 1749934 1812209 1743137 1643458 1597817 1611961 1618304 1665311 1661940 1598439 1600751 1626718
15747 1626718 1693272 1637321 1657228 1684842 1656487 1639059 1635863 1671636 1685000 1677180 1723443 1679789
15735 1679789 1665794 1689374 1747323 1794495 1721365 1635516 1628938 1619369 1690685 1683041 1646903 1679167
15723 1679167 1765261 1757581 1711898 1638586 1634534 1668885 1623319 1626152 1633881 1622964 1715936 1758134
15711 1758134 1717641 1703130 1708406 1714438 1753638 1662342 1712748 1665896 1643770 1734850 1672182 1629527
15699 1629527 1711741 1739814 1713134 1747776 1722626 1776465 1681384 1660714 1650735 1623784 1739108
15688 1739108 1747894 1654565 1715977 1720796 1695459 1699167 1811170 1783569 1702900 1740585 1710327 1692003
15676 1692003 1682689 1671204 1712312 1725257 1765463 1733094 1633354 1700586 1708641 1736859 1761799 1660886
15664 1660886 1595554 1637945 1716909 1704639 1662531 1657805 1696844 1798395 1818633 1793491 1769861
15653 1769861 1771147 1715560 1653758 1663962 1706481 1726718 1707037 1684894 1701066 1683743 1609209
15642 1609209 1563395 1600222 1677064 1578575 1573495 1619920 1702917 1694997 1696087 1658207 1633651 1624289
15630 1624289 1661151 1704451 1707830 1713590 1715889 1684613 1633029 1647759 1678915 1739447 1688143 1667930
15618 1667930 1625482 1599802 1683827 1707923 1787037 1732920 1630796 1739615 1649592 1638138 1629937
15607 1629937 1647426 1707957 1726332 1726006 1732469 1682580 1600769 1595493 1576968 1663759 1698042 1667462
15595 1667462 1653534 1685626 1683896 1710907 1701241 1758152 1696271 1674234 1609909 1630894 1768779
15584 1768779 1700597 1663028 1641004 1726068 1737995 1697760 1718878 1684489 1692385 1683053 1662422 1648125
15572 1648125 1703082 1760135 1776986 1757312 1696567 1627747 1611746 1610173 1629828 1724170 1794287
15561 1794287 1755754 1673599 1706774 1661049 1718883 1826282 1737895 1734740 1746695 1675514 1594434
15550 1594434 1637120 1655141 1667338 1645043 1668534 1726954 1720026 1688369 1756179 1776937 1645528
$$ [...]
##END NTUPLES=NMR SPECTRUM
##END=
